##TITLE=31Pdec_SR_11_2
 D6, 24 sc
 10.7.2020
##JCAMPDX= 6.0         $$ Bruker NMR JCAMP-DX V2.0
##DATA TYPE= NMR SPECTRUM
##DATA CLASS= NTUPLES
##ORIGIN= UXNMR, Bruker Analytische Messtechnik GmbH
##OWNER= root
$$ XWIN-NMR		Version 3.5
$$ Fri Jul 10 10:09:12 2020 Russian Standard Time (UT+4h)  she@DPX200
##.OBSERVE FREQUENCY= 81.013821
##.OBSERVE NUCLEUS= ^31P
##.ACQUISITION MODE= SIMULTANEOUS
##.ACQUISITION SCHEME= undefined
##.AVERAGES= 24
##.DIGITISER RES= 17
##SPECTROMETER/DATA SYSTEM= spect
##.PULSE SEQUENCE= zgpg30
##.SOLVENT NAME= Acetone
##.SHIFT REFERENCE= (INTERNAL, Acetone, 0, 182.463)
##AUDIT TRAIL= $$ (NUMBER, WHEN, WHO, WHERE, WHAT)
$$ ##TITLE= Audit trail, XWIN-NMR		Version 3.5
$$ ##JCAMPDX= 5.01
$$ ##ORIGIN= Bruker BioSpin GmbH
$$ ##OWNER= she
$$ F:/spectra/data/she/nmr/P31/1/pdata/1/auditp.txt
$$ ##AUDIT TRAIL=  $$ (NUMBER, WHEN, WHO, WHERE, WHAT)
(   1,<2020-07-10 10:08:08.73 +0400>,<she>,<DPX200>,
      <created by zg, POWCHK disabled, PULCHK disabled
       configuration hash MD5:
       00 E9 B6 7A A2 85 ED C7 34 08 36 98 17 FE 4E 26
       data hash MD5: 32K
       CB 0D 88 1B ED 95 D5 7F 06 18 C7 9B 35 93 6E 67>)
(   2,<2020-07-10 10:08:11.06 +0400>,<she>,<DPX200>,
      <Start of raw data processing
       efp BC_mod = 2 LB = 1 FT_mod = 6 PKNL = 1 PHC0 = -2363.206 PHC1 = 15.60158 SI = 64K 
       data hash MD5: 64K
       8C 1A A8 AB A5 27 3E 05 1A 86 DB 9B CF B3 D2 26>)
(   3,<2020-07-10 10:08:35.65 +0400>,<she>,<DPX200>,
      <pk PHC0 = -16.50159 PHC1 = 0 
       data hash MD5: 64K
       65 82 25 34 3E 69 60 FF AD C4 6E 09 B3 C8 1A B5>)
$$ ##END=
$$ 
$$ hash MD5
$$ D8 18 27 2D F6 60 A4 9E F1 AE 2B 1A 9C 84 2C 50
##$RELAX= 
##$RELAX= 
##$RELAX= 
##$RELAX= 
##$RELAX= 
##$RELAX= 
##$RELAX= 
##$RELAX= 
$$ Bruker specific parameters
$$ --------------------------
##$DU= <F:/spectra>
##$EXPNO= 1
##$NAME= <P31>
##$PROCNO= 1
##$TYPE= <nmr>
##$USER= <she>
##$AMP= (0..31)
100 100 100 100 100 100 100 100 100 100 100 100 100 100 100 100 100 100 
100 100 100 100 100 100 100 100 100 100 100 100 100 100 
##$AQSEQ= 0
##$AQ_mod= 1
##$AUNM= <au_zg>
##$AUTOPOS= <>
##$BF1= 81.014009
##$BF2= 200.13
##$BF3= 200.13
##$BF4= 200.13
##$BF5= 200.13
##$BF6= 200.13
##$BF7= 200.13
##$BF8= 200.13
##$BYTORDA= 1
##$CFDGTYP= 0
##$CFRGTYP= 5
##$CHEMSTR= <none>
##$CNST= (0..31)
1 1 145 1 1 1 1 1 1 1 1 1 1 1 1 1 1 1 1 1 1 1 1 1 1 1 1 1 1 1 1 1 
##$CPDPRG= <waltz16>
##$CPDPRG1= <>
##$CPDPRG2= <waltz16>
##$CPDPRG3= <>
##$CPDPRG4= <mlev>
##$CPDPRG5= <mlev>
##$CPDPRG6= <mlev>
##$CPDPRG7= <mlev>
##$CPDPRG8= <mlev>
##$CPDPRGB= <>
##$CPDPRGT= <>
##$D= (0..31)
0 1 0 0 0 0 0 0 0 0 0 0.03 2e-05 3e-06 0 0 0 0 0 0 0 0 0 0 0 0 0 0 0 0 
0 0 
##$DATE= 1594361288
##$DBL= (0..7)
120 120 120 11 120 120 24 19 
##$DBP= (0..7)
150 150 150 150 150 150 150 150 
##$DBP07= 0
##$DBPNAM0= <>
##$DBPNAM1= <>
##$DBPNAM2= <>
##$DBPNAM3= <>
##$DBPNAM4= <>
##$DBPNAM5= <>
##$DBPNAM6= <>
##$DBPNAM7= <>
##$DBPOAL= (0..7)
0.5 0.5 0.5 0.5 0.5 0.5 0.5 0.5 
##$DBPOFFS= (0..7)
0 0 0 0 0 0 0 0 
$$ [...]
##$SUBNAM2= <"">
##$SUBNAM3= <"">
##$SUBNAM4= <"">
##$SUBNAM5= <"">
##$SUBNAM6= <"">
##$SUBNAM7= <"">
##$SUBNAM8= <"">
##$SUBNAM9= <"">
##$SW= 369.568048894756
##$SWIBOX= (0..15)
0 1 3 0 0 0 0 0 0 0 0 0 0 0 0 0 
##$SW_h= 29940.119760479
##$TD= 32768
##$TD0= 1
##$TE= 0
##$TE2= 300
##$TE3= 300
##$TEG= 300
##$TL= (0..7)
0 120 53 12 22 120 120 120 
##$TP= (0..7)
150 150 150 150 150 150 150 150 
##$TP07= 0
##$TPNAME0= <>
##$TPNAME1= <>
##$TPNAME2= <>
##$TPNAME3= <>
##$TPNAME4= <>
##$TPNAME5= <>
##$TPNAME6= <>
##$TPNAME7= <>
##$TPOAL= (0..7)
0.5 0.5 0.5 0.5 0.5 0.5 0.5 0.5 
##$TPOFFS= (0..7)
0 0 0 0 0 0 0 0 
##$TUNHIN= 0
##$TUNHOUT= 0
##$TUNXOUT= 0
##$USERA1= <user>
##$USERA2= <user>
##$USERA3= <user>
##$USERA4= <user>
##$USERA5= <user>
##$V9= 5
##$VALIST= <valist>
##$VCLIST= <CCCCCCCCCCCCCCC>
##$VD= 0
##$VDLIST= <DDDDDDDDDDDDDDD>
##$VPLIST= <PPPPPPPPPPPPPPP>
##$VTLIST= <TTTTTTTTTTTTTTT>
##$WBST= 1024
##$WBSW= 4
##$XGAIN= (0..3)
0 0 0 0 
##$XL= 0
##$YL= 0
##$YMAX_a= 9882
##$YMIN_a= -10592
##$ZGOPTNS= <>
##$ZL1= 120
##$ZL2= 120
##$ZL3= 120
##$ZL4= 120
##$ABSF1= 0
##$ABSF2= 0
##$ABSG= 0
##$ABSL= 0
##$ALPHA= 0
##$AQORDER= 0
##$ASSFAC= 0
##$ASSFACI= 0
##$ASSFACX= 0
##$ASSWID= 0
##$AUNMP= <proc_1d>
##$AZFE= 0.1
##$AZFW= 0.5
##$BCFW= 0
##$BC_mod= 2
##$BYTORDP= 0
##$COROFFS= 0
##$CY= -3
##$DATMOD= 1
##$DC= 0
##$DFILT= <>
##$DTYPP= 0
##$F1P= 0
##$F2P= 0
##$FCOR= 1
##$FTSIZE= 65536
##$FT_mod= 6
##$GAMMA= 0
##$GB= 0
##$INTBC= 1
##$INTSCL= 5.30512e-09
##$ISEN= 30
##$LB= 1
##$LEV0= 0
##$LPBIN= 0
##$MAXI= 10000
##$MC2= 0
##$MEAN= 0
##$ME_mod= 0
##$MI= 50
##$NCOEF= 0
##$NC_proc= -6
##$NLEV= 6
##$NOISF1= 182.463
##$NOISF2= 159.3651
##$NSP= 0
##$NTH_PI= 0
##$NZP= 0
##$OFFSET= 182.463
##$PC= 4
##$PHC0= -2379.708
##$PHC1= 15.60158
##$PH_mod= 1
##$PKNL= yes
##$PPARMOD= 0
##$PSCAL= 0
##$PSIGN= 0
##$REVERSE= no
##$SF= 81.0140089999434
##$SI= 65536
##$SIGF1= 159.3651
##$SIGF2= -187.1042
##$SINO= 113.3802
##$SIOLD= 16384
##$SREGLST= <1H.CDCl3>
##$SSB= 0
##$STSI= 65536
##$STSR= 0
##$SW_p= 29940.119760479
##$SYMM= 0
##$S_DEV= 0
##$TDeff= 32768
##$TDoff= 0
##$TI= <>
##$TILT= no
##$TM1= 0
##$TM2= 0
##$TOPLEV= 0
##$USERP1= <user>
##$USERP2= <user>
##$USERP3= <user>
##$USERP4= <user>
##$USERP5= <user>
##$WDW= 1
##$XDIM= 65536
##$YMAX_p= 314918728
##$YMIN_p= -11295472
$$ End of Bruker specific parameters
$$ ---------------------------------
##NTUPLES= NMR SPECTRUM
##VAR_NAME=  FREQUENCY,     SPECTRUM/REAL,   SPECTRUM/IMAG
##SYMBOL=    X,             R,               I
##VAR_TYPE=  INDEPENDENT,   DEPENDENT,       DEPENDENT
##VAR_FORM=  AFFN,          ASDF,            ASDF
##VAR_DIM=   65536,         65536,           65536
##UNITS=     HZ,            ARBITRARY UNITS, ARBITRARY UNITS
##FACTOR=    0.456856943014862, 1,           1
##FIRST=     14782.0589164792, 0,            0
##LAST=      -15158.0608439998, 0,           0
##MIN=       -15158.0608439998, -11295472,   0
##MAX=       14782.0589164792, 314918728,    0
$$ Real data points
##PAGE= N=1
##DATA TABLE= (X++(R..R)), XYDATA
$$ [...]
42767b409775j246342J317198J810852l85352k036565r31875J017302J130612
42759a733945J27113M78484K082365K547995J267014J80181K50641Q2266j072449
42750D209665j667189p19526J07181o89302j562831l34947J950083K401945P16067
42741D411146o79497o76864p40753j722567k248051j294994M3915O76625J243379
42732i87661K205414K209729L21195j726891j740919l52805K17909k11870L0895
42723c5004J118223J304465Q6791q15207l44767L60840L03848K75066Q31975P07926
42713C794156r36783k391978j720817L8945M12768n65267n83367R74355K012523
42704A034535J202810k3495p3979L31460j38190q71245l90137R46537J272016
$$ plain form
42767 -2409775 -3656117 -2338919 -528067 -913419 -2949984 -3881859 -2864557 -1733945
42759 -1733945 -1606832 -1128348 954017 3502012 4769026 4949207 5199848 5282114 4209665
42750 4209665 2542476 1822950 1930131 1240829 -322002 -656949 1293134 3695079 4411146
42741 4411146 3731649 3054785 2314032 591465 -1656586 -2951580 -2907665 -2231040 -987661
42732 -987661 1217753 3427482 3748677 2021786 280867 -71938 145971 -65899 -35004
42723 -35004 1083219 2387684 2474475 1659268 1314501 1675341 1979189 2254255 3086230 3794156
42713 3794156 2857373 465395 -1255422 -1216477 -803709 -1368976 -1952343 -977988 1034535
42704 1034535 2237345 2213850 2139871 2471331 2333141 1461896 1071759 2018296 3290312
42695C290312j8161j456357j577439n57109M63369P37548L10997k70461m25425
42686D97274j22146L8137k91792n44465p8710O68832P23697N3310m38722l16834
42676A88581k4350J29549L43584N15850J29609p10270j128366q09966n29977q20636
42666b716392j037158m36472N94903J125545Q79880K40158l39100m09787K22253
42657a876170Q20671K62785j088093j285272L81775J799444Q72259j158651j364447
42648b635699N28231J875986J195754J858p2961L44817R9512l33751o0386K97560
42638A240921k85401j115744o64943Q38485J480720L69678j223337j760428j297856
42629b417905r15391j072906j154074l85846J100759K135769J613485j00503j266386
$$ plain form
42695 3290312 3272151 1815794 238355 -318754 144615 882163 1193160 922699 497274
42686 497274 375128 413265 121473 -422992 -501702 167130 890827 944137 505415 188581
42676 188581 164231 293780 637364 1153214 1282823 572553 -555813 -1365779 -1895756 -2716392
42666 -2716392 -3753550 -4190022 -3595119 -2469574 -1589694 -1349536 -1688636 -2098423 -1876170
42657 -1876170 -1055499 -792714 -1880807 -3166079 -2784304 -984860 -112601 -1271252 -2635699
42648 -2635699 -2107468 -231482 964272 966130 893169 1237986 1337498 1003747 943361 1240921
42638 1240921 955520 -160224 -825167 13318 1494038 1863716 640379 -1120049 -2417905
42629 -2417905 -3333296 -4406202 -5560276 -5946122 -4845363 -2709594 -1096109 -1196612 -2462998
42620b462998p09135P36835J335079O52965j44561m7757O50735J079597Q58279
42611A949039J40521p57049j320375q77962P39001K596743L112554J429887j523212
42602E489147l510885k951516n77537J219447R39146n17149j189024m07382P70879
42593g34874J111796M54127m93469r62617o79752m7172K29968j9568j88213J76217
42583a153557N94270L92961j57392k18952L20225P40702N76823L6308n66375j001264
42573d36251q52250O2662J034490J131537N09754J10870J26141o0656l60244J26347
42563A392400J262672J426945j86049k011603j996566k28376J381397J445535
42555B486355J89783j270173j828600j004239N23349J357192R63575K52879N0229
$$ plain form
42620 -2462998 -3172133 -2435298 -1100219 -447254 -591815 -639572 11163 1090760 1949039
42611 1949039 2089560 1332511 12136 -865826 -126825 2469918 5582472 7012359 5489147
42602 5489147 1978262 -973254 -1550791 -331344 607802 90653 -1098371 -1505753 -734874
42593 -734874 376922 831049 337580 -625037 -1304789 -1351961 -1121993 -1141561 -1329774 -1153557
42583 -1153557 -559287 -166326 -323718 -542670 -222445 518257 1095080 1131388 565013 -436251
42573 -436251 -1288501 -1225839 -191349 940188 1449942 1560812 1686953 1626297 1266053 1392400
42563 1392400 2655072 4082017 3895968 1884365 -112201 -340577 1040820 2486355
42555 2486355 2676138 1405965 -422635 -1426874 -903525 453667 1417242 1670121 1720350
42546A720350q7501o70419r55601j74348P41050K93223j159788j786365r19383
42537b998782K82937P77020O45844J21972p19192j077465l7683J468490J202488
42528c34371j033825k475477j134251J231235J668996K48863m65960N34579J586448
42519a73763J370232Q11836J112206J577805P74444j052375k101978j386128P8958
42510A011237O61019J3658q20861q66978k30993L91458P06433Q76059Q70596M48982
42500C060610j79330l74208N170L42264K63697J72805K97543L9036r06034j530020
42490A191533p88674O00943J002590K91870p5498M41944N59203n85228j752058
42481H86625j328342K84906J301504R43505l9462q34313j275845j242431n69520
$$ plain form
42546 1720350 1632849 962430 6829 -167519 573531 866754 -293034 -2079399 -2998782
42537 -2998782 -2715845 -1938825 -1292981 -1171009 -1890201 -2967666 -3005349 -1536859 -334371
42528 -334371 -1368196 -3843673 -4977924 -3746689 -2077693 -1828830 -2294790 -1760211 -173763
42519 -173763 1196469 2008305 3120511 4698316 5472760 4420385 2318407 932279 1011237
42510 1011237 1672256 1685914 865053 -1925 -232918 158540 864973 1741032 2611628 3060610
42500 3060610 2881280 2507072 2512242 2854506 3118203 3291008 3588551 3627587 2721553 1191533
42490 1191533 402859 1003802 2006392 2298262 2222764 2664708 3223911 2638683 886625
42481 886625 -441717 -156811 1144693 2088198 2048736 1214423 -61422 -1303853 -1873373
42472a873373L07579O38110M42277L91649M97351n912j159939j803431j213521
42463c779210k50079n8774m36709m04608K39893R19292J296724J294012O17524
42454e61935n64231r73873K61965J768361J407941l65918q18345P90625J685553
42445B630143j00252k157716j099030J967263K730316J17308k141530j276654
42437F69848N34454R793j994141k016847O05884K971289K936830J441122J42802
42428E301034q03985j702607k057989j666861j490486k047945k081053l63146
42420f913038J952881K509472R93537m61034l15761M78800L43062m32739l19544
42411b164364Q63637J451279L48868j168169j030236P25266J828649P66118j215361
$$ plain form
42472 -1873373 -1565794 -927684 -485407 -93758 403593 397681 -762258 -2565689 -3779210
42463 -3779210 -4029289 -4088063 -4524772 -4929380 -4689487 -3770195 -2473471 -1179459 -561935
42454 -561935 -1126166 -2100039 -1838074 -69713 1338228 972310 153965 944590 2630143
42445 2630143 2529891 372175 -726855 1240408 3970724 4088032 1946502 669848
42437 669848 1204302 1214095 -780046 -2796893 -2191009 780280 3717110 5158232 5301034
42428 5301034 4497049 2794442 736453 -930408 -2420894 -4468839 -6549892 -6913038
42420 -6913038 -4960157 -2450685 -1457148 -1918182 -2233943 -1755143 -1412081 -1844820 -2164364
42411 -2164364 -1300727 150552 499420 -668749 -1698985 -973719 854930 1621048 405687
42402D05687j864289q63973J75965K66188J08411M46186P93129N20751P0347Q9979
42392A48381J96993k80147r04748o96152J94984O02781J45004k27682K57881J085453
42382E22748J288423P24148L7307k24339n2416K48044M59321O37339Q57854P95579
42372E294008j9584j280946j838338j131359j33153q0147p71629j088699p05438
42363a755285q7518P69129K063633K850738J795086m69195j558633n76253N64580
42354C596282k4827j597224k165563j217219K38673J292596J583058J030527K22090
42345B958393J66621P53793O31784m44122p70267M21819J123433l37174k113731
42336B390549j532351M19793O19085r61837j269069N65003J780234O60593r02845
$$ plain form
42402 405687 -1458602 -2322575 -2146610 -1880422 -1772011 -1325825 -532696 -11945 58402 148381
42392 148381 345374 65227 -839521 -1535673 -1340689 -737908 -592904 -820586 -562705 522748
42382 522748 1811171 2535319 2572626 2348287 2295871 2543915 3003236 3640575 4498429 5294008
42372 5294008 5274424 3993478 2155140 1023781 890628 810481 38852 -1049847 -1755285
42363 -1755285 -1842803 -1073674 989959 3840697 5635783 5166588 3607955 3031702 3596282
42354 3596282 3571455 1974231 -191332 -1408551 -1169878 122718 1705776 2736303 2958393
42345 2958393 3125014 3878807 4510591 4066469 3296202 3718021 4841454 4504280 2390549
42336 2390549 858198 1277991 1897076 935239 -333830 231173 2011407 2672000 1769155
42327A769155r60756m33764o59719q57247j86913J44893p99367j462768m10699
42318c857185P97570J37550j173631o05997J273922J644842O6640j015888l56797
42309c088974N65860M75634J825j46449k54604j51544J003681K631582K615918
42300C652929L76831j832545j889542m35896O13307O76365L43306q9719n44346
42291H70690n52656K7757L64861k70582j325063j619061o85224R78945K313046
42282A02713K128664J67851j981254k232518o22577P52235P21077K38434J12553
42273f12822k89052j018496n89992J229806J923733j05879k298030j325350J682509
42264a403573K717249R40870n76192k21008m4125j483800k485168j042726J136969
$$ plain form
42327 1769155 808399 374635 -285084 -1142331 -1329244 -1184351 -1983718 -3446486 -3857185
42318 -3857185 -3059615 -2922065 -4095696 -4701693 -3427771 -1782929 -1716289 -2732177 -3088974
42309 -3088974 -2523114 -2047480 -2045655 -2192104 -2446708 -2598252 -1594571 1037011 3652929
42300 3652929 4029760 2197215 307673 -128223 485084 1161449 1504755 1415036 870690
42291 870690 318034 345791 710652 440070 -884993 -2504054 -3189278 -2210333 102713
42282 102713 2231377 2399228 417974 -1814544 -2437121 -1684886 -963809 -725375 -612822
42273 -612822 -901874 -1920370 -2510362 -1280556 643177 537298 -1760732 -3086082 -1403573
42264 -1403573 1313676 2254546 1678354 1457346 1413221 -70579 -2555747 -3598473 -2461504
42255b461504J217374l28554p07832P22271J770119J055234j66790m01724j51885
42246E46709o23972j460892j194717L78124J539532Q19546q82073j235881M65519
42237a648105K170434J641133n75082j893929j105529L44863O59533j20275q48234
42228a375191j027551r23742p13103l83616L8974P20276J784757K437417J428905
42219A987126q64736k127323j048148O89473R36863L37752Q56930J976554J255692
42210D000183j344162k771809j445921L05269j604j230055q85666O72365J084995
42201a616405R3204j79993J024678J860648J080861J11583N87465J558448R31811
42192E452300j165549k259462p99277J732668K553556Q32860j482231k114291
$$ plain form
42255 -2461504 -1244130 -1572684 -2280516 -1558245 211874 1267108 1100318 698594 546709
42246 546709 -77263 -1538155 -2732872 -2354748 -815216 4330 -877743 -2113624 -1648105
42237 -1648105 522329 2163462 1588380 -305549 -1411078 -1066215 -406682 -526957 -1375191
42228 -1375191 -2402742 -3326484 -4039587 -4423203 -4384229 -3663953 -1879196 558221 1987126
42219 1987126 1122390 -1004933 -2053081 -1363608 -426745 -88993 767937 2744491 4000183
42210 4000183 2656021 -115788 -1561709 -1256440 -1258044 -2488099 -3373765 -2701400 -1616405
42201 -1616405 -1523201 -1703194 -678516 1182132 2262993 2374576 2962041 4520489 5452300
42192 5452300 4286751 2027289 1228012 2960680 5514236 6347096 4864865 2750574
42184B750574j072652j58633k19365k31001M53377N24767j170759l095980k699603
42175d919275j91932J623284J378691O53987Q94204J239382O16377j97954k33596
42166H63168j82359p59264r07772K45630J180931K09043j338164r70411P43833
42157i15365R47738p92049j794686o32091R51325J319551J173356J234434M88225
42148A980438j483687k728088j507466J056752K719057K878981J986576O6236
42140D968799k138846k388356J55743K670730K045466n78137j561249k83396L89833
42131C280587r51744k257542j730600n36675l77820p27623k39867P43405Q72072
42122a925807o488p92851p13980Q3037J034009J506418J114936K12782m10114
$$ plain form
42184 2750574 1677922 1519289 1299924 1068923 1522300 2047067 876308 -2219672 -4919275
42175 -4919275 -5111207 -3487923 -2109232 -1455245 -561041 678341 1294718 1096764 863168
42166 863168 680809 -78455 -986227 -740597 440334 649377 -688787 -1659198 -915365
42157 -915365 32373 -759676 -2554362 -3186453 -2235128 -915577 257779 1492213 1980438
42148 1980438 496751 -2231337 -3738803 -2682051 37006 2915987 4902563 4968799
42140 4968799 2829953 441597 597340 3268070 5313536 4735399 3174150 2890754 3280587
42131 3280587 2328843 71301 -1659299 -2195974 -2573794 -3301417 -3541284 -2797879 -1925807
42122 -1925807 -1932295 -2725146 -3439126 -3356089 -2322080 -815662 299274 512056 101942
42113A01942n65596p17952q87852n22739K76859N88710K22820K33064J141642
42104a29102J788999R60049o84138j387986n52167O97806R74461P4553r02549
42095H39926o89552O36937J480820P15811n69052n52101M23194K93183j248493
42086A330673j977553o79272Q09804N72609m12050k17599P79247Q75404M4366
42077A125629m06365k90368l06068j02533R62952J784229R26667l65826L59097
42068C687414K345945K111849j016249l382062k463513m89816l96414j207220
42060h10066m78709J000725O29991j184647j433378N60864K129427J579831L50105
42051B344143o1233m15678j514118k091071q69546J002574J555616Q25079K09219
$$ plain form
42113 101942 -463654 -1181606 -2069458 -2592197 -2315338 -1726628 -1503808 -1270744 -129102
42104 -129102 1659897 2619946 1935808 547822 -4345 693461 1667922 1742475 839926
42095 839926 150374 787311 2268131 2983942 2414890 1862789 2285983 2579166 1330673
42086 1330673 -646880 -1326152 -516348 56261 -355789 -573388 205859 1081263 1125629
42077 1125629 719264 428896 122828 20295 983247 2767476 3694143 3328317 3687414
42068 3687414 6033359 8145208 7128959 3746897 1283384 793568 397154 -810066
42060 -810066 -1288775 -288050 341941 -842706 -2276084 -1715220 414207 1994038 2344143
42051 2344143 2282910 1867232 353114 -1737957 -2607503 -1604929 -49313 775766 984985
42042I84985O736m39555q54252l59191O33897Q90311O25720J195955K289046J745651
42032F719303r33721l092632k462667m24698K48375m56650l63964Q73638J152177
42023A259161m05324j798943j285855L654J96176k69910K31644J415858J448479
42014G94940J03939p12370L3440R68006O24962l47239n25719o6889k30564j181338
42004e38832j735797j158046K0129J027929J631513J700768J016170r4407p67813
41995A101614p50250q10231j441173j843526j004954O73126J759728J613317R00879
41986A98530L21099k02784p69385q74820j96089O10293O57443O3030k82629j3287
41976d88599L85551N35104O55901Q23062M53372q17062k108316j955922j27167
$$ plain form
42042 984985 991721 552166 -302086 -661277 -27380 862931 1488651 2684606 4973652 6719303
42032 6719303 5785582 2692950 230283 -194415 53960 -402690 -766654 106984 1259161
42023 1259161 853837 -945106 -2230961 -2227307 -2031131 -2301041 -2069397 -653539 794940
42014 794940 898879 186509 219949 1187955 1812917 1465678 939959 873070 642506 -538832
42004 -538832 -2274629 -3432675 -3412546 -2384617 -753104 947664 1963834 1869427 1101614
41995 1101614 351364 -458867 -1900040 -3743566 -4748520 -4075394 -2315666 -702349 198530
41986 198530 519629 316845 -452540 -1327360 -1523449 -913156 -255713 -192683 -475312 -488599
41976 -488599 -103048 432056 1087957 1911019 2364391 1547329 -560987 -2516909 -2644076
41967b644076J812047K126068P79293p46272j273486r79106o34843n25847m82620
41958b568842l91279j16555O10212J572930J807770Q16942l67369m45908J29535
41949A047436j46696j181134j175006L39955J379797N91954m42292K04304J487152
41940B105470J028691r29370j912613j206699o65660j225126j330512J75823J927714
41931b032282K193462J355093P51952N14940P8504l24389k06733J6034k19576
41922B127005m94165k71759q3741n66632j102588p74847K0561L10903K50025O10130
41912B4892J116646Q73338J03161j30439K13984J16173o77857j245946j051396
41903f57444n98484l33356r6278J18238j0184k97265r4843N96114J003576P71582
$$ plain form
41967 -2644076 -832029 1294039 2073332 1327060 53574 -925532 -1560375 -2086222 -2568842
41958 -2568842 -2960121 -3076676 -2466464 -893534 914236 1731178 1363809 917901 1047436
41949 1047436 900740 -280394 -1455400 -1115445 264352 856306 414014 618318 2105470
41940 2105470 3134161 2204791 292178 -914521 -1580181 -2805307 -4135819 -3959996 -2032282
41931 -2032282 161180 1516273 2268225 2783165 2861669 2537280 2330547 2346581 2127005
41922 2127005 1632840 1361081 1277340 710708 -391880 -1166727 -1146166 -835263 -585238 24892
41912 24892 1141538 2014876 2118037 1987598 2201582 2317755 1639898 393952 -657444
41903 -657444 -1255928 -1589284 -1685562 -1567324 -1577508 -1874773 -1969616 -1373502 -369926 401656
41893D01656L74148K10574J72268J93668L38509K95062k94587r95597j020423
41884c24722m70474j43089j98664j20765J24830J23898O4103L70236M75362l57215
41874d56500j090164P4250K415141K846588L37388k170470j861160Q007M04565
41865E07645q41581j337777k51728O39421J15174p01994m63737L69069O73036
41856a292472N07036N69873O57615L8173q98348p47553P32962J671629L63017
41847A601932k056706k676934p05425J305582R93586n95899r37641O8085M63905
41838b539515p4994K39675J741377K122597R6760k167619k105948l99286N00128
41829b586825P9792k09366K86667Q52159J121983J384992J396696O47371l38262
$$ plain form
41893 401656 775804 986378 1158646 1352314 1690823 1985885 1691298 695701 -324722
41884 -324722 -795196 -938285 -1136949 -1257714 -1132884 -1008986 -944883 -574647 -99285 -456500
41874 -456500 -1546664 -1472414 942727 3789315 4126703 1956233 95073 103080 507645
41865 507645 -333936 -1671713 -1923441 -1284020 -1168846 -1870840 -2334577 -1965508 -1292472
41856 -1292472 -785436 -215563 442052 480225 -418123 -1165676 -432714 1238915 1601932
41847 1601932 -454774 -3131708 -3837133 -2531551 -1537965 -2133864 -3071505 -3003420 -2539515
41838 -2539515 -2614509 -2374834 -633457 1489140 1585900 -581719 -2687667 -3086953 -2586825
41829 -2586825 -2507033 -2716399 -2429732 -1577573 -455590 929402 2326098 2973469 2635207
41820B635207n68330k64485m15633r13315q49960m86457r66258j959398j675385
41811e464014K10182J609103R78627m32345n45733O22400J413622J051138K89889
41802b67131n0116L0230J88011J69201k18739q32862r46923j4432J268704J423636
41792G49579K2021j555164j715071n94400K99325J95262j37687P4290L33312n2177
41782b380710m63378J62355J387252J696655Q34442J52894L67946N88917J43648
41773B490021k93151k70129o06313j645058j991534n48312J437263K026804J240162
41764A839753L86766j74516p36668p29426L32824J181755M10907q26108k57992
41755A427295J692807K266211O16180j039695j001006j84479J20720R8519J0433
$$ plain form
41820 2635207 2066877 1802392 1386759 473444 -376516 -862973 -1829231 -3788629 -5464014
41811 -5464014 -5253832 -3644729 -2666102 -3098447 -3644180 -3021780 -1608158 -557020 -267131
41802 -267131 -317247 -287017 -99006 70195 -148544 -981406 -1928329 -1942761 -674057 749579
41792 749579 771600 -783564 -2498635 -3093035 -2793710 -2598448 -2736135 -2661845 -2328533 -2380710
41782 -2380710 -2844088 -2681733 -1294481 402174 1236616 1389510 1757456 2346373 2490021
41773 2490021 2196870 1926741 1320428 -324630 -2316164 -2864476 -1427213 599591 1839753
41764 1839753 2226519 2052003 1315335 585909 918733 2100488 2511395 1685287 1427295
41755 1427295 3120102 5386313 6002493 4962798 3961792 3777313 3898033 3996552 4006985
41746D006985o90135j672155j385768K64041J050903k44457j705460j260141J26391
41737a509796L34366m53549n51670J06258J16937o68252q47133J56616J237392
41728b078831J281364M02805n23118o16762M67437J917533K167192P75559p63896
41719C029283r96475m17215l22157p31647q22679n35440k44520L27566J247562
41710E34278J295636l49484k092533j763514k259N70329n75544j168991J30721
41701c421361J739766J748839M42390q28585j511594j473882l80009J270478J834339
41692e79619O00810q91897q84560K16281P61428L00801l11740o23803q96627r80682
41682c289608k90170R83494J702208J102287l54581j550081j654545o13022P74438
$$ plain form
41746 4006985 3316850 1644695 258927 522968 1573871 1329414 -376046 -1636187 -1509796
41737 -1509796 -1175430 -1628979 -2180649 -2074391 -1957454 -2625706 -3472839 -3316223 -2078831
41728 -2078831 -797467 -394662 -917780 -1534542 -1067105 850428 3017620 3793179 3029283
41719 3029283 2032808 1615593 1293436 561789 -260890 -796330 -1040850 -713284 534278
41710 534278 1829914 1480430 -612103 -2375617 -2377876 -1807547 -2383091 -3552082 -3421361
41701 -3421361 -1681595 67244 509634 -318951 -1830545 -3304427 -3684436 -2413958 -579619
41692 -579619 21191 -870706 -1755266 -1538985 -777557 -476756 -788496 -1412299 -2308926 -3289608
41682 -3289608 -3579778 -2596284 -894076 208211 -146370 -1696451 -3350996 -3964018 -3189580
41673c189580J369529Q12021K91K002P32704J276589J228599R66437P42331L47840
41663D288763k60595p66995j057232j272508j210475n10186L64279L33585o05072
41654f96436r46546J91213J459613J074206m71895j097961k43085N55526L61684
41645A86319J43457O56984R67886L48782j15074M54737O82832q27982k457245
41636D0696j584472R72322J728495j17428j446111k91385J116311K34226j678361
41627a025707j874281m55683M46066L96484O24190J119712O96542l69393n16719
41618i58789K38862K01990r14806j266229Q9364J640768J819226J022951K62392
41609B135729m39004j136927j064258j2798O66488q0753j122659o45152J053033
$$ plain form
41673 -3189580 -1820051 -1008030 -1007739 -1005737 -273033 1003556 2232155 3198592 3940923 4288763
41663 4288763 4028168 3261173 2203941 931433 -279042 -789228 -424949 -91364 -696436
41654 -696436 -1642982 -1451769 7844 1082050 610155 -487806 -730891 -175365 186319
41645 186319 329776 986760 1954646 2303428 2188354 2643091 3325923 2497941 40696
41636 40696 -1543776 -571454 1157041 1039613 -406498 -697883 418428 652654 -1025707
41627 -1025707 -2899988 -3355671 -2909605 -2513121 -1888931 -769219 -72677 -442070 -958789
41618 -958789 -719927 -517937 -1432743 -2698972 -2609608 -968840 850386 1873337 2135729
41609 2135729 1696725 559798 -504460 -517258 149230 68477 -1054182 -1699334 -646301
41600f46301J810369N39433j366765j843651n47607R81881J197645J93062o22841
41591c04775l35767M40096N98825P6080l33540l23542l29420n50862o43117m35313
41581b141335j36437K15673P13435J000719N99168j75664n01439k49241L22Q0480
41571e94319L80420Q96537J155910J013859N20629o80154k492240l321683j723076
41562d844117J023828K070104R25883j9782O17994J331849P42422k8687L32506
41553B152000Q54842J82020q21367o30482J44266j22203j157151j363187o28276
41544a389538k39496l77475K2728R69656J135837J82351m92301J14014J139575
41535A065351J148822k8227j190328j025535N12016J816053J220923o42372j265704
$$ plain form
41600 -646301 1164068 1703501 336736 -1506915 -2054522 -1072641 125004 318066 -304775
41591 -304775 -640542 -200446 398379 474459 140919 -182623 -512043 -1062905 -1706022 -2141335
41581 -2141335 -2277772 -2062099 -1348664 -347945 251223 75559 -425880 -675121 -674799 -594319
41571 -594319 -213899 682638 1838548 2852407 3373036 2692882 200642 -3121041 -4844117
41562 -4844117 -3820289 -1750185 -824302 -844084 -226090 1105759 1848181 1819494 2152000
41553 2152000 3006842 3188862 2367495 1737013 1881279 1759076 601925 -761262 -1389538
41544 -1389538 -1629034 -2006509 -1983781 -1014125 121712 304063 -188238 -74224 1065351
41535 1065351 2214173 2185946 995618 -29917 482099 2298152 3519075 2876703 1610999
41526A610999J70780J298405J61413j441850o84311J555464J867358l16193j997014
41517B225051j554940r08409j591792j943184k26058K000248K123134M02830q11367
41508b84487o91327l66636l63068N8174R74477J188852P5073j284106j417939
41499b110987j77670J264018J644810O71948p74966j442505r49734j07906K04893
41490a778099R7669J75396M25868L04592k36346n64995l52140j20356m44475r67844
41480c460730p31682N02052J706163J700103N82645m21679m93547N142M05573
41471b05960O27058P58292M76136l65301j068861q55153J6677O32819O06252J52678
41461G74637n50329j163298q26594P88317K321407J946030k13915k109687k333648
$$ plain form
41526 1610999 1781779 3080184 3241597 1799747 1115436 2670900 4538258 4222065 2225051
41517 2225051 670111 -238298 -1830090 -3773274 -3999332 -1999084 124050 526880 -284487
41508 -284487 -975814 -1342450 -1705518 -1647344 -672867 515985 591058 -693048 -2110987
41499 -2110987 -2288657 -1024639 620171 1292119 517153 -925352 -1875086 -1982992 -1778099
41490 -1778099 -1680430 -1505034 -1079166 -774574 -1010920 -1575915 -1928055 -2048411 -2492886 -3460730
41480 -3460730 -4192412 -3690360 -1984197 -284094 298551 -123128 -616675 -611533 -205960
41471 -205960 421098 1179390 1655526 1290225 221364 -633789 -617112 15707 621959 774637
41461 774637 224308 -938990 -1765584 -977267 1344140 3290170 3076255 966568 -1367080
41452a367080j456771n94506Q0743Q44681J450245J375008N50033n39130j167388
41443h24165q32408J40466P16616M43843J13683L70080M85382k35085p42958K29085
41433a35461J610883J232432o61656j641951r34844l47935q45286j012422Q749
41424b727491P72148K43500j82471P79949J889197J518547L86656O4529L42057
41415C086621J60970k53775k43078l40723j030317j247042k01780P14383P1853
41406G17112j005281q18182j56735n75584j036190L92150K479704K169310m37066
41397A729238k128713j655517j018103j248937p47631J033697J868299N26348
41389a641319p68888K11353K196711K519641Q59202j083424k094861j886459m66091
$$ plain form
41452 -1367080 -2823851 -3418357 -3337614 -2492933 -1042688 332320 882353 343223 -824165
41443 -824165 -1656573 -1516107 -799491 -355648 -241965 128115 613497 378412 -364546 -135461
41433 -135461 1475422 2707854 2046198 404247 -530597 -878532 -1723818 -2736240 -2727491
41424 -2727491 -1955343 -1711843 -1894314 -1114365 774832 2293379 2680035 2744564 3086621
41415 3086621 3247591 2993816 2750738 2410015 1379698 132656 -69124 645259 717112
41406 717112 -288169 -1106351 -1263086 -1838670 -2874860 -2482710 -3006 2166304 1729238
41397 1729238 -399475 -2054992 -3073095 -4322032 -5069663 -4035966 -2167667 -1641319
41389 -1641319 -2410207 -2198854 -2143 2517498 3376700 2293276 198415 -1688044 -2154135
41380b154135J266015J586964J31831j208800q76592K41864O05994L68727L47484
41371C09352J54928p65025j461174q21555L21671L72297m44153n55510L75559
41362b513610J117019Q70670J02342m72380n36398p4785M04674R1925p74073o69640
41352b454256R29694K100826R15147j557130k550324j324876L47866J073280J197031
41343a322742J266687J026939L61953j84302k37658M2569M66815P63181L39100
41334B522542p90112j327635l37907R67546P70908m74873o98007M82245J315938
41325B430645R23503M38580O49957P24607P1612n88998r21130j676003k648366
41316e95593k104807K77979J980984J047699q68548j062681J23726L23526p68728
$$ plain form
41380 -2154135 -888120 698844 830675 -378125 -1254717 -1012853 -406859 -38132 309352
41371 309352 464280 -300745 -1761919 -2583474 -2261803 -1889506 -2333659 -2889169 -2513610
41362 -2513610 -1396591 -525921 -423579 -895959 -1432357 -1507142 -1102468 -1010543 -1784616 -2454256
41352 -2454256 -1524562 576264 1491411 -65719 -2616043 -3940919 -3593053 -2519773 -1322742
41343 -1322742 -56055 970884 1332837 1148535 910877 953446 1420261 2183442 2522542
41334 2522542 1732430 404795 66888 1034434 1805342 1330469 632462 1114707 2430645
41325 2430645 3354148 3792728 4442685 5167292 5238904 4649906 3728776 2052773 -595593
41316 -595593 -2700400 -2422421 -441437 606262 -262286 -1324967 -1201241 -877715 -1646443
41307a646443j157475o3385J026418J036860O36996M23751k0865n75691j80455
41298e20289J066189J377944O5765r97264k40382R76948N88762p21265p54418
41289H41990L69837M59842p91623j125805K52520R07198q65307k776149j747680
41280d475177J283433K657962J245195n95894j125324j189305j487428q98975
41272d585513R86979K176412J131737n35737m65222P64505P83825o26722j326235
41263a695971k88472J137070J670600J664252J655631J203248J8196j124223j479698
41254B760633j360973j375016j424556j038537j24961R14855J370098O29472r28770
41245e77755j802822j085773J22774K80669j45235M71354J937154K267812Q49763
$$ plain form
41307 -1646443 -2803918 -2867303 -1840885 -804025 -167029 256722 235857 -339834 -520289
41298 -520289 545900 1923844 1989609 992345 751963 1728911 2317673 1596408 841990
41289 841990 1211827 1671669 880046 -245759 6761 913959 48652 -2727497 -4475177
41280 -4475177 -3191744 -533782 711413 115519 -1009805 -2199110 -3686538 -4585513
41272 -4585513 -3598534 -1422122 -290385 -826122 -1291344 -526839 256986 -369736 -1695971
41263 -1695971 -1984443 -847373 823227 2487479 4143110 5346358 5364554 4240331 2760633
41254 2760633 1399660 24644 -1399912 -2438449 -2563410 -1648555 -278457 351015 -577755
41245 -577755 -2380577 -3466350 -3343576 -3062907 -3208142 -2736788 -799634 1468178 2317941
41236B317941o58420j075875j103501j261292q02094K17832K06108j083919j283194
41227d526414R47594L094858K118422r77662k590629j469380M26340J301834J179905
41218d95132N63581j44846n3189J250126K325143J496419m74450j404397r50440
41209B112815n50520n18619J24273J020146N59261j078081j777756r20760j32471
41200a161712M2726J093557L025621L147585K92103k604463k517134n72017K69935
41191A016201k76114m36891P5591J18881k59802n5866M38136J29361n94830m43241
41181b88574L45584M49897n9460n7259J63301o77828j996114j597012P96725K716756
41171b03984K350679O76790m90663o42618q9227P73199J007659k17986j857980
$$ plain form
41236 2317941 1659521 583646 -519855 -1781147 -2583241 -2365409 -2159301 -3243220 -4526414
41227 -4526414 -3578820 -483962 1634460 656798 -1933831 -3403211 -2976871 -1675037 -495132
41218 -495132 68449 -76397 -129586 1120540 3445683 4942102 4467652 3063255 2112815
41209 2112815 1562295 1043676 1167949 2188095 2747356 1669275 -108481 -1029241 -1161712
41200 -1161712 -1118986 -25429 3000192 6147777 6439880 3835417 1318283 746266 1016201
41191 1016201 740087 303196 378787 497668 237866 182000 620136 749497 154667 -288574
41181 -288574 57010 506907 447447 390188 553489 -124339 -2120453 -3717465 -2920740 -203984
41171 -203984 2146695 2823485 2332822 1690204 1600977 2374176 3381835 3163849 1305869
41162A305869j739054K38624J662334J126301m1329n54966j145348k195489j972975
41153c316033M32390K508587J515747j139206j731184L91221K240354J755248
41145B657124P6154r75929j122266p37643P9652P94208N64961k58295l59505L54555
41135A073016M99258l35683p42052J04136J020829Q55356K54602J68723J61438
41126C059623l53856o33587j8835M19755m57058j540933r56894P27729J078733
41117A324677m56617j633481p85787Q42926J158611J31608o32533l54169K03304
41108b01461K10161r3174K8813O15783Q23954M4820j030627j069878m091N95925
41098g9775k09900r88227J23413K259205K554723K42763k001443j752376j07871
$$ plain form
41162 1305869 -433185 -194561 1467773 2594074 2552745 1997779 852431 -1343058 -3316033
41153 -3316033 -2883643 -375056 1140691 1485 -1729699 -1338478 901876 2657124
41145 2657124 2733278 1757349 635083 -102560 -22908 771300 1336261 1077966 718461 1073016
41135 1073016 1572274 1236591 494539 598675 1619504 2474860 2729462 2898185 3059623
41126 3059623 2705767 2072180 2053345 2473100 2016042 475109 -481785 245944 1324677
41117 1324677 868060 -765421 -1551208 -708282 450329 581937 -50596 -404765 -201461
41108 -201461 8700 -84474 -55661 560122 1384076 1428896 398269 -671609 -675700 -79775
41098 -79775 -289675 -1277902 -1154489 1104716 3659439 3902202 1900759 148383 40512
41089D0512K65425r28765j626620q18211J41322n3294o41365j20344J407623K289186
41079d4531J442804l71140j530569j356527n96168j89376m5382M99545J292367
41070h98977J293409J11785j205235j414920m44842R90777K334181L005354K198909
41061E970441P2705j539594j117515K19388R4475j494068j958251q3187J878577
41052B042971J421223n52871j198429Q9874J102107K69770j293200j723712q41230
41043f83497K31381Q11545R72388P12389j10551j118112j530048j114752m70550
41034b299807j56340K104M30302R93424J145169P53065K51622r1277n18151j109829
41024e99718j278622m92687P64710J411936J114553O20714O55925J027245J056690
$$ plain form
41089 40512 305937 -622828 -2249448 -3067659 -2926337 -2979631 -3620996 -3741340 -2333717 -44531
41079 -44531 1398273 1027133 -503436 -1859963 -2456131 -2645507 -2690889 -2191344 -898977
41070 -898977 394432 506217 -699018 -2113938 -2558780 -1568003 766178 3771532 5970441
41061 5970441 6043146 4503552 3386037 3605425 3699900 2205832 247581 164394 2042971
41052 2042971 3464194 2911323 1712894 1802768 2904875 3174645 1881445 157733 -683497
41043 -683497 -452116 359429 1331817 2044206 1933655 815543 -714505 -1829257 -2299807
41034 -2299807 -2456147 -2454043 -2023741 -1030317 114852 867917 1119539 1028262 510111 -599718
41024 -599718 -1878340 -2371027 -1606317 -194381 920172 1540886 2196811 3224056 4280746
41015D280746M95962k66061o83114n78951l19564m05386p31573n61768L54993
41006A585284J076415O48880l51093n60921M691q9191j315348k231949j614485
40997b847717k18490N47825N56125M60525L41212J21135L53645J139047J175487
40988A628794l81718j892299j135377J192858K194773R83694k63821K9037O06395
40979B962336m1970j082789j019028k82461j93038m98768j3555R60687Q97690
40970A689104m15519j413581j054542j24834J90780o5341J7406Q82551J939061
40961A645085K069990P44140j134040j898556j102648j88431m27205r88504l25623
40952a605792J144059J492258L06584o24473j06474P33277M14099o42427j000096
$$ plain form
41015 4280746 4776708 4510647 3827533 3248582 2929018 2523632 1792059 1230291 1585284
41006 1585284 2661699 3310579 2959486 2398565 2403256 2314065 998717 -1233232 -2847717
40997 -2847717 -3066207 -2518382 -1962257 -1501732 -1160520 -1039385 -685740 453307 1628794
40988 1628794 1247076 -645223 -1780600 -587742 1607031 2590725 2326904 2355941 2962336
40979 2962336 2920366 1837577 818549 536088 343050 -155718 -169273 791414 1689104
40970 1689104 1273585 -139996 -1194538 -1319372 -1128592 -1193933 -1176527 -293976 1645085
40961 1645085 3715075 4459215 3325175 1426619 323971 135540 -291665 -1280169 -1605792
40952 -1605792 -461733 1030525 1337109 712636 606162 1339439 1753538 1111111 111015
40943A11015l15182O36659J279562J471973J073434L55160K21175R01025J080538
40934F815359l20598k083011k075720m63365L74856o23680j684413r88539P32938
40925c16173J604161J221146M04239n78431j809046k405065j294993P97474J843365
40916e33323J160641Q3443k41299j54730j40330J69789P99161P61576k35696p54344
40906I14888K52798J402084P53158j025467j427140J41822J463659P61656r65649
40897B271809j664423q63113L72687J068492R43578J40562p56294r70430m87511
40888E5357k22592o68445j059799n62377M17768R68782J102580J431897J809260
40879C272431J388005J9564j279183j411312k65062J269280J971289J219163l09339
$$ plain form
40943 111015 -204167 432492 1712054 3184027 4257461 4612621 4833796 5734821 6815359
40934 6815359 6494761 4411750 2336030 1872665 2247521 1623841 -60572 -1049111 -316173
40925 -316173 1287988 2509134 2913373 2334942 525896 -1879169 -3174162 -2376688 -533323
40916 -533323 627318 710761 469462 314732 174402 344191 1143352 1904928 1669232 914888
40906 914888 1167686 2569770 3322928 2297461 870321 1012143 2475802 3237458 2271809
40897 2271809 607386 -255727 116960 1185452 2129030 2269592 1513298 542868 55357
40888 55357 -167235 -835680 -1895479 -2457856 -2040088 -1071306 31274 1463171 3272431
40879 3272431 4660436 4680000 3400817 1989505 1724443 2993723 4965012 6184175 5874836
40870E874836j161362p67124j15173k23523n80500m5518J177223J673622Q30608
40861F663089m27112j033679r09487m81079n378L07563K83100K04078N46924J072445
40851F220464R68311J94032j76084N43337J553610J626563P02805k28905m76417
40842A0927716k51233j50964n31407j259346j757389j462584m70839N10949J004981
40833F559884J169901J188512Q05988j03772j002697j281295j044982p55108m20034
40824E116397J78743O93436M91456k16769l70063M61200J258192Q22648n38532
40815G896708j339562q60468j3976J6347o16600p81130j3224R39948J244423R49155
40805G421621N76564L40940J99294K34316M77996O26784L98552m524j51516J00010
$$ plain form
40870 5874836 4713474 3946350 3831177 3607654 3027154 2981636 4158859 5832481 6663089
40861 6663089 6235977 5202298 4292811 3811732 3806354 4113917 4397017 4601095 5148019 6220464
40851 6220464 7188775 7382807 7206723 7750060 9303670 10930233 11633038 11404133 10927716
40842 10927716 10676483 10525519 9994112 8734766 6977377 5514793 5043954 5554903 6559884
40833 6559884 7729785 8918297 9724285 9620513 8617816 7336521 6291539 5536431 5116397
40824 5116397 5295140 5988576 6480032 6263263 5893200 6354400 7612592 8435240 7896708
40815 7896708 6557146 5696678 5682702 5699049 5082449 4301319 4288095 5228043 6472466 7421621
40805 7421621 7998185 8339125 8538419 8772735 9250731 9877515 10276067 10271543 10120027 10220037
40795A0220037O30120J290545J802134J824492J510921J524718K057767K410142
40787B3270876K124889J871497K422334L459390M402327N691465P919410J0303261
40779F1465449J1663692J2523530J4270137J6233586J5758084J1750878O184285
40772A49849641J219280l251160p986263j2111230j4146337j4141021j3148911
40765H6283999j1478876r050852o742920n707576n706111n531844m795390m045627
40757C3224803l473553k783597k109950j855066j807211j493896j136412j199123
40749A7365995j379282j187732j065855j597904k068661j378148j11296M8014
40741H625131j053502j792104j363380p79594p59167m77535O07292J290596L50848
$$ plain form
40795 10220037 10850157 12140702 13942836 15767328 17278249 18802967 20860734 23270876
40787 23270876 25395765 27267262 29689596 33148986 37551313 43242778 51162188 61465449
40779 61465449 73129141 85652671 99922808 116156394 131914478 143665356 149849641
40772 149849641 151068921 147817761 139831498 127720268 113573931 99432910 86283999
40765 86283999 74805123 65754271 59011351 53303775 47597664 42065820 37270430 33224803
40757 33224803 29751250 26967653 24857703 23002637 21195426 19701530 18565118 17365995
40749 17365995 15986713 14798981 13733126 12135222 10066561 8688413 8577117 8625131
40741 8625131 7571629 5779525 4416145 3636551 2877384 2399849 3007141 4297737 4648585
40732D648585j323848j767844n44606R11246J321075Q93862N66613O61088O59134
40723F025305J18047n50982o05058k44975n78565j794960k301870q17090J402568
40714F52420J991535P51894l10596j52096J60602j61272k38568N65757J280996
40705D540672J085803P15523P67320K96515j236773k220228j167960N34220N53958
40696C869050o12783m79971J167352J744403M2385j763546j427324K41267J116397
40687C897230R35737Q70777J003520L10231j103853j631668m66255J042976J105265
40678E963960j84523j068627m11915R95477J561884P70676m74080j086686q28979
40669E237187j19742N83903R49757P97867L76761K71672N93592N54833n88673
$$ plain form
40732 4648585 3324737 1556893 1012287 1923533 3244608 4138470 4705083 5366171 6025305
40723 6025305 6143352 5592370 4987312 4742337 4163772 2368812 66942 -750148 652420
40714 652420 2643955 3395849 3085253 2933157 3093759 2932487 2693919 3259676 4540672
40705 4540672 5626475 6341998 7109318 7405833 6169060 3948832 2780872 3315092 3869050
40696 3869050 3256267 2776296 3943648 5688051 5730436 3966890 2539566 2780833 3897230
40687 3897230 4832967 5703744 6707264 7017495 5913642 4281974 3815719 4858695 5963960
40678 5963960 5779437 4710810 4298895 5294372 6856256 7626932 7152852 6066166 5237187
40669 5237187 5117445 5701348 6651105 7448972 7825733 8097405 8690997 9245830 8657157
40660H657157k299763l045410j940922K35822J800372J770623O95639l9265K50797
40651F085050Q29368O25029j74518l36533N28493J254005Q20822j29897l71689
40642I130130J1692o9234q77929j495935j252084n14410O055o0723p15268j447765
40632B714529j273733J45213J541046J295967l60930j609215j540598j014675
40624a02396p68207k98321O62313J144196N49229q5539K02598N13579l48466j497857
40614b8871j151345L91467J170073Q14567R42713J888968J641088o45336k399640
40605B623684j083524J682812K084088m79227k660479j974634K02979J247364
40597A643063P18225j10599m69466l13209M34754J311103J001401p92617k071171
$$ plain form
40660 8657157 6357394 3311984 1371062 1606884 3407256 5177879 5873518 5834253 6085050
40651 6085050 6914418 7539447 7364929 7028396 7556889 8810894 9631716 9501819 9130130
40642 9130130 9141822 9072588 8194659 6698724 5446640 4932230 4938285 4877562 4162294 2714529
40632 2714529 1440796 1586009 3127055 4423022 4062092 2452877 912279 -102396
40624 -102396 -870603 -1168924 -506611 637585 1186814 1101275 1303873 1817452 1468986 -28871
40614 -28871 -1180216 -788749 381324 1195891 2138604 4027572 5668660 5023324 2623684
40605 2623684 1540160 3222972 5307060 4827833 2167354 192720 395699 1643063
40597 1643063 2361288 2250689 1781223 1468014 1902768 3213871 4215272 3422655 1351484
40588A351484r30194J446790K191390P15535r12720j404040j599306k028029j670544
40579b839634j62184J042120J039351R56918J533965J303528p73000k696341k018361
40570b613638K42683J049548p1708p79231L5368Q61533N39234o2492o0207M4467
40560h14443j56382r7100L27515L35928L9022O36295J935355J864765k49869k092890
40550A728196j735860n71855p39617j410696l50714J954318K717499J122870n76833
40541B137308n75602K39260L15186k13046k74687L36973R83436J237297J110598
40532E296723O78453j666q21795j586325j812350r04569Q55344J911036J024502
40523D639353r04354j699045o07253R22748J274207L78505q54058j740678j990591
$$ plain form
40588 1351484 421290 1868080 4059470 4775005 3862285 2458245 858939 -1169090 -2839634
40579 -2839634 -3001818 -1959698 -920347 36571 1570536 2874064 2101064 -595277 -2613638
40570 -2613638 -2370955 -1321407 -1393115 -2172346 -2136978 -1275445 -736211 -798703 -858910 -814443
40560 -814443 -970825 -1067925 -740410 -404482 -365460 270835 2206190 4070955 3821086 1728196
40550 1728196 -7664 -579519 -1319136 -2729832 -3080546 -1126228 1591271 2714141 2137308
40541 2137308 1561706 1800966 2116152 1903106 1628419 1965392 2948828 4186125 5296723
40532 5296723 5975176 5973510 5151715 3565390 1753040 848471 1703815 3614851 4639353
40523 4639353 3734999 2035954 1428701 2351449 3625656 4004161 3150103 1409425 -581166
40514e81166j533978p24834j32365J72245N37924Q53622N91486p1720j64894O01979
40504d51701J194975P06976l20399p38397l73281l4876k94764q68938j055673
40495b236078m51054N95824J169290P81777P9367p2154R805n71209j332201o66643
40485b693276J378217K341638O82183j590915j481182P57162K132620J281042
40477B807489o3746k62109n1620n26998q36417K69522J793215J527825n73510
40468D083651k040841j261468M07475P21325m55061j384353j026318j14386K23648
40459h46328j47628n92743n55826Q9789R64641J251706M36185q31414j295400
40450a527018p40757k17228k65782p4571P97106J113639j65938j666155j197557
$$ plain form
40514 -581166 -2115144 -2839978 -2972343 -2800098 -2262174 -1408552 -817066 -888786 -1053680 -451701
40504 -451701 743274 1450250 1129851 391454 18173 -16703 -311467 -1180405 -2236078
40495 -2236078 -2687132 -2091308 -922018 -140241 -60874 -133028 -123223 -694432 -2026633 -2693276
40485 -2693276 -1315059 1026579 1708762 117847 -1363335 -606173 1526447 2807489
40477 2807489 2743743 2481634 2430014 1903016 1066599 1336121 3129336 4657161 4083651
40468 4083651 2042810 781342 1188817 1910142 1455081 70728 -955590 -1069976 -846328
40459 -846328 -993956 -1586699 -2142525 -2052736 -1088095 163611 599796 -231618 -1527018
40450 -1527018 -2267775 -2485003 -2750785 -2825356 -2028250 -914611 -1080549 -2746704 -3944261
40441c944261Q22883J722766M94356q58290n77255M11185N75995L80344R93592
40432B1315J798230J286208l06343j294750j155574r56691j212676j101602j55040
40423c076923P81767Q50428L42649L2083J58032M72830O54460M30130j62359n83019
40413i9922l88445J30105N03287R02625J565838J844456R40165o99297j857688
40404B841124k098729j664605m24719J444539K304920P55863j708582k186585
40396g36774o25491J57952p96337j034892Q46610K462310J590379m5237J10108
40387A928628R47332j44567k319033k423533l18374R00626l1047r79040m39158
40378b878166L30314K17968J82885Q89950J122953J36875p03399k35182N81947
$$ plain form
40441 -3944261 -3121378 -1398612 -904256 -1762546 -2339801 -1928616 -1352621 -972277 21315
40432 21315 1819545 3105753 2799410 1504660 349086 -607605 -1820281 -2921883 -3076923
40423 -3076923 -2295156 -1444728 -1102079 -1069996 -911964 -439134 215326 645456 483097 -99922
40413 -99922 -488367 -358262 145025 1047650 2613488 4457944 5398109 4698812 2841124
40404 2841124 742395 -922210 -1346929 97610 2402530 3158393 1449811 -736774
40396 -736774 -1362265 -1204313 -2000650 -3035542 -2188932 273378 1863757 1818520 1928628
40387 1928628 2875960 2731393 412360 -2011173 -2329547 -1428921 -1459968 -2439008 -2878166
40378 -2878166 -2547852 -2329884 -2146999 -1257049 -134096 2779 -700620 -935802 -353855
40369c53855O11407M58936Q12632P38924n17576j657615j182491K19286R59738
40360H9386R27479P76163K13952r66750j422553q1346J597951J520756K12372
40351B867410l03209q1209q51750k386571k356989j78417J852048K042429J375709
40342A979451J082456N74768p46648j662334q87205P35978J426831Q35252j46928
40333C191621r64557j426376j029249K90050J328671R32455k51497o18867O4342
40324A516593M84936m6484m98874L01564J797531K188153O92020j309484j875990
40315C249965r98988n38164j337659j695328N163K216369J987349m96620j793036
40306E99051k63542J449486O04361j371989j308408O10700J233898n53710k225974
$$ plain form
40369 -353855 257552 716488 1529120 2268044 1750468 92853 -1089638 -870352 89386
40360 89386 1016865 1793028 2006980 1040230 -382323 -463669 1134282 2655038 2867410
40351 2867410 2564201 2482992 1631242 -755329 -3112318 -3290735 -1438687 603742 1979451
40342 1979451 3061907 3636675 2890027 1227693 340488 1076466 2503297 3338549 3191621
40333 3191621 2227064 800688 -228561 61489 1390160 2322615 2071118 1452251 1516593
40324 1516593 2001529 1955045 1456171 1757735 3555266 5743419 6435439 5125955 3249965
40315 3249965 2250977 1712813 375154 -1320174 -1315011 901358 2888707 2392087 599051
40306 599051 335509 1784995 2389356 1017367 -291041 319659 1553557 999847 -1226127
40297a226127j511920O11361J910905J940647J611396J063371k16482j618633
40289B564518j498692M98474K316213J647639j082778k900233j823063N92321
40281C14399J223539n20553k031967j211053P36516J288213J68838p18369l56500
40272a106937K22447k153m43211j11479P00964R50543N08989K93966P61756J100895
40262B875780L82949r15708j309448l45261N57744k0214j398665j641394k15515
40253b029732J471074K159594J919870J067073l64329j485901q17947J195373
40245C115075J834885j07338j993784r88679J486046J752700n66147k181391j255281
40236A096086K97713L46936m77209o63963l40599k42516N6773J073720J800189
$$ plain form
40297 -1226127 -2738047 -2126686 -215781 1724866 3336262 4399633 4183151 2564518
40289 2564518 1065826 1564300 3880513 5528152 4445374 1545141 -277922 314399
40281 314399 1537938 1017385 -1014582 -2225635 -1489119 -200906 -32068 -750437 -1106937
40272 -1106937 -884490 -886643 -1329854 -1441333 -740369 210174 719163 1013129 1774885 2875780
40262 2875780 3258729 2343021 1033573 688312 1246056 1225842 -172823 -1814217 -2029732
40253 -2029732 -558658 1600936 3520806 4587879 4223550 2737649 1919702 3115075
40245 3115075 4949960 4842622 2848838 1860159 3346205 5098905 4532758 2351367 1096086
40236 1096086 1393799 1740735 1263526 599563 258964 16448 73221 1146941 2947130
40227B947130R58035q10138j565074o25241O82228Q03594k57375j027229k19317
40218H86613J639145K530863J414043k04204k91387O63088M34761j241126k076261
40209C755535r38954K08080n76873k175420k277939p61953P37412J477861J817402
40200A265151J593499L65456j091429j379932m58549M69641Q24831R46623Q05119
40191C340410M0407p89074o29522K76907N80721J9100k02761L19083K40412j220937
40181A974746k461652j492621R97831K247211J064273o27571n05514J057219J828092
40172D082014J086205M92183J239607K000918R85587j128890k129240j536132
40164E092252r07607r93540q00739Q3234M60834k34026o77023J02337J010402
$$ plain form
40227 2947130 3905165 3095027 1529953 904712 1586940 2390534 2133159 1105930 886613
40218 886613 2525758 5056621 6470664 6266460 5975073 6638161 7072922 5831796 3755535
40209 3755535 2816581 3024661 2447788 272368 -2005571 -2767524 -2030112 -552251 1265151
40200 1265151 2858650 3224106 2132677 752745 294196 763837 1588668 2535291 3340410
40191 3340410 3380817 2591743 1962221 2239128 2819849 2838949 2636188 2955271 3195683 1974746
40181 1974746 -486906 -1979527 -981696 1265515 2329788 1702217 1196703 2253922 4082014
40172 4082014 5168219 5660402 6900009 8900927 9886514 8757624 6628384 5092252
40164 5092252 4184645 3191105 2390366 2473600 2934434 2700408 2023385 2125722 3136124
40155C136124Q62041L91666O52421R56754L00093m75965K8623J354174K013754
40146I219685J816639J504796J159186R70316K290575N383304P263428M835616
40138C4443545m24584m066802m586095m352521m667034l853805j325944K66771
40130A1433531r20336k684288k093853R3394R53141j21578j074598o34363K07936
40121E158986J65089n69982q64253p5615J338331K374953K611969K531541K344552
40112A5015571J166367j497815m006548m032754j667760O59957J383223J064755
40104H084996M44727n60756j488854j204910J00397P99896M05510K32987Q82715
40095G696708J268950Q56786N49214O41555L76633J63414J328535K919439K197802
$$ plain form
40155 3136124 3998165 4389831 5042252 5999006 6299099 5823134 5851757 7205931 9219685
40146 9219685 11036324 12541120 13700306 14670622 16961197 22344501 29607929 34443545
40138 34443545 34018961 29952159 25366064 21013543 16346509 12492704 11166760 11433531
40130 11433531 10513195 7828907 5735054 5828448 6781589 6660011 5585413 4951050 5158986
40121 5158986 5324075 4754093 3889840 3814225 5152556 7527509 10139478 12671019 15015571
40112 15015571 16181938 14684123 10677575 6644821 4977061 5637018 7020241 8084996
40104 8084996 8529723 7968967 6480113 5275203 5375600 6175496 6581006 6813993 7696708
40095 7696708 8965658 9822444 10371658 11013213 11389846 11553260 12881795 15801234 17999036
40086A7999036n65469j665516J03258J431831O07351P69425L790816N936607M151491
40077C2558830J980986L741580P150324Q157604Q995083J3885634K0677930K5905877
40069A23053848L4311209N0475784O1720878M5357009n65699m6686785o2641596
40062B05024648m9352132l0999132k2709006j9627616j4198674q768891p739840
40055E1629357q646889p224998m578657l766157l822577k179363O0164j89232
40047B1281648k777208m515170l708482j668369k17652J18292l30109j009051
40039G173899j334639j110113n90510J00138R34794J298693M88480q74402j265588
40030D820752m54985J61629j28593l55354J32117M03361k48664q65330n30328
$$ plain form
40086 17999036 17433567 15768051 15871309 17303140 17910491 18679916 22470732 28407339 32558830
40077 32558830 34539816 38281396 45431720 53589324 62584407 76470041 97147971 123053848
40069 123053848 157365057 207840841 269561719 314918728 314353029 267666244 205024648
40062 205024648 155672516 124673384 101964378 82336762 68138088 59369197 51629357
40055 51629357 42982468 35757470 31178813 27412656 23590079 21410716 21470880 21281648
40047 21281648 18504440 13989270 10280788 8612419 8394767 8513059 8182950 7173899
40039 7173899 5839260 4729147 4138637 4238775 5173569 6472262 6960742 6086340 4820752
40030 4820752 4365767 4527396 4398803 4043449 4175566 4578927 4330263 3464933 2934605
40021B934605q2271n45174j064519k37136J326575J689888M56786q30629j061841
40012B586284o83597l38201Q3849O09737O69139K2845o68058p33007l25095k5049
40002A198847j89796q66166j660269j581788K6912K079813K386912M49219j425167
39993D18517r53569R75968J564793J64340q52895K50857J914805J610333m27405
39984D665744j638875q52029L57367K93234n64002p59525j37113L04470J92299
39975A861570J82152O81639J140832Q32586k22398j314893j732748j308571m76650
39966c56481J94749N60184Q36175J047463R74018P17635P17975R56802Q12649
39957F461169J06726m25546k83391q6060n27582j134530j068918o17958p02605
$$ plain form
40021 2934605 2852334 2307160 1242641 1005505 2332080 4021968 4478754 3648125 2586284
40012 2586284 1902687 1564486 1648335 2258072 2927211 2950056 2281998 1548991 1223896 1198847
40002 1198847 1009051 142885 -1517384 -3099172 -3072260 -992447 1394465 1843684 418517
39993 418517 -535052 440916 2005709 2170049 1317154 1568011 3482816 5093149 4665744
39984 4665744 3026869 2174840 2532207 2825441 2261439 1501914 1364801 1669271 1861570
39975 1861570 2043722 2725361 3866193 4698779 4476381 3161488 1428740 120169 -356481
39966 -356481 -161732 398452 1234627 2282090 3256108 3973743 4691718 5648520 6461169
39957 6461169 6567895 6142349 5858958 5772898 5245316 4110786 3041868 2423910 1721305
39948A721305j250280j332949p87227l88180l63887p3862N69666O83841m7275
39939a268848n76042L7081J236534J788950J313514L63703m26881p25273n64357
39930A178381m52927q27316j112697k31258J498280K105765N26976j582093j843064
39921g39953k69869J054103J027389O27839Q09130Q72454k45831k042774k852186
39912a759698j905846k25011O23871K25083m49085l08579O80483J715286K193093
39903G89597K043224J246549j26151j246661r26078O67314J571544L36605j831418
39894B524525k459837j038780N11630O50087L8629K9902O19727Q96830O88227
39885B460940N74345O17119K07175p62465j498342j401500q80781o19132n30883
$$ plain form
39948 1721305 471025 -861924 -1649151 -2037331 -2401218 -2475080 -1905414 -1221573 -1268848
39939 -1268848 -1844890 -1807809 -571275 1217675 2531189 2894892 2468011 1742738 1178381
39930 1178381 725454 -101862 -1214559 -1445817 52463 2158228 2685204 1103111 -739953
39921 -739953 -1009822 44281 1071670 1699509 2508639 3381093 3135262 1092488 -1759698
39912 -1759698 -3665544 -3890555 -3266684 -3041601 -3490686 -3799265 -3118782 -1403496 789597
39903 789597 2832821 4079370 3953219 2706558 1780480 2447794 4019338 4355943 2524525
39894 2524525 64688 -974092 -462462 187625 226254 256156 875883 1772713 2460940
39885 2460940 3035285 3652404 3859579 3097114 1598772 197272 -683509 -1302641 -1833524
39876a833524q6246N64996N94230j93452p95297l62993M10759K15724p29458o87944
39866b903205J004928K550666J927736k60124j539870q68987L04262M50324n2433
39857F13297n9145L95978M36481p961q6676N61069J225189J073607N2659j232712
39847B971786k020490j781397o90316K33266P0903p44599p57810O14066K136195
39838C1604K250149J030197r5317l27553l03156p82844j385478j177192l7718
39829g97308J173303J602435J059476j08825j228972j485628n57946Q09841J434525
39820A900901J052701N03142L79559K18245n19871j346811j398819p77373l71471
39811c59797n06787o46063m61710l17346m04690k17122N61536J222428Q24197
$$ plain form
39876 -1833524 -1919770 -1354774 -760544 -953996 -1749293 -2112286 -1701527 -1485803 -2215261 -2903205
39866 -2903205 -1898277 652389 2580125 2320001 780131 -88856 215406 665730 613297
39857 613297 554152 950130 1386611 1378650 1291974 1853043 3078232 4151839 4204498 2971786
39847 2971786 951296 -830101 -1520417 -1287151 -1216248 -1960847 -2718657 -2104591 31604
39838 31604 2281753 3311950 3216633 2889080 2585924 1803080 417602 -759590 -797308
39829 -797308 375995 1978430 3037906 2929081 1700109 214481 -343465 466376 1900901
39820 1900901 2953602 3456744 3836303 4054548 3534677 2187866 789047 11674 -359797
39811 -359797 -866584 -1512647 -1974357 -2291703 -2696393 -2913515 -2351979 -1129551 -305354
39802c05354l88329j064933l85888Q73539J250973L47076p64621r51815l92332
39793a781684p2803k01795L9531R81188J642298J145733K29420K45421J008938
39784C236247R52243m83338j903241j911164r13123j98713n9742K01774Q54003
39775b25054J291351R31831q5630j076250j319786o14573L43499M88960l28601
39766e94253j048837q38701k00316N6232K54901J152169K237518K158579Q79811
39757D057103j2507L65199Q20496j29250k021987l051189k407975r91924N9814
39748c312220N85321R27949R96175L66978q53270j771686j574660n02274M02265
39739d735422N80750N47013Q99573J296902J079047M77546K32173K15952l24590
$$ plain form
39802 -305354 -693683 -1758616 -2144504 -1270965 -19992 327084 -437537 -1389352 -1781684
39793 -1781684 -1854487 -2056282 -2016751 -1035563 606735 1752468 1981888 2227309 3236247
39784 3236247 4188490 3705152 1801911 -109253 -1022376 -1221089 -1280831 -1079057 -225054
39775 -225054 1066297 1998128 1912498 836248 -483538 -1098111 -754612 -265652 -594253
39766 -594253 -1643090 -2481791 -2682107 -2625875 -2370974 -1218805 1018713 3177292 4057103
39757 4057103 4044596 4409795 5230291 5101041 3079054 27865 -2380110 -3372034 -3312220
39748 -3312220 -2726899 -1798950 -802775 -435797 -1289067 -3060753 -4635413 -5137687 -4735422
39739 -4735422 -4154672 -3607659 -2708086 -1411184 -332137 145409 377582 593534 268944
39730B68944j065264o14236J160760K279295J285597m57837o79130M54580Q23248
39721C455957j69291p90272q573P76530R2771j213137j432627o50037k29377l88011
39711e56067j58018M54459K06637j088372j722841m77444J409086J837894O39255
39702E44589m77002l71652L47988N97867J90428l66493o54821n02054J22832R28009
39692C59691J301023Q36792k34501j227375j454695o45300O44296J127575j608
39683G05898j804045k308113q63925R78422J504509R41919O37063Q33508O10180
39674A235416j89133m52053L94811J265784Q05602q49441k330277k512403j268669
39665c900363O37452J874429J387775l60754j441406m87072J578815K486533J130204
$$ plain form
39730 268944 -796320 -1410556 -249796 2029499 3315096 2857259 2178129 2632709 3455957
39721 3455957 3286666 2496394 2487821 3264351 3357122 2143985 711358 61321 -168056 -556067
39711 -556067 -714085 -259626 -52989 -1141361 -2864202 -3341646 -1932560 -94666 544589
39702 544589 67587 -304065 43923 641790 832218 465725 -189096 -691150 -568318 359691
39692 359691 1660714 2497506 2263005 1035630 -419065 -1064365 -420069 707506 705898
39683 705898 -1098147 -3406260 -4270185 -3291763 -1787254 -845335 -208272 625236 1235416
39674 1235416 1046283 594230 989041 2254825 3060427 2210986 -119291 -2631694 -3900363
39665 -3900363 -3262911 -1388482 -707 -361461 -1802867 -2289939 -711124 1775409 2905613
39656B905613j347805k771125j868097O14868K354893J570686q17274j911630
39648a269871m26450J471504J156377o44165j039648N03437J392873J29269j297664
39639b4338p00854P17693L06886j732386k532499q25168J305094J507205K16104
39630a762263m46564K54810R41470K25114j365506j925278m63575J740785K510311
39621b90696J389973Q6672n302L47810k54836j450905j727120r06142k85217l50136
39611c445899j54578O65522J046615M39024l2117N46507J219918P41895l30380
39602F96507o45317k75360k46125m65221K3697R33277P91169o05908j500343o13285
39592a906909J034210J557003N35102q55494j381920p96233J94130N97342J68904
$$ plain form
39656 2905613 1557808 -1213317 -3081414 -2466546 -111653 1459033 641759 -1269871
39648 -1269871 -1696321 -224817 931560 287395 -752253 -248816 1144057 1273326 -24338
39639 -24338 -725192 -7499 299387 -1432999 -3965498 -4790666 -3485572 -1978367 -1762263
39630 -1762263 -2208827 -1954017 -1012547 -787433 -2152939 -4078217 -4541792 -2801007 -290696
39621 -290696 1099277 1185949 1180647 1528457 1273621 -177284 -1904404 -2810546 -3095763 -3445899
39611 -3445899 -3600477 -2934955 -1888340 -1449316 -1481433 -934926 284992 1026887 696507
39602 696507 51190 -224170 -470295 -935516 -911819 21458 812627 206719 -1293624 -1906909
39592 -1906909 -872699 684304 1219406 363912 -1018008 -1814241 -1620111 -1022769 -853865
39583h53865j85433L25292Q96730J02796j603893j992199k75364J456565J213122
39574i16249j8154n9653R90494J201773N8335j041621j395550j740271k019494
39565d940390q18573J895751L568148K251056m60534j508925l78349Q54860P98520
39556A261564N4742n35633r46135r86998r9962J234558J453791J18512j205723
39547C48716j243343q41188j202430j526307k73640J899732K619704J218205l59690
39538F39759n57453j61727k99202l37736O03190J465392O82533r52117j129843
39529d7204L86915J309863L85204q16976o67232J9014j87124o89150j48604P39097
39519B83803J96208j367404j579876J64922J621803J149970P0077K20960R88062
$$ plain form
39583 -853865 -1039298 -714006 182724 285520 -1318373 -3310572 -3585936 -2129371 -916249
39574 -916249 -934403 -994056 -3562 1198211 1256546 214925 -1180625 -2920896 -4940390
39565 -4940390 -5758963 -3863212 -295064 1955992 1495458 -13467 -391816 463044 1261564
39556 1261564 1316306 780673 -165462 -1152460 -1252422 -17864 1435927 1554439 348716
39547 348716 -894627 -1735815 -2938245 -4464552 -4738192 -2838460 -218756 999449 639759
39538 639759 82306 -79421 -378623 -716359 -113169 1352223 2034756 1082639 -47204
39529 -47204 339711 1649574 2034778 1217802 550570 569584 382460 -306690 -455294 283803
39519 283803 480011 -887393 -2467269 -2302347 -680544 469426 539503 760463 1748525
39510A748525O18718p12401j224168l78532N37686O11433L46302K65978K4826
39501A838367n54266q25373l98565J03974P0154j52726o5127k0914n17045r91171
39491a512692l66349J301926K596650K335678Q36540o04718j100271q27320n49261
39482B110183p15102j040268r57444m20339m7694l46938r88916j090630j91468
39473c688616J161839J799370R90178o66820j545948o68135R19745J140792m33126
39464i90721j717415o97399J759653K839149J337185r99104j945391j368818o20670
39455b403531l94147k99815k5775K71611O02570J115727J389977P63953m08527
39446F12043q35379p7582O62742K51366o70261o68185K83351P40435j06291j287455
$$ plain form
39510 1748525 2367243 1654842 430674 52142 589828 1201261 1547563 1813541 1838367
39501 1838367 1284101 458728 60163 164137 234291 81565 16438 -4476 -521521 -1512692
39491 -1512692 -1879041 -577115 2019535 4355213 5191753 4587035 3486764 2659444 2110183
39482 2110183 1395081 354813 -602631 -1022970 -1070664 -1417602 -2406518 -3497148 -3688616
39473 -3688616 -2526777 -727407 262771 -404049 -1949997 -2618132 -1698387 -557595 -990721
39464 -990721 -2708136 -3405535 -1645882 1193267 2530452 1531348 -414043 -1782861 -2403531
39455 -2403531 -2797678 -3097493 -3123268 -2851657 -2249087 -1133360 256617 1020570 612043
39446 612043 -223336 -300918 361824 613190 -57071 -725256 -441905 298530 192239 -1095216
39436a095216j309018J12279J826630K312093R23412j360605k478215j334548
39428b403188O55858J044314m27432j324807N5729K043351J790388o45479k246018
39419a457284j129988J014285J411989q5880j070851K7054J899156K147942L58209
39410C114632j492029j648149o98254m23121j123674j291646L527J680567K202647
39401C24500J493686M45489n05539j181260r25035M54105J567019R18447p74266
39392A817146j417972n78158J69550K9794N4258Q42128J250953M77920l89072
39383B256547k42665J91377j39170o64294m09120P5535j91379o62186l37709J43571
39373B0507l51291j002534j99082J309825J184787n22722j089257M54616J514703
$$ plain form
39436 -1095216 -2404234 -2291955 -465325 1846768 2770180 1409575 -1068640 -2403188
39428 -2403188 -1747330 -703016 -1130448 -2455255 -2399526 -356175 1434213 788734 -1457284
39419 -1457284 -2587272 -1572987 -160998 -246878 -1317729 -1290675 608481 2756423 3114632
39410 3114632 1622603 -25546 -723800 -1146921 -2270595 -3562241 -3558714 -1878147 324500
39401 324500 1818186 2263675 1758136 576876 -348159 105946 1672965 2591412 1817146
39392 1817146 399174 -178984 -9434 20360 74618 916746 2167699 2645619 2256547
39383 2256547 2013882 2205259 2066089 1401795 992675 1068210 876831 214645 -123064 20507
39373 20507 -330784 -1333318 -1532400 -222575 962212 439490 -649767 -195151 1319552
39364A319552O3310j936701j477201Q63946J854633L94123j191737p76735P59289
39355a27521J211012J99906n79539R1972J242649J069958m46853j342959m52509
39346H66116P37528K25951j361670j666402l46175M09836m27955j028509M8759
39337b542521J260838P43721l89389p611J175540P42043j095863j564697J02829
39328a575110J338874L84543j099770j065022k53207l35910p90872l6531J509233
39319a923772J968336J044508K18094M0717n32620j774593k211860q87084R78515
39310c079759J642634J017570J61081m25467q28538p97484q7741O53803N81999
39301a161902O8485K44803J153326J567651Q54023j87357p30650r61937j081026
$$ plain form
39364 1319552 1382862 -553839 -2031040 -1167094 687539 1081662 -110075 -886810 -127521
39355 -127521 1083491 1283397 703858 795830 2038479 3108437 2661584 1318625 866116
39346 866116 1603644 1829595 467925 -1198477 -1544652 -1134816 -1562771 -2591280 -2542521
39337 -2542521 -1281683 -537962 -927351 -934962 240578 982621 -113242 -1677939 -1575110
39328 -1575110 -236236 148307 -951463 -2016485 -2269692 -2605602 -3396474 -3433005 -1923772
39319 -1923772 44564 1089072 1307166 1347883 815263 -959330 -3171190 -4058274 -3079759
39310 -3079759 -1437125 -419555 -258474 -683941 -1512479 -2309963 -2397704 -1743901 -1161902
39301 -1161902 -1093417 -848614 304712 1872363 2726386 2539029 1808379 846442 -234584
39292b34584n13835Q44560J684957R92510p2948L06027J603023J402468r48072
39283E064106l036558k521726p4478J803273J714288R8767j884262l006432k351801
39274d194823l27624J276612J327193P83186R88263J420797P22591p43693j337606
39265h5104q46356o17739r05069l76530J114462J608612J69617j140817k86925
39256a365849J341547R08387j379145k362997n36472J840997K019341K88594j018232
39247b63829q31495j80015k19927p85208j036412o55439l619M89000P55570J030945
39237a700429J484853J855859J507865J02723j709827k572581j700550K06827
39229b525260J626247J758461J101451N05938J76753j57680o02175j081573j582015
$$ plain form
39292 -234584 -748419 96141 1781098 2773608 2700660 3006687 4609710 6012178 5064106
39283 5064106 2027548 -494178 -568656 1234617 2948905 3047672 1163410 -1843022 -4194823
39274 -4194823 -4522447 -3245835 -1918642 -1135456 -147193 1273604 1996195 1252502 -85104
39265 -85104 -931460 -1549199 -2454268 -2830798 -1716336 -107724 61893 -1078924 -1365849
39256 -1365849 -24302 884085 -495060 -2858057 -3394529 -1553532 465809 754403 -263829
39247 -263829 -1095324 -1275339 -1495266 -2280474 -3316886 -3972325 -3975944 -3486944 -2731374 -1700429
39237 -1700429 -215576 1640283 3148148 3250871 1541044 -1031537 -2732087 -2525260
39229 -2525260 -899013 859448 1960899 2466837 2643590 2485910 1883735 802162 -779853
39220g79853j885033j446561k12376P99987O25212j45429m9528J043236J627514
39211d22831Q08651l57928m70059K98125P73020M83658j83081q80646j312806
39202a263897q57237O72230K157043K185060Q58478l86963p09163n95167o10913
39193A449471m71704K37708J126996J247528M8307j921242l075370k053327M87086
39184b924547J969271Q12383j327084j631102J1046J117719N72730R5457R22105
39175c82022J396409l01336k753219l001600p89456J251101J386673N30156L7235
39166b626059q4129p5692N48436J724064K051244P07166q76345q06734M19075
39157I81026N72124r02296j924222q52474R83292J131101m40823j320727j64209
$$ plain form
39220 -779853 -2664886 -4111447 -4323823 -3523836 -2898624 -3044053 -3093581 -2050345 -422831
39211 -422831 385820 27892 -442167 -144042 628978 1112636 929555 48909 -1263897
39202 -1263897 -2121134 -1448904 708139 2893199 3751677 3364714 2655551 2060384 1449471
39193 1449471 977767 1215475 2342471 3589999 3638306 1717064 -1358306 -3411633 -2924547
39184 -2924547 -955276 -142893 -1469977 -3101079 -3090033 -1972314 -1399584 -1304127 -382022
39175 -382022 1014387 713051 -2040168 -5041768 -5831224 -4580123 -3193450 -2663294 -2626059
39166 -2626059 -2710188 -2785880 -2237444 -513380 1537864 2245030 1368685 561951 981026
39157 981026 1553150 650854 -1273368 -2125842 -1142550 -11449 -452272 -1772999 -1937208
39148a937208J429436J359351N8539l57662O40455J323490M50501r36521j210520
39139H19861l72990M75279R05523J160022J052603K52812o47160o97950j58493
39130B789507k32179j155040j776110j308041l58239J88180K99104L20015K41758
39121i91045k4971l10636m97704n63006j94537P89519J576990J062079l76662
39112D70027j131004p57086n30040r61100o39618J172767K605056J747807k20331
39103A756478p35295K53968N60724n24319j380395j006465l41131j14535L17386
39094a213584J119173J049476l75781j510553q15175P97498J293168L11550o90168
39085c4396n46509M04865R05767K1043j748027k474928q89354J506787J941844
$$ plain form
39148 -1937208 -507772 851579 910118 552456 1192911 2516401 2966902 2030381 819861
39139 819861 446871 922150 1827673 2987695 4040298 4293110 3645950 2948000 2789507
39130 2789507 2557328 1402288 -373822 -1681863 -2040102 -1851922 -1552818 -1232803 -991045
39121 -991045 -1016016 -1326652 -1824356 -2387362 -2581899 -1792380 -215390 846689 470027
39112 470027 -660977 -1418063 -1948103 -2909203 -3548821 -2376054 229002 1976809 1756478
39103 1756478 1021183 1275151 1835875 1311556 -68839 -1075304 -1416435 -1530970 -1213584
39094 -1213584 -94411 955065 579284 -931269 -1746444 -948946 344222 655772 -34396
39085 -34396 -580905 -176040 729727 750770 -997257 -3472185 -4361539 -2854752 -912908
39076i12908K92039n84517O69847J553271k40720k623913j926380J367662L075854
39067F70235J307627j243088j637720m43565K17865Q4341K77540P68990L93968
39058C96193q96488j401605K22707K891172L768905J303508k619031m312475k423153
39049c070267N18523J452058N42081J04032P76966J017126J52441n24151k10037
39040G58772Q6666m01440p72619k27771M32280L64181J88015N00678L22280j237791
39030A3251k863148k487050k60692J672120K014091J369291P05729K74331N1879
39021D89802k7330l65180j183724j726782r65476Q88446K432063K590867J387553
39012C520239m89078j994487j976731k51729J686996K068935Q70939m86050j157590
$$ plain form
39076 -912908 -620869 -1205386 -535539 1017732 777012 -1846901 -3773281 -2405619 670235
39067 670235 1977862 734774 -902946 -1346511 -1128646 -1044305 -766765 2225 396193
39058 396193 -500295 -1901900 -1679193 1211979 4980884 6284392 3665361 -647114 -3070267
39049 -3070267 -2551744 -1099686 -557605 -453573 323393 1340519 1492960 968809 758772
39040 758772 845438 443998 -328621 -556392 -124112 240069 428084 928762 1251042 13251
39030 13251 -2849897 -5336947 -5597639 -3925519 -1911428 -542137 163592 437923 489802
39021 489802 462472 97292 -1086432 -2813214 -3778690 -2890244 -458181 2132686 3520239
39012 3520239 3031161 1036674 -940057 -1191786 495210 2564145 3435084 2949034 1791444
39003A791444j370045j111454J02970J850018K602201J583073j80419j268589
38995C999199j480041j442315j399847j127123n78851J4570M90356Q18912R78698
38986B73558R27579N79423q5168o81551n75550J70676N36188l1705n49784J4836
38976E78502Q05462K80096r61908p24351J076944J655041m62988k649520j640491
38967b043213J645517L234535J492637j072604j639654n30519O2080p55008j917308
38958a523537k107287j025827O95047K031097K144213J032983l37323q58586k66838
38949b16058P54131J264690P64950m86228j564157j517363l06541R39028R77362
38940F09814j28453r67599m10027R51761J431868L30100j151374j412119m27048
$$ plain form
39003 1791444 421399 -690055 -587085 1262933 3865134 5448207 5267788 3999199
38995 3999199 2519158 1076843 -323004 -1450127 -2028978 -2014408 -1524052 -705140 273558
38986 273558 1201137 1780560 1695392 1013841 438291 608967 1145155 1113450 563666 578502
38976 578502 1383964 1664060 702152 -22199 1054745 2709786 2246798 -402722 -2043213
38967 -2043213 -397696 2836839 4329476 3256872 1617218 1086699 1148779 393771 -1523537
38958 -1523537 -3630824 -4656651 -3961604 -1930507 213706 1246689 909366 50780 -216058
38949 -216058 538073 1802763 2567713 2081485 517328 -1000035 -1306576 -367548 609814
38940 609814 481361 -486238 -896265 55496 1487364 1817464 666090 -746029 -1173077
38931a173077M48427M55691K90563O90695J076350M49162q45673j354669n38686
38922e01217M78038N74386J16618K9395J37108m03901j331907j337634j61400
38913b400514P10731K05932o39418l26922O47027N81702n98446j155868l35160
38904c310936N44045M95494N58036J755748K821938J817529p32608k253588j522013
38895A73645O3142P84048O01503L27164J30178k54973o26419m92064J39330O68327
38885A513881N19625k81585j003347q28169J14797O88997K66799j79102N57697
38876A369593J824690J696668k87879k303703k545886j210043L22829J166224
38868C2493J125890K37976r85380j518623q60439L18091J102281J354597J310267
$$ plain form
38931 -1173077 -724650 -268959 21604 712299 1788649 2237811 1392138 37469 -501217
38922 -501217 -23179 551207 667825 697220 834328 430427 -901480 -2239114 -2400514
38913 -2400514 -1689783 -1483851 -2123269 -2450191 -1803164 -1221462 -1819908 -2975776 -3310936
38904 -3310936 -2766891 -2271397 -1713361 42387 2864325 4681854 3949246 1695658 173645
38895 173645 236787 1020835 1622338 1949502 2079680 1824707 1198288 706224 845554 1513881
38885 1513881 2033506 1751921 748574 -79595 35202 724199 990998 811896 1369593
38876 1369593 3194283 4890951 4603072 2299369 -246517 -1456560 -1133731 32493
38868 32493 1158383 1396359 410979 -1107644 -1968083 -1649992 -547711 806886 2117153
38859B117153Q68819j2915q20705j106429j103968j055847n31256P32705J818521
38850I06078J495039p2767j377865j326022k41768Q26835J114583M21789r28693
38841H17209k160533k456809j562132O7132J621166K354581J953346Q37169m2461
38832A428668l0371O22596J105000Q65257p121r83007j501141j355503q43389
38823f99011m62258m65388p77799j108253r37376J56413J664742K166570J009422
38814E47062m76141n62063M14071O31398k37244m42003R24169K225535J648906
38805D673690j26674j069765o80993k29238n89491j251938j407656r28854j48220
38796a759139N97944J042061J007927M92711k77729p44075k51665J030968J736663
$$ plain form
38859 2117153 2985972 2973057 2152352 1045923 -58045 -1113892 -1645148 -912443 906078
38850 906078 2401117 2328350 950485 -375537 -617305 209530 1324113 1745902 817209
38841 817209 -1343324 -3800133 -5362265 -5295133 -3673967 -1319386 633960 1471129 1428668
38832 1428668 1398297 2020893 3125893 3991150 3984029 3001022 1499881 144378 -699011
38823 -699011 -1161269 -1626657 -2404456 -3512709 -4450085 -4293672 -2628930 -462360 547062
38814 547062 70921 -491142 -77071 554327 317083 -124920 799249 3024784 4673690
38805 4673690 4547016 3477251 2796258 2567020 1977529 725591 -682065 -1610919 -1759139
38796 -1759139 -1161195 -119134 888793 1381504 1103775 359700 108035 1139003 2875666
38787B875666P90178r13575j509462p32575l4005j17519j47204K66964K62152
38778G40620m34403q20328n93570p36651j177331k78192J918538K538185Q9582
38769A246450k542470j982097P25777K041017J156698J02983j68302m22739n64724
38760d07407K68493J322393R78963k87138n72548J13438J34258m50248r0185Q10818
38750A820837J37309j935370k673123j191929K49666K56359K32568J130874J532462
38741d40347N05567n48468m88112j88185k72441J71221J181986J115146j99010
38732H37357m99783R35204J552941j01393j559679o75936M66529p88661k817556
38723b650977k280275M75695K345397K278872J539155M58119j372287k619472
$$ plain form
38787 2875666 3665844 2752269 1242807 510232 476227 358708 211504 478468 740620
38778 740620 306217 -514111 -1107681 -1844332 -3021663 -3299855 -1381317 1156868 1246450
38769 1246450 -1296020 -3278117 -2552340 -511323 645375 748358 580056 157317 -407407
38760 -407407 -138914 1183479 2162442 1875304 1302756 1416194 1550452 1100204 1010019 1820837
38750 1820837 1958146 22776 -2650347 -3842276 -3592610 -3336251 -3103683 -1972809 -440347
38741 -440347 65220 -483248 -971360 -1159545 -1431986 -1260765 -78779 1036367 837357
38732 837357 337574 1272778 2825719 2724326 1164647 488711 955240 166579 -2650977
38723 -2650977 -4931252 -4455557 -2110160 168712 1707867 2165986 793699 -1825773
38715a825773j576098N73382J227728N15771N70582J285233N86577j234600j451640
38706a328838L79930J456576M35855m89402L41824J214984K27841j379212j349916
38697d90358R2987J092253J089322Q46401N07689m01497j471733j556853m69925
38688g61714N80231M98035l59499o72670J51333J121951R08625k25671o63218
38679E77403J58750Q40268K68411o00757m61405J26881j14445q97258j075911
38670a178063p25743n45833p1506J308644K336817J377567o13053j222803l02912
38661C63115K18866l7322M00980J436842J067042q38380j744765o03713L73877
38652F36542l70368j104284r3800J207634P34922n89189n12896Q06614J324324
$$ plain form
38715 -1825773 -3401871 -2828489 -1600761 -1084990 -514408 770825 1357402 122802 -1328838
38706 -1328838 -948908 507668 943523 454121 795945 2010929 2238770 859558 -490358
38697 -490358 -397371 694882 1784204 2630605 3138294 2736797 1265064 -291789 -761714
38688 -761714 -181483 316552 -42947 -715617 -564284 557667 1466292 1240621 577403
38679 577403 736153 1576421 1844832 1244075 782670 909551 795106 -102152 -1178063
38670 -1178063 -1903806 -2449639 -2521145 -1212501 1124316 2501883 1888830 666027 363115
38661 363115 581981 544659 945639 2382481 3449523 2611143 866378 262665 636542
38652 636542 266174 -838110 -931910 275724 1010646 421457 -91439 715175 2039499
38643B039499L97477p47129j204700j103318o04561J62461N79302K85835l3988
38634b29122K71629O22122J77919o98122j041446o85879j22716L19862L73161
38625a012592k02177q42045n07135N14196N84819o13210j141137J74245J635672
38616a409364J365456L39614M75690J168566M68786j178647j328709M87060J938867
38607B327319J454266J99379k53733k05995o65249j382748j342234m39864L99664
38598I0805N38693L48080N07717Q90615N75454o88066j494705l45563J855589
38589B278619K406973M73720j493929j135356N58090R86881k51203j285783j036291
38580A501721l34280j38235l56890n82204o95998o52126n82467q86283j366573
$$ plain form
38643 2039499 2436976 1689847 485147 -618171 -1222732 -1060271 -480969 -195134 -229122
38634 -229122 42507 664629 842548 144426 -897020 -1582899 -1705615 -1385753 -1012592
38625 -1012592 -1214769 -2056814 -2563949 -2049753 -1464934 -2078144 -3219281 -3045036 -1409364
38616 -1409364 -43908 295706 771396 1939962 2408748 1230101 -98608 388452 2327319
38607 2327319 3781585 3980964 3727231 3521236 2855987 1473239 131005 -308859 90805
38598 90805 629498 977578 1485295 2375910 2951364 2263298 768593 423030 2278619
38589 2278619 4685592 5159312 3665383 2530027 3088117 4074998 3823795 2538012 1501721
38580 1501721 1167441 1029206 672316 90112 -605886 -1258012 -1840479 -2726762 -4093335
38571d093335r01654R07837K517793K282082Q15273j10055l46277j046345j956417
38562a931098j404789O95596K045472J069677q37186j290736O128J314574J344512
38553A012150O10558L34210O87295O51304k98652j050164l55146R00729O10241
38544C102525j149540j761821j10748J326136K50303j728018j694249n7051N35904
38535a286559k24049k80229O75694O38652q53619j629617m99556R27540J119552
38526a412191P92927J029723J413145J231260O95946p330j148884k185252j863102
38517a453758k65632J035664J330139J294611R33766n07766k112644j643453P52026
38508f37047K092049J001700l70538k85864p3133r56536j441813l25490O77501
$$ plain form
38571 -4093335 -4994989 -4087152 -1569359 712723 1527996 1417941 1071664 25319 -1931098
38562 -1931098 -3335887 -2640291 -594819 474858 -362328 -1653064 -1646936 -332362 1012150
38553 1012150 1622708 1956918 2644213 3295517 2996865 1946701 1591555 2492284 3102525
38544 3102525 1952985 191164 80416 1406552 1656855 -71163 -1765412 -1822463 -1286559
38535 -1286559 -1510608 -1790837 -1115143 -476491 -1330110 -2959727 -3459283 -2531743 -1412191
38526 -1412191 -619264 410459 1823604 3054864 3750810 3743480 2594596 409344 -1453758
38517 -1453758 -1719390 -683726 646413 1941024 2874790 2367024 254380 -1389073 -637047
38508 -637047 1455002 2456702 2086164 1800300 1727167 770631 -671182 -996672 -319171
38499c19171J35258r6577J708524L350674K043500o43035j259766j82319m56643
38490D280445k094203k153462j47533J162629O47688K24045P10705L61766j297120
38481A694960j973225n72394O88322K346j134436p96233J66150n732r70812j305575
38471d206629q72542k41872P42363J986476K165971N84875j191749j328386k59714
38462b621207L92146L12640J96487K5534n06707p05000J33384J084966P41179
38453i46578n49752j271993j034020n35298K05663J583825K638067J739682o72050
38444A157546k011474q44919J310027K178444J349983n1747j079923j390830q88724
38435b71617K2350L52669m40489j588948j790355o92412P75752J389935P29052
$$ plain form
38499 -319171 -183913 -280490 1428034 4778708 6822208 6179173 4919407 4737088 4280445
38490 4280445 2186242 32780 -114753 1047876 1695564 1919609 2630314 2992080 1694960
38481 1694960 -278265 -850659 -162337 -159991 -1294427 -2090660 -1924510 -1930242 -2901054 -4206629
38471 -4206629 -5079171 -5321043 -4578680 -2592204 -426233 158642 -1033107 -2361493 -2621207
38462 -2621207 -2229061 -1916421 -1719934 -1694400 -2201107 -2906107 -2772723 -1687757 -946578
38453 -946578 -1496330 -2768323 -3802343 -4337641 -4131978 -2548153 89914 1829596 1157546
38444 1157546 -853928 -1698847 -388820 1789624 3139607 3087860 2007937 617107 -271617
38435 -271617 -249267 103402 -337087 -1926035 -3716390 -4408802 -3633050 -2243115 -1514063
38426a514063n09298j167822p86190k9057K90677K73354M36002N69334J12530
38417b324533n16088k78460O27569P32429l26017q94867J92919J584881J371129
38408A68962M1421l54176N78292J208437O54964q5566j90498l17308j026775j495717
38398h17964r27580j7689J75225j73673l50870m45360o96769l94964J006020K320969
38388c22655J928639L21036m29529K95157R80371N47644k79617p45042j311263
38379I84741k116570j877039J51205K303019K307056L33385j315744j221148j13059
38370e64154P25570Q82153M43606n30000j610739j916957j048354K77784R34800
38361b406291N56830j64117k18076O88329J715794J674523M25883p58388n92472
$$ plain form
38426 -1514063 -2023361 -3191183 -3977373 -4006430 -3715753 -3442399 -3006397 -2437063 -2324533
38417 -2324533 -2840621 -3119081 -2491512 -1759083 -2085100 -2979967 -2787048 -1202167 168962
38408 168962 210383 -143793 434499 1642936 2297900 2212334 2021836 1704528 677753 -817964
38398 -817964 -1745544 -1763233 -1588008 -1761681 -2112551 -2557911 -3254680 -3649644 -2643624 -322655
38388 -322655 1605984 1927020 1497491 1792648 2773019 3320663 3041046 2296004 984741
38379 984741 -1131829 -3008868 -2857663 -554644 1752412 2085797 770053 -451095 -564154
38370 -564154 161416 1043569 1487175 957175 -653564 -2570521 -3618875 -3341091 -2406291
38361 -2406291 -1849461 -2013578 -2231654 -1543325 172469 1846992 2272875 1514487 922015
38352I22015O64332J458297O95488j060390k151903j489589K73890J336088Q04067
38343A452295j26300K13250J405629J321022o61530k349578j635369N99586J851663
38334B070668J287620J01236o86028j006800p37383K17916Q70081j2678j785919
38325C18713k366810j153525K12295N44332P46231J756259K541329J656943l01500
38316C954267j416767j029712j70937K68177M67649P66831Q84662L39189q88770
38307C174589k211405k703914j794105n3261J084008Q70287J19313l428M08203
38298a109713L49012m69039j213475j111306l04345N19020P71367K61985n86282
38289b892776q55196q0137R46610J031045K75371K9336Q28989J375074L86835
$$ plain form
38352 922015 1586347 3044644 3740132 2679742 527839 -961750 -687860 648228 1452295
38343 1452295 1325995 1539245 2944874 4265896 3604366 1254788 -380581 219005 2070668
38334 2070668 3358288 3459524 2773496 1766696 1029313 1247229 2117310 2104632 318713
38325 318713 -2048097 -3201622 -2989327 -2444995 -1698764 57495 2598824 4255767 3954267
38316 3954267 2537500 1507788 1336851 1605028 2072677 2839508 3724170 4063359 3174589
38307 3174589 963184 -1740730 -3534835 -3588096 -2504088 -1633801 -1514488 -1517916 -1109713
38298 -1109713 -760701 -1229740 -2443215 -3554521 -3858866 -3339846 -2568479 -2306494 -2892776
38289 -2892776 -3747972 -3828109 -2881499 -1850454 -1575083 -1545747 -716758 658316 1045151
38280A045151j279702j628837m03966N07265n4701p27556J35114J562121J170954
38271C25843j052201k333893j061504Q57388R41794j77940m4372J596290K452120
38262A503525J325669k05507m26489J09165m4785q58753j215619q03501k78482
38253h94777J6160L16122N97593M66463o5535m17873j93294L50701O59379M33910
38243A268849j63318o60906o75198k53446K35546M97135M44903J22207k14439
38234F01333j76772J99757L36172N5958Q7589P91474J072860j03193j659850j653076
38224d47748l19700K62677l14485j55306J312833J818152l6144k039292j678885
38215a597898j30987j12386j254407r12504J124663K187459J145539O4998N88600
$$ plain form
38280 1045151 -234551 -1863388 -2267354 -1760089 -1814790 -2542346 -2407232 -845111 325843
38271 325843 -726358 -3060251 -4121755 -3264367 -2322573 -2500513 -2544885 -948595 1503525
38262 1503525 2829194 2623687 2197198 2306363 2261578 1402825 187206 -616295 -894777
38253 -894777 -878617 -562495 35098 501561 436026 18153 -175141 175560 834939 1268849
38243 1268849 1105531 444625 -230573 -484019 -248473 248662 693565 815772 601333
38234 601333 424561 624318 960490 1016448 1104037 1895511 2968371 2865178 1205328 -447748
38224 -447748 -767448 -504771 -819256 -974562 338271 2156423 2120279 80987 -1597898
38215 -1597898 -1728885 -1841271 -3095678 -4008182 -2883519 -696060 449479 514477 1103077
38206A103077J427573Q47444m95803q54622r8740M17675j19590j218885j816655
38197h08526j163807M38904J541422R86040n02791j245206j016478r86752j241794
38188c998988m52574J385212K122134O45538j035784n66997J416620K514495J893612
38179C923268N73723n87957j301573j047224J90425R52903p5001j914796k505989
38170a792221j570433m31548M46812J523853K136233R89099j072347j406342N13765
38161f63129J948188Q58244j142821j402516r408R15355M38444n81441j290689
38152i29773j471594q97172L55851J288511J058492L64492M76782J254057J473620
38143B973266Q25783J37749k19544o47780j036428o85622K33098N59828q8672
$$ plain form
38206 1103077 2530650 3378094 2882291 2027669 1928929 2346604 2227014 1008129 -808526
38197 -808526 -1972333 -1533429 7993 994033 491242 -753964 -1770442 -2757194 -3998988
38188 -3998988 -4451562 -3066350 -944216 -298678 -1334462 -1901459 -484839 2029656 3923268
38179 3923268 4496991 3909034 2607461 1560237 1750662 2703565 2628564 713768 -1792221
38170 -1792221 -3362654 -3794202 -3347390 -1823537 312696 1301795 229448 -1176894 -663129
38161 -663129 1285059 2143303 1000482 -402034 -411442 503913 942357 360916 -929773
38152 -929773 -2401367 -3298539 -2942688 -1654177 -595685 -231193 245589 1499646 2973266
38143 2973266 3799049 3936798 3717254 3069474 2033046 1347424 1580522 2140350 2051678
38134B051678p16122n88229k36598k30414j67165L03627N38062o903n68539q6900
38124B92497J097568J625841R50836j40333p56136q60903q86853r22997n57959
38115a58439N21485J795292K028716O03551j399726k193511j408545l66926r5577
38106f73680j71945K6416J45686k36807n63457j81500N17296Q27800Q48323R01235
38096A439367O78570M0826k44069J98360L01927o82504j431797m89884R49649
38087G60445O15834j008502j206871N70747J758527Q25437m48382j34469R05188
38078B637954R45618K00155j90378k89789n86359n35369J96224L57116r93206
38069A741966k415960k086020p91457n53202j096314m11093J524638K447799J509212
$$ plain form
38134 2051678 1335556 747327 510729 280315 113150 416777 954839 947936 379397 292497
38124 292497 1390065 3015906 3966742 3826409 3070273 2209370 1322517 399520 -158439
38115 -158439 363046 2158338 4187054 4790605 3390879 1197368 -211177 -578103 -673680
38106 -673680 -845625 -819209 -673523 -910330 -1473787 -1655287 -1137991 -310191 538132 1439367
38096 1439367 2117937 2158763 1914694 2113054 2414981 1732477 300680 -189204 760445
38087 760445 1376279 367777 -839094 -268347 1490180 2315617 1867235 1732766 2637954
38078 2637954 3583572 3783727 3593349 3303560 2717201 2181832 2378056 2735172 1741966
38069 1741966 -673994 -2760014 -3551471 -4104673 -5200987 -5612080 -4087442 -1639643 -130431
38060a30431N67549R68044J410357L18261j511982k149989j204109J32817R12657
38051f86826J110109R57927N74331Q7408l49455m88041M2062J068207J323690
38042C639412k74476k582234k870367k82424K567590K611546J01154j950280j625667
38033f65746L7007J081978J128661J083163J227446Q15762l69908j153649m89256
38024B695458P09688N24988j119218k006891p56154R78526Q11685q80615j626663
38015f69196n33700P88461J068222J007670J366447J305491r8995j993711k742090
38006e01401j981493o17966N15807J023880O87581j28091m06244K12141O67391
37997e28395M8609p74657m01630P54879J004414J43673j16327J015583J846486
$$ plain form
38060 -130431 437118 1405162 2815519 3133780 1621798 -528191 -1732300 -1599483 -686826
38051 -686826 423283 1381210 1955541 2042949 1693494 1205453 1247515 2315722 3639412
38042 3639412 3364936 782702 -2087665 -2370089 197501 2809047 2910201 959921 -665746
38033 -665746 -628739 453239 1581900 2665063 3892509 4708271 4338363 3184714 2695458
38024 2695458 3405146 3930134 2810916 804025 47871 1026397 1838082 957467 -669196
38015 -669196 -1202896 -414435 653787 1661457 3027904 4333395 4234400 2240689 -501401
38006 -501401 -2482894 -3100860 -2585053 -1561173 -873592 -1001683 -1407927 -1195786 -528395
37997 -528395 -479786 -1254443 -1656073 -901194 103220 246893 130566 1146149 2992635
37988B992635O52614j505809k086167p00549M03974j84362r22767P9125J686997
37979D15691J080273j851039l764565k263355R21527K518317J929414J012816
37971i21P41730L46899n38132j075677q36000m41233k42262J05458M75828K70510
37961a193800j31671L63871J460359J496906K19695m66221M66060J316281K74760
37952C806240j760040k633310j899799o68538M20041J329597J558804O33212p89475
37943c268j600282j531071q24103M73581J815157J894585M14901r96741j017792
37934a375033n08695o55479p91607l9523N18990j52778m18091J486060L492934
37925A556778K154603j465741k658563k37950J604879L0419k188542j631225L02795
$$ plain form
37988 2992635 3645249 2139440 53273 -647276 -243302 -427664 -1350431 -1271306 415691
37979 415691 1495964 -355075 -4119640 -6382995 -5461468 -2943151 -1013737 -921
37971 -921 740809 1087708 549576 -526101 -1362101 -1803334 -2045596 -1940138 -1464310 -1193800
37961 -1193800 -1325471 -961600 498759 1995665 2215360 1749139 2215199 3531480 3806240
37952 3806240 2046200 -587110 -2486909 -3155447 -2735406 -1405809 152995 786207 -3268
37943 -3268 -1603550 -3134621 -3958724 -3485143 -1669986 224599 639500 -357241 -1375033
37934 -1375033 -1883728 -2539207 -3330814 -3370337 -2851347 -3004125 -3422216 -1936156 1556778
37925 1556778 3711381 2245640 -412923 -650873 954006 984425 -1204117 -2835342 -2532547
37916b532547L15424j175682j258941L12615J130407N62627M55395J393042J647256
37907H49596M85513m23043L9608O08176J26317l07857N27763J387687K84413k101187
37897A476986k998186j415160O03008J046216M78608M58917Q25327K47120j103130
37888c80294j348095K87177K075085K098290P72765j57137l00960p55965j827312
37879D63554k189328p22103J842424L576021L108878O91599j848445k381886o12048
37870A928666J216172Q00055j231430k193671j096622L15370N81269M44627P88993
37861A553429P77810k64231q82644L69962K027509J453777j071459k556798j573192
37852a65837J25554O62568L41632J9555n79838j491638j322089O78214K667961
$$ plain form
37916 -2532547 -2217123 -3392805 -4651746 -4339131 -3208724 -2646097 -2190702 -797660 849596
37907 849596 1335109 912066 951674 1559850 1686167 1378310 1906073 3293760 3578173 1476986
37897 1476986 -1521200 -2936360 -2333352 -1287136 -808528 -349611 475716 722836 -380294
37888 -380294 -1728389 -1441212 633873 2732163 3504928 3347791 3046831 2290866 463554
37879 463554 -1725774 -2447877 -605453 2970568 6079446 6771045 4922600 2540714 1928666
37870 1928666 3144838 3944893 2713463 519792 -576830 -261460 319809 764436 1553429
37861 1553429 2331239 2067008 1184364 1554326 3581835 5035612 3964153 1407355 -165837
37852 -165837 -40283 622285 963917 983472 403634 -1088004 -2410093 -1731879 936082
37843I36082K427001O93576Q3473J043653J283313m34605k267519k113494n45123
37834A106357N73117Q82770J069626P19493j008739k920612k495123M36983K885903
37825A249775K563016P16497j79123R1621P0866n44592p88534n34596n98146q65631
37815A181153l48001O89383O18229r17317k032655j254186L04648O47406k67891
37806a379231p53855Q7183J312140J516303M19039r92562j475009p29620K36538
37797a759074K09608p04441j157394l11979J122648J915002J737175J133867O00152
37788B785564J96731k25018p67988j278167j355583r03664m88522n60163n84763
37779c181573J36145J020795Q66343m2876n4885J188557J833698M74795j625663
$$ plain form
37843 936082 3363083 4056659 4140132 5183785 6467098 6032493 3764974 1651480 1106357
37834 1106357 1679474 2562244 3631870 4351363 3342624 422012 -2073111 -1636128 1249775
37825 1249775 3812791 4529288 4350165 4441786 4512652 3968060 3179526 2644930 2046784 1181153
37815 1181153 833152 1522535 2140764 1223447 -809208 -2063394 -1758746 -1111340 -1379231
37806 -1379231 -2133086 -2045903 -733763 782540 1201579 209017 -1265992 -1995612 -1759074
37797 -1759074 -1549466 -2253907 -3411301 -3723280 -2600632 -685630 1051545 2185412 2785564
37788 2785564 2982295 2757277 1989289 711122 -644461 -1548125 -2036647 -2596810 -3181573
37779 -3181573 -3045428 -2024633 -1158290 -1201166 -1256051 -67494 1766204 2240999 615336
37770F15336k150768o08116J464430K367661J432512p48103k369654j689362P33344
37761i52720K090774P52852j442782j693665J3979J329376R40536k74410j062038
37752b98098r79118K4036J513932K132705Q56708j246690k020472j054493j5485
37743a086975O393j39300N48786J521342J596337O40686m23764p59962l05798
37734A597745L03322L36687k13534n92657m15838k96314o97119r08737k35491
37725a121936N11636J23690r09615j015293K3972R07521R80513Q63764R13180
37716A277432P87698O63909J072304J308167l1808k443808l433152j838422N38439
37707b099241J494804R22977j42504j167988j670689q81251P38668J215781j61541
$$ plain form
37770 615336 -1535432 -2143548 -679118 1688543 3121055 2372952 3298 -1686064 -952720
37761 -952720 1138054 1890906 448124 -1245541 -1231562 97814 1038350 763940 -298098
37752 -298098 -1277216 -1253180 260752 2393457 3250165 2003475 -16997 -1071490 -1086975
37743 -1086975 -1080582 -1219882 -671096 850246 2446583 3087269 2663505 1903543 1597745
37734 1597745 1901067 2237754 2024220 1431563 1015725 719411 22292 -886445 -1121936
37725 -1121936 -610300 -486610 -1396225 -2411518 -2387546 -1480025 -499512 364252 1277432
37716 1277432 2065130 2729039 3801343 5109510 5077702 2633894 -799258 -2637680 -2099241
37707 -2099241 -604437 318540 176036 -991952 -2662641 -3543892 -2805224 -1589443 -1750984
37698a750984j280342j85380J728828J662742l49211j516412l91738J320529J464786
37689G02818K01270p42019n13416R4201J7402n75451n04854O62587J677498J234122
37679B254158Q4181O7795J060074Q34061j356500l126237k300065j21639P76082
37670a828090K16929P0982Q94840J364266P80221j0605k87344k79781j97673M0490
37660G64235O5932n23093j055905n53009N04716P13256K090k52829N74310J623095
37650A862798K066312J794842O33100j326464k580782j490632R73209J914458
37642C846841N15475q79229n30076K28393l19622j322760j041487K02798Q24936
37633A525269N04797j1957n57497j055753m48599J713540L412881K298641o77524
$$ plain form
37698 -1750984 -3031326 -3216706 -1487878 174864 -174347 -1690759 -2082497 -761968 702818
37689 702818 904088 162069 -351347 -257146 -239744 -815195 -1320049 -657462 1020036 2254158
37679 2254158 2338339 2406134 3466208 4300269 2943769 -182468 -2482533 -2604172 -1828090
37670 -1828090 -1611161 -1540179 -645339 718927 1499148 1488543 1201199 921418 723745 764235
37660 764235 830167 307074 -748831 -1301840 -797124 -83868 -81778 -334607 239703 1862798
37650 1862798 3929110 5723952 6357052 5030588 2449806 959174 1932383 3846841
37642 3846841 4362316 3483087 2953011 3181404 2861782 1539022 497535 700333 1525269
37633 1525269 2030066 2018109 1460612 404859 -43740 1669800 5082681 7381322 6703798
37624F703798k157345r33117P14162O16814n64162j060533n48118J77413P06174
37615C655086J022343R22216L91470o1161m7220L53842J129109K216246K639662
37606A2221593J232396j148797j799719K14543K146950J049422j974288l225199
37598H716901j606061J10152m58876k081819k127434l68859J039186O52265o73324
37589C202131j236397n50779L13315P5513j185424j875319o76342J530860K338271
37580A935829P83582j220692j242068N65649J843157J196018l15912j019937p15694
37571A809932k55932N0421N96185J348329J538433O93028o17379j412645j389489
37562B360883j028159p67246m95521L5537O58982R60292Q03925L54460k69415
$$ plain form
37624 6703798 4546453 3613336 4327498 4944312 4380150 3319617 2771499 2948912 3655086
37615 3655086 4677429 5599645 5991115 5929954 5882734 6236576 7365685 9581931 12221593
37606 12221593 13453989 12305192 10505473 10720016 12866966 13916388 11942100 8716901
37598 8716901 7110840 7220992 6762116 4680297 2552863 2184004 3223190 3875455 3202131
37589 3202131 1965734 1414955 1728270 1803783 618359 -1256960 -1933302 -402442 1935829
37580 1935829 2719411 1498719 256651 822300 2665457 3861475 3545563 2525626 1809932
37571 1809932 1554000 1604421 2200606 3548935 5087368 5780396 5163017 3750372 2360883
37562 2360883 1332724 565478 69957 105494 764476 1724768 2528693 2883153 2613738
37553B613738r24192j146188n56277L56218N41838k38176j015989r79407m98458
37544a846893j95334K41374J346011K498427K435144J020934n28906j203763j031178
37535B735816l78110M94076J006322N16501n68428r01560L1816J065256Q66522
37526D868211l88629j451892j507923o57263N56511J468717J532764P99900n8340
37517E162056m72172l76798J59717J023069J596192J114401j08862p07911o2729
37508G326963Q09864P78674Q9204l77700l47677J93656J504279L161130L775067
37499A6913460L046700K977959N122524P478708O523056K136906j986656l210605
37491C9002052k782220k941490l634557l743900l626627m167200m459231k900677
$$ plain form
37553 2613738 1689546 543358 -12919 343299 885137 646961 -369028 -1348435 -1846893
37544 -1846893 -2042227 -1800853 -454842 2043585 4478729 5499663 4970757 3766994 2735816
37535 2735816 2357706 2851782 3858104 4374605 3806177 2904617 2936433 4001689 4868211
37526 4868211 4479582 3027690 1519767 862504 1419015 2887732 4420496 5220396 5162056
37517 5162056 4689884 4313086 4472803 5495872 7092064 8206465 8097603 7389692 7326963
37508 7326963 8136827 8915501 9004705 8627005 8279328 8472984 9977263 13138393 16913460
37499 16913460 19960160 22938119 28060643 35539351 42062407 44199313 42212657 39002052
37491 39002052 36219832 33278342 29643785 25899885 22273258 18106058 13646827 10746150
37483A0746150k57157P49638p05301k189239j466665L64359O86410p77321j811288
37474E339586j147160j18643l17140j215648j321882n93862j52847j56051L02943
37465F19296J179421J104586m34131k004581k136582j139269j55955M83527R61742
37456a521946J040239N88537K31018L42406K12453o27935j176953m75528N35428
37447h52281L65680n41712o02575J52191K69093l79007l49408O50880J113692
37438a73447M03313j31576L16141M40688q33974k140895j523521N64958J788662
37429a289651R61629p50021j457375n05322J093646J737041R02086k72709n05212
37420h5888n8446O8949J02498R75806K107931J836771K70524o45684m23158p17180
$$ plain form
37483 10746150 10488993 11238631 10533330 8344091 6877426 7241785 7928195 7150874 5339586
37474 5339586 4192426 4073783 3756643 2540995 1219113 625251 472404 316353 619296
37465 619296 1798717 2903303 2469172 464591 -1671991 -2811260 -2967215 -2483688 -1521946
37456 -1521946 -481707 106830 337848 680254 892707 264772 -912181 -1387709 -852281
37447 -852281 -486601 -1028313 -1630888 -1478697 -1209604 -1588611 -1938019 -1287139 -173447
37438 -173447 229866 98290 414431 855119 21145 -2119750 -3643271 -3078313 -1289651
37429 -1289651 -328022 -1078043 -2535418 -3040740 -1947094 -210053 692033 419324 -85888
37420 -85888 -144334 -75385 27113 1002919 3110850 4947621 5218145 4572461 4149303 3432123
37410C432123j767968j261089J358093K538358l68461m176823l765667M89916
37402c521518L263750J839877r07964j599186o34925K8451L01070J038510J710405
37393A518470J141846m36821j673338j784243r07750N27915J853335K191061J287021
37384C717496q0398j021383j389813j394405j001090j57481Q53134J549243J408201
37375B483504Q1416j846421k643328j157413J297265K138345Q01411o00133l47015
37366B07631O57718O02141n73615j425229j116226j37516O47055P55567J60590
37357b21884p01927j188811j120004q75134n93408J06621J210317J795956J097374
$$ plain form
37410 3432123 1664155 403066 1761159 4299517 3931056 -245767 -4011434 -3521518
37402 -3521518 -257768 1582109 674145 -925041 -1559966 -1531515 -1230445 -191935 1518470
37393 1518470 2660316 2223495 550157 -1234086 -2141836 -1613921 239414 2430475 3717496
37384 3717496 3637098 2615715 1225902 -168503 -1169593 -1327074 -473940 1075303 2483504
37375 2483504 2564920 718499 -1924829 -3082242 -1784977 353368 1154779 554646 207631
37366 207631 865349 1467490 893875 -531354 -1647580 -1785096 -1138041 -382474 -221884
37357 -221884 -923811 -2112622 -3232626 -4107760 -4701168 -4594547 -3384230 -1588274 -490900
$$ [...]
##END NTUPLES=NMR SPECTRUM
##END=
