##TITLE=31Pdec_SR_11_1
 CDCl3, 124 sc
 10.7.2020
##JCAMPDX= 6.0         $$ Bruker NMR JCAMP-DX V2.0
##DATA TYPE= NMR SPECTRUM
##DATA CLASS= NTUPLES
##ORIGIN= UXNMR, Bruker Analytische Messtechnik GmbH
##OWNER= root
$$ XWIN-NMR		Version 3.5
$$ Fri Jul 10 09:51:51 2020 Russian Standard Time (UT+4h)  she@DPX200
##.OBSERVE FREQUENCY= 81.013821
##.OBSERVE NUCLEUS= ^31P
##.ACQUISITION MODE= SIMULTANEOUS
##.ACQUISITION SCHEME= undefined
##.AVERAGES= 124
##.DIGITISER RES= 17
##SPECTROMETER/DATA SYSTEM= spect
##.PULSE SEQUENCE= zgpg30
##.SOLVENT NAME= D2O
##.SHIFT REFERENCE= (INTERNAL, D2O, 0, 182.463)
##AUDIT TRAIL= $$ (NUMBER, WHEN, WHO, WHERE, WHAT)
$$ ##TITLE= Audit trail, XWIN-NMR		Version 3.5
$$ ##JCAMPDX= 5.01
$$ ##ORIGIN= Bruker BioSpin GmbH
$$ ##OWNER= she
$$ F:/spectra/data/she/nmr/P31/1/pdata/1/auditp.txt
$$ ##AUDIT TRAIL=  $$ (NUMBER, WHEN, WHO, WHERE, WHAT)
(   1,<2020-07-10 09:49:56.75 +0400>,<she>,<DPX200>,
      <continue with go, POWCHK disabled, PULCHK disabled
       configuration hash MD5:
       00 E9 B6 7A A2 85 ED C7 34 08 36 98 17 FE 4E 26
       data hash MD5: 32K
       2F 65 42 33 6C 2C 16 A5 5A 30 37 4B E3 3C 7D 52>)
(   2,<2020-07-10 09:50:43.04 +0400>,<she>,<DPX200>,
      <Start of raw data processing
       efp BC_mod = 2 LB = 1 FT_mod = 6 PKNL = 1 PHC0 = -2338.285 PHC1 = -41.99841 SI = 64K 
       data hash MD5: 64K
       D2 09 2B 57 99 CE 4B D9 25 3C 02 94 8B 15 1C 25>)
(   3,<2020-07-10 09:51:18.48 +0400>,<she>,<DPX200>,
      <pk PHC0 = -34.90946 PHC1 = 57.59999 
       data hash MD5: 64K
       7B 3B AC 7C 3B 13 B1 AA 1C B6 37 82 78 4E 1F 8D>)
(   4,<2020-07-10 09:51:22.92 +0400>,<she>,<DPX200>,
      <abs ABSG = 5 
       data hash MD5: 64K
       F2 29 87 8A FF 67 6F 0E 24 25 28 5A 2A 2C 60 A9>)
$$ ##END=
$$ 
$$ hash MD5
$$ 96 90 2C 85 9C 78 4B C8 A3 6C 72 C0 17 78 34 2E
##$RELAX= 
##$RELAX= 
##$RELAX= 
##$RELAX= 
##$RELAX= 
##$RELAX= 
##$RELAX= 
##$RELAX= 
$$ Bruker specific parameters
$$ --------------------------
##$DU= <F:/spectra>
##$EXPNO= 1
##$NAME= <P31>
##$PROCNO= 1
##$TYPE= <nmr>
##$USER= <she>
##$AMP= (0..31)
100 100 100 100 100 100 100 100 100 100 100 100 100 100 100 100 100 100 
100 100 100 100 100 100 100 100 100 100 100 100 100 100 
##$AQSEQ= 0
##$AQ_mod= 1
##$AUNM= <au_zg>
##$AUTOPOS= <>
##$BF1= 81.014009
##$BF2= 200.13
##$BF3= 200.13
##$BF4= 200.13
##$BF5= 200.13
##$BF6= 200.13
##$BF7= 200.13
##$BF8= 200.13
##$BYTORDA= 1
##$CFDGTYP= 0
##$CFRGTYP= 5
##$CHEMSTR= <none>
##$CNST= (0..31)
1 1 145 1 1 1 1 1 1 1 1 1 1 1 1 1 1 1 1 1 1 1 1 1 1 1 1 1 1 1 1 1 
##$CPDPRG= <waltz16>
##$CPDPRG1= <>
##$CPDPRG2= <waltz16>
##$CPDPRG3= <>
##$CPDPRG4= <mlev>
##$CPDPRG5= <mlev>
##$CPDPRG6= <mlev>
##$CPDPRG7= <mlev>
##$CPDPRG8= <mlev>
##$CPDPRGB= <>
##$CPDPRGT= <>
##$D= (0..31)
0 1 0 0 0 0 0 0 0 0 0 0.03 2e-05 3e-06 0 0 0 0 0 0 0 0 0 0 0 0 0 0 0 0 
0 0 
##$DATE= 1594360016
##$DBL= (0..7)
120 120 120 11 120 120 24 19 
##$DBP= (0..7)
150 150 150 150 150 150 150 150 
##$DBP07= 0
##$DBPNAM0= <>
##$DBPNAM1= <>
$$ [...]
##$SUBNAM3= <"">
##$SUBNAM4= <"">
##$SUBNAM5= <"">
##$SUBNAM6= <"">
##$SUBNAM7= <"">
##$SUBNAM8= <"">
##$SUBNAM9= <"">
##$SW= 369.568048894756
##$SWIBOX= (0..15)
0 1 3 0 0 0 0 0 0 0 0 0 0 0 0 0 
##$SW_h= 29940.119760479
##$TD= 32768
##$TD0= 1
##$TE= 0
##$TE2= 300
##$TE3= 300
##$TEG= 300
##$TL= (0..7)
0 120 53 12 22 120 120 120 
##$TP= (0..7)
150 150 150 150 150 150 150 150 
##$TP07= 0
##$TPNAME0= <>
##$TPNAME1= <>
##$TPNAME2= <>
##$TPNAME3= <>
##$TPNAME4= <>
##$TPNAME5= <>
##$TPNAME6= <>
##$TPNAME7= <>
##$TPOAL= (0..7)
0.5 0.5 0.5 0.5 0.5 0.5 0.5 0.5 
##$TPOFFS= (0..7)
0 0 0 0 0 0 0 0 
##$TUNHIN= 0
##$TUNHOUT= 0
##$TUNXOUT= 0
##$USERA1= <user>
##$USERA2= <user>
##$USERA3= <user>
##$USERA4= <user>
##$USERA5= <user>
##$V9= 5
##$VALIST= <valist>
##$VCLIST= <CCCCCCCCCCCCCCC>
##$VD= 0
##$VDLIST= <DDDDDDDDDDDDDDD>
##$VPLIST= <PPPPPPPPPPPPPPP>
##$VTLIST= <TTTTTTTTTTTTTTT>
##$WBST= 1024
##$WBSW= 4
##$XGAIN= (0..3)
0 0 0 0 
##$XL= 0
##$YL= 0
##$YMAX_a= 59052
##$YMIN_a= -51172
##$ZGOPTNS= <>
##$ZL1= 120
##$ZL2= 120
##$ZL3= 120
##$ZL4= 120
##$ABSF1= 182.463
##$ABSF2= -187.1042
##$ABSG= 5
##$ABSL= 3
##$ALPHA= 0
##$AQORDER= 0
##$ASSFAC= 0
##$ASSFACI= 0
##$ASSFACX= 0
##$ASSWID= 0
##$AUNMP= <proc_1d>
##$AZFE= 0.1
##$AZFW= 0.5
##$BCFW= 0
##$BC_mod= 2
##$BYTORDP= 0
##$COROFFS= 0
##$CY= -3
##$DATMOD= 1
##$DC= 0
##$DFILT= <>
##$DTYPP= 0
##$F1P= 0
##$F2P= 0
##$FCOR= 1
##$FTSIZE= 65536
##$FT_mod= 6
##$GAMMA= 0
##$GB= 0
##$INTBC= 1
##$INTSCL= 5.30512e-09
##$ISEN= 30
##$LB= 1
##$LEV0= 0
##$LPBIN= 0
##$MAXI= 10000
##$MC2= 0
##$MEAN= 0
##$ME_mod= 0
##$MI= 50
##$NCOEF= 0
##$NC_proc= -9
##$NLEV= 6
##$NOISF1= 182.463
##$NOISF2= 159.3651
##$NSP= 0
##$NTH_PI= 0
##$NZP= 0
##$OFFSET= 182.463
##$PC= 4
##$PHC0= -2373.194
##$PHC1= 15.60158
##$PH_mod= 1
##$PKNL= yes
##$PPARMOD= 0
##$PSCAL= 0
##$PSIGN= 0
##$REVERSE= no
##$SF= 81.0140089999434
##$SI= 65536
##$SIGF1= 159.3651
##$SIGF2= -187.1042
##$SINO= 113.3802
##$SIOLD= 16384
##$SREGLST= <1H.CDCl3>
##$SSB= 0
##$STSI= 65536
##$STSR= 0
##$SW_p= 29940.119760479
##$SYMM= 0
##$S_DEV= 0
##$TDeff= 32768
##$TDoff= 0
##$TI= <>
##$TILT= no
##$TM1= 0
##$TM2= 0
##$TOPLEV= 0
##$USERP1= <user>
##$USERP2= <user>
##$USERP3= <user>
##$USERP4= <user>
##$USERP5= <user>
##$WDW= 1
##$XDIM= 65536
##$YMAX_p= 426580653
##$YMIN_p= -168154013
$$ End of Bruker specific parameters
$$ ---------------------------------
##NTUPLES= NMR SPECTRUM
##VAR_NAME=  FREQUENCY,     SPECTRUM/REAL,   SPECTRUM/IMAG
##SYMBOL=    X,             R,               I
##VAR_TYPE=  INDEPENDENT,   DEPENDENT,       DEPENDENT
##VAR_FORM=  AFFN,          ASDF,            ASDF
##VAR_DIM=   65536,         65536,           65536
##UNITS=     HZ,            ARBITRARY UNITS, ARBITRARY UNITS
##FACTOR=    0.456856943014862, 1,           1
##FIRST=     14782.0589164792, 0,            0
##LAST=      -15158.0608439998, 0,           0
##MIN=       -15158.0608439998, -168154013,  0
##MAX=       14782.0589164792, 426580653,    0
$$ Real data points
##PAGE= N=1
##DATA TABLE= (X++(R..R)), XYDATA
$$ [...]
47105 65930247 60847490 73185297 91087417 93058267 73321209 45143069 21263739
47098 21263739 4014844 -6741915 -9484416 -6063987 -1125624 3253852 4955214 -2181580
47090 -2181580 -20131924 -37841539 -40228349 -23936783 1945756 24980910 32937999
47083 32937999 18153215 -11304556 -33440608 -35754521 -27987978 -22640895 -16895285 -7340318
47075 -7340318 -6246908 -22316525 -37551121 -27271946 3830698 27686595 28830746
47068 28830746 13689284 -8380424 -30112009 -38650314 -26724207 -6842260 6720835
47061 6720835 20009275 38310732 37961632 -3510475 -57916870 -71282767 -38567754
47054 -38567754 -8692012 -9656098 -17028271 -10471038 -10569376 -32857013 -50800463 -40324668
47046 -40324668 -24480785 -34460540 -56217498 -57903011 -45973124 -48242534 -57640936 -40851250
47038 -40851250 2862725 35790352 36094035 19546615 3258274 -15582108 -35701457
47031 -35701457 -39176688 -17415409 13939360 38518454 57775289 75426475 82806558
47024 82806558 73396514 58100899 53120538 60738338 70192792 70611362 58409405 38984108
47016 38984108 23531873 17365299 12495257 941048 -8128816 1415638 26533585 44972735
47008 44972735 43083611 28422763 12384117 -2884277 -15019513 -15664971 -3443512
47001 -3443512 9795747 14485018 14705554 16937778 18706471 16711047 15586435 19142962
46993 19142962 22215397 20952482 22585441 34339406 49975033 58458903 59558520 58590355
46985 58590355 50948263 26730964 -9613012 -37763687 -42653128 -27153042 -2088130
46978 -2088130 23984144 39835202 30459761 -4750068 -38834664 -39008522 -4225676 31672194
46970 31672194 39416858 25014931 12545692 8435046 -476059 -17901373 -26868362 -12942416
46962 -12942416 15436671 38174521 45435437 40270794 27601890 10479668 -6464951
46955 -6464951 -17470091 -18344034 -6539329 16555204 41964724 59742473 71206410
46948 71206410 83961535 92606955 81193820 53425516 41082072 64243164 97910808
46941 97910808 102037696 76151167 57215915 65008714 78000308 70460881 48086522
46934 48086522 31935930 24812197 12014935 -12399274 -35214298 -38627145 -18070864
46927 -18070864 12176315 28350023 17980112 -5805432 -17464327 -8236862 7069487
46920 7069487 14249154 17187219 24768110 34193289 38643989 40398732 42735118 38029510
46912 38029510 20411713 4006890 8689792 27703936 29602513 -607951 -38453130
46905 -38453130 -48718625 -25651997 6536060 23092685 15098467 -14829688 -53959301
46898 -53959301 -77448395 -64437425 -23459383 11483897 17783548 5798398 -3148398
46891 -3148398 -5652562 -10492649 -17304344 -19370434 -19581625 -23415618 -20555634 4278378
46883 4278378 42220690 64438864 58872784 40779002 21964474 -4487451 -37436043
46876 -37436043 -52687661 -36044021 -11280002 -10487040 -30686131 -45374183 -47972991
46869 -47972991 -54519295 -67236905 -65499416 -38494485 -3417143 17660818 21970785
46862 21970785 18918369 12701911 1307406 -15152712 -31329047 -38146961 -27915420
46855 -27915420 -3606641 20208455 32940072 39109418 45258722 44575737 28271712 3793696
46847 3793696 -15941178 -34291529 -60510855 -82376394 -74857487 -38265532 -3584871
46840 -3584871 6691457 2479861 4322231 17435442 35135737 49594462 51055772 34070512
46832 34070512 12675915 11469993 32490788 48533030 39133863 15925454 2362301
46825 2362301 6380626 23873165 49209903 68200099 61239070 32705424 19346283
46818 19346283 46037884 86024360 90361468 49824668 2622251 -17907251 -19657922
46811 -19657922 -30260225 -56572838 -76380601 -65255386 -25948377 10327804 14367254
46804 14367254 -10390082 -34367099 -37276016 -24572121 -8481603 8219264 21901782
46797 21901782 21382811 5601626 -8661299 -13249415 -27024391 -66475763 -109522780
46790 -109522780 -113936911 -69554109 -11650719 18476836 10684142 -15796562 -35898826
46783 -35898826 -37449309 -26244713 -15334430 -7330808 6571573 27150836 39631745
46776 39631745 34189503 20607522 11536192 6118016 4215901 19577133 57821606 94840205
46768 94840205 101040337 78390774 51655960 32806729 17751974 7754787 5910822
46761 5910822 -262402 -22763660 -44653648 -39239253 -14943552 -6982888 -23277710 -34328806
46753 -34328806 -22174897 -2497438 12161684 33177355 62296337 72592916 47388238
46746 47388238 10056341 -10437519 -19362232 -35064592 -50099087 -44191858 -21692915
46739 -21692915 -7045142 -11128298 -25016590 -38216850 -42992118 -32350333 -14474352
46732 -14474352 -14866038 -40431821 -57676869 -36667379 -1728028 12413 -27473609
46725 -27473609 -31605042 7950966 45857450 36794240 -2386076 -22973703 -10739709
46718 -10739709 8155053 12539967 8303002 8940376 15569972 18132795 6274975 -18402495
46710 -18402495 -35944358 -24277169 10425319 33744371 25598377 7742010 11908745
46703 11908745 35296240 50338687 47076627 38381573 29887723 15773855 3783532
46696 3783532 11356241 30533764 29853457 4018856 -11033728 7144486 28395462 13958018
46688 13958018 -25612187 -51125775 -54746422 -59653302 -70045824 -64172645 -37446852
46681 -37446852 -12632149 -1053010 9091295 17581644 5321215 -22234416 -25876290
46674 -25876290 7243793 30753693 1108599 -55853859 -80517306 -61819913 -40289431
46667 -40289431 -38973772 -37075015 -15686451 9968344 16581815 2592864 -20384120
46660 -20384120 -43577130 -57189682 -49410729 -21392754 8947988 25273695 25150019
46653 25150019 13159001 -4605470 -18379915 -21792573 -21766476 -27252281 -30709674 -18678321
46645 -18678321 2165152 11508872 7262270 6848008 15572016 20292348 18410648 23786494
46637 23786494 35267260 29961012 2221617 -20174022 -18611740 -15720255 -39735187
46630 -39735187 -77624909 -91663291 -69786062 -34550246 -11438750 -9940869 -27162123
46623 -27162123 -49351804 -57282919 -48904151 -48497987 -74711123 -108321543 -112248287 -76955688
46615 -76955688 -26218709 15784170 42239364 53524853 51502461 43965171 36874867
46608 36874867 22464175 -9106610 -47805321 -69612187 -64187382 -43013072 -21501991
46601 -21501991 -6326064 1099895 771764 -7264483 -26866562 -59484718 -86388055 -75525917
46593 -75525917 -24599790 20523330 17481494 -15595734 -26394127 -2390559 18967209
46586 18967209 12264977 -4736918 -11007353 -14522310 -25851435 -30946383 -14713982 9670188
46578 9670188 18226144 8516611 -3734983 -7046553 2503303 26067554 53535482 63256977
46570 63256977 47216521 25435389 19627091 24022994 19082848 3220109 -8033827
46563 -8033827 -7148628 -1208071 1546758 -2846367 -15984738 -30821009 -31474923 -14019649
46555 -14019649 1769186 -1968024 -14343081 -14846621 -8174916 -12623807 -20973428 -7658117
46547 -7658117 22292285 28413786 -6428836 -45246340 -48317949 -28211162 -22378665 -31043227
46539 -31043227 -22462281 6412724 17949001 -7013326 -35251928 -29655814 -5197860
46532 -5197860 -5759617 -38879003 -66636424 -60482078 -35189845 -19573966 -17729584 -15740167
46524 -15740167 -11622116 -18711030 -42587184 -68651614 -74991295 -53004973 -17038383
46517 -17038383 4304981 -7341493 -39796835 -60862782 -53795761 -34578014 -28306824
46510 -28306824 -38313116 -48226388 -45967775 -33313727 -17313689 -4881854 -2476036
46503 -2476036 -9174071 -12162177 -136351 19896927 28410689 14634011 -14748210 -43785198
46495 -43785198 -56967568 -48044712 -29088059 -23288552 -37720171 -51717260 -44261957
46488 -44261957 -21880263 -4380347 3474580 5430919 -6715833 -38355886 -66427842
46481 -66427842 -61909037 -34477625 -20702031 -28741192 -32148591 -21087278 -16936871 -25418716
46473 -25418716 -20112958 7096565 22012742 2532621 -22212463 -21276382 -14397769 -33508022
46465 -33508022 -61808723 -59267180 -27955780 -2160527 12250529 36151821 61702742
46458 61702742 53492886 10355434 -23630385 -21689488 -3999395 8518889 25681951
46451 25681951 52411382 62398056 37175237 1925742 -7424675 9247881 28836353
46444 28836353 42723475 53357515 50877351 25253207 -7161472 -18399225 -6802483
46437 -6802483 4304107 3362941 1556114 5362102 1972735 -18407246 -42676235 -50895332
46429 -50895332 -44240776 -43251818 -57716806 -69656479 -55829494 -23158874 -6528278
46422 -6528278 -24747956 -53427327 -56723082 -34598627 -17246273 -20167843 -31958332
46415 -31958332 -44819363 -64766127 -83862028 -75290089 -33813896 6070011 14078653
46408 14078653 3451509 3059552 11915636 10227228 -815520 -3092192 2986824 -1184474
46400 -1184474 -17975992 -26452338 -11817999 18583375 48112513 61199452 45552679
46393 45552679 6265411 -25448131 -21323434 6941532 22063119 9999673 -10765696
46386 -10765696 -25743349 -38117758 -42256820 -19339779 25136830 49668036 25312926
46379 25312926 -23878096 -50454617 -39194744 -13521948 2677310 10117353 24787389
46372 24787389 56062826 92628042 107728301 86815269 49383447 27514961 22529161
46365 22529161 6089006 -30882868 -59629466 -57494627 -40939279 -33468555 -28394343
46358 -28394343 -11833121 1672515 -8151847 -26785408 -25895183 -13213982 -19980696 -44013988
46350 -44013988 -49831215 -28968630 -15558289 -29202162 -44684503 -40166979 -37221148
46343 -37221148 -60614163 -86175862 -68056856 -6392957 47167824 50551737 11750657
46336 11750657 -32829306 -57464315 -58826356 -46757596 -34369298 -30226923 -33018423
46329 -33018423 -34504578 -28145320 -14523027 -1715691 -944758 -14923255 -28066999 -17592224
46321 -17592224 19777169 60402586 79327196 74846179 61075299 46935348 33461700
46314 33461700 23295522 19399494 18351991 15370980 11891579 9593466 3840635 -6445324
46306 -6445324 -10636929 -2263167 4152087 -9733604 -35176443 -43214868 -25822663 -10517322
46298 -10517322 -22930241 -48336448 -46601013 -3475903 45826857 52065275 8670583
46291 8670583 -36858074 -36511987 329375 20305917 -2358550 -32890239 -27786140 5836595
46283 5836595 29426891 33057930 39901221 57740033 66188417 57325277 50643030 53375195
46275 53375195 41402248 2497784 -31218163 -24198021 9388276 25232519 9393641
46268 9393641 -11660908 -15142264 -6299859 1146338 3259594 1242549 -1436315 4160737
46260 4160737 19825917 25873279 2676779 -31864853 -33178067 12113349 62698503
46253 62698503 70984817 35834426 -8398285 -37608441 -52320441 -58249095 -55349522
46246 -55349522 -43958422 -25463284 2172301 37498821 67698290 80476190 80476748 80232557
46238 80232557 78082215 61562186 32667268 11822370 11455710 20661423 23490817 19604996
46230 19604996 17940990 20790824 24222581 25951923 23395775 11889804 -5118959 -11673091
46222 -11673091 3334372 29880030 48683177 53483841 50060045 40275724 22331571
46215 22331571 1781772 -14504152 -31289857 -53202572 -64575557 -45995094 -11016044
46208 -11016044 3218975 -11203865 -21971816 -12623330 -13505370 -48343731 -81858080
46201 -81858080 -63301593 -4032795 35556727 30724093 16821067 25425044 43069654
46194 43069654 48694795 49811925 56893863 55591604 33008374 5868942 -5854433 -11679122
46186 -11679122 -28080295 -42239192 -29824598 4157653 32300479 42128021 38330764
46179 38330764 19576958 -14604776 -42390826 -40218176 -21311961 -19118063 -34069527
46172 -34069527 -34548896 -13610359 -3390813 -20956924 -39223618 -31929770 -13558099
46165 -13558099 -10031712 -18741619 -24736765 -31261519 -44351320 -48759443 -32021002 -15079562
46157 -15079562 -23565220 -41683428 -33767305 -5248810 170686 -31901417 -62356801
46150 -62356801 -55781944 -27254067 -11206030 -10731527 -3869023 16597144 35503992 39448148
46142 39448148 27671939 3784821 -24994678 -42784267 -36329243 -13125181 4249584
46135 4249584 4255149 -2657388 -1111473 9859316 18632280 17354246 12123548 16009283
46127 16009283 31736489 44527106 38549262 18959275 6373105 7429917 6231192
46120 6231192 -6897132 -16018989 -6327225 4709662 -10912360 -45399269 -60245537
46113 -60245537 -39856362 -10607362 2593327 9337704 26104812 42113125 38467120
46106 38467120 22813581 16050648 16399714 6502325 -11141976 -17733687 -15364590 -27480624
46098 -27480624 -56910924 -75244647 -65446771 -46288084 -39397111 -39874111 -40255631 -57443169
46090 -57443169 -105558931 -157812704 -168154013 -127324454 -71912164 -38744463 -31948806
46083 -31948806 -34998481 -34584250 -28485681 -24060766 -31000064 -46132992 -50547311 -33767688
46075 -33767688 -10925012 1911789 17232537 53340751 89973228 83409705 30945431
46068 30945431 -15462189 -14504830 16411596 37607305 42779991 50901608 64180492 67509523
46060 67509523 60468164 58806718 64776204 61354673 39351787 10209190 -13019268 -31358718
46052 -31358718 -50617411 -67787013 -72051297 -53396108 -10915575 39934966 71938288
46045 71938288 69584188 46982359 31359573 29905988 25228376 3356179 -27713536
46038 -27713536 -50132370 -53885081 -38229082 -8484413 21070808 31542307 16819426
46031 16819426 -8040696 -22618063 -21391081 -13604726 -8570679 -7418369 -5412541 3491460
46023 3491460 21069124 38915424 43417082 33949780 30154866 48379959 72836457 67451803
46015 67451803 23227090 -22779676 -31375574 -12029482 -5803841 -21253898 -19181979
46008 -19181979 25625785 76841014 80235619 38895641 8877465 21956998 49091468
46001 49091468 50897323 31325184 19365021 21313619 19373719 5842949 -8089772
45994 -8089772 -14456277 -18109958 -24119717 -31851114 -41512819 -52651003 -56776714 -44577907
45986 -44577907 -20144403 3163087 18826957 27829869 27697859 15908701 2100248
45979 2100248 1052211 13230288 26496529 36109341 46679371 54561068 48117056 30125686
45971 30125686 20446832 27085448 31155049 12954871 -19245206 -39483697 -35447136 -18694191
45963 -18694191 -9028767 -16986249 -36904962 -50661145 -42737285 -16278004 10322209
45956 10322209 23934787 25490245 18304754 2530209 -13021453 -10028107 15460500
45949 15460500 40263340 40255948 21422045 10077875 18217830 33669583 40337427 32398884
45941 32398884 10721006 -18030648 -37999935 -36762127 -25281951 -28805687 -50514476
45934 -50514476 -60820301 -36758056 444456 7253923 -25623255 -58673192 -51715936
45927 -51715936 -11495765 19792098 13773094 -19164442 -48030327 -48945285 -16297665
45920 -16297665 35765147 76307837 76876151 40096509 1233959 -9025237 3664704
45913 3664704 12246499 5266906 -6049042 -11047499 -11368131 -10473716 -9270768 -14020877
45905 -14020877 -31108152 -49265010 -44239823 -9837411 29617475 47211385 41880095
45898 41880095 29793558 19904458 10536631 660865 -9587133 -24270971 -44810386
45891 -44810386 -60856210 -59367231 -41805775 -22977256 -12377452 -3866218 13986812
45884 13986812 40222326 56440777 43615734 8462828 -13311171 6556629 50834716
45877 50834716 72555379 51993628 18003595 4294096 7445443 6452172 3785595 18732798
45869 18732798 48649151 66177313 56746080 35133669 18985115 5465976 -16388477
45862 -16388477 -43829197 -61511870 -58572598 -39216478 -19727634 -15162649 -24529232
45855 -24529232 -31745545 -26659408 -18969222 -22295729 -31842134 -31309698 -16331973 4707729
45847 4707729 28766566 58227980 83713256 86468379 61633254 23418098 -14181607
45840 -14181607 -44039458 -52824461 -25819407 25774988 63962605 64647001 43516947
45833 43516947 29229545 27649686 27340560 23617199 17341484 2101899 -25774335 -51501918
45825 -51501918 -56221338 -42678015 -28575048 -19626126 -9546676 -3004622 -13792566
45818 -13792566 -36647223 -44570128 -24146468 5411231 20248912 21833875 24018630
45811 24018630 25450462 15892705 1651247 974056 14312793 21719690 15620205 14454019
45803 14454019 30836960 45429055 33970399 8436450 4281151 28726224 49678334
45796 49678334 42824563 22811316 12643348 6700632 -11585385 -32994913 -33911384 -16227819
45788 -16227819 -4629400 -5451657 -233498 14100777 10931644 -24715813 -66641529 -80210058
45780 -80210058 -66506232 -52764773 -51981776 -52944573 -42184907 -17890685 11845719 30595226
45772 30595226 22138061 -8226021 -31257611 -28320616 -16166924 -18568562 -27811445 -21220583
45764 -21220583 -4808275 -5720463 -23046276 -23711113 3329248 23560698 6194928 -30657467
45756 -30657467 -47739759 -37258244 -21416719 -11484572 3197831 27723349 47138493
45749 47138493 45505151 26339501 9050197 10758785 31119326 50540522 47359132
45742 47359132 21470741 -5616080 -18834496 -26073485 -37471279 -42829214 -28096940
45735 -28096940 -4739004 933150 -14056369 -25187694 -18180644 -8407519 -13023325 -23180665
45727 -23180665 -18969491 1134780 21620458 32226192 33609405 26452285 10778746
45720 10778746 -5249333 -10247588 -5371113 -3874022 -12083924 -20546553 -17824016 -4687892
45712 -4687892 9818823 19226864 21780294 18137604 12130174 8526512 5977754 -567340
45704 -567340 -4951272 12346133 58946018 109992067 129834076 113406091 88323599
45697 88323599 73354966 56615941 26711660 3767820 14446172 46342046 56780470
45690 56780470 29895549 -579786 4032154 39870622 71915275 77408670 60799474
45683 60799474 36202077 14788781 5678750 10765405 17230590 9804689 -7019196 -12066020
45675 -12066020 3495917 22641645 24642384 10953017 335758 3982010 14350705
45668 14350705 17482170 10191095 3269254 8762143 24640275 34491164 25709678 5970918
45660 5970918 -4234207 4110515 17299674 14274399 -9850064 -37431191 -45154262 -28839836
45652 -28839836 -10840661 -15767616 -36949447 -39656778 -6985856 31909611 38068257
45645 38068257 15913485 3148883 12052501 15164857 -3198319 -17375817 -3453287
45638 -3453287 18078920 13077794 -13862637 -32219146 -37021101 -48927166 -66988374
45631 -66988374 -61902994 -25275431 8920131 9164174 -12568977 -23254073 -13196524
45624 -13196524 1548142 7704996 6134748 1194420 -5728574 -14238563 -24794743 -36297475
45616 -36297475 -39725727 -23922492 6239140 29367427 34113243 34384677 46916193 64973895
45608 64973895 68470689 51953276 28129842 9850333 2636105 9297067 25956387
45601 25956387 36012329 24255429 -1185402 -14308547 -2975371 14270658 8671834
45594 8671834 -25693477 -63091852 -70575732 -41825512 -4480445 11129956 6595534
45587 6595534 6937637 20167920 26309739 13280213 -139917 5897990 20057223 20924432
45579 20924432 14256775 20338113 34589400 33547672 17246578 12113619 27219084 39285233
45571 39285233 31348557 17691906 15974129 19914541 17575907 15350851 23126383 32292464
45563 32292464 30060231 22777370 22557067 20047569 -4279688 -42538299 -56024268 -18409102
45555 -18409102 48755909 92040076 75653396 13858955 -43751587 -58467943 -32932520
45548 -32932520 4146748 33405387 52585099 57327696 39111564 7727746 -7691270
45541 -7691270 5885800 26149974 26643670 11846706 3925495 7516620 7628139 -5075086
45533 -5075086 -24736232 -40674296 -42884795 -24092412 9845527 39340384 53222356
45526 53222356 59945296 63754337 48756552 9535013 -21516986 -10798308 25212343
45519 25212343 44114200 45200202 64803058 99793716 90997325 10328981 -80482788
45512 -80482788 -100601298 -52508191 -9067293 -12677504 -33970247 -31386993 -7712665
45505 -7712665 9925033 14949855 19725891 23463837 8226967 -30987111 -68927197 -73329998
45497 -73329998 -42070709 -8284432 -3803203 -22353508 -28867227 -5906296 22034852
45490 22034852 19539389 -13757617 -43123366 -43648471 -30688109 -38088847 -73448401 -105160979
45482 -105160979 -95882390 -44055133 12806012 36603613 26144749 13212925 25253891
45475 25253891 58040493 83704237 78869145 44447397 4054732 -15315010 -4999244
45468 -4999244 21970838 48748929 67729296 71701599 48773006 4879142 -22108245
45461 -22108245 -1492661 40456191 45749806 5337895 -25954257 -11878627 12077191
45454 12077191 1597444 -21170862 -7594205 28932551 29474428 -11739512 -32596183
45447 -32596183 -151078 40305675 41036006 20597629 15858255 12855343 -19478136 -58268122
45439 -58268122 -52298440 -6844468 17834191 -3366697 -26070144 -7207831 36508129
45432 36508129 64474764 68924489 66302853 59879182 44419943 32262713 42470360
45425 42470360 68573272 81760588 65958228 32007173 -2530000 -32163770 -60055981
45418 -60055981 -86419060 -103472723 -99695844 -73392169 -43698386 -37193601 -57117114
45411 -57117114 -77604043 -76968182 -63148435 -54559319 -51498824 -44876919 -39910863 -46948304
45403 -46948304 -55674376 -43943496 -11803024 15506515 19667435 4308577 -21949961
45396 -21949961 -54230933 -79136883 -77033118 -46474250 -10017727 11055267 13161934
45389 13161934 624461 -18826846 -25248707 -148565 40159088 51244257 17308240
45382 17308240 -21930227 -20759315 16360914 49109464 52423635 29315126 -9634084
45375 -9634084 -50209894 -68201287 -47681323 -2883268 37307047 58672516 58841232
45368 58841232 33523720 -6726589 -23505470 7794192 52639446 54439575 13028300
45361 13028300 -18038771 -14006132 -8001896 -23215997 -27695577 10918684 65221628
45354 65221628 83740144 62439559 40317048 37950556 38778544 26318988 6054538
45347 6054538 -12162323 -27714152 -40320320 -45345957 -41339622 -30627083 -14419505
45340 -14419505 2014931 6167948 -5411088 -14174307 659370 33276870 56905720
45333 56905720 54289391 29359499 -4891566 -34631882 -47544702 -44008658 -41222697
45326 -41222697 -50518658 -58165784 -47668695 -31905559 -36415673 -54343275 -49261396 -9175011
45318 -9175011 31012167 34941801 10685633 -5867512 1818982 18065414 20960641 6413686
45310 6413686 -10683615 -10491470 13808538 46969571 63770866 52204397 21112305
45303 21112305 -12071274 -32026554 -28011764 -1636844 25937965 30517419 13892144
45296 13892144 2563530 12529953 30105260 33952318 20035268 -4448481 -35376367
45289 -35376367 -66075130 -80655525 -69734861 -45786393 -29190426 -24800561 -23888420
45282 -23888420 -22171393 -22384452 -23770181 -22216153 -18154655 -13258253 -2783049 16891109
45274 16891109 35340968 35024909 11928619 -19708460 -43056454 -50739541 -42621641 -22513637
45266 -22513637 -342682 10041589 740791 -23572576 -49661345 -65708778 -68939566
45259 -68939566 -64451189 -55238488 -36172036 -4392431 27113342 39049748 31020834
45252 31020834 22470819 22312549 14418451 -13964049 -44878516 -50190491 -30234147 -11008486
45244 -11008486 -7104491 -8449922 -3764482 3702563 8924064 15826757 26325974 30659561
45236 30659561 18061339 -8611874 -33780473 -41350861 -27255223 -5804244 788633
45229 788633 -10976988 -15542386 10350115 50412409 63889655 39487811 11492117
45222 11492117 13599083 37536892 51589588 43453578 26835154 15917487 11253929
45215 11253929 6915981 -1896221 -16194566 -29366015 -30538328 -19443663 -11185354 -17503028
45207 -17503028 -30586693 -34970410 -27798527 -17180581 -9277079 -8924945 -22885082 -46152896
45199 -46152896 -53713319 -26948496 14991161 32071173 13467257 -9423790 -4827347
45192 -4827347 23586783 50270097 59170964 50007983 27785166 490395 -21381409
45185 -21381409 -35485507 -51918800 -77352945 -101749602 -110493236 -102235859 -83685779
45178 -83685779 -54973029 -15969949 17289208 21687707 -3703392 -32596770 -42376707
45171 -42376707 -37388601 -32598017 -26171268 -4192842 31524998 58172373 60120781 49487230
45163 49487230 47642388 53538392 45189106 13322848 -20919985 -30828843 -18247454 -10797246
45155 -10797246 -26817876 -54365261 -68565033 -61914435 -50410706 -51047291 -58318973 -47245717
45147 -47245717 -2688939 55833654 86354964 66613816 18191282 -18500021 -27025993
45140 -27025993 -21625089 -16492375 -6699934 15723163 42687342 58608061 60092948 56846311
45132 56846311 57367390 62324445 69827410 79754933 91336138 98773800 91534548 64435970
45124 64435970 31525661 21441742 46419731 81593024 92510138 79847893 73630888
45117 73630888 82361035 78381866 44958194 6020846 -12695959 -22935743 -43924347
45110 -43924347 -58560002 -40018695 -5814756 1273727 -19072705 -24792430 -4389883
45103 -4389883 -397942 -41447963 -93832901 -108519104 -83494134 -49578111 -21603576
45096 -21603576 3300121 19342161 18527192 11547876 12895583 16095554 11470792 15504891
45088 15504891 48766597 91869647 99758435 61262330 12148040 -15404094 -25380258
45081 -25380258 -32788588 -37375163 -37186476 -42133984 -54648362 -55840550 -31073463 3757731
45073 3757731 20622327 15634723 9718772 17883646 33294629 41119336 36561924 27552117
45065 27552117 25787631 35206122 46248854 44433777 27521304 9402788 2971569 4701323
45057 4701323 2319320 -6615683 -12010828 -6671155 2962748 5238393 -1594429 -9375974
45049 -9375974 -15823274 -30991583 -58531882 -77437341 -61374622 -18968454 6908404
45042 6908404 -7232729 -32511417 -28852513 -2269235 7897544 -10685233 -30408279
45035 -30408279 -31839460 -29679236 -40024330 -52963412 -55510858 -56342116 -65624435 -69139538
45027 -69139538 -46395942 -3030746 35698966 55314369 58039604 47005552 23826007
45020 23826007 -2745356 -22426076 -34584770 -40952671 -33552064 -5506617 30167119
45013 30167119 48189897 37073174 7399015 -22157413 -37475530 -34414776 -23422609
45006 -23422609 -22230087 -32602312 -33564554 -11407149 15554388 22076016 15834556 26908861
44998 26908861 61838998 95045322 106631950 101759107 87946491 61366187 27235857
44991 27235857 8556393 17157599 34509736 38394858 32320336 30077593 27014572 11565560
44983 11565560 -3468187 10107853 52415303 85109533 76481477 41918621 24206498
44976 24206498 39994519 61436045 53170969 14593095 -24951729 -46417581 -59707584
44969 -59707584 -77279402 -86050319 -64274096 -20921220 4370811 -11946178 -47048145
44962 -47048145 -60360219 -41300713 -13884129 -633978 -116123 -2230192 -9125085 -29156382
44954 -29156382 -56466724 -69385186 -52631849 -15210597 18491243 32952948 32249693
44947 32249693 28315246 26369224 25578107 27088236 32300743 34494959 21737247 -7340497
44939 -7340497 -35948670 -43806314 -29267353 -12046877 -11184659 -23333538 -28543190 -17250979
44931 -17250979 -2696922 -1416333 -11150646 -19900356 -28932856 -47869090 -69070743 -70423292
44923 -70423292 -49660270 -32523351 -34838195 -39376564 -27637588 -11708743 -10072751
44916 -10072751 -12205642 878074 16051779 5945458 -20288141 -25114965 -1545105
44909 -1545105 18330925 20249177 28552947 53970387 65105505 40031177 7967434
44902 7967434 3241581 8890820 -10248059 -39917818 -31687051 20726493 67247778 69014480
44894 69014480 41675044 21216916 19628735 28732535 40947992 48626658 41234423 18423891
44886 18423891 -6713972 -25717782 -40521246 -44492366 -19408226 33613491 78554474
44879 78554474 80691565 48301185 19194255 12650955 14377708 6428495 -8726886 -19290654
44871 -19290654 -23352713 -26344886 -26945248 -16181205 9853644 42443346 66618732 71966769
44863 71966769 56896053 27305484 -4359025 -21680661 -13927456 14357365 48391006
44856 48391006 78423234 101980909 110022451 86869916 36364546 -5085793 -3299560
44849 -3299560 29045606 44632313 21397870 -11427279 -15887211 6857810 27306886
44842 27306886 30232229 24415372 17147280 3121017 -17395454 -27464368 -10791319
44835 -10791319 27533566 64156463 77355991 62132224 32082553 9092333 4469527
44828 4469527 6190677 -9287333 -47774803 -85466826 -92872147 -66888378 -31691481
44821 -31691481 -10059144 -2719093 3272116 15346497 29957034 39985886 41114712
44814 41114712 34169263 26529808 28010019 39617939 49575154 47044037 36532911 30580018
44806 30580018 31483153 31323402 28278982 28705653 31591784 27621517 19712411 25914638
44798 25914638 48451530 56812815 23962287 -28632185 -46822958 -6939314 55729290
44791 55729290 86986487 68356736 27008270 3523066 15167077 41903373 45674434
44784 45674434 11587231 -31558382 -43989718 -24918526 -10076526 -18166436 -25502173
44777 -25502173 -5570835 30337756 52234040 53435971 49975955 50182157 49779837 49885808
44769 49885808 54494577 53697235 34966116 10249119 4903236 17143181 17997948 300260
44761 300260 -3707286 27079784 61211014 52068500 632270 -48496629 -65187684 -58984605
44753 -58984605 -49806259 -43744609 -42907712 -52010333 -63235514 -55575635 -23980878 6119660
44745 6119660 8386452 -11268185 -24948175 -17822556 -29240 9784017 836923 -24287669
44737 -24287669 -49256035 -53706932 -33493099 -7135120 5295444 2166524 -8433087
44730 -8433087 -24243493 -41020641 -41989620 -16937897 14984549 24383199 9737586 -6798831
44722 -6798831 -17626394 -34643393 -54708744 -53324519 -23508750 9189968 25238381
44715 25238381 35663207 50181036 51912692 30702017 13771033 28132681 53091051
44708 53091051 49642808 23779375 18076483 45572425 75005916 84136453 85828893 91907861
44700 91907861 90891067 77895461 71793112 82156095 88768558 76106304 61888616
44693 61888616 67276496 81715720 83416644 75456800 74238491 77516281 71658500 59223004
44685 59223004 52660158 49518857 39089481 25678082 20726329 19953772 13924367 13010926
44677 13010926 32786929 60225378 66330191 51246266 43941026 54096536 58444025
44670 58444025 43586365 28506393 28769312 28661737 10521584 -12145034 -14754689 2502764
44662 2502764 21329383 33518103 40607086 37791103 21392988 4061520 131985 1079332
44654 1079332 -13365782 -42635128 -63828130 -62298463 -46192754 -30121037 -20330221
44647 -20330221 -17296743 -18684268 -17780161 -10274541 -2185363 -821059 -2288750 -1041163
44639 -1041163 -4817133 -21019643 -33896875 -20921521 7598068 14154795 -12257715
44632 -12257715 -36471759 -27102215 -564722 7562184 -5783866 -17088301 -20120591
44625 -20120591 -29828783 -44930597 -40460974 -7349001 26691747 31383897 11405233
44618 11405233 -6594084 -11670505 -14678254 -22916949 -28276231 -23402273 -14266230 -7666931
44610 -7666931 4232933 33104578 68871933 79919050 49804010 6065538 -4427171
44603 -4427171 28965025 65727950 63657276 29259136 3555140 7085005 19888223
44596 19888223 16063177 -1724822 -10488836 3101600 30760185 54218432 61701434
44589 61701434 55911959 48992502 47812497 46431626 38258699 30210739 33168011 41793391
44581 41793391 39818469 25986136 16783546 18650871 16295325 -1818041 -23951798 -34442468
44573 -34442468 -37146936 -42971697 -46519860 -35087569 -14085013 -3788448 -12122678 -26000800
44565 -26000800 -29074509 -15735523 10258155 38343034 53777529 49308697 33151887
44558 33151887 16698539 -524754 -22948214 -43385336 -50373949 -46115122 -41412315
44551 -41412315 -36734769 -24500365 -6440304 8396053 19065450 27824867 25236383
44544 25236383 3779883 -16388273 -3853415 37344414 65127675 52626945 18044260
44537 18044260 -10184206 -31124415 -56184666 -79179775 -84244934 -68613732 -38186401
44530 -38186401 4868488 50137802 69384782 43867189 -5914744 -39402047 -40375785
44523 -40375785 -24378325 -8819133 3132122 11625384 13918038 11795519 11094898 12750700
44515 12750700 14752129 19742284 28722752 31728989 18969844 -1349132 -9520677 3331093
44507 3331093 29778710 57156782 72127713 62770565 32882038 7510877 5513777
44500 5513777 11915511 -1781265 -33676931 -51499146 -37102021 -7604856 11983825
44493 11983825 15451723 8723164 -2478693 -9579241 -4106663 6776348 3931716 -15247796
44485 -15247796 -27647872 -14376844 13484960 29695467 22749277 2896202 -10283276
44478 -10283276 -1769576 25011855 43734410 30053680 -3936144 -18998823 -164946
44471 -164946 23452978 23177914 10755520 12081835 21881099 14787338 -9513974 -24391432
44463 -24391432 -18198059 -9103151 -12415649 -17351774 -7659692 11195306 18690805 5760115
44455 5760115 -14256686 -19300494 -1369804 22731417 27069797 6732706 -15646845
44448 -15646845 -20899371 -18878963 -27793137 -39117150 -27175782 9405458 41866024
44441 41866024 50448462 44149831 34121634 14795953 -12747821 -24045058 -2919802
44434 -2919802 27292996 32626980 18063583 16937706 34289866 36130535 4906832 -26219258
44426 -26219258 -16621419 25065582 54434751 51748207 41391456 50666232 74127375
44419 74127375 88679136 86330466 77010492 67630064 53363962 29276668 1160937
44412 1160937 -17339503 -15236342 6234854 30795807 37363814 19197798 -8712337
44405 -8712337 -26193160 -28705766 -25293224 -20604880 -11660189 -3092190 -10387775 -38867768
44397 -38867768 -70062716 -81720847 -75383215 -69892355 -70379877 -61317070 -34539193 -6531481
44389 -6531481 4333271 4508131 11839944 23322676 18118853 -6703557 -25464364 -17296660
44381 -17296660 7834491 28401623 40421558 51514914 59856003 59643651 58655448 68021952
44373 68021952 79340346 74798065 57462450 46772690 43982094 30121455 3386287
44366 3386287 -11412813 -2207159 10869161 12163724 17620449 41305414 61064067 49259470
44358 49259470 19160584 6237035 15408589 22655089 22489454 36091353 69681059 98418354
44350 98418354 100127225 78932774 48582082 16944790 -5638532 -6494278 10857107
44343 10857107 26827201 31022245 29889596 26667201 15479011 -272932 -6318001 80986
44335 80986 8454568 20337601 50620152 96233677 128970657 128940353 102046177 59167381
44327 59167381 7528667 -30175880 -24660398 15375999 41613453 28967173 6939129
44320 6939129 6977099 16071583 12581093 11147965 31801347 54068063 46581094 19913053
44312 19913053 4431014 -5113048 -33229529 -65613978 -61404506 -20808024 10480806
44305 10480806 8864915 -1106070 4813412 20160704 36250013 58352721 77169053
44298 77169053 62152240 5052186 -57251831 -81629155 -59916017 -12461870 35079943
44291 35079943 61201058 61093962 56425947 66766841 71848293 39003736 -10892272 -15533284
44283 -15533284 35058585 70486842 38098860 -17959471 -21026166 29408544 65255524
44276 65255524 46877638 2213113 -24742967 -20612976 4965406 39548168 72815745
44269 72815745 100795369 125514169 138018206 114844288 51883128 -13099683 -38655833
44262 -38655833 -29015291 -17824987 -15144276 -4302247 16325101 26511276 20749820
44255 20749820 17532264 26228096 34297760 34155928 35277769 41871355 43942184 38695870
44247 38695870 37181909 42118767 42342781 36232679 36245224 42417367 37140630 15990233
44239 15990233 -2733077 -10196656 -19466796 -30925650 -18399616 25037693 57685789
44232 57685789 40948930 -356343 -8840610 26086399 60813379 66137529 60346991
44225 60346991 65173859 68571875 52592437 29040365 20378159 23311484 18863030 8419059
44217 8419059 11695599 30237887 39314955 24535849 7261495 19427822 62400198
44210 62400198 103629183 110880232 80785574 36104800 4182571 -1342453 13807276
44203 13807276 31955878 39183277 36322113 33658510 36227014 38989644 36745989 32425053
44195 32425053 31824659 34787648 36831152 36861628 37482563 38337706 35074428 26855016 20380232
44186 20380232 22404328 30170477 34334247 32528569 34464348 47585181 60913203 54251565
44178 54251565 27085139 6468131 14946854 39033781 46441779 31825221 24165556
44171 24165556 42560947 65929725 63212177 39328362 28568878 46417472 69685830
44164 69685830 68418952 40507477 7441033 -10609891 -5828832 19943611 55259939
44157 55259939 80738585 83373815 70101045 59164688 58795834 63782175 72316952 91109371
44149 91109371 116496379 125560970 102828294 67419661 52580599 60738754 63891879
44142 63891879 52630474 54175040 84200715 109621998 90977669 43450066 17620676
44135 17620676 27739350 40070041 33246603 26847436 37777063 48672502 41059589
44128 41059589 26289687 19442323 13331631 5126302 17449055 58665847 89530955
44121 89530955 70332321 20883210 -9868608 -17258746 -34836191 -65050910 -71566684
44114 -71566684 -44307310 -18854288 -17083616 -16095185 3985494 24010834 21512301 4609383
44106 4609383 -15125810 -47175201 -89567879 -105979788 -71834106 -17080043 13629206
44099 13629206 20326217 29236122 37832967 25504060 5987304 18000785 63058349
44092 63058349 98753263 101671062 95473049 103814919 113915934 106448509 89779510 80911124
44084 80911124 76121644 64003651 49754198 44363621 43487353 37406741 30543526 31934490
44076 31934490 36286942 33491083 28830220 34889979 49545374 60122182 63938238 65905125
44068 65905125 60669737 39434395 14447113 13143795 40472796 65988163 59460317
44061 59460317 26296621 -2451890 -4817450 16174372 41239990 50103683 36301826
44054 36301826 14841654 7112122 13075352 12183182 -67711 3169050 39484081 79547816
44046 79547816 80503505 47706256 26640608 32255863 26915328 -15746055 -62599328 -66234547
44038 -66234547 -32297385 -6219433 -7645825 -15051405 -10556326 -3543557 -3978770 -2180262
44030 -2180262 12911811 35381206 52062398 55882764 44996018 24520776 11534562
44023 11534562 19677584 36029426 34369867 15082827 7074163 22800281 39272627
44016 39272627 37211024 30843902 38387832 48518094 42605050 29717187 29755796 37482391
44008 37482391 35009685 28174645 35995679 50824762 46093651 23722703 15917273 32206670
44000 32206670 42016027 26497406 13738021 35435320 72804771 78935028 44463344
43993 44463344 8969050 6200195 25019032 34473071 27761331 23879833 33378424 41485643
43985 41485643 31040225 10242394 4351820 21935347 42955956 44450956 25532787
43978 25532787 -645049 -26009417 -44413235 -41107026 -7197099 38443465 63388384
43971 63388384 60071644 50413348 48657810 42160655 19672635 -2417241 -759704 20864420
43963 20864420 38069779 40536852 41365680 51961767 63973086 62464703 47656023 35112729
43955 35112729 35284649 38138555 23349100 -12549731 -45393982 -47773077 -20869695 8662773
43947 8662773 21666718 21958828 17632145 5249578 -17884319 -40530057 -49543424 -44939307
43939 -44939307 -31831700 -8966012 20854245 40525488 37668812 26921160 33339203
43932 33339203 57164019 75608409 78614378 80039177 88954727 92789799 80014261 60128073
43924 60128073 45866229 31460179 7870259 -12003391 -7326287 15272524 25866160
43917 25866160 15571311 11695440 33924280 56757567 42096815 -322695 -17475536
43910 -17475536 16157633 62069505 69956796 42728470 21583874 21757307 20146029 5280821
43902 5280821 -873139 14194787 24152222 4749764 -21307569 -15484017 14568274 22486504
43894 22486504 -9116896 -44830147 -47919836 -23772392 1902661 20462083 35879193
43887 35879193 44256170 41758016 39906752 49920308 60228192 52055276 32457174 28261983
43879 28261983 45605103 56965564 36838931 -3565074 -26271206 -4461014 53058567
43872 53058567 108386553 124376694 96671210 58042225 43690845 53315645 57750205
43865 57750205 40603441 16039587 1826716 -5057073 -13538953 -16217921 -1804420
43858 -1804420 19071984 22303593 4299670 -10975727 -3361911 19687639 37198350
43851 37198350 41104290 40340590 46077319 60734155 77310093 84021436 73629716 52779499
43843 52779499 37854917 37164681 41696692 38036281 25194354 12585233 6336820 5794884
43835 5794884 10630305 22210473 37981339 52471474 64857816 78293283 90491719
43828 90491719 93278307 85502906 79267918 86712156 104022020 114014731 102472423 68221405
43820 68221405 21525105 -20083243 -36685303 -17802305 24439668 58527213 57121735
43813 57121735 19782100 -27790772 -56035199 -54012514 -34916270 -22863718 -31221778
43806 -31221778 -49628459 -53839487 -31786767 2601239 25773142 30770947 29431257
43799 29431257 32095725 38137580 47570043 65442386 85947327 87645947 60124665 24169850
43791 24169850 6117351 674660 -15596042 -36588575 -23941352 37660517 110269224
43784 110269224 146767815 144457438 133384091 129786079 128318141 127570436 131152937 127227898
43776 127227898 98611730 56388162 34606402 44478274 60406695 60353058 52651277 49659620
43768 49659620 43076197 26103103 15552077 25432512 37310756 26290990 2618191
43761 2618191 -4640039 3191760 -3667908 -32974405 -56066849 -51016983 -30361636 -14812111
43753 -14812111 -5746743 1946860 2772906 -6278714 -12992611 -6382492 8437517 24320040
43745 24320040 43794738 63085812 64899051 46391438 34485658 48669025 66124808
43738 66124808 54107939 23647318 15400073 38138689 59346960 58504779 51001405 49607652
43730 49607652 40029600 13832444 -5881989 3477987 28663670 40599964 31785060
43723 31785060 13872243 -2237381 -2814062 29285393 83670507 111797628 81876527
43716 81876527 28957602 12176635 33579754 43053303 18902420 -6486936 -8518737
43709 -8518737 -7072021 -20439140 -27617308 -8241457 15229386 12786806 -1056797 9568998
43701 9568998 42591252 61694721 52100209 35761485 32080326 37310172 46846613 67156522
43693 67156522 95922131 114253481 109817828 91361986 73919061 65185711 69590310
43686 69590310 86774678 100693265 90093600 58435113 35114788 36694368 44547942
43679 44547942 34449120 12854941 6379836 24725765 51646085 69003632 74773360
43672 74773360 76788992 80136367 84415567 87388830 86986245 80288626 63372649 36829022
43664 36829022 12897058 9280129 28066301 47424109 45846968 29536562 21203982
43657 21203982 25766521 26362811 15189583 7590543 19207918 46710685 77383222 99657885
43649 99657885 98165656 61776415 9872885 -12055891 16660712 62087023 77663718
43642 77663718 60836576 44264393 44006625 45627652 35981369 19351282 1263374 -17182221
43634 -17182221 -25339935 -9281005 20284633 30296645 7556416 -21373788 -26363206
43627 -26363206 -12081518 -3117212 -5038162 -1575884 15941016 37221615 51286848
43620 51286848 58807605 62566804 60917991 58712395 72126696 108407758 145288443 146398254
43612 146398254 102446190 46698617 20681126 30594104 48005170 49569197 41511281
43605 41511281 42325462 55742073 70227642 76302144 73982545 68243730 66231363 74971106
43597 74971106 93101256 107694491 106964270 93501636 78531147 67630195 60087199
43590 60087199 57348413 61534964 68223438 70940542 71019977 73067102 72862391 61739567
43582 61739567 43196416 33004039 39563837 53824174 62285804 61596031 56255936 49395502
43574 49395502 41439579 33945384 30279561 33015182 40791754 46943344 44468347 35284333
43566 35284333 29991459 34071483 40392189 41922301 44513090 56845620 73901350 83276773
43558 83276773 83903112 84355787 84489711 73804225 49315517 21972934 3546297 -1753488
43550 -1753488 6224844 21137874 24797892 2407574 -32219093 -43726268 -15975984
43543 -15975984 27443818 51863869 49608643 41673090 50944066 80405293 109975665
43536 109975665 111991011 80278481 44997612 43507444 73759896 95504462 83707219
43529 83707219 58343488 49234761 55071088 57434388 54996229 56863768 55859477 38888351
43521 38888351 17450810 16790831 34255529 38279080 15342278 -9160286 -8126227 13133002
43513 13133002 34749326 52536202 70129647 78117188 67035298 52716359 61121814
43506 61121814 87662800 97745865 75592406 49373814 53247000 82793964 107769473
43499 107769473 115642698 117890342 119891854 113417905 101849415 103975018 120544451 122417404
43491 122417404 91254602 51893944 40483910 55264149 65859404 61741989 61964877
43484 61964877 79645546 105155868 126094801 137825755 131929655 102122608 67772821
43477 67772821 63132523 91751081 116535552 107560414 75986585 48009441 31601885
43470 31601885 26543396 40911422 73012376 97347236 94482282 79074252 73868794
43463 73868794 72114776 53861462 27157831 22568748 51527977 95039766 129227676
43456 129227676 140951102 126722264 100136700 91769673 115447378 142290119 136047545
43449 136047545 106262518 94090482 110512475 125325146 118342939 103206166 92728419
43442 92728419 78267197 58100490 52084615 67661354 79053893 62560492 30711241
43435 30711241 10476322 7159106 11034192 21884297 43310490 65004075 72713865
43428 72713865 67911931 60446763 51133434 38673068 34092094 49069799 75924693 97021136
43420 97021136 110020080 126829825 148898599 159396480 143842067 109995535 83596110
43413 83596110 85286548 109736781 129385367 125895508 114100303 120774457 142935050
43406 142935050 150177151 132180086 116239915 124238103 139012856 134848050 118307026
43399 118307026 111466645 112107151 101496700 80915998 69501698 71908827 77740092 88447855
43391 88447855 113083641 138158899 135798607 108324634 92688005 108524599 130663503
43384 130663503 129754500 114583165 112027274 124034968 129642004 119369223 104070714
43377 104070714 93318197 84978485 77161902 74980267 81464283 91488177 98254326 100352202
43369 100352202 101307433 106332167 118985060 136641532 149642635 149014923 135814943 121049896
43361 121049896 116330136 124641424 138268343 145029434 138527415 122960938 107070087
43354 107070087 95586177 89427341 90340178 98608456 108382812 113657833 118152998 129481658
43346 129481658 142642237 141519776 122691770 106822788 115602639 142821259 159620503
43339 159620503 147956790 120026467 102504193 107877639 125180368 135703705 132687781
43332 132687781 123959849 118531695 116684005 115691904 119236968 132824893 151080167 159282810
43324 159282810 151404417 139115703 136342187 139934285 134639073 116541220 101883892
43317 101883892 106880479 123984453 127288728 102900042 66291106 44180181 45301153
43310 45301153 57922498 71547886 86260652 98622905 95423910 72613866 48126217
43303 48126217 40811282 44621319 41010014 32608183 44081771 86294354 137821986 170495814
43295 170495814 179563512 178213432 173048776 158884826 134771597 113649325 112099395
43288 112099395 132356232 155742322 157550395 133462491 108204197 109486072 134987484
43281 134987484 156132692 154481485 140643844 134016679 139091477 149327422 159656378
43274 159656378 163382796 149192294 116556516 86313811 80573722 96323911 112159173
43267 112159173 116684863 115975294 116279602 115803595 114684073 118135629 125560388 128243998
43259 128243998 122283031 114196967 110084476 108572168 108512058 114517386 129235282 146669747
43251 146669747 157808831 157955949 146788224 128640157 115521948 121442476 148365040
43244 148365040 183097100 210847366 225333108 224378809 207072385 181667656 165590703
43237 165590703 167025875 172647233 163334897 137729656 112052109 101755032 112136279
43230 112136279 140905658 177670901 203974843 207260772 195910647 190233438 198131635
43223 198131635 209630667 215007386 215715539 214799726 208977099 195677002 177946640 157476403
43215 157476403 133129684 111831412 108765738 127359733 149574278 158200459 160750862
43208 160750862 176837705 206363230 226471215 222079785 206404229 204706241 224128631
43201 224128631 245532755 244351961 217605597 188208648 178985629 184786495 180382684
43194 180382684 157044340 135503177 133718240 138776229 128845935 110655050 111632099 140400767
43186 140400767 178884905 210966690 233214695 236852862 209563682 165346675 145373195
43179 145373195 172008681 220337794 249291349 244001532 216300535 184637638 168028150
43172 168028150 177323952 194294986 182220218 138528165 112215570 141447909 198373227
43165 198373227 230858101 236130332 247890327 266679727 258948629 224564784 208487149
43158 208487149 231522261 259450436 261275496 251968819 251177081 243780654 217143323 199723020
43150 199723020 218881971 247848740 241991865 210508717 203869761 237377972 273387513
43143 273387513 280701340 269583906 259961546 251746713 239713651 228106328 216614816
43136 216614816 196239016 171304529 162600597 176452601 193599264 202629896 220221103
43129 220221103 257452554 286509148 269658299 213712198 169294478 174026648 215209604
43122 215209604 252950571 264771435 259177273 255701228 264202403 283132461 307200086
43115 307200086 328318790 332683124 309371196 267433504 235269835 233751736 255396159
43108 255396159 277885368 289708613 291046188 280062902 258289627 244058837 256429529
43101 256429529 284615069 297531770 288469038 284342521 300567857 314589158 303744745
43094 303744745 285550682 292794058 323727319 347036971 349026355 345875277 349442331
43087 349442331 349569224 336961825 319426938 304762579 287460019 265970825 257598122
43080 257598122 279558014 323203882 361389659 377960448 379475195 380389199 385750950
43073 385750950 387888105 374568768 342470715 306771335 292401596 308590886 335919085
43066 335919085 347264806 339165338 332135929 340097537 352432066 352993540 346624049 353964897
43058 353964897 381958861 411545954 418777411 400378836 372725060 351265038 338948925
43051 338948925 332438036 330021150 330316132 329797484 326975794 326169392 332619840 344985418
43043 344985418 355970978 359678912 355756764 347353126 338347103 332693805 333025384 337685812
43035 337685812 340582591 336680338 328476825 325127498 332576563 345035919 350243646 345043904
43027 345043904 341179487 350345308 366277160 369474658 350845215 323853573 310193215
43020 310193215 318894863 342825435 369291219 387430360 389504311 374360009 351016915
43013 351016915 332625567 324470613 322081347 322410254 330057860 346360991 357586777 346389334
43005 346389334 318267497 304099115 324152741 357075670 363275797 339313616 326138907
42998 326138907 351857690 388347602 388435871 352142662 324526787 330725403 347255162
42991 347255162 345954791 333374581 327854559 326074287 320241306 327482799 366858744 416022527
42983 416022527 426580653 384817680 327097748 289530588 271650253 260415666 260281409
42976 260281409 277901227 298150837 301937567 297335260 307834422 333605884 348502247
42969 348502247 338407230 321529766 321371562 334788309 340120177 329212415 317483294
42962 317483294 322426906 342570512 361987566 369339265 365586183 354891257 336899890
42955 336899890 313083366 294617186 293603486 305539210 310193345 295918962 276600890
42948 276600890 275831667 296982747 318452661 319675287 302971674 285358364 276697983
42941 276697983 274457568 275526137 281568790 291417949 299113233 304580274 316155530 334066679
42933 334066679 341469275 326396059 306123965 309666328 335281810 347461460 324955333
42926 324955333 290855456 278600025 285595297 284414265 269756648 265109934 281169847
42919 281169847 294573105 279880356 244881655 219582412 219675088 233508352 241230111
42912 241230111 238077578 238917459 261395121 302207807 333163617 329023666 297095712
42905 297095712 267913462 257734793 254852408 244420470 229274175 219305648 216218715
42898 216218715 218383357 226687610 235529345 232967606 222648316 230257863 270089692 316785611
42890 316785611 331478125 309482035 280482033 264558640 251638253 228334765 202929632
42883 202929632 191353181 191868738 187919882 171764655 155106013 155483132 176298236 202030308
42875 202030308 214031764 210849574 208759657 219499676 232862101 227550868 196390082
42868 196390082 155213546 128924283 132108545 158447217 184705727 191114092 182631287
42861 182631287 182020346 196346057 203301073 183374891 153209067 146696768 168488849
42854 168488849 188771179 185645495 171329492 168536345 178047901 182284856 171924778
42847 171924778 157567389 157438032 179056019 211425932 233455098 232069322 212077718
42840 212077718 187875725 170726599 166675566 177013355 192424625 196162013 184260203
42833 184260203 173230817 174458341 172316045 146983228 110100943 93906716 108354833
42826 108354833 132105781 143825019 138598760 116221026 82560516 64517961 91085207
42819 91085207 149429333 188722669 180575726 149783491 132963744 135147157 143568404
42812 143568404 155338281 168851996 172424410 165829938 171555624 200198393 226008470
42805 226008470 223554577 208015974 208630337 220610364 218071557 200940047 191813978 193877785
42797 193877785 188886314 174610100 169151601 176077546 177020999 163120498 145902893 133810822
42789 133810822 125176435 126931739 150952834 186027479 201753527 188876748 170741115
42782 170741115 167020991 171094715 171591455 170730425 170409089 163836315 152973564 152675699
42774 152675699 165592192 172898818 160923593 137879562 115195891 93302056 75326681
42767 75326681 72012230 81234396 84770017 77722014 79132787 100973682 129174353 147522184
42759 147522184 155809169 152402259 128901243 99193165 100885702 142978176 182548064
42752 182548064 181973246 159238098 148596730 143338931 121086134 98391272 106451595
42745 106451595 129545170 126161630 104687852 116026952 165035826 191780655 161784857
42738 161784857 119087983 117543974 146095910 162279599 162882048 173593834 190850999
42731 190850999 183593079 147362288 115156886 110387181 119929689 120148848 106025701 88627817
42723 88627817 82819064 101429417 142836283 179605145 178906101 143578984 116737394
42716 116737394 132873704 175854569 199911244 185540222 158031585 149679046 159140125
42709 159140125 158889276 135920941 109844384 105389618 117700945 118372183 94905137 69851503
42701 69851503 72494847 100483360 122664464 118514132 101127029 95020777 101702570 100385469
42693 100385469 80349658 57150175 49767324 54041577 52759497 45067192 46521459 59124084
42685 59124084 63271178 50377136 43917699 67566115 104094876 111631282 80013249
42678 80013249 47351362 53566964 95421906 137020594 150372691 134193056 104155275
42671 104155275 79110018 72109587 82063925 93239485 89720914 71031937 50750360
42664 50750360 42120861 47993563 61552291 72974432 77445339 79429405 87360575 103267059
42656 103267059 120799936 133723277 141286131 143975386 139906058 128681356 114653732
42649 114653732 103355023 97163970 95108988 93700288 88621104 79557437 71094430 64022277
42641 64022277 51761256 35518505 35876576 70640252 121956397 147734885 132640369
42634 132640369 106631920 101705770 111799205 113196610 104681237 101771680 104043134 97359404
42626 97359404 83250868 77221560 78387630 69940068 53990939 55963237 83136219 106643239
42618 106643239 102030454 84191624 81096661 93182862 103707257 112430657 128802742
42611 128802742 141896508 130169651 99106802 77503386 73617822 66594416 48728459
42604 48728459 42815303 61329060 79299778 72701114 59653553 73371194 110501321
42597 110501321 138258297 143207631 140913909 141768269 139828163 136745331 145247985 162463010
42589 162463010 168344270 159144140 154595311 160657235 153814800 119717243 81652320 68366964
42581 68366964 74442638 77236662 76173748 87247048 108640371 120135529 114799194 108529002
42573 108529002 116512436 136387827 155564724 163727157 159861267 154926628 161166721 172199857
42565 172199857 166757063 141657454 122639674 126736181 134351536 121094114 96968422
42558 96968422 84679256 77463166 55267801 29743456 30519387 51659764 56354736 37680783
42550 37680783 30271266 51547552 73893615 71993934 59639023 58658975 64941616 68307648
42542 68307648 76183523 92871781 101434643 91224672 80419843 86642819 96258805 86981725
42534 86981725 61155086 33116099 3796420 -27255648 -44465095 -37637780 -22735696
42527 -22735696 -14460804 2836027 46093384 92771770 105158243 85240174 69708731
42520 69708731 75208226 82770608 76468502 65587751 62931964 66007585 66201131 59665159
42512 59665159 47695010 39786781 50686220 78978701 98975682 93576576 82408240
42505 82408240 91939019 110363183 104426316 72998803 47792787 43099888 42749660 41003136
42497 41003136 57384403 96945396 128642845 123254319 90386124 60400586 47649965
42490 47649965 47484187 54560075 67404141 82316547 93820058 97881086 92339317 79865738
42482 79865738 68679861 63078823 59034949 57350537 68148658 87817766 89506332 61386144
42474 61386144 37241321 54664997 95233730 107993276 87089272 78721170 106100445
42467 106100445 135821709 134195901 112957665 96745733 83504812 63675644 47198073
42460 47198073 44327511 44974898 40496545 41336471 51633734 53045453 37186310 27500481
42452 27500481 43500051 68974219 82147017 90902760 108157848 118326232 103451610
42445 103451610 80866214 77097875 81996833 68584755 45343297 46653132 76689311
42438 76689311 102667624 104399577 95314477 90678211 86213190 74966952 60782101 49148782
42430 49148782 42854252 46619547 58622335 62656495 48968992 35213968 42731298 60400208
42422 60400208 60791791 45771105 42794738 57591196 66490839 61005863 64460167 91091936
42414 91091936 118729567 120200152 100022995 82347401 78302538 80678728 79893859 73329853
42406 73329853 65820762 66176510 75916845 82253686 74045548 61898273 66107933 86641460
42398 86641460 103976103 108307422 105992717 96958142 71877861 37902243 21790546
42391 21790546 36083051 62142585 76843531 77378571 71058431 61053766 52416847 51372525
42383 51372525 47419652 18960578 -28241996 -51968711 -24941082 23679050 44274462
42376 44274462 31152578 22558890 42844386 74619288 91836739 93819186 93812700 92465823
42368 92465823 80997862 62828206 53464947 57236212 59784337 52189267 49341280 67606187
42360 67606187 92116592 91210139 65492922 53420369 74278423 94697298 77384108
42353 77384108 38155202 19121496 23975541 24307044 20100665 40539744 79279456 84110683
42345 84110683 33939024 -20575223 -25626420 3895024 18522427 9603990 6532978
42338 6532978 18300506 25335959 24023466 35493161 64257529 83369394 72736609
42331 72736609 47145638 34233692 42680304 61858473 78011259 81566154 69948641
42324 69948641 51838828 41770979 45491776 55811814 64061766 68702250 71523039 72823092
42316 72823092 73451870 77139751 87531164 102315947 109331350 92108988 48002975 879024
42308 879024 -16173894 4953181 41637919 72230014 97105633 120144081 129461693
42301 129461693 115090952 91777578 82043466 84410709 80551679 70042511 75105306
42294 75105306 108139286 152935755 183713929 190190878 179960840 166658084 159168969
42287 159168969 154610288 140267716 108405271 68133657 37330802 26540845 35927051
42280 35927051 60024506 86433882 98216042 89517801 72779075 61283996 55105289
42273 55105289 55339731 75582884 118467791 155068598 155242734 129443818 110118778 99007050
42265 99007050 71133540 31314031 20973971 52379674 78330384 57016015 14082585
42258 14082585 2507055 23844846 33383430 13323095 -5435352 1427175 17098251
42251 17098251 20488332 22192890 37526160 49164540 30510346 -5049419 -12831612
42244 -12831612 23374464 69470728 88200435 83324380 81357635 89801111 96068313 95817023
42236 95817023 97195037 100735654 98489134 93550445 97749921 106385383 98387032 69237224
42228 69237224 41100053 29442845 23011516 12528852 15010235 45461901 83803029
42221 83803029 99557545 96608378 101433295 114643334 109652645 79914295 52201848
42214 52201848 44664626 43647184 35410565 31299218 42412930 54805552 54242874 56133247
42206 56133247 82161125 118100588 124898065 91172440 49478054 34810396 46290772
42199 46290772 58412599 55350742 42611547 33293628 34685769 46050076 60451912
42192 60451912 67858145 63165398 54117465 56267015 74812549 93813737 90237554 60111273
42184 60111273 25814655 15773078 40729974 88586271 133529998 149230188 126546508
42177 126546508 86417040 64348544 72039349 84572185 76800470 59270638 59562378
42170 59562378 78125664 87552815 73936350 54405919 49298707 58400549 71835328
42163 71835328 85365905 95941712 98874377 99309244 111595201 136813141 153912205
42156 153912205 143521204 109755789 70869921 41505062 32412922 51443666 90357497
42149 90357497 122166932 126292023 109035017 89258842 75346418 68808234 77211407
42142 77211407 104109542 133328565 143000794 133177792 122832799 120858711 117287743 105026142
42134 105026142 93117307 90962528 91844712 82733235 64533381 52293139 55342262 64941875
42126 64941875 65753059 54863974 41841867 31335464 17528011 665038 -4950818
42119 -4950818 7864758 22375548 20892659 14046255 22119139 35117467 25787758 3234597
42111 3234597 12584142 66205235 114409229 111334676 77226671 61635191 72187537
42104 72187537 80795927 80855768 90702774 106910645 100862069 66877185 35154582 28930375
42096 28930375 42394663 67862560 108646843 152508862 167722130 145422518 117263467
42089 117263467 110132493 109199116 89251584 59327776 47815030 58895624 72267549
42082 72267549 77162636 80896972 88438566 96224782 104370227 115897818 125052354 123147356
42074 123147356 114871049 113230433 119202723 121355842 115385123 109093074 106248185 99410688
42066 99410688 83482756 66332925 60236951 67314892 76318846 73101511 56560629 43995081
42058 43995081 52764598 75748929 89067624 88707372 98176706 125524411 137608364 106397148
42050 106397148 62198020 59507306 96282919 114841484 90811416 70784351 96012266
42043 96012266 134124065 129609413 90875169 73902717 92759731 102062994 73085933
42036 73085933 36811815 32355970 52498978 66924765 70224768 77098247 89460080
42029 89460080 97841735 103949124 115619815 126765367 125454854 116022934 111586466 110277011
42021 110277011 101081066 88563074 87858722 97174292 99968405 94842886 97420487 108941217
42013 108941217 109970295 93656225 79183907 79855546 82557328 75270628 72149018 90277642
42005 90277642 119494046 137408149 139736397 133805558 116862889 87305143 66236961
41998 66236961 77331184 108701977 123507799 109172295 89263016 83772170 85238341
41991 85238341 81848313 77782433 77625356 72670707 58291744 47316644 50513291 59100006
41983 59100006 62402909 67843614 84586970 100258650 96851211 82605011 83887389 106143185
41975 106143185 125503732 123302877 108671387 98753777 94427777 88595679 85207715 92874263
41967 92874263 104647868 100253393 70742981 31248130 6110540 6290044 21427217
41960 21427217 29154209 14216205 -14291049 -26689824 -3622064 38046425 63754513
41953 63754513 66343376 72916352 98530288 117484122 103715128 80778273 95489534
41946 95489534 146256238 177447264 155432065 113564384 99550444 108655371 101664395
41939 101664395 70283983 47755478 59206472 92870991 122574849 134022042 126135787
41932 126135787 108127707 97888134 103183073 103638109 74369802 30010578 18196309
41925 18196309 59114598 116096705 141731631 133059470 122639753 130885306 149034368
41918 149034368 161066403 161974679 155534281 148510030 147710032 153248739 154841260 141378936
41910 141378936 113479980 83195156 64271840 63947587 77568177 89164586 86280145
41903 86280145 77623833 85410004 114752221 142189401 143163057 120998039 98720837 90521074
41895 90521074 92553725 96299833 99144472 101916168 102560872 93922778 69932273 38854485
41887 38854485 24919218 42990004 73820491 83434208 68867251 61691835 79587563
41880 79587563 101692440 107065184 109741896 130573239 157054630 162710198 150667381
41873 150667381 143899089 142744852 128989615 107410221 103758322 118044847 118787393 94488273
41865 94488273 73887454 77480097 83380672 67213952 47452097 57852104 93008214
41858 93008214 116987975 118034652 119723012 136763762 152505352 150982485 144431802 150477477
41850 150477477 160057524 151569454 129951045 127085772 157494711 192343452 192349686 157708572
41842 157708572 127841827 131912279 156892219 171558941 166390677 155341990 148820387
41835 148820387 144881019 144986710 157841891 180945069 193873474 181243907 154509939
41828 154509939 140996141 154194484 180987183 196723290 189911270 172922801 167469692
41821 167469692 177536777 182562322 165403155 140146098 136299204 156990639 172361897
41814 172361897 159474327 129272930 103643299 85014613 66468469 56945051 71450292
41807 71450292 100601489 114372177 101157154 84571579 92176510 120644287 144004162
41800 144004162 149347777 150409356 163665164 181144085 177071661 141580242 97666605
41793 97666605 76101627 79619767 86002355 85267120 93750050 121915051 147353813 140681272
41785 140681272 109328479 92271308 110849922 144938069 163112052 159684440 153384190
41778 153384190 161797146 186197067 212788466 221329543 200472831 161975866 133405404
41771 133405404 131415057 149060556 171978696 194027848 209853190 207961786 186474409
41764 186474409 163898472 155837757 150828741 132390082 117657090 141334719 195655744
41757 195655744 220911552 177592811 102929879 65552468 78697270 94089121 79463901
41750 79463901 63250628 86273608 138463980 171973284 164927801 143622179 140218522
41743 140218522 151705698 151749756 129045955 98417678 77948001 70241455 71023724 84116550
41735 84116550 114097344 146978718 155007264 128567273 91040241 69918699 63531808
41728 63531808 53734608 43571291 56259074 94081408 125719813 127776566 116038793
41721 116038793 116746667 126806631 127682937 123405040 132752147 150215343 149942456 132160399
41713 132160399 130971476 161917541 191699208 182484313 144839514 120634555 127114576
41706 127114576 145156488 156028469 161976870 169469278 177239145 188052766 211028946
41699 211028946 239965586 245241169 204093418 133023574 76802732 66314774 95114470
41692 95114470 134396105 160196942 164215632 148764800 121938000 97990400 93095139
41685 93095139 110987249 132857747 131759866 104051013 79048825 86101284 116512247
41678 116512247 133978065 123558229 110510492 120404055 139427933 135177583 106381857
41671 106381857 86112734 95912651 121568526 140673637 150601885 156807642 155199854
41664 155199854 145214307 143251129 159508223 173072524 155939800 114812196 81603153
41657 81603153 66370913 51317722 33738937 39320137 79388188 127423274 159119134
41650 159119134 187549579 231253583 271217960 274479086 246367348 222448608 214242462
41643 214242462 199907786 171276527 154395507 170796909 205663709 229991100 234340048
41636 234340048 226212106 211225507 193063842 180400161 178767953 181505352 178528315
41629 178528315 169189549 160979899 161329471 173122921 190926614 202103287 202033784 205377286
41621 205377286 226458313 250801224 247798844 213608064 177007590 157048025 142689911
41614 142689911 125718891 123010554 144569063 166278521 163035657 148869010 152669965
41607 152669965 169113959 168337976 146126478 128936122 130364319 136726793 139877296 151266845
41599 151266845 172603531 182082707 167454833 150933518 160392372 188638022 201281105
41592 201281105 180800642 147841647 137378623 161203766 196719647 212032048 199968501
41585 199968501 181137309 172285336 165572455 150459005 141189891 159200526 194192802
41578 194192802 209558125 189759581 158691994 144264339 146621169 151076646 152339968
41571 152339968 152874474 152809721 153631462 158979129 163356850 156148825 145550273 157614586
41563 157614586 196642007 227655337 220231742 192645439 185265823 200974705 202743596
41556 202743596 169032207 123011986 100065389 107927675 128230835 141835667 143409426
41549 143409426 141083256 147587946 164442840 174965038 163843472 141882652 135124814
41542 135124814 148093573 157007063 145566901 127358009 121062908 122800822 121324487
41535 121324487 125029275 149169668 184060132 203360676 204877919 216233118 250396171
41528 250396171 278769734 265444522 212435359 152308548 108340091 84211651 84212462 113606991
41520 113606991 155201579 174246187 161390473 149603718 170086280 208728619 229144106
41513 229144106 225404219 222559646 229894604 226941901 203035886 180553323 181890102 195800677
41505 195800677 197535280 186209552 178560868 175948932 163698811 141182260 127999623
41498 127999623 135107987 149367526 155168672 155922519 163431038 177494702 188693989 195018234
41490 195018234 202968022 212751377 212513357 191928218 158275897 134406951 137684583 160657662
41482 160657662 176686693 168357616 146402699 134116013 136553987 135671990 116694809
41475 116694809 88186511 71272657 78080869 106418469 145943574 180185987 190566514
41468 190566514 172414186 145881185 139462160 161055485 193302263 216490436 224696725
41461 224696725 218276734 196014579 164859474 146369525 157587617 186907494 201408715
41454 201408715 180811583 136540936 96464004 79575955 87630763 110940941 134671891
41447 134671891 145605110 141925218 135987587 142585505 164409255 190079005 203138582
41440 203138582 192077597 158586117 120748089 101736560 108921038 129240320 149801403
41433 149801403 172645210 199008300 211785472 194436564 161795586 146878149 154650702
41426 154650702 155209847 132050753 109245928 111578774 123462436 118077365 109407953 134598193
41418 134598193 187744796 215071827 190382417 158439669 176428772 237123405 281982261
41411 281982261 276454491 239340144 203162278 179897967 171143214 180620815 200985109
41404 200985109 210850605 203463156 201673278 224277525 250441380 242072979 196611760
41397 196611760 152748264 140821226 149705737 151975622 143602343 143408592 162886852 192153771
41389 192153771 213847384 220077904 214983542 207327579 201967575 196319912 186543707 177226500
41381 177226500 178345245 189386018 195119495 185163850 170564033 169088362 177805173 175205325
41373 175205325 153513356 134910972 145138627 177859805 198465557 185225757 156219531
41366 156219531 146668948 164256740 180353413 169573242 144031006 134329568 145275785
41359 145275785 151729106 139137326 125461532 132664059 154914630 170071014 169460776
41352 169460776 161004711 153622135 152886674 160588355 163975659 140553314 93284180 64535975
41344 64535975 87495327 136786427 160216262 149597871 140640588 147836304 148392512 138490298
41336 138490298 153123225 205625604 252467551 251746637 220281907 196116659 178203661
41329 178203661 147384535 118794570 120476953 136703806 127548645 96957469 84952942
41322 84952942 92532510 75549075 27110550 5211180 47041386 106438811 119656689
41315 119656689 96294172 95335455 133574283 170452379 177761801 175515199 189394536
41308 189394536 210533608 215702077 203617631 192604213 194822500 206705880 217517916
41301 217517916 217557509 202879329 179077432 157352884 142636878 128944059 110092328
41294 110092328 91936042 88980203 107779506 136075171 152155708 147204757 135345484
41287 135345484 136704821 153002990 167503701 167771280 157602028 144608430 128888663
41280 128888663 110707038 97877560 95670927 98358722 101239888 112189489 137542349
41273 137542349 162764255 164089192 139827256 115817657 115448150 133908306 146524011
41266 146524011 135658205 105364057 74318121 58243373 57768821 61799270 61292492 56168465
41258 56168465 49247590 41710389 38275928 47203613 67279059 83558104 86171344 84637582
41250 84637582 90384990 93911206 78338331 51378411 41040759 56411013 74451319
41243 74451319 74504444 66507120 71280893 88091752 98985444 95860243 85543738 72915573
41235 72915573 56928491 43838104 47782163 71323645 96109470 102251991 92607004
41228 92607004 88738923 101788183 115187101 104029068 69508535 42539614 47003324
41221 47003324 70201307 83147598 82268238 89934543 113727507 130341285 120932857 100283464
41213 100283464 91952833 90869591 74282635 40847044 14682310 13653813 34542247
41206 34542247 66582491 97533717 108790035 91129044 68766868 80899382 130924194
41199 130924194 178831741 193270176 183490456 166374976 134789842 85008417 46793697
41192 46793697 48467850 69104912 65601184 38346184 28190265 49733538 71500268
41185 71500268 70616792 64665193 71691593 77168376 66189499 55768672 63799854 72422914
41177 72422914 58468804 40467849 53922605 89706028 100750112 72337022 45489962
41170 45489962 57986063 94979587 116647701 110037068 92114886 78412002 71112389
41163 71112389 69947397 75284222 81547886 80791323 74542839 75340317 94386256 127515333
41155 127515333 152005691 142826059 101243742 62738316 61999950 91956363 115191586
41148 115191586 115098730 110834324 115336111 108577541 72529992 28240308 9555942 15217310
41140 15217310 17797264 11098371 15036546 34486395 47461991 42636135 38903251 53256475
41132 53256475 73313587 78989676 71902374 64540693 57019186 45976448 43096097 59727494
41124 59727494 80355320 77509779 52339028 35687064 45022038 64042752 73659096
41117 73659096 79858522 94268255 105493847 93570109 65030314 49672345 61316486
41110 61316486 81419419 87158669 79355344 73237536 74003888 73847511 66659685 54577679
41102 54577679 43119503 38476499 46420755 64989361 80625642 81034740 70893217 65370629
41094 65370629 68572512 69447322 60719445 49443940 43236872 38159691 30417540 30591390
41086 30591390 51764543 86785234 111552612 112316615 97835681 81454117 63501583
41079 63501583 39475347 16620094 10363909 25598102 49773106 65383006 64640476
41072 64640476 52978555 43747616 48899907 68275049 86328681 84764447 61292844
41065 61292844 33027239 20167964 28982485 49712213 65593151 64136962 46996280
41058 46996280 30311269 27784227 32575010 27102417 13349202 16629008 48341983 81619678
41050 81619678 83604345 60756740 47707017 56326792 63422952 50889265 29901598
41043 29901598 16143719 6869029 -3024037 -4354683 9511592 27617611 40507784
41036 40507784 56101821 77500295 84838813 64841499 41650426 46711778 67990256
41029 67990256 63154946 21201459 -21132825 -27710763 133556 39204770 70065748
41022 70065748 80703401 69701556 54206167 53820669 61527115 52881517 26951656 10454392
41014 10454392 15284371 23281231 24331955 36010362 66486714 89688029 83167345 64110444
41006 64110444 58604602 57988865 39203521 11746967 7820257 33035560 60045419 69395716
40998 69395716 68288751 68559635 71530277 77013483 85423776 87887396 72725538 44673652
40990 44673652 22988800 19749598 31773162 49914641 63195398 60572108 44437458
40983 44437458 34999424 44158304 54021432 41353037 13501180 -4378026 -9130017 -17264512
40975 -17264512 -27351411 -17999373 12651192 35911982 30785502 9830514 -1484238
40968 -1484238 8776848 37807072 71616050 85862598 66595959 34844511 26189175
40961 26189175 41784244 47866414 29915231 13625739 18320559 23936138 7219492
40954 7219492 -18588226 -28310001 -25776604 -29428492 -34321688 -21372512 4745867 17713611
40946 17713611 6847339 -12616407 -24589463 -25121804 -11700839 18275938 55539845
40939 55539845 82673493 92690305 91458209 83314138 68779249 54900913 51784380
40932 51784380 58031847 63736122 67401940 73980325 76101676 57488988 22042786 760781
40924 760781 15890040 50697289 70792546 67593733 62153941 67959097 71443638 58092180
40916 58092180 39754618 37895073 49306507 50702545 36102288 26446489 36328941 53739180
40908 53739180 63760408 69708168 74181034 62229936 28391030 1231558 9405298
40901 9405298 36349181 43206369 27582911 20779565 30540390 29729461 6766106 -15758045
40893 -15758045 -24735990 -37800418 -63911674 -81422313 -76445000 -66357679 -61295049
40886 -61295049 -39543118 8366249 45889682 38496064 8540943 2807150 25748640
40879 25748640 44084664 42152354 34152738 31609675 33647054 42446368 58843869 70897431
40871 70897431 71551567 73226015 80050761 68330200 27902546 -1922170 18418023 63433086
40863 63433086 76514625 54908032 45232898 60841682 64329413 38919362 19393190
40856 19393190 33936241 63198614 78395215 80568051 82282479 84881259 90560224 104432239
40848 104432239 111629048 87016120 39971564 12279330 17816573 23660398 7319081
40841 7319081 -8696470 -339287 20415451 35703320 50513052 64850067 55941045
40834 55941045 19078533 -9313272 -1924192 19038624 23158820 18079756 19306965 11705740
40826 11705740 -14035593 -19754712 32197719 111133667 150729772 135680985 107490242
40819 107490242 96329571 96149609 98667966 102164774 89940351 48026169 4237120
40812 4237120 3352429 41015365 67095602 58393370 41891385 38329602 30368498 2680152
40804 2680152 -28689870 -46667238 -56630663 -60760375 -44022798 -7431233 16617210
40797 16617210 6553040 -16967183 -23741748 -12467627 5396009 32787454 69761929
40790 69761929 91635152 77067433 44276194 28671927 33470279 31987801 13994611
40783 13994611 -482006 3237137 11288051 4466989 -12826885 -20864726 -14026987 -8533791
40775 -8533791 -18851868 -34829982 -31909894 -5300432 16755339 4126661 -36593728
40768 -36593728 -68170391 -66097025 -42218019 -23972035 -23890057 -33774901 -37757641 -26271673
40760 -26271673 -4609766 11435523 15309738 19805305 35255744 46162027 31356978
40753 31356978 3164765 -2254167 21929066 39603410 24268000 -1744395 -596228
40746 -596228 28503639 52292677 46246358 14992591 -20302391 -38322619 -30099329 -9310090
40738 -9310090 -1072936 -9264475 -8689790 16905155 46916738 54388769 47624049 53106523
40730 53106523 67150011 57975902 17089013 -22283407 -28090865 -7100282 13873177
40723 13873177 26154587 40957883 62110203 74888352 64134076 34313223 6508614
40716 6508614 -2934617 2795394 9285517 10008393 9870433 11199890 8372320 920398
40708 920398 -450338 9991872 21790102 25104871 29031851 47795129 74943082 88483046
40700 88483046 80183019 64239749 56261726 58039990 65427783 77698309 93865880 109398396
40692 109398396 120936085 126775810 120925302 96332161 57696870 21800003 -692049
40685 -692049 -16462874 -35920662 -54167299 -55016758 -33558225 -5931469 8569479 10166645
40677 10166645 14626137 27251465 33433166 22559220 8985478 13320075 30471459
40670 30471459 37306025 29453725 25173797 28855047 19369488 -11982055 -38445845 -32712858
40662 -32712858 -2987211 27334712 53511072 75695433 73372513 31230438 -21644424
40655 -21644424 -38701294 -18680504 -3697611 -15388735 -32471859 -35423315 -30818076
40648 -30818076 -20103747 11724472 54868365 63552188 18624321 -30748924 -26265453
40641 -26265453 20320878 46777170 26297326 -5699315 -7359993 22397974 56190366
40634 56190366 69178145 52042259 16413736 -7054417 3140976 28128691 26621302
40627 26621302 -9271072 -38190907 -21672768 26968583 63253404 67550671 59125509
40620 59125509 59471027 64939786 62905175 57395396 61820894 72360996 67927896 41945444
40612 41945444 18141477 21604584 44841171 59845259 57178525 51646213 51262125 46718640
40604 46718640 37726207 42469013 65689163 81111158 66670402 38064332 23155007
40597 23155007 19795228 8519429 -4921230 4795183 36084885 54729056 42775202
40590 42775202 23475804 23657912 35359663 33305827 14344552 -125950 5996380 26008431
40582 26008431 40196743 34102717 8856359 -20719791 -37951503 -34787609 -11283425
40575 -11283425 27154431 64820177 77466174 54004532 13052951 -15217680 -19254217
40568 -19254217 -5491655 22013188 59719690 89941725 95105322 84137686 77148926
40561 77148926 67802661 36783736 2999336 14513616 72445946 110461426 80236007
40554 80236007 17693924 -14078249 -12800949 -18569256 -32655230 -15423863 38176919
40547 38176919 78242980 69263544 36326585 22000023 30207000 36187601 28841984 18252095
40539 18252095 12320576 6309920 -5036804 -14345620 -4110399 32815017 72948315
40532 72948315 76388482 34540396 -11039975 -18479834 -85502 1885327 -18002750
40525 -18002750 -24995693 -5450619 12209163 7785594 -1025544 1783231 -1385598 -27266353
40517 -27266353 -54781620 -52742782 -23559144 8782930 36375720 64207828 83458323
40510 83458323 78095549 51950260 25274296 9523366 4949678 14789659 40148787
40503 40148787 66435368 74963980 64514981 46288520 25320190 3022937 -11724115
40496 -11724115 -12691716 -8573943 -7008528 2709551 30350309 59967992 69051297 62941653
40488 62941653 63525966 71499735 69260252 56416617 50506966 52401737 43040003 19288465
40480 19288465 2601909 3496680 4944996 -8445123 -29591001 -47820656 -63920519
40473 -63920519 -73658644 -60830593 -24804967 4371564 -733739 -27828742 -39011249
40466 -39011249 -16019238 21793683 41636260 31375546 10341051 6338496 19555277
40459 19555277 18534205 -16512161 -59039835 -67347903 -41213611 -17113474 -10800823
40452 -10800823 -1648681 20789111 34699301 26494529 17006757 24453751 32826472 24026987
40444 24026987 13921970 25445833 47443343 52532595 39840157 28867791 24063416
40437 24063416 16627219 11538049 21416826 38489050 40932422 25444361 10670346 10947543
40429 10947543 25452699 46652289 60994255 51971444 23657801 8318970 26081056
40422 26081056 51108907 46778090 20148329 6528313 11688221 10683833 -1435782
40415 -1435782 -2888079 8168850 4762219 -21175348 -43005844 -44003603 -38182516 -31200082
40407 -31200082 -1909794 53061918 93303831 84036090 44360765 17251859 14988488
40400 14988488 22284225 30617615 38408810 35606197 19357188 10159572 22686923 35072597
40392 35072597 18654663 -14592759 -28469020 -16981911 -5935006 -4450733 6745293
40385 6745293 34906850 58909054 63559161 60165810 60384152 56316416 41836334 30397195
40377 30397195 33308516 38229364 28518835 11183322 6613926 18254542 29528359 27557033
40369 27557033 16648303 9404790 13356071 24650598 29431194 16574184 -4733042
40362 -4733042 -7669766 21856358 63230579 82072901 70745201 54093453 52862461
40355 52862461 56024176 39675879 5281443 -15395554 3814125 51765771 90852954
40348 90852954 95695106 73387869 45887181 23054235 1911519 -13168947 -5781995
40341 -5781995 28702442 64511395 66985577 35303540 9732991 25243401 66057512
40334 66057512 82436266 51873091 5342860 -14711290 -4509074 9949967 18665978
40327 18665978 37327939 70489435 92583299 80578096 47931433 26662173 24867706
40320 24867706 22463829 6904427 -7577866 -3173930 14502533 25342422 23475860
40313 23475860 23333194 36881029 56796278 68287963 69164980 68100859 67440779 61030486
40305 61030486 49823623 44851388 48593986 48039587 36821618 29495238 37622575 45428942
40297 45428942 32419468 10541394 9551613 28541961 35723845 21789908 17676230 43343707
40289 43343707 71882536 69203548 42624205 21091569 9965710 -134473 3040160
40282 3040160 39998002 95835542 129521896 129062690 122020170 125686415 122237669 95472588
40274 95472588 59886792 35528888 20816049 9860367 12602804 34511877 56096575
40267 56096575 58496505 54349713 65359929 80247446 67809970 30981468 14854965
40260 14854965 48192723 100166796 114280225 74164749 18097549 -8121488 3156105
40253 3156105 25735718 36199573 34658832 32976915 36535446 44481374 58502025 78610144
40245 78610144 93188408 87538050 65176425 47477737 45426636 43586706 23124526
40238 23124526 -7692833 -20514428 -3049220 23913557 28667312 892666 -40266200
40231 -40266200 -65260143 -59705045 -35210717 -16679387 -17086426 -25704514 -23965566 -10231494
40223 -10231494 -2025090 -12653033 -32707173 -40663303 -29161571 -13529238 -11598626
40216 -11598626 -20420580 -20294592 -2013351 18022300 16036299 -9725656 -35545607 -38034936
40208 -38034936 -16930007 8727331 20407578 12969579 -6335932 -25336963 -34132628
40201 -34132628 -29118788 -12507376 10465937 32772585 46180367 44643598 28304424
40194 28304424 3157179 -22359238 -39776574 -43223730 -32939679 -13693836 12039530
40187 12039530 43556078 71278379 76630857 52939154 19047781 -1417950 -8916370
40180 -8916370 -20068093 -35557616 -38166639 -24794015 -15710608 -21482695 -23312822 -3626367
40172 -3626367 21695502 23538181 622886 -21887040 -27248413 -17811306 3607485 35878223
40164 35878223 61263254 53252767 14674720 -14357401 -3486672 29446713 46546343
40157 46546343 43811347 51640664 84101988 114075789 109069170 73560555 40025137
40150 40025137 27523163 26455257 22397728 18034917 24347298 40319175 52192714 51061569
40142 51061569 43332582 40974179 44404594 39504037 15490760 -14901306 -22105555 4992155
40134 4992155 37827705 39150512 14699535 11423119 53713572 103706950 107138738 63306049
40126 63306049 20309479 7728851 7976129 -1248273 -10486268 -1644127 18835811 33299692
40118 33299692 42049058 55062545 66102083 59936622 40097263 26330095 25552686 26301033
40110 26301033 23034773 24726138 33470944 33997851 15994421 -6761583 -13309234 -3776131
40102 -3776131 3340007 112259 1725401 24191732 57535865 72476662 55698134 28817980
40094 28817980 23041248 39920785 51285571 39819865 23698860 29976058 54244822
40087 54244822 62597310 32174310 -21920064 -61501772 -59986414 -22612303 20737731
40080 20737731 41179055 32898911 11243756 -8432034 -23199534 -34264733 -38529582
40073 -38529582 -34516033 -25713456 -10462276 18819956 55128422 69371929 41155895
40066 41155895 -11785974 -53293777 -70095165 -72806129 -63737984 -32922581 11735078
40059 11735078 40064908 37621278 25196797 25356467 28738673 12480507 -21939918 -50861225
40051 -50861225 -61367543 -61193672 -57146020 -43755790 -19827964 -1451841 -6035991 -28132555
40043 -28132555 -42407880 -33157125 -13640872 -9689469 -27390824 -46077502 -44518522
40036 -44518522 -24269895 -2358823 8751503 5316161 -12711599 -36329847 -44016159
40029 -44016159 -21367445 16883112 40408928 39170696 30400357 29708431 33661061 34962067
40021 34962067 35667915 36620388 30836548 18842665 15767709 29668852 45157145 43796654
40013 43796654 31022106 25454663 27028547 14652248 -22388345 -65353784 -85117632
40006 -85117632 -73156937 -47940488 -33555394 -36420896 -43609125 -41246718 -29834555
39999 -29834555 -19632976 -16590659 -18861819 -23013431 -25904807 -23976548 -19355264 -22001688
39991 -22001688 -34280371 -38566752 -16580855 21072059 43743052 40604947 31462781
39984 31462781 33085743 36482573 27828567 12277087 2885897 1250536 3049837 9320037
39976 9320037 18476697 19556307 7258544 -7003643 -10999031 -7077370 -1018778 10006726
39968 10006726 25728294 34838551 33588661 35794611 47512871 50465403 32897009 18669319
39960 18669319 36243156 70962121 80612910 53129792 17337381 -2703579 -12930331
39953 -12930331 -24470662 -31799967 -25577074 -7320239 16441799 39148954 50651904
39946 50651904 45574615 36617621 41371680 54367498 50858938 20350382 -21415858 -54180426
39938 -54180426 -68396178 -60827227 -37103463 -17563198 -16397961 -15867198 11670169 56677937
39930 56677937 79572076 67686360 48700471 39530152 22981782 -7717758 -23389707
39923 -23389707 -6640008 10637007 -7120626 -44096585 -61456159 -57515370 -58089721
39916 -58089721 -63823546 -52424604 -25915671 -11059378 -11783420 -2599847 23305348 37443581
39908 37443581 21434898 -2363123 -3707764 14974284 28221248 20916029 -2419871
39901 -2419871 -27856216 -39390138 -28147815 -4685546 8280821 2525755 -8231388
39894 -8231388 -12830701 -18120552 -30331416 -38251455 -30585124 -17305591 -15502219 -21579921
39886 -21579921 -16301123 4560956 21136321 12788022 -21867727 -69264375 -111623321
39879 -111623321 -129342462 -107552128 -53303996 183036 20462639 7757834 -10273482
39872 -10273482 -15948670 -19467431 -33060639 -43969969 -31734543 -3559100 11803007
39865 11803007 5848540 732197 10090512 15228626 -2689308 -29002084 -38230823 -33373545
39857 -33373545 -32871657 -29403703 2163923 54944949 84101943 63271174 18483628
39850 18483628 -10989388 -21618646 -34110816 -52048548 -59643743 -53127326 -47869715
39843 -47869715 -51548918 -49920952 -27205478 10884780 42705822 54067572 49814818
39836 49814818 43196738 38230910 26681339 3925298 -17222524 -16640290 8812285 38958864
39828 38958864 51015428 40724055 21263064 8288041 8452155 15410257 14330755 -2700718
39820 -2700718 -24212615 -30917333 -20871126 -11443890 -13702616 -19759396 -21865871 -27135885
39812 -27135885 -40967292 -50806926 -43244685 -26679039 -19491420 -24077883 -30494010 -37581424
39804 -37581424 -49292243 -56020853 -44149553 -22625110 -14191330 -18217867 -10622244 11894901
39796 11894901 18902154 -5157625 -28556411 -16406579 14139352 18074838 -8622516
39789 -8622516 -23039038 -298203 32206697 38731900 22480377 7783025 -1191002
39782 -1191002 -15816302 -30750402 -27516270 -8739553 -719909 -14722317 -28231730
39775 -28231730 -17311828 8862848 21542912 10436533 -8141181 -16394511 -11772380
39768 -11772380 2545865 28457649 65170063 98295082 108057138 89944405 61015652
39761 61015652 41812352 35628909 31899605 27974307 34709048 52938354 57619309 25320408
39753 25320408 -25917342 -48701136 -25651666 6677780 8384121 -11347172 -16722211
39746 -16722211 -2634002 4731246 -2327345 -1442046 16090675 27980404 23630128 29207850
39738 29207850 62827822 92309111 74078032 19458450 -15387300 -1477751 35005943
39731 35005943 57187889 56495693 41028948 17764546 269594 6172776 28831716
39724 28831716 35007884 10624299 -13734754 -8001713 7333246 -9318461 -52026763
39717 -52026763 -68174265 -32507998 15133918 22266454 -11729530 -44220923 -45486565
39710 -45486565 -23522092 -729053 12057217 16166497 14630120 8539102 147599 -3926648
39702 -3926648 4420976 23825293 37480742 29045323 6851585 -876180 18391847 44060307
39694 44060307 50464929 38773862 27395541 24380538 28097567 43053063 69682904
39687 69682904 85021803 63021391 15607770 -15222096 -12855132 -5459324 -18812305
39680 -18812305 -38546735 -38835448 -24036725 -15323201 -11956799 5904554 42913369 80587362
39672 80587362 99821076 93402291 63084955 23134616 -790843 2959913 14126251
39665 14126251 8309747 -6127614 -3167209 18040738 35928153 46320922 63374917
39658 63374917 80154724 68545587 28512681 -2405386 -6628477 -14729777 -49281882
39651 -49281882 -76014382 -49081878 19108909 75047005 97026981 108546554 124260199
39644 124260199 126335920 103258558 76415924 70712445 81538157 86969349 77265410
39637 77265410 58984800 41456330 30727874 29048736 31455574 28109491 15552925
39630 15552925 1528384 -3337703 6268299 29358229 57210871 72422182 59688016
39623 59688016 23041877 -12341689 -20058968 4843226 40886581 58088807 46975485
39616 46975485 30320292 36220255 58629128 61668997 30213195 -4766337 -6751197
39609 -6751197 20556509 49282415 69047606 82791895 77606231 39253040 -9480204
39602 -9480204 -25435647 -3722252 17134744 14497025 7802427 14817673 21719331 16290183
39594 16290183 14735023 29978740 44181933 41215445 39465420 60726975 88600119
39587 88600119 91556968 71143340 54219166 49605187 44670591 36154677 33662918 38374510
39579 38374510 45320082 59658371 84213455 100012997 88494204 64684530 57116766
39572 57116766 62894882 57505074 42487196 42833778 58083412 60109700 46321751 50055619
39564 50055619 82029822 103351539 81416234 39111860 21345659 38938416 70876712
39557 70876712 97838598 107474385 88806951 50007018 25206940 37687945 70261633
39550 70261633 93367542 103893746 112488760 114093120 101859846 92103752 101109184 111821346
39542 111821346 99945209 80286391 86100974 110589846 114102998 88229802 65652691
39535 65652691 60804841 49933890 25018665 18550032 47965148 77593623 70208974
39528 70208974 42773621 33559584 42225839 44690461 45664895 68232634 101105412 104646698
39520 104646698 71559801 39320111 34339550 41794078 43365707 49474635 74135944
39513 74135944 105364618 122819922 124736469 117181128 95155477 56963510 22996139
39506 22996139 15774926 29004047 38016269 35354670 34448198 40282988 38757433 20374149
39498 20374149 -1943074 -7149849 9977177 34029576 43338677 28826017 4125716
39491 4125716 -4092940 18144004 57287112 87199973 93834828 79499949 51666928
39484 51666928 19501869 -4848709 -15715234 -21319400 -29579572 -33277092 -25615952 -21919138
39476 -21919138 -40190641 -62359599 -46687054 12172843 66042439 74139848 54780116
39469 54780116 51464074 69601668 81151255 80717353 96510424 138380116 168329046
39462 168329046 143855936 74453119 14052583 871641 19861242 28292103 9314736
39455 9314736 -10098467 3740387 46586676 81716434 86510447 74383153 65303792
39448 65303792 57069170 42150431 33417743 46917680 69496664 72221782 53225225
39441 53225225 39533474 44652402 51845095 45972270 35356042 30337391 23554963 7147370
39433 7147370 -9041075 -13101299 -10585000 -12760410 -17095925 -13663776 -707142 18343640
39425 18343640 42118423 63514883 67014432 47654528 22119671 8545418 6903638
39418 6903638 10456203 19751324 29219604 18680935 -18272090 -52096230 -49894456 -18976171
39410 -18976171 9124571 25892617 43432751 53800844 33741513 -5421113 -15186138
39403 -15186138 25438099 76196551 87936738 61844310 33851278 23346309 23622876
39396 23622876 26594026 29842909 27882962 18690479 12994653 20228352 33376207 42721450
39388 42721450 52335168 64736514 63093369 32751283 -9891974 -36345291 -45669857
39381 -45669857 -55694081 -60637244 -34557563 17992321 52589489 43443364 20358823
39374 20358823 23315024 44303882 44798246 17638257 -915953 19613154 67835754
39367 67835754 108012497 114825796 85582032 35024864 -11814377 -32174779 -22513189
39360 -22513189 -1154678 10582014 8353460 4903148 13655973 33509689 48234793
39353 48234793 42688171 22039015 9704278 19931210 38864899 44023559 36657486
39346 36657486 36978457 48725440 52606460 43105305 45493809 75208773 101548182 83888733
39338 83888733 33816930 3832302 12666618 21459132 -762795 -25619848 -9562732
39331 -9562732 37355446 66013761 58701256 44394601 44931470 45919993 32072783 17758133
39323 17758133 23350890 44827977 65767126 80884573 90054109 87069195 74388278
39316 74388278 73124992 95566259 119645458 114241881 81214039 49136288 32993776
39309 32993776 25616170 24036413 35169211 52896114 56821829 42250557 30005480
39302 30005480 37695259 59007076 78400141 88664496 87479755 74903352 61171424
39295 61171424 58314830 57913293 39444062 9247519 4631780 42893133 90891448 107115876
39287 107115876 93121862 78800200 75774853 74681206 74167759 80136063 84279583 74736480
39279 74736480 62505948 65781437 73321281 60181115 39387565 54704097 109882930
39272 109882930 147327016 122573697 66892221 43427975 64586547 89295867 88698770
39265 88698770 75482374 68231385 62277177 48665259 37676614 45069518 66579865
39258 66579865 82802379 86093237 88673750 100714877 111418093 103033938 79766281
39251 79766281 66412545 72681627 76807171 60426557 42875356 52789372 75186620
39244 75186620 65202443 18784914 -11591941 9810005 51400266 67018461 65986865
39237 65986865 87779732 128268810 142132971 114622801 82461236 74604201 74240129
39230 74240129 57196294 34027953 29725718 43610960 52682814 42723278 19761542
39223 19761542 -17870 -1433541 17817731 39137854 39931913 24147800 19200095 36042530
39215 36042530 53450438 53516281 50582711 66689542 96204828 116078212 118643160 113814640
39207 113814640 108440137 103020935 101499459 106092552 107823578 97420997 79815182 65454523
39199 65454523 56478553 54093815 66483251 92610566 111186275 105010906 84418173
39192 84418173 68175694 57519338 51766447 68157744 111664047 143587863 125665255
39185 125665255 85242565 83636343 120067795 127438402 78427570 32278918 41308732
39178 41308732 68524931 52392924 10994209 13576442 68170769 108059297 92599571
39171 92599571 58546937 52911139 66833917 65372663 44753787 26412326 19389452
39164 19389452 21198503 39117444 78510644 118274149 127098892 103365404 76208711
39157 76208711 66585522 67826449 66770702 63168859 60492048 55307942 48172451 52597538
39149 52597538 78056877 110278647 123921267 114364053 102352286 102325780 99738716 72768136
39141 72768136 30139357 9725022 34111590 80249418 104185406 88669453 53133925
39134 53133925 20933585 -4186437 -23677139 -25971033 -1304934 33656693 47951083
39127 47951083 35785723 25791118 42949681 76675507 99219875 103039125 101700374
39120 101700374 100344529 86872318 54996369 18235653 -5206025 -8081186 8972394
39113 8972394 39092395 61143386 50440571 12107132 -13924776 -550352 28431378
39106 28431378 30412541 1197407 -27872452 -40591262 -48615209 -54234712 -39429335
39099 -39429335 -3836404 21779466 20224601 16170102 34473146 56027349 47400008
39092 47400008 16936082 5314709 27057838 55034778 63590014 57598365 53603027
39085 53603027 57116218 66755975 81132074 92915144 90986852 75554543 60142332
39078 60142332 56020397 65411964 87677065 116463623 132941289 121646279 93973156
39071 93973156 75827959 70770912 58309532 31693785 10400440 6543410 6752883 1296374
39063 1296374 3196172 18021202 21093402 -6435931 -37821161 -29962461 17229578 61922784
39055 61922784 76390744 71846155 67318225 64206426 60154195 63067333 77030986 89755352
39047 89755352 86838655 69489672 49805516 35870466 27305674 19093476 5529922
39040 5529922 -14845173 -36576961 -52932281 -61541570 -60372769 -46075988 -24889989
39033 -24889989 -14157432 -18207740 -14421954 14783632 46215528 42798357 13070220
39026 13070220 6868634 43527934 81825062 80403883 54226788 42922093 50771317
39019 50771317 53587585 46801012 47949487 59350273 64459323 59308707 54905990 49100459
39011 49100459 29654265 7757542 12888616 45652669 70454215 68637094 64356953
39004 64356953 77997702 88418158 71246986 46029266 47074665 65526396 61716070
38997 61716070 27789758 -1842357 -3343142 9623061 17526301 19493184 15675678 -2756731
38989 -2756731 -29168985 -34165443 -3822733 35209688 49682671 41500305 34213371 33965992
38981 33965992 29654486 21836107 23949382 36451031 42529671 31263662 7819381 -18746442
38973 -18746442 -40168207 -42080631 -12641616 37019268 77123968 90020722 84536753
38966 84536753 76891675 71627104 66355555 61666650 58640256 55567212 51955056 48209942
38958 48209942 41133625 30803784 30521267 53130187 85226402 94463923 70068578 37916388
38950 37916388 25200856 27876107 26699601 19143861 17377604 25400640 35625603 41246577
38942 41246577 38101800 22139641 -1639308 -16682252 -15255673 -11562292 -19699906 -30175825
38934 -30175825 -26753337 -14796394 -9636849 -6447953 10416168 33344013 38000913 24848981
38926 24848981 21885366 38699490 49834552 38303006 26094661 39417388 66531408
38919 66531408 76393575 64453369 53316497 55602297 61065194 59315663 54767509 55982748
38911 55982748 63690164 71232250 67958435 44655196 5479272 -29016474 -41356294
38904 -41356294 -36042482 -28603596 -21492527 -5400004 18253125 32366170 24109387 -1860661
38896 -1860661 -31116006 -49405164 -46060748 -22379458 796574 -1320166 -28420540
38889 -28420540 -54082743 -59460726 -54077036 -54000960 -53989341 -38033633 -9527164 9096540
38881 9096540 7566230 726984 3177366 5629867 -9535311 -36670775 -48513091 -31880271
38873 -31880271 -6374305 2277435 -3314413 660509 22363472 42754498 44446701 35722639
38865 35722639 35969119 48840814 61642490 62969790 48860536 19143906 -17316356
$$ [...]
##END NTUPLES=NMR SPECTRUM
##END=
