##TITLE=31Pdec_SRXYk1
 CDCl3, 124 sc
 23.09.2021
##JCAMPDX= 6.0         $$ Bruker NMR JCAMP-DX V2.0
##DATA TYPE= NMR SPECTRUM
##DATA CLASS= NTUPLES
##ORIGIN= UXNMR, Bruker Analytische Messtechnik GmbH
##OWNER= root
$$ XWIN-NMR		Version 3.5
$$ Thu Sep 23 12:50:45 2021 Russian Standard Time (UT+4h)  she@DPX200
##.OBSERVE FREQUENCY= 81.013821
##.OBSERVE NUCLEUS= ^31P
##.ACQUISITION MODE= SIMULTANEOUS
##.ACQUISITION SCHEME= undefined
##.AVERAGES= 124
##.DIGITISER RES= 16
##SPECTROMETER/DATA SYSTEM= spect
##.PULSE SEQUENCE= zgpg30
##.SOLVENT NAME= CDCl3
##.SHIFT REFERENCE= (INTERNAL, CDCl3, 0, 248.564)
##AUDIT TRAIL= $$ (NUMBER, WHEN, WHO, WHERE, WHAT)
$$ ##TITLE= Audit trail, XWIN-NMR		Version 3.5
$$ ##JCAMPDX= 5.01
$$ ##ORIGIN= Bruker BioSpin GmbH
$$ ##OWNER= she
$$ F:/spectra/data/she/nmr/P31/1/pdata/1/auditp.txt
$$ ##AUDIT TRAIL=  $$ (NUMBER, WHEN, WHO, WHERE, WHAT)
(   1,<2021-09-23 12:48:53.60 +0400>,<she>,<DPX200>,
      <continue with go, POWCHK disabled, PULCHK disabled
       configuration hash MD5:
       00 E9 B6 7A A2 85 ED C7 34 08 36 98 17 FE 4E 26
       data hash MD5: 32K
       B0 93 0B 3B E7 85 4E 93 58 9B A9 03 02 22 C9 CA>)
(   2,<2021-09-23 12:48:55.92 +0400>,<she>,<DPX200>,
      <Start of raw data processing
       efp BC_mod = 2 LB = 1 FT_mod = 6 PKNL = 1 PHC0 = -8216.459 PHC1 = 328.2697 SI = 64K 
       data hash MD5: 64K
       6A C9 29 73 4B 17 D2 CD 04 62 38 C7 E0 6B 66 2B>)
(   3,<2021-09-23 12:49:21.53 +0400>,<she>,<DPX200>,
      <pk PHC0 = -12.46773 PHC1 = 32.40001 
       data hash MD5: 64K
       5A 88 2B 1E 64 8A 5F 4B 27 D2 29 3C AA 95 F8 5E>)
(   4,<2021-09-23 12:49:48.78 +0400>,<she>,<DPX200>,
      <pk PHC0 = -424.7022 PHC1 = 505.5999 
       data hash MD5: 64K
       E2 28 9B 5A 63 5E DB 1B 78 5D A6 26 59 74 8B D0>)
(   5,<2021-09-23 12:50:19.06 +0400>,<she>,<DPX200>,
      <pk PHC0 = -15.21365 PHC1 = 8.799996 
       data hash MD5: 64K
       69 31 44 80 60 CE 87 2D 8D 7A 6E 06 89 38 B2 E1>)
$$ ##END=
$$ 
$$ hash MD5
$$ 92 80 DC AB 8E 06 55 D4 B6 26 12 E4 63 68 10 EC
##$RELAX= 
##$RELAX= 
##$RELAX= 
##$RELAX= 
##$RELAX= 
##$RELAX= 
##$RELAX= 
##$RELAX= 
$$ Bruker specific parameters
$$ --------------------------
##$DU= <F:/spectra>
##$EXPNO= 1
##$NAME= <P31>
##$PROCNO= 1
##$TYPE= <nmr>
##$USER= <she>
##$AMP= (0..31)
100 100 100 100 100 100 100 100 100 100 100 100 100 100 100 100 100 100 
100 100 100 100 100 100 100 100 100 100 100 100 100 100 
##$AQSEQ= 0
##$AQ_mod= 1
##$AUNM= <au_zg>
##$AUTOPOS= <>
##$BF1= 81.014009
##$BF2= 200.13
##$BF3= 200.13
##$BF4= 200.13
##$BF5= 200.13
##$BF6= 200.13
##$BF7= 200.13
##$BF8= 200.13
##$BYTORDA= 1
##$CFDGTYP= 0
##$CFRGTYP= 5
##$CHEMSTR= <none>
##$CNST= (0..31)
1 1 145 1 1 1 1 1 1 1 1 1 1 1 1 1 1 1 1 1 1 1 1 1 1 1 1 1 1 1 1 1 
##$CPDPRG= <waltz16>
##$CPDPRG1= <>
##$CPDPRG2= <waltz16>
##$CPDPRG3= <>
##$CPDPRG4= <mlev>
##$CPDPRG5= <mlev>
##$CPDPRG6= <mlev>
##$CPDPRG7= <mlev>
##$CPDPRG8= <mlev>
##$CPDPRGB= <>
##$CPDPRGT= <>
##$D= (0..31)
$$ [...]
##$SUBNAM2= <"">
##$SUBNAM3= <"">
##$SUBNAM4= <"">
##$SUBNAM5= <"">
##$SUBNAM6= <"">
##$SUBNAM7= <"">
##$SUBNAM8= <"">
##$SUBNAM9= <"">
##$SW= 501.771253377433
##$SWIBOX= (0..15)
0 1 3 0 0 0 0 0 0 0 0 0 0 0 0 0 
##$SW_h= 40650.406504065
##$TD= 32768
##$TD0= 1
##$TE= 0
##$TE2= 300
##$TE3= 300
##$TEG= 300
##$TL= (0..7)
0 120 53 12 22 120 120 120 
##$TP= (0..7)
150 150 150 150 150 150 150 150 
##$TP07= 0
##$TPNAME0= <>
##$TPNAME1= <>
##$TPNAME2= <>
##$TPNAME3= <>
##$TPNAME4= <>
##$TPNAME5= <>
##$TPNAME6= <>
##$TPNAME7= <>
##$TPOAL= (0..7)
0.5 0.5 0.5 0.5 0.5 0.5 0.5 0.5 
##$TPOFFS= (0..7)
0 0 0 0 0 0 0 0 
##$TUNHIN= 0
##$TUNHOUT= 0
##$TUNXOUT= 0
##$USERA1= <user>
##$USERA2= <user>
##$USERA3= <user>
##$USERA4= <user>
##$USERA5= <user>
##$V9= 5
##$VALIST= <valist>
##$VCLIST= <CCCCCCCCCCCCCCC>
##$VD= 0
##$VDLIST= <DDDDDDDDDDDDDDD>
##$VPLIST= <PPPPPPPPPPPPPPP>
##$VTLIST= <TTTTTTTTTTTTTTT>
##$WBST= 1024
##$WBSW= 4
##$XGAIN= (0..3)
0 0 0 0 
##$XL= 0
##$YL= 0
##$YMAX_a= 3488
##$YMIN_a= -2540
##$ZGOPTNS= <>
##$ZL1= 120
##$ZL2= 120
##$ZL3= 120
##$ZL4= 120
##$ABSF1= 0
##$ABSF2= 0
##$ABSG= 0
##$ABSL= 0
##$ALPHA= 0
##$AQORDER= 0
##$ASSFAC= 0
##$ASSFACI= 0
##$ASSFACX= 0
##$ASSWID= 0
##$AUNMP= <proc_1d>
##$AZFE= 0.1
##$AZFW= 0.5
##$BCFW= 0
##$BC_mod= 2
##$BYTORDP= 0
##$COROFFS= 0
##$CY= -3
##$DATMOD= 1
##$DC= 0
##$DFILT= <>
##$DTYPP= 0
##$F1P= 0
##$F2P= 0
##$FCOR= 1
##$FTSIZE= 65536
##$FT_mod= 6
##$GAMMA= 0
##$GB= 0
##$INTBC= 1
##$INTSCL= 5.30512e-09
##$ISEN= 30
##$LB= 1
##$LEV0= 0
##$LPBIN= 0
##$MAXI= 10000
##$MC2= 0
##$MEAN= 0
##$ME_mod= 0
##$MI= 50
##$NCOEF= 0
##$NC_proc= -7
##$NLEV= 6
##$NOISF1= 182.463
##$NOISF2= 159.3651
##$NSP= 0
##$NTH_PI= 0
##$NZP= 0
##$OFFSET= 248.5645
##$PC= 4
##$PHC0= -8668.843
##$PHC1= 875.0697
##$PH_mod= 1
##$PKNL= yes
##$PPARMOD= 0
##$PSCAL= 0
##$PSIGN= 0
##$REVERSE= no
##$SF= 81.014009
##$SI= 65536
##$SIGF1= 159.3651
##$SIGF2= -187.1042
##$SINO= 113.3802
##$SIOLD= 16384
##$SREGLST= <1H.CDCl3>
##$SSB= 0
##$STSI= 65536
##$STSR= 0
##$SW_p= 40650.406504065
##$SYMM= 0
##$S_DEV= 0
##$TDeff= 32768
##$TDoff= 0
##$TI= <>
##$TILT= no
##$TM1= 0
##$TM2= 0
##$TOPLEV= 0
##$USERP1= <user>
##$USERP2= <user>
##$USERP3= <user>
##$USERP4= <user>
##$USERP5= <user>
##$WDW= 1
##$XDIM= 65536
##$YMAX_p= 322364348
##$YMIN_p= -25543441
$$ End of Bruker specific parameters
$$ ---------------------------------
##NTUPLES= NMR SPECTRUM
##VAR_NAME=  FREQUENCY,     SPECTRUM/REAL,   SPECTRUM/IMAG
##SYMBOL=    X,             R,               I
##VAR_TYPE=  INDEPENDENT,   DEPENDENT,       DEPENDENT
##VAR_FORM=  AFFN,          ASDF,            ASDF
##VAR_DIM=   65536,         65536,           65536
##UNITS=     HZ,            ARBITRARY UNITS, ARBITRARY UNITS
##FACTOR=    0.620285442955139, 1,           1
##FIRST=     20137.2065510759, 0,            0
##LAST=      -20513.1999529892, 0,           0
##MIN=       -20513.1999529892, -25543441,   0
##MAX=       20137.2065510759, 322364348,    0
$$ Real data points
##PAGE= N=1
##DATA TABLE= (X++(R..R)), XYDATA
$$ [...]
##PAGE= N=2
##DATA TABLE= (X++(I..I)), XYDATA
15052 -16585448 -21051496 -18742651 -11295333 -5268942 -2913551 -1214696 697195 -284701
15044 -284701 -4770003 -8499120 -8773809 -8479096 -10606839 -12647144 -10457673 -5334700 -2803350
15035 -2803350 -4916462 -7571514 -6171248 -1076137 3844959 5879271 4819168 1130517
15027 1130517 -4600662 -10304089 -12804726 -10876701 -6768719 -3462290 -1330787 1117709
15019 1117709 4143386 6455924 7568262 8116628 7689327 4887875 348200 -2802884
15011 -2802884 -2846611 -1537129 -731589 489687 3025917 4540777 2374310 -1896225 -4370789
15002 -4370789 -4309629 -3994605 -3817659 -1860884 1371141 2370699 171697 -1685551 -776137
14993 -776137 542789 -195142 -992977 728068 2792821 1655614 -749444 1016293 7327012
14984 7327012 12170681 11490799 8160619 6599403 6619937 5744177 4350382 4482348 5368120
14975 5368120 4294313 1392787 -294652 123165 -232522 -3336641 -6852195 -7368898 -5183919
14966 -5183919 -3709989 -4973141 -7431616 -8047742 -5586142 -2145725 -1674669 -5893945
14958 -5893945 -11321545 -12126100 -7058042 -1621208 -1467061 -5392262 -7559179 -5379082
14950 -5379082 -1788568 -6725 370430 1307819 3504644 6825617 10807476 13376336
14942 13376336 11760767 6439436 1719523 477166 831094 235186 -78673 1806099
14934 1806099 3433629 769956 -4796696 -7132835 -3625913 1511093 3502340 2622950
14926 2622950 1461686 160378 -2355840 -4724712 -4437908 -1906020 70287 762607
14918 762607 2329702 5480458 7243491 5000872 868546 -598663 1437531 2919711
14910 2919711 509941 -4096215 -7209322 -8361450 -9345475 -9098909 -4006136 5364008
14902 5364008 11900941 9627552 1287458 -5362286 -7139022 -7160203 -7951648 -7910012 -5521621
14893 -5521621 -2385713 224545 3937854 9414393 13088917 11577222 7186257 4878211
14885 4878211 4999344 3562577 -421164 -2819227 -1124589 1060036 -523405 -3807113
14877 -3807113 -2988186 3013797 8751796 9369338 6219773 4020843 4918239 7283834 8712644
14868 8712644 8076396 5504266 2263122 230154 24781 291674 168835 1147950 4221141
14859 4221141 6474052 4046673 -1660133 -4627864 -2071796 2006832 2841148 988127
14851 988127 -93656 492965 1137240 901166 -444266 -3472136 -7101927 -7803195 -4313892
14842 -4313892 -812701 -1161843 -2317188 1106881 7334578 9075944 4606609 328150
14834 328150 769332 2616490 1524948 -1112993 -2145192 -2368700 -3617829 -4078412 -1411443
14825 -1411443 2354970 3735013 3164903 2947346 2161239 -1363481 -5695732 -6693571 -4349384
14816 -4349384 -2192992 -968741 1713380 5299267 5501770 975161 -4177805 -6454788
14808 -6454788 -6896119 -6652015 -3380361 4042601 10811013 11069909 5867372 1817346 2478514
14799 2478514 5123723 6119253 5396259 4217228 1972312 -2172201 -6371298 -7693898
14791 -7693898 -6039842 -4116503 -3497446 -2883375 -972379 869147 369965 -2147411 -3678163
14782 -3678163 -1951847 1972722 4584965 3124050 -1504837 -4710780 -2388365 3980957
14774 3980957 7957937 5492733 14572 -2222388 -298259 1375359 249351 -1777960
14766 -1777960 -3390286 -6421855 -11195306 -13657762 -10578751 -4550197 -418502 708890
14758 708890 538327 -650620 -3095655 -4317735 -1554771 3224816 5055931 2691845
14750 2691845 -154787 -332074 1473190 2975793 2344102 -1868180 -8955649 -14014024
14742 -14014024 -11910214 -4238925 1757446 2439654 1681342 3735476 6744854 6551024
14734 6551024 3283680 249137 -1158073 -1506495 -302320 2884945 5376633 3606132
14726 3606132 -1760732 -6384042 -7901406 -7710063 -7048684 -5100887 -2123187 -919551
14718 -919551 -2939279 -5288923 -4053125 901907 6461499 10073841 10709115 7468101
14710 7468101 549231 -6590589 -9394021 -7483997 -5083051 -4952395 -4788986 -1791743
14702 -1791743 1947130 2157304 -1017562 -3181189 -2147369 -264820 239062 280799 961297
14693 961297 1390153 1495419 3350368 6936562 8066807 4195427 -720329 -1609205 -2561
14684 -2561 -916933 -3691826 -2635864 2834276 5610920 1094699 -5748827 -7459986 -3803968
14675 -3803968 166698 2346572 4371311 5995577 4649791 970470 -411755 2528471
14667 2528471 5772972 5061344 2244782 2506667 6829170 10987521 12020663 12035617 13920157
14658 13920157 16104604 14640158 9262665 3961021 1367436 7645 -1498666 -846539
14650 -846539 4215919 10510021 11819834 6767244 970420 203230 3879988 7020360
14642 7020360 6912520 5414969 4892553 4198380 468469 -5516051 -8154073 -3259204 5538478
14633 5538478 9715637 5728679 -1157552 -4285039 -3255781 -1384933 755736 4212007
14625 4212007 6302731 2874707 -3838454 -5858515 -195443 6256991 5958373 763422
14617 763422 -1602656 1533475 5237846 4579712 466918 -2888067 -3217773 -1433491 541082
14608 541082 1544449 1534694 1524190 3102435 6913337 11078047 12050713 8313081 2910566
14599 2910566 797745 3641035 8908232 13814286 17276323 17727729 13435673 7113429
14591 7113429 5348839 9319229 10679355 2824219 -7481781 -7930453 1559948 8234342
14583 8234342 4477077 -2995135 -5004804 -2144556 77665 790593 1565889 229989
14575 229989 -5441769 -11174645 -10706415 -5213183 -1824591 -3602350 -6783509 -7800001
14567 -7800001 -7753345 -9061366 -11489198 -12548364 -9814551 -3165794 3747898 5985627
14559 5985627 3279091 1016577 2694225 4697605 2459922 -1607577 -1785048 1668715
14551 1668715 3034859 71203 -3355306 -3542828 -764458 3257724 6878204 7487651
14543 7487651 3745157 -988607 -2123759 -678676 -1547828 -4958645 -5658124 -1710203
14535 -1710203 1981164 1214172 -1795959 -2978324 -1959249 -193037 2016345 3481955
14527 3481955 1323893 -4144581 -7325476 -4144285 1803604 3770245 253876 -4822175
14519 -4822175 -8224387 -9527449 -8308980 -3581040 3446831 8911554 9611100 5704577
14511 5704577 248305 -3116373 -2852659 -1074794 -1605318 -5392819 -8749324 -7318325
14503 -7318325 -1071335 5750024 9233949 9510999 9907954 12529492 15009417 13101443
14495 13101443 7045223 2640267 3597240 5777369 3397620 -1480004 -2048762 1547812
14487 1547812 1521534 -4923256 -10337760 -8461549 -3578713 -2511422 -3555581 -1208865
14479 -1208865 2593810 1283687 -4149140 -5310398 408872 5471906 3909239 -37446
14471 -37446 351847 3490800 2464024 -4048297 -9755388 -9399372 -4925350 -1890334 -2533323
14462 -2533323 -4125225 -3099879 614427 3658976 3297644 790558 67319 3249162
14454 3249162 8483965 12342523 13110426 11066612 6847349 1194786 -4023486 -6451837
14446 -6451837 -5821327 -4767292 -5697746 -7312181 -5941955 -663068 4709846 5927947
14438 5927947 3252992 397826 -568374 -1070808 -2853524 -5075777 -5430749 -3076067 159914
14429 159914 1077962 -2119722 -7690133 -11636783 -11928994 -10198249 -8125043 -4458854 1596957
14420 1596957 6206662 4627180 -1471170 -5135829 -3074093 1014761 2897329 2814445
14412 2814445 2433377 1696332 1256879 3461579 7666265 8832078 4640963 166329 1063295
14403 1063295 5497655 7773717 7097050 7078107 8382784 7914606 4926194 2466584 2096196
14394 2096196 1591264 -1098818 -4940402 -7476918 -6795111 -2151328 4470648 8139154
14386 8139154 5735760 417988 -2125964 -1111940 -398717 -1609666 -2429627 -1855026 -1908733
14377 -1908733 -2998416 -2584070 -356126 1130 -3081603 -5363095 -2665306 2753274
14369 2753274 5520147 4685807 3933020 5095004 5225901 994852 -6203635 -11021930 -9688490
14360 -9688490 -3898845 1332393 3176961 2857852 2061511 411743 -1726445 -1084827 4210639
14351 4210639 10306525 11967853 9866144 8675000 8907499 6566121 1165568 -2320430
14343 -2320430 -1385719 108013 -1136711 -2465620 -654750 2001701 1582993 -1024856
14335 -1024856 -2308407 -2047027 -2347291 -2753146 -1105885 1678266 2054005 -936346 -4167808
14326 -4167808 -4369664 -1392569 2182049 3112747 110465 -4162742 -5125347 -1696721 2277708
14317 2277708 3430025 2875833 2759041 2239411 220098 -1146215 65122 1176912 -1176134
14308 -1176134 -4755873 -4574775 -727037 2123011 2401976 2991695 4834762 5289747 4227221
14299 4227221 5792416 11203648 14737457 10853343 2055292 -4298356 -4982371 -3064611
14291 -3064611 -2279445 -2812109 -2933056 -2257986 -2094223 -3303584 -4786793 -4523231 -1982150
14282 -1982150 1215775 3184503 3219119 1147554 -2717653 -5948395 -4928580 377167
14274 377167 4962293 4811054 1873667 -265173 -2414953 -6310401 -8040184 -2396720
14266 -2396720 6997636 10178015 4882371 51549 2172040 5924594 3621566 -2685256
14258 -2685256 -5442859 -3438877 -1981537 -3591094 -5445686 -5411042 -4807947 -5026810 -5869159
14249 -5869159 -7311037 -9207152 -9568202 -6610887 -2028461 1007345 2249731 3538499
14241 3538499 4823654 4733458 3941411 4038470 4145759 2683188 1208219 2016233 3340886
14232 3340886 2108213 69146 1030346 3052561 996840 -2978779 -306105 10079744
14224 10079744 17535881 14376349 7041696 5841051 9707556 9578987 3222808 -2414878
14216 -2414878 -2885253 -2072780 -4774775 -9553158 -11583292 -8785713 -2924681 2832895
14208 2832895 5789716 4946758 1761601 -922350 -1021980 1647811 5136011 5955534 2261418
14199 2261418 -2605707 -2882923 1591643 4101377 793613 -2897192 -622555 4201190
14191 4201190 3222132 -3681796 -8179198 -6073021 -1936633 97106 2159496 6249814
14183 6249814 9132637 7895607 4891529 2717506 -508188 -5925468 -8904906 -5400268
14175 -5400268 185626 155229 -5413901 -9250643 -7716206 -4578078 -3323868 -1772231
14167 -1772231 3072626 9008691 10870959 6979121 932290 -2427235 -1649468 364152
14159 364152 -325758 -4119888 -7119507 -5774108 -1409115 1520565 1197098 370841 2147540
14150 2147540 5643153 7064696 4430242 -28770 -2525904 -1988954 -449041 747065
14142 747065 2899134 6616952 8818939 6327081 1176247 -1740612 -1879116 -3142243
14134 -3142243 -6372867 -7348865 -4306433 -1878110 -3916190 -7176438 -6652592 -3250391
14126 -3250391 -1153034 -793507 168045 1338329 540664 -1467596 -2294398 -2258713 -2595388
14117 -2595388 -1555005 2050792 3664299 -1729534 -10327301 -13014955 -8180323 -3547582
14109 -3547582 -4277149 -6727350 -6133200 -3368310 -920683 1647104 4561529 5347761 3023456
14100 3023456 412135 -543815 -1292136 -2206050 -1007742 1550327 423836 -5479344 -9766212
14091 -9766212 -7973252 -4661132 -5435389 -7554228 -5578925 -1595741 -1376930 -3540535
14083 -3540535 -1785426 3188948 3356003 -3798244 -10336763 -8733583 -1255106 5003574
14075 5003574 7248976 7048952 5088032 612230 -5335820 -9855996 -11316919 -10385801
14067 -10385801 -8025157 -4344161 -68160 2282812 646248 -2816279 -2515675 3582211
14059 3582211 9313805 6721569 -2935715 -9473171 -6678339 240388 3327336 2894335
14051 2894335 4530520 8825606 10838287 8524332 5339289 4096191 3447080 1505953
14043 1505953 -1070633 -2627905 -2122707 968868 5402316 7361553 4484722 185379
14035 185379 -99805 3297315 4779703 2067762 -657607 369869 2963896 2686783 -1213428
14026 -1213428 -5899019 -8540725 -7931164 -4568695 -756590 982788 633739 337372 955274
14017 955274 1014138 -439538 -2109258 -2376523 -1209928 528437 2306422 4001972 5569335
14008 5569335 6422968 4958465 429800 -4092163 -3805144 1009208 4240983 2992072
14000 2992072 2507138 7216724 12033639 9981164 4389983 4144083 9090258 10573729
13992 10573729 5934382 1493686 111395 -2646764 -7035625 -5717389 2884810 8874029
13984 8874029 5590523 132198 946871 4019278 1177409 -5494174 -8313063 -7071578
13976 -7071578 -6446567 -5319498 -261869 4168534 941118 -5887313 -5696971 1391503
13968 1391503 4537948 296820 -2398725 1586797 5056323 1570292 -3928076 -4491039
13960 -4491039 -1928076 -500915 2257280 9730427 17169987 17464969 12065743 7878894
13952 7878894 6335765 3729327 110495 -810501 167020 -1766883 -6036711 -5953002 332022
13943 332022 5582957 4019936 -171969 60682 3939374 5443337 3452708 2295380
13935 2295380 3124059 1990572 -1998526 -3319103 1202717 5299144 709921 -10801538
13927 -10801538 -18958749 -17940652 -12013585 -7408982 -4487250 -890601 2293249 2083245
13919 2083245 -1058093 -3528986 -3204566 -846158 1946632 3572862 2526833 -590744
13911 -590744 -2251364 175070 4747489 7416371 6825219 4366162 1419229 -510614
13903 -510614 866668 5210096 7309961 2898740 -4498837 -7480840 -4768739 -1875822
13895 -1875822 -2016545 -2523818 -1381372 -920430 -2323467 -2226556 1193788 3420675 -155984
13886 -155984 -6311698 -7603927 -2511954 2936267 3676952 1572951 1533784 4549944 6889899
13877 6889899 5315572 879325 -3254918 -6146229 -8895016 -10603838 -8208505 -1964118
13869 -1964118 2659261 1942637 -404454 960904 4369169 4262118 1105727 870989 4678865
13860 4678865 6595997 3300609 -1378423 -4026887 -6341823 -8623129 -6013081 3214165
13852 3214165 11772753 12302772 7511468 4854682 5235546 4246194 1561801 1108971 3037637
13843 3037637 3022011 -34208 -1828329 708818 5456345 8785511 9312633 7343644 3914377
13834 3914377 844374 -660502 -1003288 -54975 3574128 8329258 8376844 1251833 -6415669
13825 -6415669 -6871684 -2225237 -384532 -2279144 -1900441 1491010 1043414 -5754826 -11995359
13816 -11995359 -12032419 -9229931 -8289317 -7187419 -2828387 1355629 606958 -2467350 -1557590
13807 -1557590 3444530 6776657 5702465 3135225 1822821 1121296 -155808 -1892202
13799 -1892202 -4205797 -7540177 -10804699 -12017796 -10929751 -8945406 -6944889 -5372631
13791 -5372631 -5683431 -8930959 -12969703 -13417048 -7998403 927365 7832108 7822556 899483
13782 899483 -6668745 -7748690 -2657839 831671 -2198515 -7308116 -7959348 -5205951
13774 -5205951 -4516105 -5850867 -4274303 148031 954425 -4115619 -8068918 -4479387
13766 -4479387 2552249 3620340 -3286582 -10503574 -10696913 -4921301 433587 1891539
13758 1891539 1777153 3469313 6055251 5569879 1095829 -3169737 -3505250 -1797975 -2011930
13749 -2011930 -3326713 -1230816 4771069 9346288 8628908 5162098 3337794 3520851
13741 3520851 3563246 3103524 2902066 2121996 -74074 -1714263 -434327 2287885 2986144
13732 2986144 1778599 2221686 5297501 7289765 4835780 -1023353 -7262514 -12343478
13724 -12343478 -15255670 -13942082 -7950367 -1226641 1154625 -1079023 -3475044 -2949438
13716 -2949438 -933057 285917 1211975 2972099 3902570 1646583 -2173981 -2865550 1153539
13707 1153539 5874635 6669925 3607873 359231 -390523 1178982 3112871 2865956 -1049742
13698 -1049742 -6457775 -7948990 -2600148 5507864 9224484 6470031 1874330 544910
13690 544910 3001212 6400278 7848770 5814925 835482 -4286495 -6970978 -7795778
13682 -7795778 -8791282 -9354316 -7331911 -3987893 -3231010 -4918797 -4094811 867470 4655960
13673 4655960 3100355 -191283 -126130 1450515 -187088 -3671985 -4053602 -2387234 -4631889
13664 -4631889 -10721948 -12770215 -6641194 1322289 2819469 -2012776 -6456542 -5842137
13656 -5842137 -895149 4717107 7132722 4737488 157216 -2161883 -1660319 -2095510
13648 -2095510 -5092990 -7282787 -6125698 -4382660 -5374659 -7467739 -7354810 -5836559
13640 -5836559 -5902040 -7304120 -7455215 -5964111 -4034660 -1023915 3899329 8019256 7778843
13631 7778843 4489024 2706217 3378883 3272417 963227 -1579791 -3690160 -7061013
13623 -7061013 -10914161 -11101736 -6130002 80885 3647000 5065819 5747699 4182813
13615 4182813 -902202 -6378524 -7647844 -4557534 -1377297 -1494743 -4354440 -7199943
13607 -7199943 -8082141 -7178937 -5940411 -4914924 -3020988 -119249 1006275 -1903475
13599 -1903475 -6004363 -6340715 -3464333 -2980127 -6173469 -6925514 -1260763 5613786 6965107
13590 6965107 4663727 5026566 7653832 6385435 678893 -2222145 1482636 5755455
13582 5755455 3482582 -3394938 -7240323 -5124411 -1097756 518189 -270488 -1307536
13574 -1307536 -1599448 -1312320 -568044 288918 55019 -2447786 -6599039 -9586493 -8594906
13565 -8594906 -3942977 473818 948525 -1861441 -3671102 -1667648 2486775 5372714
13557 5372714 6031205 5993652 6072934 5255434 2920393 119668 -2349519 -5354425 -9048240
13548 -9048240 -10482485 -6678050 -24491 2990060 -50866 -4030871 -3751716 -1483553
13540 -1483553 -2540405 -5813406 -5165031 46471 3053346 440105 -2054575 1180957
13532 1180957 6333362 6148484 1080611 -2438299 -2424277 -2768184 -5069247 -6256346 -5092911
13523 -5092911 -4432683 -5157963 -3804990 1083700 5380079 5399779 3206695 2378615 2229293
13514 2229293 269349 -2448335 -2750374 -433213 1888977 2994935 3823067 4774331 5223866
13505 5223866 5322774 5767646 6023366 4835770 2265377 -329721 -1720353 -973418 2430990
13496 2430990 6877575 8553035 5515207 741024 -1280309 44206 1874851 2497155
13488 2497155 2171551 354678 -3856047 -8204464 -8236756 -3267296 1794698 2339780 -937469
13479 -937469 -4738317 -7931907 -10788018 -11753803 -8865963 -3709636 -379360 -157281 -298568
13470 -298568 1164339 2618880 2601260 3340395 7428831 12673713 14058880 10551418 6258459
13461 6258459 4219869 2896164 537902 -883816 478302 1600787 -1550195 -6808945
13453 -6808945 -7698200 -2724555 2339742 2977176 1847416 3247888 5837581 5414452 2582769
13444 2582769 2501841 7037453 11363088 9791437 2473370 -5243462 -8745938 -8101717 -6608328
13435 -6608328 -6533529 -6991353 -6137329 -4331529 -3409149 -3165857 -1167774 3137932 6828004
13426 6828004 7699572 7439914 8048200 7434803 2240888 -6161691 -12431433 -13939960 -13129834
13417 -13129834 -12768079 -12373284 -10637277 -8295527 -6537807 -4812200 -2571026 -1727782
13409 -1727782 -4712233 -10354539 -13999366 -12449689 -7409894 -3008422 -872144 660361
13401 660361 2597656 3084314 867337 -1072508 1185697 6108556 7748021 4104073
13393 4104073 68634 -337994 -205394 -3926249 -8715678 -8028889 -2109855 1321796 -2209955
13384 -2209955 -8050397 -9348852 -5524074 -1135456 381230 -1081528 -4087704 -6779029
13376 -6779029 -7347330 -5510866 -3073510 -2123704 -3409081 -6497637 -9865377 -10813589 -7708392
13367 -7708392 -2817820 -400124 -1254852 -1902307 -128671 1769257 982781 -1445379 -2545762
13358 -2545762 -1505200 409707 2150003 2984374 1962573 -678399 -2929440 -3441790
13350 -3441790 -3072019 -2737089 -1684827 671565 3284941 5209361 6431728 5816639 1598919
13341 1598919 -4188055 -5816275 -1584891 2390374 253222 -5187343 -7125475 -4824625
13333 -4824625 -2960788 -2876820 -1350625 2210951 4044333 2600255 1029080 1408878 1606476
13324 1606476 -139606 -2128362 -2804808 -3239913 -3919387 -3153999 -788736 731808 1243926
13315 1243926 4104106 9556089 11930502 8011227 3757044 6666376 14333118 17363299
13307 17363299 12701069 7348142 7886348 12127293 13671556 10519789 5895492 2921265
13299 2921265 1591864 269004 -1916795 -4223777 -5069859 -3784018 -1708964 -1023204
13291 -1023204 -2446890 -4629437 -5475196 -3430598 1686782 7731671 10757045 8466633
13283 8466633 3212943 -149589 436265 2718508 3932068 3843578 3268065 1973700 -72893
13274 -72893 -1055959 664291 3608535 4726966 3804124 3678756 5317209 5533083 1919808
13265 1919808 -2118750 -1082496 4277556 6641874 1734162 -5575809 -7825248 -4550389
13257 -4550389 -1061701 251946 1819989 4447684 5122578 3029649 2164552 4682012
13249 4682012 6405595 3289363 -1604058 -2871921 -1528817 -2785427 -6688369 -7825211
13241 -7825211 -4596578 -2117934 -3989748 -7022118 -7116884 -5399950 -4715201 -4192134 -1956172
13232 -1956172 -305453 -3007617 -8742680 -11991633 -10227327 -6228251 -3225434 -1695346
13224 -1695346 -1563325 -3573332 -6677600 -7296301 -3728816 799661 2095495 551730
13216 551730 -44544 1525200 2372410 476769 -1818362 -1317135 921616 872068 -2468015
13207 -2468015 -5314246 -4245754 -668269 1669054 1696644 975768 -168180 -3077670 -7135168
13198 -7135168 -8975298 -6692951 -2379061 1108513 3595686 5796037 6304277 3425403
13190 3425403 -1172316 -3863169 -3864437 -3663892 -4508411 -4572021 -2595812 -497553 -545704
13181 -545704 -2054186 -2993344 -3267465 -3934458 -4225945 -2283098 1098721 2307136 -339421
13172 -339421 -3822094 -4236523 -2054862 -1321679 -3942836 -7128920 -7329109 -4909534 -3323825
13163 -3323825 -4459074 -6503936 -6433303 -3270712 1471882 5571898 7712525 7909991 6919527
13154 6919527 5229162 2810264 54754 -1871180 -2666401 -4023649 -7062627 -8978831
13146 -8978831 -5395621 2713329 7702642 3951549 -4140003 -6912471 -1687090 4177046
13138 4177046 3603302 -1076205 -2420861 1538419 5418791 4634923 1191756 -193684
13130 -193684 1103914 1291802 -2315868 -7678227 -10228959 -7612845 -1964456 2056991
13122 2056991 1660633 -1259971 -2304595 -144965 1359886 -1665190 -7081417 -9150299
13114 -9150299 -6957844 -6092087 -9842506 -13144115 -9854596 -2977693 -1149055 -5686989
13106 -5686989 -8433889 -4324240 1040121 715562 -2793067 -2700136 222584 -774535 -6342097
13097 -6342097 -9162137 -5624689 -1495145 -2177109 -3922206 -502846 5893401 7513025
13089 7513025 3005372 -501378 1921457 6257995 6223474 2345657 372186 2773562
13081 2773562 5997357 5986442 2954327 -403495 -2851222 -4831593 -6308160 -6725252 -6578110
13072 -6578110 -6745645 -6209542 -2822566 2871285 6891640 6460520 3588763 2151959 2875523
13063 2875523 3410207 2217336 -89760 -2534333 -4449450 -4920611 -3993132 -3827001 -5979002
13054 -5979002 -8229838 -7352694 -4508251 -3875345 -5793966 -5905239 -2308383 1230893 1562162
13045 1562162 1083926 2973469 5462092 5303337 4000561 5476515 9078619 9963831 6239883
13036 6239883 1433681 -589742 289518 1970168 2754637 1772795 -785770 -3151001 -3358133
13027 -3358133 -1324013 1700854 4909742 7422569 7340913 3935808 -235708 -2187797
13019 -2187797 -2421745 -2923316 -2670411 582907 4682300 4273584 -1527380 -7135224 -7594203
13010 -7594203 -3815113 552519 3316140 3061004 -1309847 -7520444 -10140433 -7149702
13002 -7149702 -3214030 -3073847 -4650611 -2763410 2670199 6900000 7767845 8178133 10779390
12993 10779390 13956351 14267813 10331339 3324090 -4271253 -9321953 -9165358 -3838751
12985 -3838751 2922019 5979268 3110220 -2548782 -5306327 -3367285 -1362395 -4048837
12977 -4048837 -8524554 -7035157 1745296 9337701 8337187 2245574 -81200 3562740
12969 3562740 7921737 9450790 9856262 10564931 9867146 7129849 4684706 3326672 429393
12960 429393 -4852107 -8680625 -8130939 -5997976 -5962529 -6005151 -1698542 5683212 9992936
12951 9992936 9044519 7065538 7042619 6125626 1787987 -2258643 -1405027 1713730 724563
12942 724563 -3978315 -5274665 -911357 2292430 -562692 -4127056 -1684943 3169382
12934 3169382 2394033 -2211337 -1077570 6820030 10802766 4973924 -2499137 -2655269
12926 -2655269 868376 210433 -2459761 52614 5459948 4777726 -1800884 -4083613
12918 -4083613 1595171 6523728 4162847 205142 1994783 6375684 5865552 1015229
12910 1015229 -1626798 -272203 1212160 1216957 1950443 3598976 3287560 491723 -1592904
12901 -1592904 -1089284 191799 443897 589345 2163206 4861596 6979608 6666093 2873537
12892 2873537 -3223335 -8339974 -10402892 -10688837 -10700213 -8902551 -3883488 1004943 794932
12883 794932 -3674356 -6118742 -3164973 1932098 4902919 5524272 5389159 4577812 2930986
12874 2930986 1498619 417713 -1790335 -4644607 -4640288 -609140 2902485 1315006 -3199205
12865 -3199205 -4731618 -2033134 365559 -1036839 -4763904 -7441944 -7344206 -4383448
12857 -4383448 199604 3379573 2497818 -1267216 -4195838 -5276983 -6980624 -10027740
12849 -10027740 -11315712 -9009906 -5904215 -4783209 -3909308 -1021904 1168136 -1321245
12841 -1321245 -6130912 -6508648 -1193986 3084951 817867 -4963529 -7162517 -3261976
12833 -3261976 3120697 7008879 6066831 1664884 -2071889 -1817761 1015821 1800030 -895795
12824 -895795 -3251296 -2063497 719533 1764802 1276363 922052 22263 -2133669 -2809739
12815 -2809739 616113 5277074 5572022 160092 -7754064 -15259391 -20241702 -19309064
12807 -19309064 -11463488 -2873325 -1420105 -6481377 -10433688 -10212951 -10100854 -12306229
12799 -12306229 -13058359 -10669209 -9492624 -11834915 -13110451 -9789300 -5547518 -4269473
12791 -4269473 -3331850 125576 2354865 -506036 -4414122 -3714269 -1037670 -2537060
12783 -2537060 -6746082 -7143901 -3519856 -1591152 -2338923 -782071 4465452 8844984
12775 8844984 9843109 9535873 8283783 3756896 -2303224 -4110571 -733276 2298505
12767 2298505 2441925 3694686 7898024 10152894 7008492 2414954 829138 342318
12759 342318 -2414958 -5800169 -6626285 -5539860 -4182927 -1358287 3189962 5388183
12751 5388183 2265604 -2939173 -5891903 -7536087 -10290009 -11824584 -8658179 -3017357
12743 -3017357 -28938 -177968 -185931 628464 613623 709380 3206020 6586296 7098560 4662594
12733 4662594 2033859 -774910 -5477933 -9703667 -8579234 -2547143 2349387 2909345
12725 2909345 1788607 921614 -1782882 -6479981 -7978138 -2792712 4346211 6068610
12717 6068610 2325529 -145704 2204466 5010793 2840505 -2615887 -4578056 -509259
12709 -509259 4273149 3756391 -1048986 -4729964 -5694838 -6992512 -9383561 -9290233 -5308042
12700 -5308042 -1475250 -1137226 -2167153 -1682650 -1022030 -2036748 -2933663 -2578679 -4419818
12691 -4419818 -10211221 -13992903 -9608256 -1276481 1262879 -3534956 -8211241 -8404725
12683 -8404725 -7405358 -8084354 -8328168 -6328013 -3550609 -586682 3698189 7411849 6555143
12674 6555143 2297087 592434 2695332 3210893 -60737 -2160389 -445646 -110354
12666 -110354 -4953677 -9649188 -7752299 -1893239 974997 325083 1044855 4565536 7708984
12657 7708984 8776451 8927462 8314608 5688241 1502291 -2057037 -3494502 -2309326
12649 -2309326 1121772 3981233 2551527 -2129180 -4036530 -738149 2284231 -44128
12641 -44128 -4615584 -6011926 -5382577 -6687966 -8021548 -4611628 1978039 5708155 5545719
12632 5545719 4953112 3171254 -3592832 -11789121 -11427033 -761187 8616754 6599795
12624 6599795 -2223914 -6150102 -2113050 2769519 2545350 -1208806 -3959930 -4163530
12616 -4163530 -3609646 -4605805 -7728325 -11171863 -12310700 -10610460 -8370634 -7966784 -9343238
12607 -9343238 -10825308 -11035769 -9120640 -4668311 966966 4265736 2538176 -2413878
12599 -2413878 -5077375 -1794247 4759058 7925463 4568462 -986231 -2191453 1409597
12591 1409597 3923419 1292624 -3711094 -6173836 -5429159 -4199551 -3965076 -4205876 -4356775
12582 -4356775 -3652210 -767034 3683549 6312851 5562021 4763724 6996753 9230530 6126467
12573 6126467 -1877610 -8898258 -10915196 -8360390 -2860881 3421225 6200223 2614862
12565 2614862 -3632644 -6061475 -4257156 -3188108 -3751428 -1054182 6234440 11818751
12557 11818751 10384904 4601325 -66756 -2508836 -4094253 -4257413 -2437891 -962756
12549 -962756 -1674479 -2305210 -19177 3645779 4711868 1756608 -3495610 -8278455 -9513219
12540 -9513219 -5655511 -138151 790184 -3472431 -5802213 -1499920 3905553 2197536
12532 2197536 -5796583 -12063065 -12428798 -9271764 -4853099 988260 6351412 7045356
12524 7045356 2502363 -2925579 -5928084 -7197662 -7547245 -5913666 -2901390 -1666077
12516 -1666077 -2911772 -3173812 -760948 674103 -2024793 -5781130 -5892417 -3716049
12508 -3716049 -4449445 -8385326 -9935759 -5904836 344216 4661995 7339483 9603186
12500 9603186 9109517 3757237 -2416020 -2875768 2061599 4891817 1209445 -4517436
12492 -4517436 -5861345 -2820951 193230 1284470 1600561 1201103 -875142 -3314451
12484 -3314451 -3489988 -1466200 364279 1158396 1930507 2885404 3942931 6717889 11812498
12475 11812498 15362905 13324811 8352679 6558970 7722729 5605074 -1054148 -5421922
12467 -5421922 -3205518 817983 1131978 -145858 1335653 3811928 2886119 -423344
12459 -423344 -1602985 -211503 415244 -568889 -886953 333142 2023543 4059128 6503296
12450 6503296 7372406 5339649 3144146 3934497 5745170 4335628 275300 -1836032
12442 -1836032 -541669 1029859 646711 -860169 -2911579 -5880950 -7892365 -5358501
12434 -5358501 2034599 10175380 15051763 15494291 11510803 3719602 -4763483 -9258289
12426 -9258289 -7784272 -2632748 2391157 4525402 2871326 -613557 -1804725 1030931
12418 1030931 4331064 3795464 343611 -1992522 -2368022 -2896187 -3575912 -2581645 -825576
12409 -825576 -857840 -1548788 556215 4528919 5607283 3124372 1880537 4220863 6551181
12400 6551181 5596412 2575448 -854313 -5115083 -8782918 -8062935 -3402322 -984480
12392 -984480 -3849177 -6977858 -5611727 -3048867 -4586207 -8377552 -8999727 -6842357
12384 -6842357 -6715301 -8690074 -7503119 -1371923 4665770 5607453 2110136 -2144512
12376 -2144512 -4863618 -5353140 -3583324 -1021915 -175331 -1511290 -2383384 -572907 2215107
12367 2215107 1987491 -2733071 -8974807 -12443608 -11755659 -8836754 -5707648 -2570148
12359 -2570148 429028 1666677 221785 -1905848 -2252649 -1465319 -1595408 -1968105 -495680
12350 -495680 1509557 398791 -3526610 -5507788 -3289371 134578 2383416 5118395
12342 5118395 8871411 9732374 5516756 962683 1674313 6050376 8516106 8179676 8339207
12333 8339207 8882058 5665187 -1967341 -8475217 -8696155 -3516837 2372021 5419895
12325 5419895 4886877 2428416 1330666 3927475 8554933 10811862 8753691 5151315
12317 5151315 3597348 3897475 2822105 -1157678 -5392155 -6049551 -3044505 -345483
12309 -345483 -488004 -840506 1856243 4835200 2156601 -5363399 -8959101 -3614211 4250987
12300 4250987 5408319 -52070 -4940808 -6043003 -5906426 -5044092 -227773 8147710
12292 8147710 13711039 12086307 6477154 2354902 491760 -1500810 -3793572 -4206249
12284 -4206249 -2023075 921254 2428391 1598497 -927494 -3220637 -3383206 -1438871
12276 -1438871 862057 2288104 2890715 2646082 1429463 686297 2683569 7017706 9959677
12267 9959677 8613304 4103422 -364660 -2724012 -2211006 1366077 6427636 9314457
12259 9314457 7618615 3147613 -362649 -1848426 -3154476 -4967344 -5005523 -1365847
12251 -1365847 3871461 6172707 3586708 -1099709 -3785185 -3463013 -1898692 152337
12243 152337 3753458 8272747 10087728 7201766 3145168 3070695 6887671 9616774 8311163
12234 8311163 5104164 2951038 2065926 2045880 4040377 8175420 11227884 9933572 5503955
12225 5503955 2291709 2466462 3990006 3560360 59571 -4616511 -7174407 -6080904
12217 -6080904 -3795395 -4281930 -7216600 -7176542 -1178730 5360145 4523761 -3146476 -8685260
12208 -8685260 -6544862 -1263023 275167 -1580824 -2082677 -1140927 -3118549 -8169319
12200 -8169319 -10296046 -6091757 -261311 954767 -1942016 -4014640 -3552094 -2523178
12192 -2523178 -1008292 3113542 8429382 9240711 2911127 -5739951 -10156621 -9491974
12184 -9491974 -7570868 -6688161 -5814780 -3826033 -1174171 1594793 4385431 6356161
12176 6356161 6277534 4448876 2490517 881876 -1522796 -4850174 -6708787 -4658515
12168 -4658515 489610 4988067 5816034 3505203 1186201 1142292 2731760 3769286 3222997
12159 3222997 1801038 548379 289348 2099179 6213735 10066934 9858912 5519356
12151 5519356 1986699 3393781 7578420 8970948 5837259 1563745 -925080 -2499108
12143 -2499108 -4538901 -5491708 -3256639 572402 1770601 -1063239 -4305634 -3732619
12135 -3732619 21958 2116002 -378379 -4635902 -5519894 -1961512 1815572 1473986
12127 1473986 -2638796 -6496778 -6954679 -4385476 -1552963 -751115 -1757756 -2240462 -487392
12118 -487392 2477578 4350460 4695837 4977008 5442504 4246952 641732 -2994784 -3889352
12109 -3889352 -2161350 209854 2333486 4368422 5491604 4242831 1005793 -1632099
12101 -1632099 -1709078 -185511 374801 -705844 -844308 2666899 8209620 10457740 6848582
12092 6848582 1627458 930745 5153533 9344816 10138790 8331574 5169976 1058071
12084 1058071 -1545007 573209 5416955 6494853 2069290 -1705331 -277164 2326379
12076 2326379 818096 -2393436 -1947512 999048 1537069 485032 2970018 8529775
12068 8529775 10730352 7376132 3750343 3834851 4825550 3162517 538579 414857 2537550
12059 2537550 4319995 4955219 5317222 5595421 5064664 3094081 -254642 -3258266 -2734539
12050 -2734539 2197518 7176377 6846123 1809233 -2393264 -3023854 -2437083 -2429734 -1524893
12041 -1524893 666513 1447104 -218735 -1473717 -916259 -1921932 -6968153 -12133069
12033 -12133069 -11659426 -6052702 -1511044 -1987853 -5108511 -6062980 -3264374 486680
12025 486680 1539155 -470473 -2494893 -2241757 -799812 368889 2741430 7739722
12017 7739722 12275575 11927112 7735079 4690997 3762128 1423486 -2277860 -2169928 3025256
12008 3025256 6743465 3666002 -2776489 -6431881 -6854331 -6605438 -4867284 -77943
12000 -77943 4336320 3566609 -855717 -2903728 -719037 1916824 2162801 1073782 140595
11991 140595 -418169 244977 2931610 5552703 4956997 1943452 611558 2286634 3944461
11982 3944461 3426095 2389009 2702442 3253960 2180958 -184818 -2278476 -3330299 -3159534
11973 -3159534 -1686745 161887 615902 -674485 -1702408 -464390 2540331 4870608
11965 4870608 4675620 2447417 731465 1807899 4943877 6561498 4202174 -428103
11957 -428103 -3743797 -4664350 -4706189 -4475699 -2942833 -495068 214916 -2091606 -4941178
11948 -4941178 -5165876 -2907229 -679985 505844 1787814 3475901 3929506 2310895
11940 2310895 472916 409009 1098822 177 -3023951 -5752213 -7377875 -9180462 -10749170
11931 -10749170 -9064904 -3458562 1665811 2192686 -88489 -794077 387669 694157
11923 694157 41950 328714 -59528 -4631566 -11039512 -11645821 -4360060 3107760 3696934
11914 3696934 674931 1922069 8144313 12425210 10054422 3886204 -167066 276530
11906 276530 2348165 1156622 -4879328 -11279152 -11824726 -6308439 -996752 30620
11898 30620 76932 3420019 7549569 6503317 -247116 -7113718 -9612441 -7854148 -3386989
11889 -3386989 2749160 8006261 8442891 3143364 -3452350 -5705867 -2902491 -80089
11881 -80089 -2165751 -7500923 -8825155 -2264533 6438265 8234482 2512407 -2408390
11873 -2408390 -1134357 2342746 2572981 941160 1251844 2063176 -142351 -3309232 -2272045
11864 -2272045 2527115 5385121 4214081 2963270 4412627 6071029 4915344 1700366
11856 1700366 -1396547 -3728718 -4880352 -3773885 -1312275 -1075361 -4642686 -8118936
11848 -8118936 -6365528 -86875 4227625 2294401 -2275519 -2607071 1978317 4634859
11840 4634859 524717 -5818046 -6284004 -40695 6191568 7476827 4718808 -197198
11832 -197198 -6607319 -11149544 -8684228 -280584 5808677 4763825 1006821 -305276
11824 -305276 -992300 -3867716 -5623195 -2756984 644520 -1012744 -4850382 -3832083
11816 -3832083 1594037 4317326 1537885 -2623743 -4610341 -4632241 -3039493 175288
11808 175288 2822484 3005524 2859926 4487241 4709146 293512 -4529201 -3603530 581111
11799 581111 796944 -2168296 -787958 5275543 7140031 709953 -6903696 -8411785
11791 -8411785 -5659292 -4026651 -4281203 -3913761 -1488306 2989261 7571634 7385293 -363013
11782 -363013 -10066515 -12815204 -8066988 -3122029 -1010791 2309327 7620224 9147333
11774 9147333 4750532 459658 887858 3097156 3719274 4164042 4866276 2527252 -2538240
11765 -2538240 -4241713 -354739 3613631 4438841 6352223 11222685 12939892 8030358
11757 8030358 2898329 3165934 4421721 1610784 -944553 1811153 4960113 2005379
11749 2005379 -2835521 -1880200 2201166 1616796 -1970840 -543402 5174985 5979915 -1085958
11740 -1085958 -9242558 -13396803 -15168686 -15951092 -14119626 -10320728 -7720108 -6167666
11732 -6167666 -2947437 913295 2001530 1219458 1823234 2370639 -73241 -1518657 4212107
11723 4212107 13126489 14445788 7099172 1473460 2534354 3010164 -2346948 -7256488
11715 -7256488 -5349801 -1140179 -1209846 -2400690 1751622 8401521 9086467 3138514 -1631082
11706 -1631082 -769246 1986330 2053839 -252346 -2671482 -4693437 -6349058 -6682700 -5377488
11697 -5377488 -3938592 -3864791 -4811185 -5439923 -5330157 -5372303 -6470849 -8153062 -8674574
11688 -8674574 -6709179 -2783414 1075687 2662524 706873 -3877204 -7452806 -6510396
11680 -6510396 -2310721 -278466 -2777199 -5206902 -2393624 3721873 7058295 6158211
11672 6158211 4762373 4413518 2372422 -2104052 -4912562 -3148416 20915 -297916
11664 -297916 -3990401 -6532269 -5121634 -1826415 -617655 -2406133 -3714228 -906489
11656 -906489 4669816 8007502 7502706 7182038 9510927 10002456 3713041 -5794778 -10069658
11647 -10069658 -7155683 -3195863 -2803086 -3997702 -3608040 -1826222 334533 2893330
11639 2893330 4279874 1833551 -2834342 -3758217 1350843 7198531 7834461 3545256
11631 3545256 -1990552 -7214678 -11500361 -11992487 -6590346 1298735 5110583 2163989
11623 2163989 -4105297 -8641320 -9600753 -8850323 -8976128 -10200731 -10524795 -9110867 -7947942
11614 -7947942 -8536987 -8848864 -6467341 -2891935 -757452 1461350 6669721 12188830
11606 12188830 12116113 6896671 3493622 4529511 4652922 600353 -2651181 -510333
11598 -510333 3067402 2102816 -1817543 -2890504 -203579 2688657 4071710 3908412 386853
11589 386853 -6925505 -12878256 -12335165 -8201499 -7199267 -9216552 -8337721 -3862861 -2003880
11580 -2003880 -5158123 -7313123 -3436652 2945653 5793989 5246612 5501755 7320348
11572 7320348 7430676 3866956 -1860428 -7165679 -10242183 -10215114 -7694102 -4793781 -3181130
11563 -3181130 -2770050 -3180358 -4848245 -7221173 -7676425 -4582761 -335157 1160115 -472429
11554 -472429 -1943215 -1078257 697974 1113991 48070 -1223488 -1976330 -2025314 -1288969
11545 -1288969 -701288 -2010416 -4919763 -6049860 -3405367 -637567 -3036147 -9280692
11537 -9280692 -11734435 -6789713 -528128 -342404 -4266428 -3986793 2799763 8830046
11529 8830046 7165749 40071 -4528710 -2055615 4749570 9806422 9345067 4859485
11521 4859485 1301211 1430575 2378455 -100760 -4727655 -5811051 -1653720 2633816
11513 2633816 2669101 900738 1942190 5292332 6952075 6122863 5753712 7208894 8514987
11504 8514987 8149641 7291586 7562245 8835974 9942415 9914765 8247562 5279846 2468170
11495 2468170 1285521 1958522 3771692 5676137 6030968 3509306 -513061 -2534843
11487 -2534843 -1678360 -1523205 -4580570 -7277780 -4205864 4099964 11704546 14724317
11479 14724317 13966118 10734133 5181670 -396029 -1834819 1126004 3565118 2369646
11471 2369646 592183 1864886 4287783 3936683 1539969 940378 2614335 3496689 2548527
11462 2548527 1959361 2795072 3641527 3951140 4634394 4616430 1147963 -4916038 -8339547
11453 -8339547 -6380010 -2790857 -2167070 -3670499 -3777777 -2312992 -1691362 -2318506 -2937463
11444 -2937463 -3897499 -5815827 -6488190 -3859369 -912096 -2246621 -6286866 -6774461 -2398401
11435 -2398401 1322982 1116191 364557 1893983 2888967 938160 -940064 -427719 -1549815
11426 -1549815 -7778537 -13864774 -11949318 -3147834 4282523 6567591 6735328 6294789
11418 6294789 2757983 -3463895 -7070442 -5316695 -1762724 -171391 252209 1036457
11410 1036457 666258 -2253378 -5747636 -7274718 -6928233 -5731659 -3622346 -1019538
11402 -1019538 363673 -133367 -1540435 -3755024 -7221070 -9559347 -7081281 -1128752
11394 -1128752 1967380 -463152 -3685885 -3321041 -1711661 -2455703 -3365012 -434338 4458184
11385 4458184 5872758 3186093 991537 1600290 2200927 76156 -3363242 -4971475
11377 -4971475 -3744392 -1393754 -554957 -2570693 -5941220 -7470575 -5977732 -3865847
11369 -3865847 -3886842 -5709590 -7049545 -6764617 -5385986 -3961691 -3575187 -4346307 -3906213
11360 -3906213 779585 8610822 13981295 13187701 8785105 5513725 4511985 3976828
11352 3976828 2898973 1249443 -1211499 -3344686 -2114563 3146781 7966967 7549297
11344 7549297 2831259 -1136322 -1207667 1993763 5991453 7469554 4037551 -1748373
11336 -1748373 -3008913 2915153 9407099 8553410 1377458 -5070322 -8041515 -10007014
11328 -10007014 -11174661 -8902856 -4838451 -5002390 -10502601 -14437730 -11152497 -3554939
11320 -3554939 2180996 5010374 8052796 11875435 12977470 8756232 1628733 -2482742
11312 -2482742 230955 7171821 11726655 10908453 8598728 9111826 10378605 7721785
11304 7721785 2319114 168929 2926676 5569003 4211505 1044013 -168734 1105594
11296 1105594 3621695 6309577 7076744 4084983 88071 769660 6322176 9538195
11288 9538195 5559263 -1085279 -3227176 -733193 1347110 1002341 294381 275627 77911
11279 77911 -61144 563434 501937 -1345577 -1750060 2984859 9366354 8827835 -791537
11270 -791537 -10965171 -12625852 -6793229 -1627830 -1727745 -4454422 -5520187 -3989765
11262 -3989765 -1387804 804209 1413604 -469115 -4202455 -7398839 -8138836 -6518579
11254 -6518579 -3418824 696792 4610029 5828599 3424253 104676 -1180928 -1727619
11246 -1727619 -4859688 -9673069 -11167857 -7514570 -2969423 -1541833 -1692060 -218347
11238 -218347 2148649 2805139 2149103 2307858 3124523 3450130 4362017 6716790 7592560
11229 7592560 4351244 540319 1675427 6019446 6393083 1546853 -1517152 1433002
11221 1433002 5452030 4540317 257028 -2198375 -1762819 -594373 857975 2947358
11213 2947358 3785049 1826509 -573654 -484092 586128 -829454 -4328793 -6576477 -6762169
11204 -6762169 -6786591 -6836019 -5143190 -2021215 -162414 -628949 -1951441 -3440589 -6033464
11195 -6033464 -9306020 -10781754 -9244774 -6453679 -4794860 -4966457 -6108929 -6471270
11187 -6471270 -4349621 -478374 1254479 -1775501 -6545147 -7930913 -6258597 -6887661
11179 -6887661 -11533951 -14905800 -12414177 -6907406 -3924004 -3428167 -1089431 3721907
11171 3721907 6414913 4226940 470591 -279236 1695553 2651708 1349545 603039 2742903
11162 2742903 5988537 6775906 4429813 1554478 -96848 -1947746 -5513853 -8629029
11154 -8629029 -7286933 -1164240 5190193 7707356 7322103 7461222 8627099 8068377 4373023
11145 4373023 -384877 -3776152 -5940568 -7931487 -9054566 -8189028 -6822710 -7906240
11137 -7906240 -11173745 -12131113 -7452788 109266 4474360 3447505 805928 632227
11129 632227 1918537 736064 -3612001 -7343180 -7172613 -4016729 -778029 1222304
11121 1222304 1770620 -157991 -4722957 -8571032 -7632461 -3110607 -1105433 -4603023
11113 -4603023 -8967989 -7956798 -1774386 3911618 5164258 2610547 -1549351 -5449842
11105 -5449842 -6880490 -4593319 -757557 1161437 1387717 3356621 7716333 10539674
11097 10539674 8843895 4496828 987664 -610185 -842234 -188689 60639 -1595755
11089 -1595755 -3647672 -2463654 1655938 3498352 739841 -1900929 -237207 2342271
11081 2342271 834240 -2449113 -1783053 1893354 2550675 -514494 -2029269 -860020
11073 -860020 -2309097 -7836390 -10371734 -4613306 3876461 5639450 -84664 -5158264
11065 -5158264 -3265534 3608292 8867598 8309821 3500753 -88441 1361940 5752248
11057 5752248 7623650 4965360 823332 -2117030 -4460491 -5967138 -3193417 4882962
11049 4882962 12348726 12375643 6017371 391530 -863976 -542554 -1380310 -1591640 1328720
11040 1328720 5886321 8234408 6866466 3795125 1937891 2470578 4085889 4190664
11032 4190664 1522236 -2031383 -3049815 -404023 3365107 4875032 3324477 810414
11024 810414 194426 3034270 8358307 12509653 11386769 4600098 -2989265 -5763056
11016 -5763056 -3537113 -1271538 -2053503 -3088096 -801958 2552497 1464284 -4275466
11008 -4275466 -8179506 -5630109 68318 2778015 1634228 684704 2329892 4822918
11000 4822918 5790325 5186249 4483300 4817282 5905179 5677741 2002840 -3808937 -6781166
10991 -6781166 -3680201 2624417 6338939 4997304 595548 -3586382 -4821948 -1820611
10983 -1820611 3108863 4981438 2643104 1642845 6236673 11636048 10384002 4009729
10975 4009729 507478 1202149 -694649 -7061258 -9936159 -3878641 4779809 6979464
10967 6979464 3098753 -350579 -1331715 -2488868 -3870154 -2636532 1020475 3617483
10959 3617483 3877121 3876261 4898246 6118544 7217443 8690779 9586200 7999226 3860514
10950 3860514 -1041565 -5255344 -7893554 -7984664 -5947092 -4139728 -3355309 -771835 5255178
10941 5255178 10401360 8876904 1789737 -3646083 -3245903 219237 2728348 4085169
10933 4085169 5580902 6454825 5482903 3880769 3998336 6072376 8072324 8293317 6961254
10924 6961254 5546894 5151506 5508862 5544459 4954705 4476953 4072377 2174933 -1714595
10915 -1714595 -4824444 -3932505 -126901 1914094 -21113 -2963348 -3543239 -2985216 -4475723
10906 -4475723 -6935259 -5461272 1185574 7478051 8483812 7373908 10669220 17144749
10898 17144749 17959677 9755060 1277380 2137409 9661954 13390040 9792386 5116086
10890 5116086 4484055 5816078 5675754 4262537 2403641 -432109 -2737350 -1343447
10882 -1343447 2290419 2277365 -2062778 -3427167 2025755 7103430 3966101 -3433106
10874 -3433106 -5274495 -509346 3079459 1613446 -832037 -987731 -966105 -2208102 -1830844
10865 -1830844 1904695 5724682 6150900 4156824 2051215 -784193 -5707435 -10861694
10857 -10861694 -12854838 -11227850 -8453822 -5944494 -2434250 3219298 9186393 11832969
10849 11832969 9668330 5272937 2621982 2979307 4409438 4719104 3129337 -497756
10841 -497756 -5393325 -8559626 -6891250 -1766511 1667133 1423575 1423129 4857981 8407692
10832 8407692 6920427 1326045 -2537346 -1796420 798897 1746676 982986 1011762 4044300
10823 4044300 9836760 14959247 15280541 10645621 5546243 3682996 3986662 3699823 2576781
10814 2576781 1556094 133253 -1833589 -2178124 544621 4300393 6537739 7148621
10806 7148621 6030786 1854706 -3209802 -2613647 5172572 10939569 5518432 -6978280
10798 -6978280 -14232205 -11552539 -4788719 333295 2762988 1169214 -5505997 -11688015
10790 -11688015 -9272864 -486273 2774254 -4074898 -11228908 -9358975 -2718442 -411305
10782 -411305 -1884274 90673 6388715 10367425 8136783 2824645 -875008 -711640
10774 -711640 3938480 11361654 15899393 12202734 2249281 -5716342 -6396423 -2484817
10766 -2484817 478138 1095984 1898247 4176907 5791826 4251734 309706 -2751973
10758 -2751973 -3235622 -3135161 -5288138 -9404090 -12434345 -12381806 -9959461 -6643291 -3139059
10749 -3139059 -171907 1183159 1008024 1200034 3618586 7841848 10936518 9580997
10741 9580997 3532643 -2594146 -2998129 2493493 7600053 7696011 5865224 7279108 10334069
10732 10334069 8889528 2147068 -3805187 -4680393 -2402607 304273 3760731 7368123
10724 7368123 7394689 2459199 -2983180 -4418805 -3017026 -1955073 -636798 2850845
10716 2850845 6354421 6055535 2939976 1799337 3957679 5489477 3254795 -1199626
10708 -1199626 -4863111 -6946206 -7603527 -5747930 -664946 5466149 8811157 7339631
10700 7339631 2000382 -4619551 -9332984 -9098812 -3415260 3636735 6344832 3892926
10692 3892926 1899481 5333642 11734789 14535932 11895397 8216334 6943395 6316210
10684 6316210 3729424 280362 -1539892 -1641565 -1173478 11238 2268564 4684106
10676 4684106 6784712 9432389 12154818 12454335 9895520 7586365 7081101 5550193
10668 5550193 1201204 -2514245 -2207272 -207624 -145295 -556578 1619127 4532604 4594008
10659 4594008 3219497 3615954 3324660 -2289668 -10489299 -13319451 -9381041 -5604358
10651 -5604358 -6283915 -7863344 -6610389 -4588471 -4982689 -6824977 -7255703 -5082506 -420166
10642 -420166 5393960 8800590 7220129 3544724 2715897 4141885 3564555 2415320 7430327
10633 7430327 18670646 25714681 20549537 8662595 1972196 4265199 8605185 7365149
10625 7365149 748554 -4587162 -3419717 2119644 5201866 3091656 347266 1069767
10617 1069767 2239846 -262939 -3002569 264817 7580467 10961541 8744374 7026364
10609 7026364 8497309 8760033 5303610 1520324 -597279 -3591540 -7473826 -7333607
10601 -7333607 -1537991 4585862 6570148 5844689 4321913 1085746 -2462234 -1553028
10593 -1553028 4015322 7693474 5716649 2213819 1214234 644785 -1412360 -1395409 3647951
10584 3647951 10268024 13567187 13107749 10408744 5792398 747722 -1978258 -2913717
10576 -2913717 -4534627 -4345998 2573985 12458613 14229775 5510240 -2906289 -3218185
10568 -3218185 -739756 -1974960 -3372244 90707 4748950 5570309 5232022 6939905
10560 6939905 6265753 -207953 -5560955 -2332239 4598715 5687943 2195128 2992277
10552 2992277 9434733 14060209 12701388 8828739 6632395 6928015 8979342 10811513
10544 10811513 9370126 4733595 1409596 1848918 2842263 1918365 1921485 5075134 8267788
10535 8267788 8583499 7618009 6473284 3261106 -768291 -564390 3323506 3482240 -2069880
10526 -2069880 -5971367 -4148363 -1521634 -594148 3237201 9596767 10234988 4863621
10518 4863621 4975006 14054212 20081864 16888824 15419350 22579502 27534382 22679402
10510 22679402 19233917 26135429 32401697 27849267 21903242 23196947 21659511 11920112
10502 11920112 11175601 28562546 41111233 29890006 15219509 21744428 34754302
10495 34754302 31778187 29773541 50914443 69684764 57768268 56326560 118610486
10488 118610486 188380212 138190443 -44283452 -205077525 -212724064 -118031307 -57490439
10481 -57490439 -66213868 -75408542 -51048389 -33168587 -45006360 -53153378 -34790492
10474 -34790492 -16459898 -22220364 -34829880 -32657403 -24498466 -24617276 -26096699 -20505441
10466 -20505441 -17127330 -23206219 -27582246 -21065533 -13405032 -14817548 -18573806 -16075736
10458 -16075736 -12842506 -15867939 -19654278 -17754709 -15315210 -18084708 -20597545 -16710116
10450 -16710116 -11416982 -11237853 -12136648 -7667335 -1402662 -1046035 -5836186 -8585445
10442 -8585445 -6307178 -2272868 -658511 -3253844 -8140094 -9736616 -4634794 2137580
10434 2137580 2586183 -2784996 -6423092 -6236279 -7533623 -11882514 -13917576 -11178284
10426 -11178284 -7752113 -6031504 -4062633 -2924975 -6829506 -13489337 -14635266 -9193807
10418 -9193807 -5738854 -8363945 -10647476 -7966318 -5147231 -6339800 -7356022 -4510225
10410 -4510225 -1874059 -2866190 -3110444 1111624 5138560 4213872 2262708 4315153 6514716
10401 6514716 2429993 -5366167 -8640596 -5511396 -1723448 -1894889 -5456378 -9486772
10393 -9486772 -10751380 -7038923 -596707 2286231 -1246811 -6589968 -8356515 -7068101
10385 -7068101 -5432366 -2720074 1940161 4796134 2134924 -3074637 -5113387 -3984208
10377 -3984208 -4164900 -6430476 -6889666 -3869054 -394569 745469 -74838 -2193575 -6297372
10368 -6297372 -11359911 -13230267 -9266614 -3110964 -1791127 -7263877 -13040049 -11631853
10360 -11631853 -4463247 -708123 -5308426 -12344648 -13364477 -8438464 -4037105 -2820615
10352 -2820615 -2048248 -1057791 -3087227 -8382967 -11858372 -10317802 -7168824 -7024155 -9395844
10343 -9395844 -10562662 -8758503 -5048896 -1369351 382237 -773973 -3581812 -5691652
10335 -5691652 -6479380 -6822802 -6434067 -4146886 -664094 1865079 2823669 2972139 2054201
10326 2054201 -424194 -3126492 -4913948 -7343568 -11308507 -13386503 -10473241 -5844318
10318 -5844318 -4688836 -5674214 -3879651 -305661 -198937 -2790113 -2038363 1827650 1344829
10309 1344829 -5429006 -10799085 -9533772 -6016720 -5068195 -4477117 -1997735 -1392904 -4971821
10300 -4971821 -7407722 -4172283 65336 -1079663 -5117850 -5309212 -1626928 761178
10292 761178 884702 2076574 4392579 4033183 10385 -4097141 -5081238 -3082423 -440162
10283 -440162 -366587 -4786324 -10700165 -11535406 -5409829 1094661 1169662 -3391199 -5807709
10274 -5807709 -3800542 -859965 -321928 -2588005 -6501469 -9727503 -9482676 -5993913
10266 -5993913 -3157436 -3228406 -3791911 -2498798 -886855 -360219 1223671 5065195 7949251
10257 7949251 7535776 6542051 7042688 5776923 835951 -2281471 1506956 7404215 7098286
10248 7098286 1229210 -2761251 -2579698 -2210411 -2814797 -1409110 1783958 2987751 2155940
10239 2155940 3053751 5782780 6505458 4831961 4114158 4153971 1409338 -2873418 -2879572
10230 -2879572 1987699 5533092 4801155 3547302 3363882 -26820 -7895502 -14103058
10222 -14103058 -14342045 -12483083 -12627008 -11937228 -7293764 -2410658 -1417838 -1143201 2614323
10213 2614323 6118788 3545755 -1881398 -1906228 3358771 5356603 610951 -4367289
10205 -4367289 -3695726 -239330 168576 -3008360 -6233256 -7447156 -6942429 -5253852 -2871318
10196 -2871318 -447460 2029271 4479638 4949405 1603134 -3161046 -4626429 -2902178
10188 -2902178 -3456703 -8231521 -11312734 -7581715 -1236428 72537 -3377355 -4580906
10180 -4580906 -1134205 1736905 137795 -3152860 -4340524 -3624545 -1617759 3506014
10172 3506014 10946985 14282427 9320236 1815350 1189487 8038952 13691940 11742246
10164 11742246 4623268 -1596673 -3927656 -2898567 -600538 195294 -1832962 -4409653
10156 -4409653 -4501923 -3218877 -4151512 -7066833 -8144799 -7013313 -7857407 -11656569 -13044790
10147 -13044790 -8177997 -883571 2787050 1949715 -899456 -4685348 -8197354 -7750652
10139 -7750652 -1922896 4280008 5515622 3916951 5121964 8770919 9555892 6492152
10131 6492152 4016112 3730987 2233536 -1298549 -2224203 1712360 5345602 3103961
10123 3103961 -3002340 -6735486 -6110090 -4240836 -3483010 -2809353 -524841 3498940 8214798
10114 8214798 11839048 12264224 9108537 5096801 3430793 3860433 3245776 114746 -3378258
10105 -3378258 -4784000 -4816762 -5910180 -8319411 -9645619 -8274103 -5419173 -2982014
10097 -2982014 -1150883 270503 -248473 -3872720 -7643686 -6317395 882890 8340139
10089 8340139 10786093 9324658 8141746 7721400 5310368 966020 -1469082 -119389
10081 -119389 2147447 2460716 2279879 4368733 7641133 8346914 5674759 2901225 2391695
10072 2391695 2351001 324763 -2271053 -2117977 362190 1035344 -1422773 -2780195 363957
10063 363957 4566170 4087077 -395445 -2800179 -1049876 253550 -1995919 -4221305
10055 -4221305 -2498533 568962 -9377 -3647455 -5391853 -3446980 -695391 631954
10047 631954 1383568 2405026 2704299 1359356 -1287701 -4495070 -7180687 -7935665 -7332186
10038 -7332186 -8658946 -12961667 -15071412 -9535250 105766 3841224 -1824801 -9000633
10030 -9000633 -8982038 -2632671 3392464 6360211 8319179 9902410 8957823 5138876 1378584
10021 1378584 -72871 -1784 123151 208038 326470 -164036 -971676 -254826 2622193
10012 2622193 5038009 3927363 245594 -1539854 946293 4680129 5071574 1988644
10004 1988644 -350719 572736 2410824 2164459 933400 1524465 2909791 1206396 -3510159
9995 -3510159 -5557335 -962023 6731604 11021469 10549732 8873160 7549142 4364395
9987 4364395 -886377 -3798023 -1521110 1915723 654010 -4317983 -6137530 -1657578
9979 -1657578 4406406 6322460 4428764 2791324 2830367 2823209 2012233 1399007 987232
9970 987232 -233387 -1360532 82700 4034392 7022604 6814807 5557482 6455339 9045759
9961 9045759 9865673 7052680 2542042 -269600 -48795 1531090 2231516 2399677 4609482
9952 4609482 9365840 12848873 11448434 7660853 7922016 14001762 20039726 19786047 13791074
9943 13791074 7142840 2768464 216517 -651843 1210284 5010494 7465165 6682455
9935 6682455 4983472 6157628 10375294 13247541 10506525 2941115 -4308245 -7210866
9927 -7210866 -6279037 -4329590 -2831822 -1819864 -1486396 -1591958 -720169 1316884 1683605
9918 1683605 -1795401 -6360831 -7453822 -5331068 -4297663 -5687700 -6494705 -5437040
9910 -5437040 -5062521 -6286724 -6105033 -3229614 -1056466 -1718550 -1651747 2814638 8969527
9901 8969527 11176603 8329079 3993544 1363742 1727408 5654632 11573208 14678487
9893 14678487 11263674 3509176 -2963758 -5337254 -4781661 -2821378 224116 3526760
9885 3526760 5104464 3622732 507787 315769 7136450 18016893 22767910 16686682
9877 16686682 11905483 25725690 54611770 71023047 54525836 17866707 -8414984
9870 -8414984 -11600639 -5042385 -4155671 -8334195 -9254936 -5450210 -2139850 -2854764 -6832725
9861 -6832725 -11682851 -15225364 -16446755 -15920168 -13877746 -9049362 -2387592 248968
9853 248968 -5678591 -15581063 -19938474 -16156285 -10593740 -8660493 -8923260 -8123374 -6349788
9844 -6349788 -5257012 -5486141 -7297762 -10133845 -11191465 -8309137 -3883598 -1547044
9836 -1547044 -151411 3372106 6756135 5514954 2643581 6032899 14756302 17578458
9828 17578458 9038833 -1643975 -3207106 3302240 8908283 9380015 6769114 2897725
9820 2897725 -1615984 -4464513 -3848593 -2072282 -2493308 -4650774 -6108696 -6771542 -7549730
9811 -7549730 -7165932 -4366582 -1365109 -1224551 -3316558 -4641486 -4195821 -3343141 -3530841
9802 -3530841 -5773484 -10112464 -13686025 -12490804 -7315321 -4125534 -5691391 -7218916
9794 -7218916 -4352868 -1082417 -3958125 -11496272 -15674114 -12597980 -5959765 -533385
9786 -533385 2408390 3119465 1665104 -905197 -3066737 -4907451 -6978313 -7622042 -4827078
9777 -4827078 -391133 1439097 -288657 -2297540 -2449358 -2699928 -5407608 -9358647 -11303926
9768 -11303926 -10036069 -7389638 -5659281 -4991168 -3617368 -617846 2210430 2307960 -160904
9759 -160904 -2508657 -3287041 -3714016 -4882968 -5966094 -6089857 -5578021 -4393268 -2146377
9750 -2146377 -836675 -4122688 -11611352 -17095239 -15557070 -9539598 -5552710 -6322069
9742 -6322069 -9622399 -12531399 -13223774 -10364059 -4834682 -1196735 -3453820 -9421511
9734 -9421511 -12741657 -10800614 -7585095 -7913840 -11383136 -13383900 -10768459 -5339497
9726 -5339497 -1922436 -3192199 -6622718 -7356482 -4039191 -234258 463548 -1196535 -1903169
9717 -1903169 -385923 1452665 1300199 -904755 -2853273 -2089735 1230965 4218045 4715409
9708 4715409 3823937 3426189 2874133 880247 -960494 -435021 677016 -1070047 -4487370
9699 -4487370 -5097458 -2737262 -1909234 -3841203 -4555999 -2440483 -1198704 -2875294 -4485333
9690 -4485333 -4537624 -6070905 -9391888 -8908173 -2372421 3389687 2263371 -1556285 -812152
9681 -812152 3106353 3665206 615979 -438787 2089493 3995513 2580904 -560930 -3444718
9672 -3444718 -5136817 -4227235 -447032 3412685 4908952 5016145 4526612 1420092 -3906731
9663 -3906731 -5862563 -1919930 1546487 -1295765 -5673832 -4007767 1122336 1771905
9655 1771905 -1539163 -2008368 57219 -1773015 -6569557 -6173613 203505 3864951 1553388
9646 1553388 502077 4743133 7875160 4872046 672753 467287 525980 -4018735 -9858604
9637 -9858604 -11374385 -9489715 -7660336 -4858507 223626 3095064 -804059 -7991250
9629 -7991250 -11457703 -10179628 -7887920 -5666682 -2475807 -333484 -1898311 -4435367
9621 -4435367 -2972148 1226528 1861220 -2435072 -5467696 -2493318 3061732 4548430
9613 4548430 544123 -4559381 -6841942 -6849172 -6986408 -7108308 -5048692 -1351287 -239888
9604 -239888 -3721297 -7498574 -6514554 -2593573 -1697118 -4680702 -6656110 -5716955 -5810189
9595 -5810189 -9041739 -11262530 -8602466 -3367742 303927 2435329 4836488 6165570
9587 6165570 3681275 -1976918 -7064572 -8602596 -6286400 -2455193 -1259649 -5185511
9579 -5185511 -11260120 -13472442 -9589543 -2476868 4888797 10857453 11919692 4999399
9571 4999399 -5500835 -9982707 -5698584 103233 1635310 1413706 2089685 394150
9563 394150 -4786648 -6805265 -1633591 3479894 710405 -5402749 -5728444 -1680192 -1136143
9554 -1136143 -3302570 -524647 6248148 6985056 -1005276 -8175908 -7613542 -4272314 -4694181
9545 -4694181 -6612462 -4722946 129878 3642384 4955322 5493253 4778490 2168315 -211421
9536 -211421 -262910 752013 673087 -289378 -1219956 -2597679 -4299676 -4418200 -2547934
9527 -2547934 -1403195 -2689945 -4211324 -3602837 -2044529 -1481317 -986764 940006 2946791
9518 2946791 3101259 2506934 3114001 3662150 1628230 -1948818 -3605353 -2961318 -3005526
9509 -3005526 -4495882 -4208654 -447642 3261218 2914025 173631 178689 4126655 7870165
9500 7870165 8272037 7027796 6485153 5705299 4158670 5643704 12686285 18997200 15120601
9491 15120601 2427153 -6443002 -4408118 452579 -2139815 -9060832 -9814757 -3574346
9483 -3574346 476071 -1284590 -1911970 3208909 8045800 5436183 -2124388 -7034976
9475 -7034976 -7094388 -5689256 -4813430 -3617500 -2289347 -2459931 -4096312 -5386337 -5351997
9466 -5351997 -4100676 -1332512 2911161 6674564 7521678 5291273 2103875 384557
9458 384557 1717084 5925475 9903518 9358178 3760223 -2054188 -3305668 -833009 811211
9449 811211 -725074 -3900995 -6118548 -5709636 -2107817 3457125 8075480 9988925 10394880
9440 10394880 10645562 9464238 5751823 2357527 3001867 6126334 6196625 1569788 -3140338
9431 -3140338 -3829323 -2149951 -1952263 -3858403 -6105980 -8114563 -9981810 -10228945 -7480698
9422 -7480698 -3513942 -1399983 -922398 996999 5029295 7725360 6252711 2330936
9414 2330936 -243951 -178128 1019316 1885544 2076304 1399811 -110046 -1324474 -1004989
9405 -1004989 264059 674137 -142894 -609279 309744 1686904 2323324 2333123 2034787 563315
9395 563315 -2958725 -7457320 -10373426 -9982707 -6649021 -2274419 792364 935327 -1552083
9386 -1552083 -4553450 -6029784 -5684790 -4471513 -3193588 -2338158 -2589787 -4350400 -6885709
9377 -6885709 -8796844 -9332069 -8768671 -7805789 -7104954 -7063035 -7469598 -7638422 -7154374 -6047487
9367 -6047487 -4282192 -2178897 -1422421 -3789555 -8044179 -10264599 -8992505 -7902310
9359 -7902310 -10498293 -13727985 -10886312 -969056 8819381 11427862 7696138 3443638
9351 3443638 1303089 -1114161 -5601189 -9432423 -8551461 -2954932 3018560 5497404
9343 5497404 4599789 2708965 845272 -1481159 -3555383 -3294343 -617095 1450305 807761
9334 807761 -607275 -188339 593228 -1738572 -6600937 -9362990 -7914039 -5275003 -4151688
9325 -4151688 -2783598 858388 3869747 1682541 -4736037 -9274873 -8563024 -5789571
9317 -5789571 -5384959 -6916386 -6553097 -2889105 1226777 2405471 541538 -1371889 -472396
9308 -472396 3006377 5740230 4767097 1166299 -850974 704471 2739831 1406358 -2136282
9299 -2136282 -3376387 -1455812 -561968 -3136919 -5750088 -4614879 -1783892 -1546735 -3013190
9290 -3013190 -1774606 1751361 1717525 -4077252 -10084296 -10811645 -8051624 -6547569 -6429731
9281 -6429731 -4864557 -2512768 -2691470 -5107920 -5902331 -4216412 -3687239 -6105043 -8095439
9272 -8095439 -6406386 -2864798 -1098984 -938570 502512 3514226 4967508 2824007
9264 2824007 -1116024 -3697267 -3947983 -3219384 -2886019 -3068399 -3345559 -3697466 -4326590
9255 -4326590 -5030097 -5292825 -4864910 -3871889 -2668231 -2155803 -3685364 -7342679 -10487217
9246 -10487217 -9744963 -5031249 -15281 2247079 2536220 3203424 4441294 4728223 3830666
9237 3830666 3100783 3045402 2434501 8319 -4073519 -8490295 -11650120 -12487547 -10932553
9228 -10932553 -7410664 -2188513 3530679 6323004 3136696 -4026290 -9030692 -8827370
9220 -8827370 -6671401 -6035785 -5151217 -1418821 2227300 999652 -3451812 -4521126 -289129
9211 -289129 4029564 4067501 1298726 -1523527 -4671287 -8448014 -10270633 -8284517 -4924198
9202 -4924198 -3554349 -3765634 -3065839 -1510689 -1593792 -4381829 -8156623 -10470051 -9967459
9193 -9967459 -6785560 -2498846 674730 1315982 -790644 -5122237 -9829602 -11481364
9185 -11481364 -8191892 -3075886 -1487709 -4238254 -6852854 -6459063 -5518091 -6818425
9177 -6818425 -8701009 -8371522 -6813179 -6675640 -7454462 -6596860 -4040062 -1994289 -964609
9168 -964609 589286 2819039 3749104 2294593 -286101 -2303865 -3252454 -3380904 -3217964
9159 -3217964 -3676040 -5349860 -7472051 -8285571 -6476431 -2150283 2853829 5553630 4138585
9150 4138585 144812 -3128665 -4572555 -5563838 -6132400 -4119928 352902 2966586 497401
9141 497401 -4501343 -7307048 -7170979 -6573203 -6204940 -4649741 -2275564 -1541334 -3115080
9132 -3115080 -4761221 -4812963 -4473056 -5770877 -8573701 -10313941 -8456177 -3655078 -341524
9123 -341524 -2430577 -7996691 -10601068 -6941707 -504147 3627544 4151138 1866719 -3087175
9114 -3087175 -8920900 -11218101 -8782529 -6800134 -8954552 -10118571 -3711431 6472056
9106 6472056 9962235 4089542 -3672974 -7965821 -11118574 -14609639 -14281876 -8600499
9098 -8600499 -3826695 -4879676 -7033129 -3412417 3620626 5660459 399488 -5925249
9090 -5925249 -7323545 -4095933 -501226 -435142 -4849516 -10167838 -10537527 -5050463 -852495
9081 -852495 -4727494 -13134915 -15912964 -9538965 -1169352 1511176 -837069 -2979816
9073 -2979816 -3401193 -4740612 -7830846 -9287913 -5674136 1835303 8010838 8636957 4728346
9064 4728346 1323940 1908459 4682206 4992960 816737 -5123779 -8308804 -6657027 -2190868
9055 -2190868 840479 -33735 -2820899 -3020661 1315479 7453672 11349093 11764484 10265778
9046 10265778 8675002 7704365 6836145 4563871 166805 -4051254 -4457583 -1122433 1528925
9037 1528925 807421 -606306 235569 1105282 -1695307 -6716135 -9374370 -9128291 -9339974
9028 -9339974 -10426061 -8703655 -3050766 2183146 2826772 -262780 -3718063 -5732067
9020 -5732067 -5952720 -4402334 -2364225 -1880172 -2939613 -3493326 -3063354 -3310792 -4016766
9011 -4016766 -2184971 2833455 6641715 4907614 -1168372 -6792440 -8902415 -7612046
9003 -7612046 -4567111 -1907982 -939946 -266866 2534918 6227636 6165130 1155255 -3507293
8994 -3507293 -2714204 1916410 5257082 5264117 2827073 -1731102 -7460593 -10510515 -8014791
8985 -8014791 -2901863 -360691 -781511 -743771 219745 -900383 -4583481 -7436119 -7663441
8976 -7663441 -7400690 -8255015 -8323736 -5541776 -1495593 -185963 -3913191 -10489353 -13905679
8967 -13905679 -9415516 464117 7381308 6836261 3287533 2435740 2716088 -130064 -4111793
8958 -4111793 -4248166 -2115167 -3299809 -6477924 -4718104 1789853 4424061 -81978
8950 -81978 -4341941 -2563801 1269061 2289784 2691253 4664742 4087715 -1161612 -4292926
8941 -4292926 319602 6683259 6182944 1466593 1105352 4707105 4507689 -533042 -3420369
8932 -3420369 -1466650 477773 -57465 380558 3001095 3711158 759899 -1939118 -1673374
8923 -1673374 -695712 -1020487 -1510984 -1900094 -3748058 -5975735 -5579507 -3869788 -5160501
8914 -5160501 -8063496 -5973128 1535769 6145075 3242666 -1144107 -596592 2129781
8906 2129781 1633989 -774028 -952484 267758 -10724 -425657 1502839 3692345 3207939
8897 3207939 2043699 3047849 3831637 1434037 -544290 2894597 8534400 8703878 3264512
8888 3264512 -341246 1213430 3340155 2308912 358714 9276 -281713 -1994865 -3183680
8879 -3183680 -2025137 219452 1995743 3608264 4660681 2825526 -2636049 -8732322
8871 -8732322 -11821567 -10854865 -6956712 -2259351 546296 374685 -255325 1649169 4532522
8862 4532522 4054727 -32792 -3011419 -1911434 1122956 3121498 3531080 2023973 -2044777
8853 -2044777 -6140577 -5589440 -763738 1829935 -935898 -3376370 145037 5544990
8845 5544990 4566863 -2880670 -8784832 -8323796 -4537415 -1529818 702521 2920796 3419638
8836 3419638 1127758 -1514223 -1631910 301118 1879350 2070754 1245990 -366541 -2328786
8827 -2328786 -3336149 -2578344 -856125 784885 2326696 3581232 3291425 1116833 -729794
8818 -729794 192990 3286304 5677354 5593450 3326777 -285700 -4211115 -6664844 -6672242
8809 -6672242 -5978951 -6851320 -8134740 -6699470 -3133407 -1916817 -4253131 -5111058 -873374
8800 -873374 3919165 2689173 -2749916 -4348116 -1640 3279972 249999 -4785389
8792 -4785389 -4837312 -109062 3768320 4134549 2899286 1731592 626087 357837 1871192
8783 1871192 3637684 3658672 3485004 5792968 8481029 6685105 1291580 -681899 3505525
8774 3505525 7576945 5916932 2415426 3576369 7033861 5109325 -1644498 -3539828
8766 -3539828 3604652 11129899 9730728 2706636 177961 3962171 6321153 2752162
8758 2752162 -2246704 -3926500 -4373166 -6841715 -8893186 -6718010 -2304027 -203391
8750 -203391 235386 2927308 6839400 6780687 2400529 -879726 -1350639 -3895468 -10115872
8741 -10115872 -13007855 -7257622 1082164 2674284 -1295676 -1832555 3264884 6679941
8733 6679941 4135043 662604 907916 973661 -4176791 -10653485 -10294072 -2844747 3715503
8724 3715503 4654561 3446034 3697306 2656406 -2883738 -8750634 -7754480 -507669 4344426
8715 4344426 1664849 -4003130 -6392386 -6331182 -7697844 -8544664 -3544804 5534597 9509086
8706 9509086 4290108 -2550354 -1962234 4282937 6708442 1152380 -6697367 -9517525
8698 -9517525 -6711568 -3241366 -2610921 -2969247 -277667 5429646 8940899 6778182 2964266
8689 2964266 3530784 6551583 4328777 -3573061 -7550712 -2116966 5128619 5298350 1993188
8680 1993188 4221330 10698893 12212703 7291433 3940285 5409063 5440902 323671 -4556724
8671 -4556724 -4581233 -3485187 -5599860 -7931977 -6246929 -3113234 -3188641 -4856916 -3221760
8662 -3221760 1411699 4161121 3106773 1154011 1151611 2915786 4529465 4151793 1525086
8653 1525086 -1002357 -943143 232006 -1006622 -3459761 -1451365 5970357 11776742 10517902
8644 10517902 5766379 3617198 4000999 3768438 3469005 4701739 4792642 1004144 -3096425
8635 -3096425 -2436895 917473 879744 -2982157 -5840012 -5847110 -4899756 -2889865 1189414
8626 1189414 3757804 627430 -3981424 -1239463 8628569 15127268 11778806 3391095
8618 3391095 -3320575 -7942307 -11514867 -11479150 -6774406 -1939620 -978762 -1963508 -1986194
8609 -1986194 -2433220 -4938734 -7063023 -6664660 -5908890 -6347480 -5019164 -644637 1478673
8600 1478673 -2793713 -8303575 -7566729 -2594705 -1759539 -6681469 -10300885 -7819274 -2273847
8591 -2273847 1562691 2460365 678491 -3691418 -8609712 -10885974 -10525058 -10402543 -11003977
8582 -11003977 -9834192 -6665277 -4459630 -3747055 -999721 5231901 10892516 11699060
8574 11699060 8275361 3612605 -1188876 -5957774 -9162482 -9478236 -7724663 -5257669
8566 -5257669 -2439047 -84226 299805 -585865 352648 3849287 6304345 4855211 1412783
8557 1412783 -968270 -2633900 -5033203 -6770454 -5822148 -3578161 -2832010 -3420956 -3467957
8548 -3467957 -3206258 -3813968 -4278987 -3569665 -4074374 -8052677 -12224738 -11510058 -7259169
8539 -7259169 -5477435 -6866820 -5623274 422110 5674181 5885638 4619029 5973547
8531 5973547 6914269 3162522 -1808968 -1221069 3878118 5572879 858825 -4638307 -5934278
8522 -5934278 -5271629 -6730688 -9452730 -10130825 -8902092 -8651164 -10107000 -11167590 -10452270
8513 -10452270 -8637829 -6322448 -3022582 1011042 3630089 2654348 -1419427 -5230736
8505 -5230736 -5390937 -1699263 2524829 3686376 1592511 -468560 551911 4096781
8497 4096781 6717315 5926195 2776335 287764 -232015 -229213 -1034754 -1594080 -665722
8488 -665722 65950 -1969498 -5299818 -5179710 -441624 4213410 5227449 5752818 10075627
8479 10075627 15316860 14390704 6422998 -1629301 -4491860 -4124493 -3943207 -3162401 -593034
8470 -593034 679298 -2218725 -5714549 -4126041 829293 1154098 -5867161 -13070607 -13160876
8461 -13160876 -8221305 -5135909 -4989929 -3001248 1937482 4111705 -500481 -7479488
8453 -7479488 -9492579 -5615631 -1129701 134560 -1001088 -2608464 -3972352 -4217495
8445 -4217495 -2735669 -1656719 -3956420 -8209128 -9424310 -6439173 -3836781 -4352543
8437 -4352543 -4384791 -554758 3994184 4610877 2656754 2683342 5052803 6897929 7928245
8428 7928245 9453474 9819456 7105471 4484013 5940877 8114911 4364752 -3446644
8420 -3446644 -6036079 -811999 3981436 2124316 -1977451 -1812895 1717368 4658047
8412 4658047 7284323 10851474 12355666 9045551 4251054 2672539 3134884 1658954
8404 1658954 -1363315 -2701630 -2210690 -1680343 -353476 2850222 5056976 3057367 -984178
8395 -984178 -3063249 -4170794 -7306924 -9872643 -6472919 1427527 6078630 4213379
8387 4213379 516440 -712800 -894080 -2317501 -3863984 -4279250 -5069593 -7325457 -9092582
8378 -9092582 -8129644 -4627285 -34325 4008837 5138040 2172227 -1944302 -2864701 -965780
8369 -965780 -596926 -2748171 -3548042 -1544746 -1076778 -5352034 -10620611 -11096973 -6683758
8360 -6683758 -2232306 -1288034 -3613358 -7041746 -8955857 -7442480 -3531108 -1078508
8352 -1078508 -2329976 -4891687 -5128617 -3187131 -2237108 -3561432 -4994109 -4447286 -2865869
8343 -2865869 -2436203 -2932312 -1918331 774846 1107891 -3663295 -8851101 -6818298 1347621
8334 1347621 4715409 -2964804 -13108958 -13021862 -2811293 6169036 7393866 4870958
8326 4870958 3255252 1618834 -930548 -1816881 -645004 -1394648 -5406470 -8359233 -7633013
8317 -7633013 -6423469 -6888542 -5874855 -2115703 -1054857 -6416575 -12485707 -11548056 -4841938
8308 -4841938 462172 1624518 1102576 -63982 -2953691 -6678241 -9182080 -10264411
8300 -10264411 -9354371 -3815194 5112613 9101036 2868796 -6120675 -6638831 414498
8292 414498 4660048 2911262 2056048 4873511 4892746 -913180 -5080763 -1525542 4034987
8283 4034987 3002186 -2841219 -4765381 30547 6183005 8639050 7132606 3379863
8275 3379863 -826359 -3136251 -2592526 -1951937 -4650141 -9607484 -11903888 -8553819 -1546864
8266 -1546864 4416225 5625594 1824417 -3347836 -5372135 -3516224 -1040881 -55503
8258 -55503 1042736 3578634 5650768 5838812 6264332 8291709 8650107 4677929 487327
8249 487327 1810172 6414931 6519994 614811 -4119232 -2530071 2066283 4751322 5945238
8240 5945238 7451233 7132496 3075275 -835995 317352 4301194 4356401 -814077 -5393561
8231 -5393561 -4993215 -1526484 1556118 3914800 5956534 5995303 3072413 34380 511658
8222 511658 4123122 7285820 7894886 6879376 5646849 4212042 2064875 -622791 -3092441
8213 -3092441 -4539800 -4419224 -2743859 -255937 1754415 1780661 -1189476 -6376473 -10833442
8204 -10833442 -11616847 -8685388 -4880142 -2988254 -3522156 -4991737 -5357397 -3762397 -1829083
8195 -1829083 -2035853 -3487146 -1686460 4554920 8742282 4352434 -4894090 -9082314
8187 -9082314 -5996353 -3013572 -3881661 -2903466 3515441 8681057 5978877 -217770 -2523046
8178 -2523046 -2878805 -6826414 -10694822 -6502409 2991199 6579168 1585119 -3495078
8170 -3495078 -4187383 -5468328 -9317551 -9377974 -3210189 1493362 -321936 -2243192 1842672
8161 1842672 6419024 4099884 -1026830 -378171 4380702 4485526 -1431565 -6353735 -6527445
8152 -6527445 -4593990 -2082476 2246704 6671242 7394978 5654194 6397720 9249303 8314427
8143 8314427 2431182 -1639966 1007568 6366964 7569321 3827258 224545 1058748
8135 1058748 5469783 8572290 6847400 3287650 4877044 12629249 17856575 13019043
8127 13019043 2727549 -2595901 -1299789 -718915 -4161579 -6810203 -5460120 -3453526
8119 -3453526 -3314353 -2370287 877815 3103467 2640311 2951071 5356675 4738001 -2207732
8110 -2207732 -9853825 -10624098 -4940751 1253419 5018492 6669346 5006873 -845094
8102 -845094 -6440578 -5440426 1657775 7155664 5309872 -1638331 -7055913 -6781777 -2187830
8093 -2187830 1417179 -509548 -7001702 -12158986 -11851571 -8449441 -7002916 -8402066
8085 -8402066 -9027250 -6230936 -1464955 1853507 1723458 -906121 -2768851 -1332207 1636499
8076 1636499 971711 -5863912 -15029052 -20275723 -19392667 -15071417 -10881369 -8483296 -7756655
8067 -7756655 -7529591 -6526373 -4811452 -3635091 -3246380 -2388745 -727476 346348 501962
8058 501962 1534360 3845961 4484341 1275387 -3253636 -5056028 -4059521 -3442523 -4585092
8049 -4585092 -5756346 -5172893 -2677763 1176508 5325313 7800507 7207064 4356073 990538
8040 990538 -2297612 -5469755 -7691794 -8392994 -8414684 -8405588 -7692583 -6525669 -7087541 -9547402
8030 -9547402 -9555493 -3547397 5099681 9492324 7803841 3960504 444925 -4194666 -9879504
8021 -9879504 -12511026 -9551607 -4074959 -337773 1411873 2604636 1991810 -2008813
8013 -2008813 -6353181 -5794090 -602073 2571750 -621575 -6184743 -7344846 -3668698
8005 -3668698 -524946 -403760 210118 3855665 6723750 4088325 -1995929 -5443243 -5155131
7996 -5155131 -5683149 -8676994 -9600401 -5270293 450837 2294995 1236000 2110548 5935998
7987 5935998 9083511 9028618 6870326 4295094 1357954 -2326252 -6450985 -10293353 -12707208
7978 -12707208 -12454788 -10001600 -7939547 -7955757 -8513588 -7168972 -3804460 9187 2982402
7969 2982402 3683603 701159 -4258526 -6153565 -2721073 1804889 2724192 1658121 2635481
7960 2635481 4375509 2748926 -926536 -1270946 1900152 3119881 695253 -1109885
7952 -1109885 -1002355 -3497377 -9289132 -11065982 -4914540 1151449 -1953447 -10001340
7944 -10001340 -11214122 -3955995 1199622 -2385140 -8484203 -8598804 -3938109 -1269658
7936 -1269658 -1756285 -677646 3471302 6012738 3333463 -1541500 -3328447 -1805965
7928 -1805965 -1361721 -3848825 -5343211 -1660364 4988389 7742127 3408985 -3578512
7920 -3578512 -6674339 -4630403 -1421523 -235565 -496891 -764018 -1310820 -2216416 -1426985
7911 -1426985 2425674 6473128 6205755 1811755 -1233559 852423 5358228 7217046
7903 7217046 5483915 2943738 1312637 463363 1159479 4164899 6655516 4078324 -3160635
7894 -3160635 -8884351 -8878537 -5859922 -4524011 -5110370 -4901067 -3447425 -2991231 -5108401
7885 -5108401 -9134700 -12478988 -11502658 -4959649 2348560 3586683 -540658 -1598215
7877 -1598215 3956800 8355727 4293855 -3208723 -4832366 -1745712 -2235988 -6756987
7869 -6756987 -7953011 -4893351 -5050052 -10139513 -11946355 -6602195 -2018897 -4803490
7861 -4803490 -9431413 -8204713 -3835055 -3261927 -5454191 -4961477 -2872505 -4299748 -7805451
7852 -7805451 -6998689 -1480533 2584814 2512925 1636368 1616830 71936 -3029684 -3927021
7843 -3927021 -1940068 -1272457 -3579599 -4665253 -1565471 2206781 2033049 -1112972 -2898607
7834 -2898607 -1838742 -156209 -221754 -2447910 -5432978 -6740246 -4787419 -859719 1878692
7825 1878692 1480455 -1948230 -7554326 -13504010 -16482670 -14722292 -10955254 -8909724
7817 -8909724 -7727987 -4228427 57481 8608 -4168251 -5504995 -377732 5547695 5176700
7808 5176700 -728653 -6156709 -7979137 -7306570 -5871081 -5237559 -6953891 -9543402 -8125624
7799 -8125624 -1210593 5109007 4730857 546823 -141829 2841128 2892000 -1714305 -4220799
7790 -4220799 379084 7983472 11584881 9603823 4387787 -2700898 -9889462 -12600467
7782 -12600467 -8432398 -2651040 -2932751 -9150217 -13655398 -11837570 -7014995 -3708533
7774 -3708533 -1651904 613160 1052713 -2407901 -6900148 -8101795 -6960652 -7873778 -11010130
7765 -11010130 -11840400 -8627391 -4900823 -3007923 -692588 3143855 4636199 1355138
7757 1355138 -1893064 559604 6066474 7423957 4261669 3534455 8327783 13174908
7749 13174908 12646988 8549367 5393573 3810291 2349722 1674104 2534632 2554754 -612595
7740 -612595 -4989172 -6968262 -6405211 -5328630 -3544439 285036 4530014 5854104 4034370
7731 4034370 1911107 1199203 1712045 3589846 6370628 6948243 2975851 -2395903 -3980844
7722 -3980844 -2174539 -1650382 -2769025 -1081390 3452731 4292214 -1295410 -6624828 -5338097
7713 -5338097 -794900 303248 -1524968 -1661719 -992817 -3712254 -7705293 -6521514 -915632
7704 -915632 1058321 -2566912 -3600811 2643179 8249379 4308697 -4763488 -7249488
7696 -7249488 -1011794 4664921 3239757 -1663356 -4364561 -4979858 -5693265 -5058561 -852524
7687 -852524 4722283 7163415 5330013 1656440 -1818116 -4582473 -6093339 -6231967 -6666971
7678 -6666971 -9007987 -12116673 -13780702 -14288436 -15288676 -15626070 -12168290 -5435914 -541682
7669 -541682 -638692 -2662095 -2218270 -8578 219325 -1538347 -1311468 1958251 3560809
7660 3560809 -639550 -7821670 -11499141 -10042404 -8247776 -9915814 -12482260 -11417521
7652 -11417521 -7272230 -4374389 -3561214 -1121241 4000503 7021634 4586992 911878
7644 911878 1567681 4123458 1679002 -5243547 -7963510 -2420876 4531111 5322498 1886188
7635 1886188 377755 831498 -996161 -4666137 -5703183 -4347589 -6165454 -12620863
7627 -12620863 -17235009 -13758189 -3885976 5632913 10434883 11110061 10850936 12075437
7619 12075437 13716838 11835160 5119968 -1446256 -2370150 46306 -1170186 -6347691
7611 -6347691 -7986917 -2730138 2786840 1932050 -2612985 -4726689 -4290577 -4390408 -3754188
7602 -3754188 522124 5599068 5935342 2451735 1488142 4818438 7346230 5444451 1702880
7593 1702880 66894 1146514 3688061 6559357 8175755 7485131 5958796 5221162 3240336
7584 3240336 -2823091 -10614272 -14657037 -14261381 -13589710 -13617354 -10785842 -5165678 -2732996
7575 -2732996 -6081967 -9207989 -6153800 213724 3089135 1350229 -1001881 -2087295
7567 -2087295 -3420482 -5418043 -6368825 -5609628 -4417147 -3773919 -3298294 -2173625 -297800
7558 -297800 658144 -2222851 -9060856 -14421677 -12861420 -7090930 -4989540 -7713293 -7801249
7549 -7801249 -1641081 3974304 2590756 -1932310 -2944105 -2175187 -4951811 -8887010
7541 -8887010 -6981486 95171 4074067 1245158 -3439264 -5019771 -4303620 -3846102 -4006715
7532 -4006715 -4312436 -4385041 -3227912 -1228808 -1411349 -4298973 -4221343 3066394 11582642
7523 11582642 11579040 3297283 -3837265 -4717060 -2423545 794085 6311120 11957724 12508537
7514 12508537 9670027 11182048 16764123 16018457 5306419 -4512472 -4390987 -619799
7506 -619799 -2764414 -7409855 -5557443 627316 1603175 -2553913 -2149482 5356366 10545487
7497 10545487 6608485 -817675 -2513004 2382556 7741393 9459226 8870308 8827627 9210281
7488 9210281 6991589 986656 -4434996 -3599407 1968287 4204427 129007 -2972219
7480 -2972219 1301158 7777761 7139885 -239307 -6062863 -6955422 -6747335 -7208656 -5702176
7471 -5702176 -2743979 -3331830 -8530214 -12841573 -12484752 -10181340 -9261028 -8678691 -6600993
7462 -6600993 -4043350 -2336171 -1106148 -698251 -2564574 -5816622 -7560525 -7637788 -8424856
7453 -8424856 -9281781 -6807801 -1775509 443773 -1602875 -2908721 -717095 835863
7445 835863 -1381077 -3324822 -539291 4349873 6521956 6768771 8363616 9787156 7046733
7436 7046733 1020895 -3496695 -4749607 -4800832 -4534057 -2936068 -770213 -301948 -1391259
7427 -1391259 -1740290 -1016848 -1276113 -3206502 -5014296 -5291252 -4558725 -3780652 -3156626
7418 -3156626 -2340206 -695704 2043505 4609010 4956806 2773325 -511388 -4180589 -7684456
7409 -7684456 -7821115 -1544231 7062227 8702725 1115068 -6463916 -5703294 -345448 990377
7400 990377 -2268008 -4655751 -5343674 -7599805 -9812873 -6693439 612839 4447903 1797575
7391 1797575 -2313607 -3902535 -4741026 -6001152 -4837768 -430365 3212104 3823531 4270579
7382 4270579 6160512 6085040 2032556 -2006303 -2014904 262779 1388316 1445984 1545170 1001252
7372 1001252 743611 4120595 9951361 10710451 3372145 -3635497 -1492303 5790074 7569360
7363 7569360 2523524 -1007460 755029 2072377 -1889769 -7848517 -10155206 -7630602
7355 -7630602 -2391078 2934250 4979621 1753855 -3053130 -2797946 2881887 6337706
7347 6337706 2086249 -5687243 -9024843 -5964588 -997331 1392939 190405 -3218277
7339 -3218277 -6418908 -7170267 -5231850 -2337866 276966 2708092 4458016 4278152 2686893
7330 2686893 1838581 1975468 1125828 -601667 -142381 3239145 5501250 3303617 -1241048
7321 -1241048 -4063228 -4362157 -3383775 -1116009 2049750 2925270 -850653 -6115658 -6999931
7312 -6999931 -1889311 5215812 9313545 7944245 1840451 -4904191 -6777960 -2195998
7304 -2195998 4073710 6362394 4325359 1147715 -1771880 -4381562 -4689226 -1164714
7296 -1164714 2705383 1558437 -4281873 -9071094 -9460737 -7562527 -6266748 -6250737 -7963440
7287 -7963440 -11742413 -15061039 -14073400 -8905789 -3567392 -398875 997393 -369101
7279 -369101 -6085150 -12616653 -12994331 -6599279 -1294981 -2807031 -7498523 -8983580 -6453657
7270 -6453657 -2599026 1447442 4589676 3993962 -294668 -3177906 -1730642 -365860
7262 -365860 -3698487 -8613779 -9375554 -6718157 -5254260 -5110611 -3258042 -660275 -651338
7253 -651338 -1852674 -253419 2541871 727371 -6059384 -11686659 -12512361 -10481871 -6831570
7244 -6831570 -318277 6668771 7849379 2081713 -3595041 -3306158 687676 3472801
7236 3472801 4350954 4287435 1596135 -4684058 -10300932 -9619926 -2668771 4803014 7242564
7227 7242564 3490498 -3244392 -8146914 -9109007 -8728912 -10013305 -11109858 -8427147 -4157126
7218 -4157126 -4439738 -9073151 -10060989 -3395363 4327095 5521340 2079579 700489 2419628
7209 2419628 3152389 1662973 616371 961307 559595 -1925513 -5509238 -8693342 -10151613
7200 -10151613 -8904105 -5997849 -4077432 -3483979 -1736814 1225874 1515504 -2085953
7192 -2085953 -4717093 -2773264 -49470 -1528307 -5296861 -6400875 -4997813 -4526796
7184 -4526796 -5130003 -5262997 -6541923 -10156531 -11779072 -7687122 -2867522 -4403394 -9368395
7175 -9368395 -9051232 -3609386 -1615424 -4977050 -5848080 -696002 3848881 3196065 2331876
7166 2331876 5586476 8194400 4883087 -813951 -3038788 -2989040 -4474807 -5512552 -2061175
7157 -2061175 3647279 5619179 2389660 -2742848 -6840209 -7817090 -3612205 3846918
7149 3846918 7851447 5617550 3274631 5871578 7651763 860593 -9948284 -12911603
7141 -12911603 -6419095 -812033 -2046659 -4341974 -1906037 1770933 1368673 -1117864
7133 -1117864 -781951 1701737 1758898 -2058986 -7337004 -11634920 -13370302 -11358119 -7131385
7124 -7131385 -5606591 -9731677 -15815016 -17376500 -12640531 -5501340 -191706 2015496
7116 2015496 1407351 -1633888 -5839463 -8705730 -8209584 -4634271 -504439 1260467 -404921
7107 -404921 -3888248 -6473240 -6760855 -5366880 -3765334 -3150773 -3901001 -5186203 -5517579
7098 -5517579 -4491384 -3231951 -2277255 -460589 2590233 4483673 2909241 -833988
7090 -833988 -3718965 -5201825 -6719925 -8242047 -8656734 -8483574 -8476244 -6711714 -1566365
7081 -1566365 3425305 3265157 -145285 309798 5979262 10024375 8321237 5741925 7419034
7072 7419034 10073304 7706570 1174699 -3941363 -5482027 -4943248 -2670993 1153072
7064 1153072 3135485 389763 -3986610 -4815419 -2694384 -2362176 -4822642 -7076389 -8208726
7055 -8208726 -9114354 -7268699 591180 10347403 12963614 6855002 591740 677223 3391279
7046 3391279 2259347 -2463721 -6124795 -6763834 -5623578 -4147212 -3831070 -5686410 -7336848
7037 -7336848 -4743056 811502 2590080 -1546939 -4650120 -773854 5929315 7977682
7029 7977682 5567647 3933155 3498386 465697 -4832603 -7923121 -7977625 -8623797 -10728720
7020 -10728720 -10694250 -6880667 -2375306 -295493 -736168 -2854110 -5688870 -6723958 -3932278
7011 -3932278 689155 3652331 5222945 7428700 8285459 4397089 -1344042 -2186377 1577391
7002 1577391 1994446 -4085112 -9689209 -8457249 -3621423 -1657294 -3047634 -4430110
6994 -4430110 -4683390 -3673396 293114 6405916 9202808 6080894 2670282 4594787
6986 4594787 8006273 5600233 -1022236 -3135048 2228952 8912061 11089291 8965686
6978 8965686 4417812 -2086389 -8378686 -10470662 -8217143 -6424082 -7830293 -9099750
6970 -9099750 -6329973 -854806 3315565 4942055 5464984 5427800 3835631 340343 -3782954
6961 -3782954 -6643359 -7117313 -5786646 -4541922 -4439753 -4374176 -3008807 -1200175 -803951
6952 -803951 -1863358 -2920060 -3273168 -2792638 -550881 3649572 7163420 6863926 3241517
6943 3241517 -455875 -2416157 -2779694 -1184049 2426812 5281086 4328901 1212190 402778
6934 402778 2220608 2327821 -1083694 -4451927 -4855155 -4412839 -6313102 -10048962 -13022604
6925 -13022604 -13918183 -12370790 -8101524 -2489169 1387918 2020600 732586 -1090437
6917 -1090437 -3243946 -4624696 -3563090 -1280384 -1124996 -3135558 -3706924 -2201668 -2797866
6908 -2797866 -7154540 -10466535 -8606735 -4467597 -2653423 -2104192 640312 4261875
6900 4261875 4825690 3104434 3776654 8009784 12017679 13054288 12634758 13411648 15840533
6891 15840533 17914512 16290922 9136262 -48657 -4075330 -647950 3709028 2364413
6883 2364413 -2031539 -2370364 1451482 2954521 -42596 -2485212 -1008598 1011907
6875 1011907 -288099 -3457160 -5049975 -4500945 -2921538 -444956 2703410 5117982
6867 5117982 6080097 6284082 5776905 3832006 1320557 -141555 -1764979 -6070376 -11002439
6858 -11002439 -10706724 -4323479 1173460 417994 -2635188 -1054828 4526587 7299689
6850 7299689 4539614 909481 1163096 3894878 4228435 397735 -4073031 -4413934 -375501
6841 -375501 2706420 -68231 -6531564 -9599066 -6518057 -2223930 -1533375 -2129508 671353
6832 671353 5354600 6065085 1934068 -1409845 -615605 474990 -2636924 -7845571 -9764797
6823 -9764797 -7979014 -7319407 -10070536 -12234355 -9473146 -3737539 -650771 -1484221 -1628538
6814 -1628538 2145473 6505956 6200639 1383111 -3226259 -5085756 -5499511 -4764722 -591760
6805 -591760 6697628 11479086 8770685 736362 -5762015 -6687066 -3381635 783508 3213124
6796 3213124 2445470 -985800 -3812844 -2615751 2318828 7227016 8879921 6938422
6788 6938422 2862937 -1539490 -4628658 -5886341 -6513420 -7804849 -9408759 -10593023
6780 -10593023 -12048967 -14051545 -13932473 -8908482 -1427512 2044480 -1346497 -7631799
6772 -7631799 -11699455 -12797917 -12434566 -10341603 -5970987 -1684155 -564842 -2088552
6764 -2088552 -3364562 -3896866 -5532428 -7948158 -8087632 -4952038 -1591208 -861103 -1966622
6755 -1966622 -2935055 -4046313 -6529961 -9541058 -10816015 -9549116 -6862973 -4089889
6747 -4089889 -1954871 -651737 544652 2850368 6003532 7865066 7186238 5312510
6739 5312510 3681098 1439193 -2410089 -6360400 -8494074 -9360872 -9576341 -6559065 1734311
6730 1734311 10836886 13027541 7201987 415640 -1728216 -1152995 -1767105 -3148424 -3213752
6721 -3213752 -2746814 -3103584 -2893093 -1068890 -8273 -1083238 -609592 4284522 8703525
6712 8703525 5690443 -2621279 -6976987 -4352078 -1919359 -5595911 -11343275 -11749132
6704 -11749132 -6294107 -481165 2078837 2242084 1734204 973817 214521 270210 1841591
6695 1841591 4972810 8552751 10173094 8219917 4600700 3173612 4636101 5537097
6687 5537097 3665992 1588270 2643707 5858711 7635432 6859153 5436893 4721427 4165059
6678 4165059 3196567 2079507 871840 -572183 -1430046 -416523 2076060 3521415 1640725
6669 1640725 -3058648 -7311099 -7691267 -3631350 1801111 4395740 2424456 -2015583
6661 -2015583 -4929197 -3760424 291350 3098964 2126955 379414 3280406 10381273
6653 10381273 13835574 8553633 490720 -686227 4859603 7843875 3927411 -587641
6645 -587641 663382 4960189 6088424 3440510 587876 -981886 -1752250 -1249488 48792
6636 48792 -894292 -4633989 -6021659 -1512684 3607392 2084940 -3479147 -3557606 3873208
6627 3873208 9918473 7740139 1900638 1038004 6374323 11926167 12940242 9849678
6619 9849678 5411063 1592782 -683639 -934468 927759 4209825 7111046 7695619 6203502
6610 6203502 5334021 6624349 7814599 6139461 2952607 1840576 2873510 2570950 -267535
6601 -267535 -2631556 -2203131 -654899 -503228 -1624833 -2622479 -3176696 -3319078 -2461350
6592 -2461350 -788672 76953 -873762 -2776031 -4375446 -4919893 -3102674 2254415 9200299
6583 9200299 12734398 9670907 2015145 -5384645 -8829074 -7126546 -1863011 2560992
6575 2560992 2208187 -1291796 -1735050 3539608 9498293 10026145 5762867 1759807 -248806
6566 -248806 -2537202 -5287344 -4850186 621362 7324773 9663738 6256696 705232 -2548059
6557 -2548059 -2097337 120616 1693432 2613648 4613874 7558496 8323724 4784130 -615785
6548 -615785 -3587497 -3369737 -2791864 -3585869 -4745571 -5635160 -7251804 -9264636 -9088104
6539 -9088104 -5891416 -2638313 -1525255 -106895 4325356 8544597 6602505 -955716
6531 -955716 -6310957 -4368999 1077511 3804620 3488834 3631088 4682787 4511096 3558633
6522 3558633 3576643 2138147 -4906522 -14742655 -18282053 -12280108 -4571721 -3203576 -5944303
6513 -5944303 -5965179 -3171516 -2957897 -6597300 -10214297 -12071719 -13756641 -14368210 -10735338
6504 -10735338 -4463064 -1902667 -4941342 -7964467 -6632470 -3699660 -2635626 -1350435
6496 -1350435 2720550 6027715 3546570 -2754134 -6040232 -3917053 -396965 817912
6488 817912 228659 -411525 -806057 -1167798 -1637450 -3095259 -6035817 -8703869 -8913953
6479 -8913953 -7353747 -6184373 -4846460 -926747 4601981 7095558 4604668 938442
6471 938442 192503 1175712 105186 -3222819 -5205525 -3617150 -233427 1773901 1006732
6462 1006732 -1829018 -5068488 -7084191 -7329705 -6768078 -6368180 -5247651 -1765548 3260481
6453 3260481 6309123 5354391 2781239 2249132 3699604 3895743 1526501 -1103966 -2007935
6444 -2007935 -2128136 -2472791 -1455540 2195499 5795128 5287680 761321 -3620475 -4971029
6435 -4971029 -4209583 -3292211 -2755895 -2471672 -2303127 -1374802 1077551 3607415 3584343
6426 3584343 904607 -1550119 -1705967 -311135 1169451 2020087 1194217 -2119800 -5957440
6417 -5957440 -6869988 -5001852 -4395410 -6544967 -7487026 -4003071 847193 2012554 -374837
6408 -374837 -1895803 22067 4435542 9566967 13439978 13381846 8948166 4474622 4761076
6399 4761076 8541770 9851046 5770667 -512105 -4291238 -3746114 227156 5314414
6391 5314414 8519098 8352592 6534103 5243901 3442145 -960028 -6193471 -8166390
6383 -8166390 -6785319 -5963777 -6576939 -4647120 1296165 6108656 5032068 956040 88271
6374 88271 2830998 3988512 1188810 -1799813 -975255 2536640 4850641 4462770 2755192
6365 2755192 771184 -2000970 -5558408 -8083768 -7884625 -5726847 -3855987 -2998380 -1926107
6356 -1926107 -196766 668205 -69867 -208251 2760364 7792316 11167663 10782894 7796790
6347 7796790 4592742 3025607 3942974 5991464 5373796 -345356 -8142655 -12100525 -10330199
6338 -10330199 -6344318 -3193689 14677 4390820 7888232 8258043 6484802 4524665
6330 4524665 2202926 -636530 -1550130 919256 3037837 170322 -5404187 -6295387 -558065
6321 -558065 4644420 2492767 -4483350 -8518881 -6821236 -3241905 -1317143 -641048 -441709
6312 -441709 -1984827 -5350652 -7436506 -6103144 -3820658 -3983198 -5484164 -4696792 -1712697
6303 -1712697 -257099 -1313929 -1300658 2021672 5711190 5783193 1919800 -4020403 -10622912
6294 -10622912 -15283092 -13857667 -6314221 269643 -375651 -4820352 -4863860 -93196 1699828
6285 1699828 -2506434 -5270729 119408 8778973 10408958 3077402 -5141245 -7150629
6277 -7150629 -4084023 -1155059 -854428 -2334266 -4669095 -7759682 -10464267 -10105198 -5198596
6268 -5198596 1723497 5557314 3859529 -333263 -2270222 -1110928 245321 140047
6260 140047 -35500 892423 2107328 3238221 5296634 7611406 7121458 3138648 -137323
6251 -137323 992946 4138952 4169833 458678 -3073378 -4078717 -3767610 -3003508 -797015
6242 -797015 2313023 3345048 1379450 -149423 1649855 4198141 2700822 -2693019
6234 -2693019 -6457183 -4795477 -110844 3123255 4328083 5769478 7074871 5066078
6226 5066078 -113767 -2865682 896630 7503383 10224187 8408980 7157600 8540215
6218 8540215 8813727 5627759 2462139 2847389 4655518 4091257 1888727 1126427 1512846
6209 1512846 542839 -1523174 -2573462 -3081757 -4625198 -5036777 -772822 5801854 7485277
6200 7485277 2122571 -3975338 -4825734 -2011349 -19089 957943 3087631 5249906 4725584
6191 4725584 2943928 4273387 8993496 11856407 8817312 2140408 -2493134 -1888636
6183 -1888636 2487373 6305758 5583532 17641 -5848850 -6430782 -1248192 4083893 4193484
6174 4193484 -50103 -3336433 -2443721 1166150 4630352 6791607 7247877 4711577 -1517482
6165 -1517482 -9248108 -14517568 -15116872 -11876609 -6822711 -1776355 1194216 324468 -3341084
6156 -3341084 -5583135 -3297883 1363525 3125533 -139980 -5173650 -7827915 -7860321 -7873058
6147 -7873058 -8891153 -9246871 -7846227 -6403918 -7098603 -9119188 -9410062 -6829988 -3681716
6138 -3681716 -2180135 -1119953 1878136 5659450 5929636 1076596 -4801193 -6374023
6130 -6374023 -3082421 1155994 3092176 2781935 1563020 -109494 -2074510 -3385278
6122 -3385278 -3024517 -1176145 816191 1539091 551811 -1172184 -1896411 -768257 1236458
6113 1236458 2437313 2135238 542273 -2273774 -5966309 -8590543 -7472238 -2310327
6105 -2310327 3544561 6015651 4377280 1797259 1713062 3967203 4892498 1472118 -4862919
6096 -4862919 -9298969 -8583587 -4068741 386424 2314492 1737802 -178577 -1937082 -1881316
6087 -1881316 668947 4369565 6928830 7036121 4597041 77461 -5061620 -8285486
6079 -8285486 -8132644 -5730061 -2500135 2328645 9268893 14842083 14307508 8357844 3023816
6070 3023816 1705264 1337885 -1416678 -4324272 -3627407 -807921 -488341 -3060918 -4404741
6061 -4404741 -2910565 -1983895 -4171078 -6869653 -6415495 -3560421 -1765125 -1646461 -492878
6052 -492878 2751649 4897339 2300147 -4030386 -8712387 -7608393 -2418166 1113122
6044 1113122 -362725 -4108360 -5014195 -2268050 -310398 -2662632 -6978380 -8109535
6036 -8109535 -4765347 -551812 1292292 1339100 1425145 1487664 858053 499272 1239033 1245396
6026 1245396 -1479468 -4854301 -4772121 -1538314 -13880 -2050558 -3303675 -361462 3266211
6017 3266211 2687076 -293826 -400885 1957383 1627216 -1587215 -1638584 3574668 7943940
6008 7943940 6794968 4420298 6594650 10663310 9828726 4092350 -259284 -556612 -98072
5999 -98072 -924938 -1185206 -677582 -2471965 -6805908 -9065600 -6718730 -3364044 -2740028
5990 -2740028 -3172666 -1508973 1488028 3582027 5238529 7104371 6657540 2173281 -2753518
5981 -2753518 -3840395 -2975855 -4796541 -8188177 -7660976 -2704814 844076 -432397 -3559362
5972 -3559362 -5398296 -6813298 -8311749 -7313501 -3119001 296738 24013 -1744900 -2998578
5963 -2998578 -6178156 -12282890 -15576705 -10911870 -3030872 -934738 -4587667 -5289892
5955 -5289892 531968 6096374 5177135 914363 -543596 484277 -412850 -3503984 -4930704
5946 -4930704 -3499791 -2177667 -2615776 -2420138 770883 5276931 7213793 5026254 843268
5937 843268 -2072258 -2133814 165577 3431906 5943142 5651913 1655485 -3505211 -5094422
5928 -5094422 -1807213 1423429 -837139 -6947090 -10063710 -7640863 -4808983 -6661956
5920 -6661956 -11001061 -11811292 -7554892 -2539513 -872386 -1937310 -2131726 592619 4467117
5911 4467117 5794882 3105899 -1023286 -3130719 -2868922 -1916605 -97514 3817584 7647042
5902 7647042 6805516 1248755 -3116057 -2565072 -889377 -3006014 -6975098 -7110468 -2626081
5893 -2626081 1763311 2624900 664156 -2524092 -6273869 -9349906 -10146749 -8733415 -6318875
5884 -6318875 -3226541 298407 2620034 2954841 3514648 5949254 7284640 3641783 -3158610
5875 -3158610 -7350929 -6993653 -5322387 -4724367 -4394951 -4215986 -5813875 -8757976 -10326428
5866 -10326428 -10076591 -10173581 -10330996 -7417318 -1493982 2864148 3312168 2966642 4565274
5857 4565274 6117678 5148832 2893914 1308979 -7359 -1079980 -85797 2272970 1528152
5848 1528152 -3593938 -7403415 -4898328 835978 3648942 2820319 1181850 -1340763
5840 -1340763 -5598773 -7451333 -1837348 8169623 13610224 11386818 7251450 6106995
5832 6106995 5921290 3690832 1502890 2546149 4945023 4014719 -1025178 -6034102 -7033264
5823 -7033264 -3920721 647129 4149440 5418015 4070549 231851 -4387632 -6266767
5815 -6266767 -3309606 1474099 2274315 -2429623 -7952467 -10068875 -9928774 -9603367 -6945302
5806 -6945302 96874 6983598 6790278 125940 -5135230 -4312720 -535728 1942699 3375505
5797 3375505 5361662 6978607 7072437 6813034 7103660 6350249 3508045 879778 1200060
5788 1200060 3785130 5890755 6353238 5926345 5420805 5227865 5455292 5274061 3548914
5779 3548914 1073337 238692 1278831 1121023 -2166414 -5881729 -6182243 -3706501 -2809753
$$ [...]
##END NTUPLES=NMR SPECTRUM
##END=
