##TITLE=31Pdec_SRR167_C_TFA
 CDCl3 64 sc
 4.9.2023
##JCAMPDX= 6.0         $$ Bruker NMR JCAMP-DX V2.0
##DATA TYPE= NMR SPECTRUM
##DATA CLASS= NTUPLES
##ORIGIN= UXNMR, Bruker Analytische Messtechnik GmbH
##OWNER= root
$$ XWIN-NMR		Version 3.5
$$ Mon Sep  4 14:25:23 2023 Russian Standard Time (UT+4h)  she@DPX200
##.OBSERVE FREQUENCY= 81.013821
##.OBSERVE NUCLEUS= ^31P
##.ACQUISITION MODE= SIMULTANEOUS
##.ACQUISITION SCHEME= undefined
##.AVERAGES= 64
##.DIGITISER RES= 16
##SPECTROMETER/DATA SYSTEM= spect
##.PULSE SEQUENCE= zgpg30
##.SOLVENT NAME= DMSO
##.SHIFT REFERENCE= (INTERNAL, DMSO, 0, 248.564)
##AUDIT TRAIL= $$ (NUMBER, WHEN, WHO, WHERE, WHAT)
$$ ##TITLE= Audit trail, XWIN-NMR		Version 3.5
$$ ##JCAMPDX= 5.01
$$ ##ORIGIN= Bruker BioSpin GmbH
$$ ##OWNER= she
$$ F:/spectra/data/she/nmr/P31/1/pdata/1/auditp.txt
$$ ##AUDIT TRAIL=  $$ (NUMBER, WHEN, WHO, WHERE, WHAT)
(   1,<2023-09-04 14:24:24.31 +0400>,<she>,<DPX200>,
      <continue with go, POWCHK disabled, PULCHK disabled
       configuration hash MD5:
       00 E9 B6 7A A2 85 ED C7 34 08 36 98 17 FE 4E 26
       data hash MD5: 32K
       C3 45 3C B6 4F 8B 9F 15 68 E0 5B 71 2F BA E8 82>)
(   2,<2023-09-04 14:24:27.40 +0400>,<she>,<DPX200>,
      <Start of raw data processing
       efp BC_mod = 2 LB = 5 FT_mod = 6 PKNL = 1 PHC0 = -10614.64 PHC1 = -13.31499 SI = 64K 
       data hash MD5: 64K
       34 4A FF 46 73 43 67 5C 02 E0 BA 3A 8A 3A 37 E1>)
(   3,<2023-09-04 14:24:47.37 +0400>,<she>,<DPX200>,
      <pk PHC0 = 0.4022838 PHC1 = 0 
       data hash MD5: 64K
       25 27 DE A1 AB 7C 08 C4 16 4D B5 47 5B BD 69 C9>)
(   4,<2023-09-04 14:24:52.98 +0400>,<she>,<DPX200>,
      <abs ABSG = 5 
       data hash MD5: 64K
       4C 00 18 6B C4 8F 5E 10 8D EB 52 33 B9 DF 94 17>)
$$ ##END=
$$ 
$$ hash MD5
$$ 19 88 AB 09 FB 00 E6 14 A9 B8 30 D6 07 B1 40 9C
##$RELAX= 
##$RELAX= 
##$RELAX= 
##$RELAX= 
##$RELAX= 
##$RELAX= 
##$RELAX= 
##$RELAX= 
##$RELAX= 
$$ Bruker specific parameters
$$ --------------------------
##$DU= <F:/spectra>
##$EXPNO= 1
##$NAME= <P31>
##$PROCNO= 1
##$TYPE= <nmr>
##$USER= <she>
##$AMP= (0..31)
100 100 100 100 100 100 100 100 100 100 100 100 100 100 100 100 100 100 
100 100 100 100 100 100 100 100 100 100 100 100 100 100 
##$AQSEQ= 0
##$AQ_mod= 1
##$AUNM= <au_zg>
##$AUTOPOS= <>
##$BF1= 81.014009
##$BF2= 200.13
##$BF3= 200.13
##$BF4= 200.13
##$BF5= 200.13
##$BF6= 200.13
##$BF7= 200.13
##$BF8= 200.13
##$BYTORDA= 1
##$CFDGTYP= 0
##$CFRGTYP= 5
##$CHEMSTR= <none>
##$CNST= (0..31)
1 1 145 1 1 1 1 1 1 1 1 1 1 1 1 1 1 1 1 1 1 1 1 1 1 1 1 1 1 1 1 1 
##$CPDPRG= <waltz16>
##$CPDPRG1= <>
##$CPDPRG2= <waltz16>
##$CPDPRG3= <>
##$CPDPRG4= <mlev>
##$CPDPRG5= <mlev>
##$CPDPRG6= <mlev>
##$CPDPRG7= <mlev>
##$CPDPRG8= <mlev>
##$CPDPRGB= <>
##$CPDPRGT= <>
##$D= (0..31)
0 1 0 0 0 0 0 0 0 0 0 0.03 2e-05 3e-06 0 0 0 0 0 0 0 0 0 0 0 0 0 0 0 0 
0 0 
##$DATE= 1693822980
##$DBL= (0..7)
120 120 120 11 120 120 24 19 
##$DBP= (0..7)
150 150 150 150 150 150 150 150 
##$DBP07= 0
##$DBPNAM0= <>
##$DBPNAM1= <>
$$ [...]
##$SUBNAM3= <"">
##$SUBNAM4= <"">
##$SUBNAM5= <"">
##$SUBNAM6= <"">
##$SUBNAM7= <"">
##$SUBNAM8= <"">
##$SUBNAM9= <"">
##$SW= 501.771253377433
##$SWIBOX= (0..15)
0 1 3 0 0 0 0 0 0 0 0 0 0 0 0 0 
##$SW_h= 40650.406504065
##$TD= 32768
##$TD0= 1
##$TE= 0
##$TE2= 300
##$TE3= 300
##$TEG= 300
##$TL= (0..7)
0 120 53 12 22 120 120 120 
##$TP= (0..7)
150 150 150 150 150 150 150 150 
##$TP07= 0
##$TPNAME0= <>
##$TPNAME1= <>
##$TPNAME2= <>
##$TPNAME3= <>
##$TPNAME4= <>
##$TPNAME5= <>
##$TPNAME6= <>
##$TPNAME7= <>
##$TPOAL= (0..7)
0.5 0.5 0.5 0.5 0.5 0.5 0.5 0.5 
##$TPOFFS= (0..7)
0 0 0 0 0 0 0 0 
##$TUNHIN= 0
##$TUNHOUT= 0
##$TUNXOUT= 0
##$USERA1= <user>
##$USERA2= <user>
##$USERA3= <user>
##$USERA4= <user>
##$USERA5= <user>
##$V9= 5
##$VALIST= <valist>
##$VCLIST= <CCCCCCCCCCCCCCC>
##$VD= 0
##$VDLIST= <DDDDDDDDDDDDDDD>
##$VPLIST= <PPPPPPPPPPPPPPP>
##$VTLIST= <TTTTTTTTTTTTTTT>
##$WBST= 1024
##$WBSW= 4
##$XGAIN= (0..3)
0 0 0 0 
##$XL= 0
##$YL= 0
##$YMAX_a= 3885
##$YMIN_a= -8698
##$ZGOPTNS= <>
##$ZL1= 120
##$ZL2= 120
##$ZL3= 120
##$ZL4= 120
##$ABSF1= 248.5645
##$ABSF2= -253.2056
##$ABSG= 5
##$ABSL= 3
##$ALPHA= 0
##$AQORDER= 0
##$ASSFAC= 0
##$ASSFACI= 0
##$ASSFACX= 0
##$ASSWID= 0
##$AUNMP= <proc_1d>
##$AZFE= 0.1
##$AZFW= 0.5
##$BCFW= 0
##$BC_mod= 2
##$BYTORDP= 0
##$COROFFS= 0
##$CY= -3
##$DATMOD= 1
##$DC= 0
##$DFILT= <>
##$DTYPP= 0
##$F1P= 0
##$F2P= 0
##$FCOR= 1
##$FTSIZE= 65536
##$FT_mod= 6
##$GAMMA= 0
##$GB= 0
##$INTBC= 1
##$INTSCL= 6.047779e-11
##$ISEN= 30
##$LB= 5
##$LEV0= 0
##$LPBIN= 0
##$MAXI= 10000
##$MC2= 0
##$MEAN= 0
##$ME_mod= 0
##$MI= 50
##$NCOEF= 0
##$NC_proc= -9
##$NLEV= 6
##$NOISF1= 182.463
##$NOISF2= 159.3651
##$NSP= 0
##$NTH_PI= 0
##$NZP= 0
##$OFFSET= 248.5645
##$PC= 4
##$PHC0= -10614.24
##$PHC1= -13.31499
##$PH_mod= 1
##$PKNL= yes
##$PPARMOD= 0
##$PSCAL= 0
##$PSIGN= 0
##$REVERSE= no
##$SF= 81.0140089999694
##$SI= 65536
##$SIGF1= 159.3651
##$SIGF2= -187.1042
##$SINO= 113.3802
##$SIOLD= 16384
##$SREGLST= <1H.CDCl3>
##$SSB= 0
##$STSI= 65536
##$STSR= 0
##$SW_p= 40650.406504065
##$SYMM= 0
##$S_DEV= 0
##$TDeff= 32768
##$TDoff= 0
##$TI= <>
##$TILT= no
##$TM1= 0
##$TM2= 0
##$TOPLEV= 0
##$USERP1= <user>
##$USERP2= <user>
##$USERP3= <user>
##$USERP4= <user>
##$USERP5= <user>
##$WDW= 1
##$XDIM= 65536
##$YMAX_p= 326727355
##$YMIN_p= -329281871
$$ End of Bruker specific parameters
$$ ---------------------------------
##NTUPLES= NMR SPECTRUM
##VAR_NAME=  FREQUENCY,     SPECTRUM/REAL,   SPECTRUM/IMAG
##SYMBOL=    X,             R,               I
##VAR_TYPE=  INDEPENDENT,   DEPENDENT,       DEPENDENT
##VAR_FORM=  AFFN,          ASDF,            ASDF
##VAR_DIM=   65536,         65536,           65536
##UNITS=     HZ,            ARBITRARY UNITS, ARBITRARY UNITS
##FACTOR=    0.620285442955139, 1,           1
##FIRST=     20137.2065510682, 0,            0
##LAST=      -20513.1999529968, 0,           0
##MIN=       -20513.1999529968, -329281871,  0
##MAX=       20137.2065510682, 326727355,    0
$$ Real data points
##PAGE= N=1
##DATA TABLE= (X++(R..R)), XYDATA
$$ [...]
43093a3812063q67747o33110m33915j86971K66721Q35348J186735J167208J048655
43084a1429139J197885J594629J876393J826198J574468J252365O96175k78534
43076a689560j415973k091113j893898r98647R1625J021028J701259K082338K017083
43067a175858J426715N03793l69837r37254j255541j534916j812340j852392j415343
43058h422973n92310J99266N92096O20872O66593J048341J688610K185957K190175
43049A76627J674742Q63786j5600q36151j486200j828096j793085j426298p80710
43040e450985J24808J132991J845222J910512J441536R65751Q91149J147508J396374
43031E404866J401455J068256L24178p75816j887289k568825k663554k334139
$$ y = [-13812063, -14679810, -15312920, -15746835, -15933806, -15667085, -14831737, -13645002, -12477794, -11429139, -10231254, -8636625, -6760232, -4934034, -3359566, -2107201, -1411026, -1689560, -3105533, -5196646, -7090544, -8089191, -7997566, -6976538, -5275279, -3192941, -1175858, 250857, 754650, 384813, -552441, -1807982, -3342898, -5155238, -7007630, -8422973, -9015283, -8816017, -8223921, -7603049, -6936456, -5888115, -4199505, -2013548, 176627, 1851369, 2715155, 2699555, 1863404, 377204, -1450892, -3243977, -4670275, -5450985, -5326177, -4193186, -2347964, -437452, 1004084, 1969835, 2860984, 4008492, 5404866, 6806321, 7874577, 8198755, 7422939, 5535650, 2966825, 303271, -2030868]
43023b030868j761632j039810l61104J00K5908M3051L01786O56079Q44104Q94089
43013b428297J007246J192605J322398J465067J813859K256946K346485J828128
43005A0804437R76413K79345k6143j3442J03606L4575m81844j393596k269483
42996H013868k735788k889932l052687l181679k821965j689048o8337J455829
42988f969739K472206K832757K497478J576377N05592q9959J03377P66093J236763
42979D930945J135819O33972J10633l18895q27506j506967k153140k460969k300593
42970b756701j720776p92079M10046J684871K683060L057572K655832J628465
42962F850290L92676n88555j106932j312209j484535j719145j854677j654987
$$ y = [-2030868, -3792500, -4832310, -5193414, -5193314, -5167406, -5124355, -4822569, -4166490, -3322386, -2428297, -1421051, -228446, 1093952, 2559019, 4372878, 6629824, 8976309, 10804437, 11780850, 12060195, 12034052, 12020610, 12124216, 12158791, 11676947, 10283351, 8013868, 5278080, 2388148, -664539, -3846218, -6668183, -8357231, -8425568, -6969739, -4497533, -1664776, 832702, 2409079, 2914671, 2824712, 2928089, 3694182, 4930945, 6066764, 6700736, 6811369, 6492474, 5664968, 4158001, 2004861, -456108, -2756701, -4477477, -5269556, -4859510, -3174639, -491579, 2565993, 5221825, 6850290, 7242966, 6654411, 5547479, 4235270, 2750735, 1031590, -823087, -2478074]
42954b478074j008348q849J060925J833381K025878J576044O75564k68179p82064
42945B626278o67911l01400m08577j331551k572771l238928k901542j877323p45540
42936a1419265J60195P63556J022959Q87499M08403k08618o59499o77205k19174
42927i941149M50288R43295J038376P56321K33005l35878o81555o26749l19324
42918h483370j13448j38042j54730O0019L68755M57643K37901r9763l47050m36697
42908h648782l89540k51274p7963J07717L31452N83090P77148Q75325R82141J217089
42898d493597J535958J770212J792729J552019J020825K70751m24883p48034o69519
42889A606461n08324n57420p08456n59810Q7824R24025J383827J193283N97106
$$ y = [-2478074, -3486422, -3495271, -2434346, -600965, 1424913, 3000957, 3676521, 3408342, 2626278, 1958367, 1656967, 1248390, -83161, -2655932, -5894860, -8796402, -10673725, -11419265, -11259070, -10495514, -9472555, -8585056, -8176653, -8385271, -9044770, -9721975, -9941149, -9490861, -8547566, -7509190, -6752869, -6519864, -6855742, -7537297, -8164046, -8483370, -8596818, -8734860, -8889590, -8829571, -8460816, -8003173, -7765272, -7865035, -8212085, -8648782, -9038322, -9289596, -9367559, -9259842, -8928390, -8345300, -7568152, -6692827, -5710686, -4493597, -2957639, -1187427, 605302, 2157321, 3178146, 3448897, 3024014, 2275980, 1606461, 1098137, 540717, -167739, -727549, -639725, 284300, 1668127, 2861410, 3458516]
42880C458516M8501k18779k53818j60449K5733K85087O20379J099395J692731
42871F597296K066875J808307R77927K12731O9679L98955N51896J04475p98821
42862A1989320j702020k208841k152579j635807r52208l51103J27007N25680Q03523
42853D442972R43068J102153J407959J656687J510934J037866P75236J122015
42845A3998890J834996K261944J966893J051747k62o94019q58635p56736q15894
42836A7988924j166481j482374j327018o08263L32004R98849J088152O62564O2331
42827A6548688m18830q04900j305935j904922k243639k046831j542339j260545
42819E020747j409052j603420j305219m60905L90082O49657K30611m52555r79703
$$ y = [3458516, 3507017, 3288238, 3034420, 2873971, 2899704, 3184791, 3805170, 4904565, 6597296, 8664171, 10472478, 11450405, 11663136, 11732815, 12131770, 12683666, 12788141, 11989320, 10287300, 8078459, 5925880, 4290073, 3337865, 2986762, 3113769, 3639449, 4442972, 5386040, 6488193, 7896152, 9552839, 11063773, 12101639, 12876875, 13998890, 15833886, 18095830, 20062723, 21114470, 21114208, 20420189, 19561554, 18804818, 17988924, 16822443, 15340069, 14013051, 13404788, 13736792, 14735641, 15823793, 16486357, 16548688, 16129858, 15324958, 14019023, 12114101, 9870462, 7823631, 6281292, 5020747, 3611695, 2008275, 703056, 242151, 632233, 1281890, 1512501, 1059946, 80243]
42810H0243j259095j361922j250365q61035l43317K9623J83467K73108L75987
42801d133306L70004J82984l5613j04096j8492J34144L35019N91583Q47346J021263
42791h09164J010374N93560m34231j836231k836764k760839j743270n72623J38122
42782i251066L80969L76460J18582m96805j269257j681242j326470k73746R82307
42773a2440268J874205K102800J743366J102065M88733Q3872p7398p9649o4737
42764e267011j00709p4326K36644R33519J835665K560014K771758K386738J569379
42755F851671N67477m21458j231936j687193j715321j516276j470210j787938
42747b411184k318469k753484k919506k787649k331484j565445o87058J1232M23150
$$ y = [80243, -1178852, -2540774, -3791139, -4652174, -4995491, -4965868, -4782401, -4509293, -4133306, -3763302, -3580318, -3615931, -3720027, -3738519, -3604375, -3269356, -2677773, -1830427, -809164, 201210, 794770, 360539, -1475692, -4312456, -7073295, -8816565, -9389188, -9251066, -8870097, -8493637, -8375055, -8871860, -10141117, -11822359, -13148829, -13422575, -12440268, -10566063, -8463263, -6719897, -5617832, -5129099, -5045227, -5122625, -5202274, -5267011, -5367720, -5442046, -5205402, -4271883, -2436218, 123796, 2895554, 5282292, 6851671, 7419148, 6997690, 5765754, 4078561, 2363240, 846964, -623246, -2411184, -4729653, -7483137, -10402643, -13190292, -15521776, -17087221, -17774279, -17763047, -17339897]
42738a7339897P08881J058810J470793J786497J843449J544369Q80312j1874q37239
42729h895899j265088j117868m93314K56692P11222O51939K07988k73269m84664
42720a0702261k88794K94374J085824J766079K069721K022727J880587J788348
42712h3395J614343J170036M63801l48192j126479j720048j881093j427456n16162
42703c854645L95121R23155J024219Q81310O52388L98572J65642J3675m3664p6043
42693D79730j92428m51440p79928r73218q36570l76357J75242N53853O33220L71420
42683a396476k96851j339478k397723k882772k468611j447355m78324R059R5805
42674a2602726J25308L35958P59240J311024J853106K231454K378583K377317
$$ y = [-17339897, -16631016, -15572206, -14101413, -12314916, -10471467, -8927098, -8046786, -8058660, -8895899, -10160987, -11278855, -11772169, -11515477, -10804255, -10152316, -9944328, -10217597, -10702261, -10991055, -10696681, -9610857, -7844778, -5775057, -3752330, -1871743, -83395, 1530948, 2700984, 3164785, 2816593, 1690114, -29934, -1911027, -3338483, -3854645, -3459524, -2536369, -1512150, -630840, 21548, 420120, 585762, 599437, 555773, 479730, 287302, -164138, -944066, -1917284, -2753854, -3130211, -2954969, -2401116, -1767896, -1396476, -1693327, -3032805, -5430528, -8313300, -10781911, -12229266, -12707590, -12698531, -12602726, -12477418, -12141460, -11382220, -10071196, -8218090, -5986636, -3608053, -1230736]
42666a230736K352452K310207K148178J802507J301028O80006l3559p03882j061308
42657G564893r37288n26040k91986n37243j098345j529498j554657j269540r31830
42648a111534o83802n24682m20837l12432p9329L47891Q54290J243379J446948
42639G59892J467340J137763K31077j040704j886375j608638l69766R57017J683367
42630A330973J820289J718694J545246J299366J087980J054221J086130Q83174
42622A1826073L84932o3519j01229J94655L68523O9959o03777j228986j442557
42613I404074j206074p58568l59814p8045J85551M85985P00494O47892L03893
42604I325388j90721p43889j421046k251837k996271l246970k809402j918509
$$ y = [-1230736, 1121716, 3431923, 5580101, 7382608, 8683636, 9363642, 9330083, 8626201, 7564893, 6627605, 6101565, 5809579, 5272336, 4173991, 2644493, 1089836, -179704, -1111534, -1795336, -2320018, -2740855, -3053287, -3132616, -2784725, -1930435, -687056, 759892, 2227232, 3364995, 3596072, 2555368, 668993, -939645, -1309411, -352394, 1330973, 3151262, 4869956, 6415202, 7714568, 8802548, 9856769, 10942899, 11826073, 12211005, 12147486, 12046257, 12240912, 12609435, 12679394, 12075617, 10846631, 9404074, 8198000, 7439432, 7079618, 7001573, 7187124, 7673109, 8373603, 9021495, 9325388, 9134667, 8390778, 6969732, 4717895, 1721624, -1525346, -4334748, -6253257]
42596f253257j046003n28011l74031l49447j85055K36533Q00501J228781J262038
42587e207951Q28999R3985o35494j093365j223162j178971j135197j119593j065593
42578a1736342r44264p12689j79484Q59218K254988L429853L813629L321364K347100
42569B453373J395697Q09355P04362R46551J174335J002936K91377p90249j897892
42560F089845k659854k786840k204965j117733J12243J128107J636618J480158
42552A677579Q15625J15872k22008k49019k76478l68305k56115K20278Q21480
42543B278909J144603R87235M26144k72034p35881o90145k24593K62234N01028
42534C677500O08058Q12568J102781J295124J295240J092205O24948r2464p62118
$$ y = [-6253257, -7299260, -7827271, -8201302, -8550749, -8735804, -8499271, -7698770, -6469989, -5207951, -4378952, -4284967, -4920461, -6013826, -7236988, -8415959, -9551156, -10670749, -11736342, -12680606, -13393295, -13572779, -12713561, -10458573, -7028720, -3215091, 106273, 2453373, 3849070, 4658425, 5362787, 6309338, 7483673, 8486609, 8777986, 7987737, 6089845, 3429991, 643151, -1561814, -2679547, -2567304, -1439197, 197421, 1677579, 2493204, 2609076, 2387068, 2138049, 1861571, 1493266, 1237151, 1457429, 2278909, 3423512, 4410747, 4836891, 4564857, 3828976, 3138831, 2914238, 3176472, 3677500, 4285558, 5098126, 6200907, 7496031, 8791271, 9883476, 10508424, 10415960, 9653842]
42525I653842r71685o15313J7106N82962R51992J111645J011889O26176O7674
42516A2436288m57256p70143p54367l45781M22752J369041K190318K576813K372377
42507A9040042J705872R39944L87983N9765k47375o20467r17433j018654j055297
42498A8274380j260955j651558j984881k043436j841451j497041r93802j98467
42490F802789Q71038J893462K435005K272253J502941M17178o39429j335850j493755
42481A2725632j257611j017648j041711j228084j302251j177790r86231p94611
42473C919695m79345N3405O38286R41252P57163J87977m36289p98677q25887p37023
42463C220557q33724j186898j527649j476028q95392l5587O60761R07913P68961
$$ y = [9653842, 8682157, 8066844, 8083950, 8666912, 9618904, 10730549, 11742438, 12368614, 12436288, 11979032, 11208889, 10454522, 10108741, 10531493, 11900534, 14090852, 16667665, 19040042, 20745914, 21685858, 22073841, 22133606, 21886231, 21265764, 20348331, 19329677, 18274380, 17013425, 15361867, 13376986, 11333550, 9492099, 7995058, 7001256, 6802789, 7673827, 9567289, 12002294, 14274547, 15777488, 16194666, 15555237, 14219387, 12725632, 11468021, 10450373, 9408662, 8180578, 6878327, 5700537, 4714306, 3919695, 3440350, 3493755, 4132041, 5073293, 5830456, 6018433, 5582144, 4783467, 3957580, 3220557, 2386833, 1199935, -327714, -1803742, -2699134, -2734721, -2073960, -1166047, -397086]
42454c97086N20757L45154J90099n9005l50861m97527m05482j80402J5443J29831
42444f89079K07206K72500K84094J73751j03237n21565r38129j119054r02098
42435c335611l73648J63870M67622N88098P52202R93666J009752N05313l67487
42426D03777j075107j247130j021455p79388o72066n31198j48210N12647J319616
42417c238514K022404K312630K010168J244196L58677l67801q22160r45701p41531
42408A832368m37063m13809q07246j277913j325531p91830J9658O35801P32707
42399a832858K74743m87630j162414j476284j414397j080537n23584J67290O84265
42390f851406O64147J23924m01993k94278N78012J726036K439462K337013J645915
$$ y = [-397086, 123671, 468825, 658924, 599919, 249058, -248469, -653951, -834353, -818910, -689079, -481873, -209373, 74721, 248472, 145235, -376330, -1314459, -2433513, -3335611, -3709259, -3545389, -3077767, -2489669, -1737467, -743801, 265951, 771264, 403777, -671330, -1918460, -2939915, -3719303, -4391369, -4922567, -5070777, -4558130, -3238514, -1216110, 1096520, 3106688, 4350884, 4709561, 4341760, 3519600, 2573899, 1832368, 1395305, 981496, 174250, -1103663, -2429194, -3221024, -3201366, -2565565, -1832858, -1558115, -2045745, -3208159, -4684443, -6098840, -7179377, -7702961, -7535671, -6851406, -6187259, -6063335, -6465328, -6759606, -6181594, -4455558, -2016096, 320917, 1966832]
42381A966832J009135R45837J408359J868190J855755J370012P32957J43050m86337
42372A0813790j246486j948838k258043k086646j720784j469653j261036p26999
42364a904695K76673J361066J928132J760485J177313O20345K26305j33419n17693
42355D794512p76462p47279m73829j51465J18418M45790R73572J592946J914536
42346G690739J607430P64619j51434p61806j094899j395303j691842j709933j245420
42337B012151m93176J22585M17558O26776J072899J748379K339015K638957K783833
42328A3268977K961461K989373K398440J016882o74359j922050k391916k356711
42320A5290097k239836k151460j917829j403513o94644p1857R2878m48229j487514
$$ y = [1966832, 2975967, 3921804, 5330163, 7198353, 9054108, 10424120, 11157077, 11300127, 10813790, 9567304, 7618466, 5360423, 3273777, 1552993, 83340, -1177696, -1904695, -1628022, -266956, 1661176, 3421661, 4598974, 5219319, 5445624, 5312205, 4794512, 4018050, 3270771, 2796942, 2645477, 2763895, 3209685, 4183257, 5776203, 7690739, 9298169, 10062788, 9911354, 9149548, 8054649, 6659346, 4967504, 3257571, 2012151, 1518975, 1641560, 2059118, 2685894, 3758793, 5507172, 7846187, 10485144, 13268977, 16230438, 19219811, 21618251, 22635133, 21960774, 20038724, 17646808, 15290097, 13050261, 10898801, 8980972, 7577459, 6882815, 6810958, 6903836, 6455607, 4968093]
42311D968093k281989k067370p96400P35509J603272J534516R51847M05787J50829
42302E204094K04039N44310J103822J670667J966100J852979J428400R21755N33761
42293A5429927L30692K06215n9690o04807j272441j645002j398356o56864O0745
42284A0390419K94435L0183l60602n05194l18136J8919K60380K77540J19217o8176
42274A0138985k04209l51283n86527q23895q59421o17755k68514n0106m4670j71890
42264F160715l24562m31300m45891l73542k86026k36301j89110j18405j34235
42255C621343l87195q31769j197516j250180j016395p14507n31469n08658n70441
42246c386787n84008m27948r3003K66834M37381L38463J09564j9763M6065J86264
$$ y = [4968093, 2686104, 618734, -177666, 557843, 2161115, 3695631, 4647478, 5053265, 5204094, 5408133, 5952443, 7056265, 8726932, 10693032, 12546011, 13974411, 14896166, 15429927, 15760619, 15966834, 15907144, 15302337, 14029896, 12384894, 10986538, 10329674, 10390419, 10684854, 10715037, 10354435, 9849241, 9531105, 9550024, 9810404, 10087944, 10207161, 10138985, 9934776, 9583493, 8996966, 8173071, 7313650, 6695895, 6427381, 6377275, 6332605, 6160715, 5836153, 5404853, 4958962, 4585420, 4299394, 4063093, 3873983, 3755578, 3621343, 3234148, 2402379, 1204863, -45317, -1061712, -1776219, -2307688, -2816346, -3386787, -3970795, -4398743, -4491746, -4224912, -3787531, -3449068, -3339504, -3359267, -3313202, -3126938]
42236c126938K20842J26731L7383K1952l5207k45799m68946l92072J05735P59625
42226b996694J139358J025869N63386J12204j4505K56128P32994J110045J161854
42217C090639Q30857K07130m97004r97851j106765q95941o16347m13222k05821
42208f04325J17737N07516Q53816J195787J679957K301619K787041K784137K154897
42199A3778182J081788q5139j073815j794323k243668k407057k320373k134930
42191B800665j959742j667545j046514j62821O43383J189378J625893K032195
42183C454892K101711J519472M82246n01493j248960j961781k629005k777523
42175a560441k023480o27185P11288J465955J559415J214421P49989M38949L80003
$$ y = [-3126938, -2906096, -2779365, -2741982, -2720030, -2755237, -3001036, -3469982, -3862054, -3756319, -2996694, -1857336, -831467, -268081, -155877, -170382, 85746, 818740, 1928785, 3090639, 3921496, 4128626, 3631622, 2633771, 1527006, 631065, 14718, -398504, -604325, -486588, 20928, 874744, 2070531, 3750488, 6052107, 8839148, 11623285, 13778182, 14859970, 14774831, 13701016, 11906693, 9663025, 7255968, 4935595, 2800665, 840923, -826622, -1873136, -2035957, -1392574, -203196, 1422697, 3454892, 5556603, 7076075, 7558321, 7056828, 5807868, 3846087, 1217082, -1560441, -3583921, -4211106, -3499818, -2033863, -474448, 739973, 1489962, 1928911, 2308914]
42166B308914N13205Q04474J287658J838826K098610J830087J260729Q64916Q51668
42157A3659087J032221J123393R76814N52472q8007p13755j040006r84580o95133
42148A3822506l21439P1699L57051L44692M5405k39916k46875o2063J1152j89351
42138A3592861n75710r68872j229296j282200j138803q76210n35260j18417K28257
42129G096350J73641m45881j279947j711863j515840j092104r63366j186547j376203
42120b301760j190455o47631k9170L75022M33453K31402K3656N8024L78243P95288
42110a873928J048675R91009O64573K63061M1n9203m1551q6785j42754l6930K42707
42099I68915M79231N27183N70365R26783J618689K266656K428132J951295J002212
$$ y = [2308914, 2822119, 3626593, 4914251, 6753077, 8851687, 10681774, 11942503, 12807419, 13659087, 14691308, 15814701, 16791515, 17343987, 17255980, 16542225, 15502219, 14517639, 13822506, 13501067, 13572766, 13929817, 14274509, 14319914, 14079998, 13833123, 13771060, 13782212, 13592861, 13017151, 12048279, 10818983, 9536783, 8397980, 7521770, 6986510, 6868093, 7096350, 7269991, 6824110, 5544163, 3832300, 2316460, 1224356, 260990, -925557, -2301760, -3492215, -4139846, -4169016, -3793994, -3360541, -3129139, -3105483, -3047459, -2669216, -1873928, -825253, 165756, 830329, 1093390, 1093431, 1034228, 992677, 905892, 763138, 726208, 968915, 1448146, 1975329, 2545694, 3472477, 5091166, 7357822, 9785954, 11737249, 12739461]
42090A2739461j18899j123465j802637k069124j947564j526050r63090n15408
42082B673224m20308o78318j040070j271827j342228j292351j077880o91214l14416
42073e455388j26581M94L84125J078619J741958K022095J908080J613209J264868
42064D431479Q33599K74325l69537r54183j297048j354737j363714j633144k111702
42055c544662k338808j965950j162395l30896L97737J107842J646460J601661
42047d589011Q33966k17084r06002r36406m69518J60730P04063J063942J276478
42038c078842J444716J634596J802580J803462J462933P13308k64390j086688
42030D431675j463954j423380j148277o80876L6840Q74775J509525J761368J746197
$$ y = [12739461, 12620562, 11497097, 9694460, 7625336, 5677772, 4151722, 3188632, 2673224, 2252916, 1574598, 534528, -737299, -2079527, -3371878, -4449758, -5140972, -5455388, -5581969, -5581475, -5197350, -4118731, -2376773, -354678, 1553402, 3166611, 4431479, 5265078, 5539403, 5169866, 4215683, 2918635, 1563898, 200184, -1432960, -3544662, -5883470, -7849420, -9011815, -9342711, -8944974, -7837132, -6190672, -4589011, -3755045, -3972129, -4878131, -5814537, -6284055, -6123325, -5419262, -4355320, -3078842, -1634126, 470, 1803050, 3606512, 5069445, 5782753, 5518363, 4431675, 2967721, 1544341, 396064, -284812, -247972, 626803, 2136328, 3897696, 5643893]
42021E643893J639522J491858J349957J324548J382981J267950Q17543K34056
42013A5152308j48272k51487k37569k27092k42707l38115n46482p40150p63996
42004A1656438o97902p78706j051000j286851j275061j020389o50001l13551j94744
41995D388233m03036p78974r97613r56288q82638r52372r78994o43492Q0220Q70331
41985a254623J343823J300633Q15680K44044L1996L34274Q52353J183826J255309
41976F107315J239285J135533P23964j7296p17050j010373r88028j067474j481520
41967C924356k041989k368555k212522j586435p48150r8127O6716j75244l93629
41958e633579j93062M27366J120833J531782J538363J252293R05742P04611O57222
$$ y = [5643893, 7283415, 8775273, 10125230, 11449778, 12832759, 14100709, 14918252, 15152308, 15004036, 14752549, 14514980, 14287888, 14045181, 13707066, 13160584, 12420434, 11656438, 10958536, 10179830, 9128830, 7841979, 6566918, 5546529, 4896528, 4582977, 4388233, 3985197, 3206223, 2208610, 1252322, 369684, -582688, -1561682, -2205174, -2124954, -1254623, 89200, 1389833, 2205513, 2449557, 2481553, 2815827, 3668180, 4852006, 6107315, 7346600, 8482133, 9206097, 9188801, 8471751, 7461378, 6473350, 5405876, 3924356, 1882367, -486188, -2698710, -4285145, -5033295, -5131422, -5064706, -5239950, -5633579, -5826641, -5399275, -4278442, -2746660, -1208297, 43996, 949738, 1654349, 2311571]
41949B311571N34743J15477n07558r64946r74001n52910J23847Q89573J521034
41940B496830J723134J397641Q46457N09272N18709O53107O68068M89114J09068
41931I411400m77323j171095j752184k022909j869821j214896j18780J011948
41923A796340J552567J186147K34829o31895r53674p07736j42137M69275R70283
41914C773999J343500J586240J566531J121437L36573m41738r79428j373280j746810
41905E187024j911985j604828r83699n91181p57905j258175j643960j745399j713982
41896g024090j676346j487976q39536M12480J985463L255349L712316L396549
41888A734209K825625K447271K228392J845618J216192P02128P15766J174957
$$ y = [2311571, 2846314, 2961791, 2454233, 1489287, 515286, -37624, 86223, 975796, 2496830, 4219964, 5617605, 6464062, 6973334, 7492043, 8145150, 8813218, 9302332, 9411400, 8934077, 7762982, 6010798, 3987889, 2118068, 903172, 784392, 1796340, 3348907, 4535054, 4769883, 4137988, 3184314, 2476578, 2334441, 2803716, 3773999, 5117499, 6703739, 8270270, 9391707, 9728280, 9286542, 8307114, 6933834, 5187024, 3275039, 1670211, 686512, 95331, -662574, -1920749, -3564709, -5310108, -7024090, -8700436, -10188412, -11027948, -10615468, -8630005, -5374656, -1662340, 1734209, 4559834, 7007105, 9235497, 11081115, 12297307, 12999435, 13715201, 14890158]
41880A4890158J482237J138819L23112k90889l19948j20836l49751j196639k207358
41871A3348905k774061k607864j778682n61077O43821J410810J510717J042011
41863A0234580L03542m34718j038600j493692j856020k173583k402068k412631
41855a273190k090789j405796m32233N95472J282599J314322P92929K21241L2138
41846i63307J92980L65672L79879M01264O39216J028676J272151J141450O83626
41837E141607J53879k07582l35578l36728l84598o04762r76742j298494j321893
41828a70891j024569p10710p14921r96268j153800q92849l61322N5090J77716
41819e792524J71022K91272O11185R84892J196653J119695P71393K48072l57571
$$ y = [14890158, 16372395, 17511214, 17834326, 17543437, 17223489, 17102653, 16752902, 15556263, 13348905, 10574844, 7966980, 6188298, 5627221, 6271042, 7681852, 9192569, 10234580, 10538122, 10103404, 9064804, 7571112, 5715092, 3541509, 1139441, -1273190, -3363979, -4769775, -5202008, -4606536, -3323937, -2009615, -1216686, -995445, -963307, -770327, -404655, -24776, 376488, 1015704, 2044380, 3316531, 4457981, 5141607, 5295486, 5087904, 4752326, 4415598, 4031000, 3426238, 2449496, 1151002, -170891, -1195460, -1906170, -2621091, -3617359, -4771159, -5664008, -6025330, -5970240, -5792524, -5621502, -5330230, -4719045, -3734153, -2537500, -1417805, -646412, -398340, -755911]
41810g55911r27606j239682j049643l34138O18255J433356J908743J981356J560989
41801C195719O01290o43315j618074j873693j449577p86371k87079l8285N8012
41792b841373K5281j80980m51840n11653k52335L9341r009l38092m62431n5365
41782e038456O65279J252033J545767J688285J745816J577512J082269L82843
41774D901348k71901o51367n89602o7199O83077J274152J438352J149969N23190
41765H390019k32726p55211o92069q9954N43674P48651N70869L46170J65037j76346
41755H818114p28559j196677j305454j152018j049961j154309j383378j613548
41747g65790j789809j887647j921354j992190k186728k378039k234819j521627
$$ y = [-755911, -1683517, -2923199, -3972842, -4306980, -3688725, -2255369, -346626, 1634730, 3195719, 3797009, 3153694, 1535620, -338073, -1787650, -2574021, -2861100, -2899385, -2841373, -2816092, -2997072, -3448912, -3960565, -4212900, -4173559, -4182568, -4520660, -4983091, -5038456, -4373177, -3121144, -1575377, 112908, 1858724, 3436236, 4518505, 4901348, 4629447, 3978080, 3388478, 3321279, 4004356, 5278508, 6716860, 7866829, 8390019, 8157293, 7402082, 6710013, 6620059, 7163733, 7912384, 8483253, 8829423, 8994460, 8818114, 8089555, 6892878, 5587424, 4435406, 3385445, 2231136, 847758, -765790, -2555599, -4443246, -6364600, -8356790, -10543518, -12921557, -15156376, -16678003]
41739a6678003l69418P96919J589067J906923J923765J897747J996296K223681
41731d713023K437332K426957K050564J367390O24793L9724m17952r42310j560703
41722A312772k000390j994448j637707j266858r96297n65049K67945J309460K034331
41713c536241K048789J392612M72405k18906m15186k51257r6740j31287j48426
41704h84237J29798O61063J175357J555303J865235K021349J741748R50893O884
41695I223393o49974r37021j074245j224534j355324j361317j158583p21968j76057
41686E64370K12704K78792J40678J8686m0359r7188q6031J07157L59993L67762
41676A826564L8969l69304n79514n74238m84976m04063m18227o34730r93723j174238
$$ y = [-16678003, -17047421, -16250502, -14661435, -12754512, -10830747, -8933000, -6936704, -4713023, -2275691, 151266, 2201830, 3569220, 4194013, 4233737, 3815785, 2873475, 1312772, -687618, -2682066, -4319773, -5586631, -6582928, -7147977, -6880032, -5570572, -3536241, -1487452, -94840, 377565, 158659, -256527, -507784, -604524, -735811, -884237, -754439, -93376, 1081981, 2637284, 4502519, 6523868, 8265616, 9216509, 9223393, 8573419, 7636398, 6562153, 5337619, 3982295, 2620978, 1462395, 740427, 564370, 777074, 1055866, 1196544, 1215230, 1174871, 1077683, 991652, 1098809, 1458802, 1826564, 1865533, 1496229, 916715, 342477, -142499, -546562, -964789, -1599519, -2593242, -3767480]
41666c767480q85800k36860L06454L33210j66169p87437j000751n62192K74774
41657f492251J031124J514971J914058K328848K476628K087303J393639Q81260
41649G135580O08220J40189p51536j634981j851000j233000k37016N12228O50718
41640C339402J78705o26199j355858j655846j371886n95574L49998J000659J013360
41631B76761M67802j62577m33675k79800Q0923M28765O03192M47012m9876n76178
41621H02349p15031m00263J6959K12406K09755J65139N1711k15138m56692l32149
41611f60954J73702N66953L02678o17037j575247j846733j162630J31153J372039
41602c316076K045973K047942J573062Q42139J0939o98559r74311o72333l5918
$$ y = [-3767480, -4653280, -4890140, -4583686, -4250476, -4416645, -5204082, -6204833, -6767025, -6492251, -5461127, -3946156, -2032098, 296750, 2773378, 4860681, 6254320, 7135580, 7743800, 7883989, 7132453, 5497472, 3646472, 2413472, 2176456, 2688684, 3339402, 3518107, 2891908, 1536050, -119796, -1491682, -2087256, -1737258, -736599, 276761, 744563, 581986, 148311, -131489, -50566, 378199, 981391, 1428403, 1378527, 802349, 87318, -312945, -295986, -83580, 126175, 291314, 343025, 127887, -328805, -660954, -487252, 79701, 382379, -234658, -1809905, -3656638, -4819268, -4688115, -3316076, -1270103, 777839, 2350901, 3193040, 3203979, 2505420, 1531109, 858776, 822858]
41593H22858M91756O72206N77550L25761r0396o33946j063104j111510p56938
41584g65763j76985M81144J114431J512574J446516R80268N01452L12060K98637
41575E704334J15118l94865j044061j471507j385001p72926j9101L16063L4854
41566A082908m32386n01124j33147J68824P0013j70514j04391K95184O17789M95190
41556A388346o6449p51251j175587j115563o38695j4790N60080J098109J639562
41547I23762K073433K259424K209463J991830J572749R64016M32548K78503M06696
41538A3112424M00236Q0410k79600m12476m55998o85840j042307j176915q91174
41529H648760l35617J63545L15644J494n89316j009467r62827o52953n19050o28697
$$ y = [822858, 1314614, 1986820, 2564370, 2890131, 2799735, 2165789, 1102685, -8825, -765763, -942748, -461604, 652827, 2165401, 3611917, 4592185, 5093637, 5405697, 5704334, 5819452, 5424587, 4380526, 2909019, 1524018, 751092, 731991, 1048054, 1082908, 650522, 149398, 16251, 185075, 255088, 84574, -19817, 275367, 893156, 1388346, 1321897, 570646, -604941, -1720504, -2359199, -2373989, -1813909, -715800, 923762, 2997195, 5256619, 7466082, 9457912, 11030661, 11994677, 12427225, 12705728, 13112424, 13512660, 13593070, 13313470, 12900994, 12444996, 11759156, 10716849, 9539934, 8648760, 8313143, 8476688, 8792332, 8793826, 8204510, 7195043, 6232216, 5579263, 5060213, 4431516]
41519D431516n75848n6759O69269J038459P79956J40661l93079n06100k82212
41510E245863j29189m18121j112539j790800k059681j854832j315892n53170L14055
41501c674306J023414J301787J143840Q31038O64361P46101R66244J092008R29916
41492E024403N38907K34800K29126L24154J83659j22163j37606L24168Q37152
41483G436600Q75438M50676k5022l52105o78318j056845j233299j004745n38260
41474C874120j50913N9966J77043J79732n7393m91520q43439q82231o66898m26868
41464G71599k69098q8904K30813N80441O31741J41044p30277j461832j622813
41455a817286j251768p15815k49358K00039O49724Q31200M54744l55652j088574
$$ y = [4431516, 3855668, 3798909, 4468178, 5506637, 6286593, 6427254, 6034175, 5528075, 5245863, 5116674, 4698553, 3586014, 1795214, -264467, -2119299, -3435191, -3988361, -3674306, -2650892, -1349105, -205265, 625773, 1290134, 2036235, 3002479, 4094487, 5024403, 5563310, 5798110, 6027236, 6351390, 6535049, 6412886, 6275280, 6599448, 7436600, 8312038, 8762714, 8737692, 8385587, 7707269, 6650424, 5417125, 4412380, 3874120, 3723207, 3783173, 3960216, 4139948, 4082555, 3591035, 2747596, 1865365, 1198467, 771599, 502501, 413597, 644410, 1224851, 1856592, 1997636, 1267359, -194473, -1817286, -3069054, -3784869, -4034227, -3834188, -3184464, -2353264, -1898520, -2254172, -3342746]
41446c342746j324424j062143n68590o6723L52106O40383P68722P73400P36781
41437c093234O91920N64293K16100m13935j152361j609102j501566j012003o72108
41428g981996p65851r55422o65341K24498J251082J907172K104947K071085J992774
41419h17052J896614J748403J523474J219512Q86461O04931L86159J62906o8675
41410G542733j90965j25779L9406J85806L43588O24201J034021J463091J794001
41401A2710103J908175J666742J048080K67405l89590q18512j046983j026485
41393A4318935p16272l54121l50961q05587j323227j418390r32214o518J079981
41384I491626J888011J908084R96188l64150j474168k041691k219850k169239
$$ y = [-3342746, -4667170, -5729313, -6297903, -6364626, -6012520, -5372137, -4603415, -3830015, -3093234, -2401314, -1837021, -1620921, -2034856, -3187217, -4796319, -6297885, -7309888, -7981996, -8747847, -9703269, -10368610, -10144112, -8893030, -6985858, -4880911, -2809826, -817052, 1079562, 2827965, 4351439, 5570951, 6457412, 7062343, 7448502, 7611408, 7542733, 7351768, 7225989, 7265395, 7451201, 7794789, 8418990, 9453011, 10916102, 12710103, 14618278, 16285020, 17333100, 17600505, 17210915, 16392403, 15345420, 14318935, 13602663, 13248542, 12897581, 12091994, 10768767, 9350377, 8418163, 8411645, 9491626, 11379637, 13287721, 14283909, 13919759, 12445591, 10403900, 8184050, 6014811]
41376F014811j891676j475083j174606j121569j140928r75206n76813j12321K23086
41367b230305L59213M15190O06779R60502J139553P44970j74586j096140j553708
41358h28532j510618j161188o27368j3696M63368O54764O83113P55038Q44133
41349g40986P55958M39438K1883m23120r07981j314533j371572r47493k34767
41340d723173M30909Q42272R83960R55221Q95543Q83432Q32643N62066L3131n38964
41330A157040q57938p79138l53990K57274Q49955J235139J343631J260149J095316
41321E207438Q34393L55875m06257j340371k182776k666765k698781k414910k023170
41312g335324j569476r15597R956R92155J629318J652841J135684M28925p4109
$$ y = [6014811, 4123135, 2648052, 1473446, 351877, -789051, -1764257, -2341070, -2453391, -2230305, -1871092, -1455902, -849123, 111379, 1250932, 1995902, 1821316, 725176, -828532, -2339150, -3500338, -4127706, -4141402, -3678034, -3023270, -2340157, -1585119, -740986, 14972, 454410, 476293, 53173, -854808, -2169341, -3540913, -4488406, -4723173, -4292264, -3449992, -2466032, -1510811, -615268, 268164, 1100807, 1662873, 1696004, 1157040, 299102, -480036, -834026, -576752, 273203, 1508342, 2851973, 4112122, 5207438, 6041831, 6397706, 5991449, 4651078, 2468302, -198463, -2897244, -5312154, -7335324, -8904800, -9820397, -9810441, -8818286, -7188968, -5536127, -4400443, -3971518, -4045627]
41303d045627j77345P623J68557O8341k39341m56087k85195L61997J337917K355870
41293i03290L112520L389526L117933K403137J520847Q52229O93178J004517J363932
41284A6554529J281093O19860l31192j210287j900929k441736k755047k673112
41276G143179k249777j848805j785540j969927k030493j723556j075887j87830
41268e728636Q68977J893020K505190K448486J877035J221092P98538O37885N99978
41259G121565N31592L36414M8137j49036q4261J98163M85435O26817O00720L69322
41249A0084868j58117r44517j732295k225585k303487k018806j497190r09695
41241a704824m34074j19129J72252N97187J134392J597624J790996J601961J028281
$$ y = [-4045627, -4222972, -4215349, -4046792, -3978451, -4217792, -4673879, -4959074, -4597077, -3259160, -903290, 2209230, 5598756, 8716689, 11119826, 12640673, 13492902, 14186080, 15190597, 16554529, 17835622, 18455482, 18124290, 16914003, 15013074, 12571338, 9816291, 7143179, 4893402, 3044597, 1259057, -710870, -2741363, -4464919, -5540806, -5728636, -4859659, -2966639, -461449, 1987037, 3864072, 5085164, 5883702, 6521587, 7121565, 7653157, 7989571, 8037708, 7888672, 7804411, 8002574, 8488009, 9114826, 9715546, 10084868, 9926751, 8982234, 7249939, 5024354, 2720867, 702061, -795129, -1704824, -2138898, -2258027, -2085775, -1488588, -354196, 1243428, 3034424, 4636385, 5664666]
41232E664666K17637n62229j097658j379086j535039j644995j653962j426222
41224c416888q56714j1260Q04253J241079J274332J253038J440322J610275J300977
41215D639414M18511o17038j313006j484717j203746o43783r7797P9404k31414
41206d54172p38948j001673q22760l20385K77536P71442J007352R36208O67078
41197C21678L51986J5355m08480q65714j104496q50518n8783R63625J660907J580697
41187A606257P90987p3255l44883L8789N24065N73357J78176k86777n28913n00480
41177A977323k19553L24949J033043J609917J746188J378669P52007K37198N3852
41168H893593P7086j00271q08349j914259k829767k973109k227484r58714L10021
$$ y = [5664666, 5882303, 5320074, 4222416, 2843330, 1308291, -336704, -1990666, -3416888, -4273602, -4284862, -3480609, -2239530, -965198, 287840, 1728162, 3338437, 4639414, 5057925, 4440887, 3127881, 1643164, 439418, -204365, -302162, -222758, -454172, -1193120, -2194793, -3017553, -3337938, -3060402, -2288960, -1281608, -345400, 321678, 673664, 689019, 280539, -585175, -1689671, -2540189, -2598972, -1635347, 25560, 1606257, 2397244, 2323989, 1979106, 2017895, 2541960, 3115317, 3293493, 3006716, 2477803, 1977323, 1757770, 2082719, 3115762, 4725679, 6471867, 7850536, 8602543, 8839741, 8893593, 8970679, 8870408, 8062059, 6147800, 3318033, 344924, -1882560, -2841274, -2531253]
41159b531253J171344J420881J092655M47458k04964p29818j155303j469527j576833
41150c535360j466847j243796r20359l75125L55541R23604J003819O70172K56672
41141d331679l8136j99504j92333k2272O3111k01225o33452p22990l25164J09483
41131f494161J82405Q8533K39597O35143R72665J196655J523071J961935K181492
41122B487335J890111J090918m2772j258732k165781k392045j930745j140604
41114c462315l57312K74351N73648K87173n32448j377569j759621j675482j418296
41105i447871j117172p16271k69953M1352J62644J96729J96333J40784J28644
41096a0684781L68099Q86290J395411J555599J319544R77075Q94032J185234J566621
$$ y = [-2531253, -1359909, 60972, 1153627, 1601085, 1396121, 666303, -489000, -1958527, -3535360, -5002207, -6246003, -7166362, -7541487, -7185946, -6262342, -5258523, -4588351, -4331679, -4369815, -4569319, -4761652, -4783924, -4720813, -4922038, -5555490, -6278480, -6603644, -6494161, -6311756, -6223223, -5983626, -5348483, -4375818, -3179163, -1656092, 305843, 2487335, 4377446, 5468364, 5425592, 4166860, 2001079, -390966, -2321711, -3462315, -3819627, -3545276, -2971628, -2684455, -3216903, -4594472, -6354093, -8029575, -9447871, -10565043, -11281314, -11551267, -11509915, -11347271, -11150542, -10954209, -10813425, -10684781, -10316682, -9430392, -8034981, -6479382, -5159838, -4182763, -3288731, -2103497, -536876]
41087e36876J549919Q89945j38486r72985j271982j139128q85896o82726m49954
41078c638169j514P20035J488338J888112J657007R44217J67992l62679o14148
41069B249191o90383p09862q40294j256718j906533k381673k191830j250642o9614
41060i048358O07945M53040j41293m48906j22546N52834J102973J367162J454400
41051d222749J419795J253140J082359J066221J070023P44304J8042p20482j031586
41042F79067q06142j78682O51464J351805J503391J016908L51848L9099P4008
41033D682766L7518k66862n95338o64587m70144j46639K16020M83113M14699j02246
41023C588300q33730j353969j410539j081139o15832j88912K10197O68908J126476
$$ y = [-536876, 1013043, 1902988, 1764502, 791517, -480465, -1619593, -2505489, -3188215, -3638169, -3639683, -2919648, -1431310, 456802, 2113809, 3058026, 3226018, 2863339, 2249191, 1558808, 848946, 8652, -1248066, -3154599, -5536272, -7728102, -8978744, -9048358, -8440413, -7987373, -8128666, -8577572, -8700118, -8147284, -7044311, -5677149, -4222749, -2802954, -1549814, -467455, 598766, 1668789, 2413093, 2431135, 1710653, 679067, -127075, -305757, 345707, 1697512, 3200903, 4217811, 4569659, 4608758, 4682766, 4720284, 4453422, 3858084, 3193497, 2723353, 2576714, 2792734, 3275847, 3690546, 3588300, 2754570, 1400601, -9938, -1091077, -1706909, -1895821, -1685624, -1016716, 109760]
41014A09760J296807R19622J17835n91286p24643k59047L83525P15063N10276
41005B477912j53059j030189j815286k187457j918058j053516L9682R30034J448310
40996c261627J686657J696991J368111O76156j25032p33707j111521j388195j544166
40987b736333j404623r21816k56958M20121J013963J379653J355699J012047O74492
40978E36245N81731O55627P10251P40341Q65759J095318J286022J285235J030813
40969H787342N88243J65774r931O0502J13526o3833l79247o11630p28567q38407
40959G083772q83144o14266N7285Q48689J363018J497652J497002J608017J768499
40950A4226524J696337J253966O11963n435o15349j352372k114975k583887k650556
$$ y = [109760, 1406567, 2326189, 2444024, 1852738, 1128095, 869048, 1252573, 1967636, 2477912, 2324853, 1294664, -520622, -2708079, -4626137, -5679653, -5639971, -4709937, -3261627, -1574970, 122021, 1490132, 2166288, 2041256, 1307549, 196028, -1192167, -2736333, -4140956, -5062772, -5319730, -4899609, -3885646, -2505993, -1150294, -138247, 536245, 1117976, 1773603, 2483854, 3224195, 4089954, 5185272, 6471294, 7756529, 8787342, 9375585, 9541359, 9531428, 9591930, 9705456, 9641623, 9262376, 8650746, 7922179, 7083772, 6200628, 5586362, 5643647, 6492336, 7855354, 9353006, 10850008, 12458025, 14226524, 15922861, 17176827, 17788790, 17783355, 17168006, 15815634, 13700659, 11116772, 8466216]
40941H466216k592152k682386k825120k755039k425454j955252j321554m18624
40933h509365N81530J215028J185374O97788K78327L47057R25103J583860J691702
40924c596R34760l14081j272076j447312r80316l48277N4753N6093k65951n46087
40914d132090l57738L33392J082350J464463J490072J381722J176631Q22084M96909
40905C757795M76907O91799P23844L16161l39499q81821j139489j128936q76716
40896A600045l71809L91066J372230K396870L107671L188199K699726K034491
40888A6418489J458959Q80057J70939m73130p11019m80027n1174K69690L29208
40879A7811992J13086k18449l15070Q2243P77859J235527J140444O96232L00826
$$ y = [8466216, 5874064, 3191678, 366558, -2388481, -4813935, -6769187, -8090741, -8509365, -7927835, -6712807, -5527433, -4829645, -4551318, -4204261, -3279158, -1695298, -3596, 931164, 617083, -654993, -2102305, -3082621, -3430898, -3376145, -3320052, -3586003, -4132090, -4489828, -4156436, -3074086, -1609623, -119551, 1262171, 2438802, 3260886, 3757795, 4234702, 4926501, 5650345, 5966506, 5627007, 4745186, 3605697, 2476761, 1600045, 1228236, 1619302, 2991532, 5388402, 8496073, 11684272, 14383998, 16418489, 17877448, 18757505, 18928444, 18455314, 17744295, 17264268, 17213094, 17482784, 17811992, 17925078, 17706629, 17391559, 17473802, 18251661, 19487188, 20627632, 21323864, 21624690]
40870B1624690J12197N2005N8834J27324J63898R90m17809r59416j397447j517676
40860A7847590j189695m70671L52728R18088J001633N59707l37673j468863k419112
40851A4793732k804190k612609k187379j804634j412368q68509k67203J57346
40843B994186L73063N94069R72518J406270J702263J799274J737851J496772R90956
40834A4067222K41253n39121j077226j232339j025674n25793J93035R46141J416667
40825A2464165J410816J148232J133583J619379K267415K461977J935779R91876
40817B5433222J32662m07759p44376j083131j474168j774423j773061j353900
40809A6955066n90356K83594R96993J365368J344955J010893M84407j36131p69182
$$ y = [21624690, 21736887, 21788892, 21847726, 21975050, 22138948, 22139938, 21722129, 20762713, 19365266, 17847590, 16657895, 16187224, 16539952, 17458040, 18459673, 19019380, 18681707, 17212844, 14793732, 11989542, 9376933, 7189554, 5384920, 3972552, 3104043, 2836840, 2994186, 3367249, 3961318, 4933836, 6340106, 8042369, 9841643, 11579494, 13076266, 14067222, 14308475, 13769354, 12692128, 11459789, 10434115, 9908322, 10101357, 11047498, 12464165, 13874981, 15023213, 16156796, 17776175, 20043590, 22505567, 24441346, 25433222, 25565884, 25158125, 24413749, 23330618, 21856450, 20082027, 18308966, 16955066, 16364710, 16648304, 17645297, 19010665, 20355620, 21366513, 21850920, 21714789, 20945607]
40800B0945607j285313j517453j403815j092294q19180o75523n62002l86776k20091
40791A2983160j86819k46593j59779K95610J072897J823145K137374J869663J236561
40782B0825219N87384J07364k09107l59631k73524m983J67056p63l88984n93979
40772A9856052l57239J87185P14362J035897J157521J120968R30018O16042K51234
40763B5512040j48352o59461j331271k051715k572636k671100k298352j616538
40755A2162615r10226m21708k26925k57013m08869n80178o21517l88071Q0464
40746H428572N24912P34651Q06918J011473J416867J793136J896146J689975J227241
40737A9529891M75906n73631j689344k444755k535279k019290j261502o61334
$$ y = [20945607, 19660294, 18142841, 16739026, 15646732, 14827552, 14152029, 13590027, 13203251, 12983160, 12796341, 12549748, 12389969, 12685579, 13758476, 15581621, 17718995, 19588658, 20825219, 21412603, 21519967, 21310860, 20951229, 20677705, 20672722, 20839778, 20839015, 20450031, 19856052, 19498813, 19685998, 20400360, 21436257, 22593778, 23714746, 24644764, 25260806, 25512040, 25363688, 24704227, 23372956, 21321241, 18748605, 16077505, 13779153, 12162615, 11252389, 10830681, 10603756, 10346743, 9937874, 9357696, 8736179, 8348108, 8428572, 8953484, 9688135, 10495053, 11506526, 12923393, 14716529, 16612675, 18302650, 19529891, 20005797, 19432166, 17742822, 15298067, 12762788, 10743498, 9481996, 8820662]
40729H820662l82093k75794p2387L39976Q31025J177815J199393P72016r2965
40720A2317648j091292j714560j670410j137143m78379J65410Q12589J301739
40712H505602J335804Q98011L62435Q8016Q6785J80556K90803M30399N53582N87006
40702A3318999N50976N31741N77398O94229Q71271J023790R88188O75085J86542
40693A9418219k80919n85527o45386m20022j0218L17743L72895K79240L36005
40684A8782030O42417R83692J100699R60634P27757N57313M75578M21587L53587
40675B5005294K88976K17725M959n06972j224640j716901j538777o56570N06671
40666B0379765J421048J783168J576527R70868K19372m34375q30269q94886o17733
$$ y = [8820662, 8438569, 8162775, 8090388, 8430364, 9261389, 10439204, 11638597, 12410613, 12317648, 11226356, 9511796, 7841386, 6704243, 6225864, 6391274, 7203863, 8505602, 9841406, 10739417, 11101852, 11189868, 11276653, 11457209, 11748012, 12178411, 12731993, 13318999, 13869975, 14401716, 14979114, 15673343, 16544614, 17568404, 18556592, 19231677, 19418219, 19137300, 18551773, 17906387, 17486365, 17476147, 17793890, 18166785, 18446025, 18782030, 19424447, 20408139, 21508838, 22469472, 23197229, 23754542, 24230120, 24651707, 25005294, 25294270, 25511995, 25516954, 25009982, 23785342, 22068441, 20529664, 19873094, 20379765, 21800813, 23583981, 25160508, 26131376, 26350748, 25916373, 25086104, 24191218, 23573485]
40657B3573485q7231M77624Q26461Q37347N46817N6516n07155r64781j145256
40648B3613827j029175p55387m34290j4429O09948J398554K128646K551299K563894
40639C0632887K255033J815467J401147J056342P43768M18055N1117l86509r16603
40630C7070704j502641k017275k276023k134123j592927q12773J8459Q21673J568745
40621B9143819K109230K203019J808109J213407P42550L92834p3217p05966j218457
40612C5615328j304573r72636m88226p8383K23503M94854P79149J031506J163549
40603C6464071J113384Q71277M74693L5350k48409k21870L5421K63022L48732
40594C9135671M90456R09075J517126K046635K408535K697008K890554K826945
$$ y = [23573485, 23486254, 23963878, 24790339, 25627686, 26174503, 26231019, 25723864, 24759083, 23613827, 22584652, 21829265, 21394975, 21380546, 21990494, 23389048, 25517694, 28068993, 30632887, 32887920, 34703387, 36104534, 37160876, 37904644, 38322699, 38373816, 37987307, 37070704, 35568063, 33550788, 31274765, 29140642, 27547715, 26734942, 26753401, 27575074, 29143819, 31253049, 33456068, 35264177, 36477584, 37220134, 37612968, 37539751, 36833785, 35615328, 34310755, 33338119, 32849893, 32771510, 32995013, 33489867, 34269016, 35300522, 36464071, 37577455, 38448732, 38923425, 38958775, 38710366, 38488496, 38523917, 38786939, 39135671, 39626127, 40535202, 42052328, 44098963, 46507498, 49204506, 52095060, 54922005]
40586E4922005K513247K201124K054175J955021J759042J542580J456690J505744
40578F9909628J632699J877804K266522K634838K742349K514574K066573J579380
40570H7224367J269818J347666J800558K280228K392573K087178J620452J181788
40562A01204628P35856K32317k00939l33708k8776O34386J362347J819954J894196
40553A07320261J744452J526254J195076P36340M48564P21269J538067K428259
40545A17658542K930407K920356K530620K042160J887649K407973L411945M227228
40537A40016880M414452M253855M308580M681157M985587M955436M755468M661935
40529A77033350M705305M745107M724344M711638M768057M865827M901046M745999
$$ y = [54922005, 57435252, 59636376, 61690551, 63645572, 65404614, 66947194, 68403884, 69909628, 71542327, 73420131, 75686653, 78321491, 81063840, 83578414, 85644987, 87224367, 88494185, 89841851, 91642409, 93922637, 96315210, 98402388, 100022840, 101204628, 101940484, 102172801, 101971862, 101638154, 101609378, 102243764, 103606111, 105426065, 107320261, 109064713, 110590967, 111786043, 112522383, 112970947, 113692216, 115230283, 117658542, 120588949, 123509305, 126039925, 128082085, 129969734, 132377707, 135789652, 140016880, 144431332, 148685187, 152993767, 157674924, 162660511, 167615947, 172371415, 177033350, 181738655, 186483762, 191208106, 195919744, 200687801, 205553628, 210454674, 215200673]
40521B15200673M355298L891146L709426M131258N165349O431925P376025P623647
40513B57884747P210695O501223N882910N535357N446662N543737N721832N791806
40505C05518969N527168M839317L883872K936695K138402J382757N00175m49735
40497C26277620j142853j306219j017861o14388l57027l16623n46726j152183
40489C19823740k094506l095671l886783m464312m969531n401054n617455n597441
40481B84696987n532962n632248n933399o327566o665862o812168o669719o208831
40473B34914232n470070m582494l818031l535427l916366m736950n499249n822930
40465A97532715n671482n245946m775143m399826m125409l841028l468155l109515
$$ y = [215200673, 219555971, 223447117, 227156543, 231287801, 236453150, 242885075, 250261100, 257884747, 265095442, 271596665, 277479575, 283014932, 288461594, 294005331, 299727163, 305518969, 311046137, 315885454, 319769326, 322706021, 324844423, 326227180, 326727355, 326277620, 325134767, 323828548, 322810687, 322196299, 321839272, 321522649, 320975923, 319823740, 317729234, 314633563, 310746780, 306282468, 301312937, 295911883, 290294428, 284696987, 279164025, 273531777, 267598378, 261270812, 254604950, 247792782, 241123063, 234914232, 229444162, 224861668, 221043637, 217508210, 213591844, 208854894, 203355645, 197532715, 191861233, 186615287, 181840144, 177440318, 173314909, 169473881, 166005726, 162896211]
40457A62896211k960261l055612l204717l191385k931413k419429j682371q80712
40449A42570311l34606l07031p78987j494395k172053k619987k726329k457199
40441A29679724j871711j094004k66578M90364J143540J762350K357944K692130
40433A34893759K407675J443786J97765q34499j464614j752676j712034j302703
40425A31876459o48133j2466M54212P52465Q05779M37456l10776j018691j226238
40416A31110067q86383l92072k14617n82921j411471k384993l122543l398978
40408A18716089l287463l064869k949038k925726k820498k522299k137437j924443
40400I7084316k057800k441999k767486k762701k406407j923182j586356j496761
$$ y = [162896211, 159935950, 156880338, 153675621, 150484236, 147552823, 145133394, 143451023, 142570311, 142235705, 141928674, 141149687, 139655292, 137483239, 134863252, 132136923, 129679724, 127808013, 126714009, 126447431, 126937795, 128081335, 129843685, 132201629, 134893759, 137301434, 138745220, 138942985, 138108486, 136643872, 134891196, 133179162, 131876459, 131228326, 131215860, 131670072, 132422537, 133228316, 133665772, 133354996, 132336305, 131110067, 130223684, 129831612, 129616995, 129034074, 127622603, 125237610, 122115067, 118716089, 115428626, 112363757, 109414719, 106488993, 103668495, 101146196, 99008759, 97084316, 95026516, 92584517, 89817031, 87054330, 84647923, 82724741, 81138385, 79641624]
40392G9641624j530342j524285j507514j659474k001693k256624k141264j710562
40384F5309866j237501q22528l66420O9602J89368r2519l76317k15107K83505
40375F2741949N56490K68778l20519o97168o08762j92791K41678M59137M24016
40366F2872808K76938J50057j0329l54963q45472j182314j112094p32428l84777
40357E8677426k71458k68244j16613K67374O98885R08263Q01968N42605L74738
40348F1614944M06380O08540R86725J610485K401763L006876L037209K453005
40340G6125927J630463J050827R88040J451113K256955L083109L588739L653831
40332I3829004L490637L409589L476994L512707L438277L482261L926820M710417
$$ y = [79641624, 78111282, 76586997, 75079483, 73420009, 71418316, 69161692, 67020428, 65309866, 64072365, 63249837, 62883417, 62953019, 63142387, 63049868, 62673551, 62458444, 62741949, 63298439, 63567217, 63246698, 62549530, 61940768, 61747977, 61989655, 62448792, 62872808, 63149746, 63299803, 63289474, 62934511, 62089039, 60906725, 59794631, 59062203, 58677426, 58405968, 58137724, 58021111, 58288485, 58987370, 59895633, 60697601, 61240206, 61614944, 62021324, 62629864, 63616589, 65227074, 67628837, 70635713, 73672922, 76125927, 77756390, 78807217, 79795257, 81246370, 83503325, 86586434, 90175173, 93829004, 97319641, 100729230, 104206224, 107718931, 111157208, 114639469, 118566289, 123276706]
40324A23276706N400326N565428N111257M266436L343338K549231J949699J530226
40316A52992647J284057J248001J426088J677991J753247J503388J051749P10185
40308A63647353P11172J005504J278503J153992M58655o21738j635532k164949
40300A63832960k078139j524556p43976Q4383Q52255J466273J819386J821960
40292A65530546J469856Q65809J27672p13094j640271k483304k970142l038467
40284A57148605k953944k963680k947913k639444k126039j847107k049460k532624
40276A37088394l050127l656451m398900m908669m702499l852056k976808k481006
40268A07061878k113853j464247o34975j45990k81097q06315j329555j699941
$$ y = [123276706, 128677032, 134242460, 139353717, 143620153, 146963491, 149512722, 151462421, 152992647, 154276704, 155524705, 156950793, 158628784, 160382031, 161885419, 162937168, 163647353, 164358525, 165364029, 166642532, 167796524, 168255179, 167633441, 165997909, 163832960, 161754821, 160230265, 159486289, 159570672, 160422927, 161889200, 163708586, 165530546, 167000402, 167866211, 167993883, 167280789, 165640518, 163157214, 160187072, 157148605, 154194661, 151230981, 148283068, 145643624, 143517585, 141670478, 139621018, 137088394, 134038267, 130381816, 125982916, 121074247, 116371748, 112519692, 109542884, 107061878, 104948025, 103483778, 102848803, 102702813, 102421716, 101615401, 100285846, 98585905]
40260I8585905j980890k219515k387864k466616k455328k327466k079468j816905
40252H0851853j685389j679297j604612j302515q53481m62989j76576J43085N04829
40243G3734908O14820J88668o23018j333383j680313j886023k248143k672004
40235F4095512k835058k701985k577185k625063k631061k378031k020525j849862
40227D4476742j825402j615359j076587m34955O0864M25467P40772Q52929M82658
40218D2087129l86450j373394j976135j935556j387302p72791n82745j036416
40210C2636340j915894k741390l144477l059038k582415j774706o90215M45188
40202A7173393J236663J401487J042565N87986M31200O33455R60712J152618J124143
$$ y = [98585905, 96605015, 94385500, 91997636, 89531020, 87075692, 84748226, 82668758, 80851853, 79166464, 77487167, 75882555, 74580040, 73726559, 73263570, 73086994, 73230079, 73734908, 74349728, 74538396, 73915378, 72581995, 70901682, 69015659, 66767516, 64095512, 61260454, 58558469, 55981284, 53356221, 50725160, 48347129, 46326604, 44476742, 42651340, 41035981, 39959394, 39524439, 39585303, 40010770, 40751542, 41604471, 42087129, 41700679, 40327285, 38351150, 36415594, 35028292, 34255501, 33672756, 32636340, 30720446, 27979056, 24834579, 21775541, 19193126, 17418420, 16728205, 17173393, 18410056, 19811543, 20854108, 21442094, 21873294, 22506749, 23467461, 24620079, 25744222]
40193B5744222R63590Q22491Q09114R10689R80648Q41909M35942j33885o77829
40184C0696891r93846r32604n44070j82398k83879r03778j570487j740730j343497
40175B2201602p51517k96674m999K10801L24325K56719K3257k97956o84098j182566
40165A9798894j835613k591778l223577l364559k791949j728080p14894j00343
40157C448101K24544M94263O58284N02549P4291k72737k85380q1827L4505j05518
40147D691075m39397p39774o96974p8594J028926K155490K734665K508902J679163
40138A2843482P27230J19417P5339M74823R54611J172662J049542P72861N77205
40129A8767172N32850N36911M74178L52906K65080K21747P6533l27168r23415
$$ y = [25744222, 26707812, 27530303, 28339417, 29250106, 30230754, 31072663, 31508605, 31374720, 30696891, 29703045, 28770441, 28226371, 28043973, 27760094, 26856316, 25285829, 23545099, 22201602, 21450085, 21153411, 21148412, 21359213, 21683538, 21940257, 21963514, 21665558, 20981460, 19798894, 17963281, 15371503, 12147926, 8783367, 5991418, 4263338, 3548444, 3448101, 3672645, 4166908, 4825192, 5327741, 5402032, 5129295, 4843915, 4762088, 4796593, 4691075, 4251678, 3511904, 2814930, 2736336, 3765262, 5920752, 8655417, 11164319, 12843482, 13570712, 13690129, 13765468, 14240291, 15194902, 16367564, 17417106, 18189967, 18767172, 19300022, 19836933, 20311111, 20664017, 20929097, 21150844, 21227377, 20900209, 19976794]
40120A9976794j384807j355873p34228K52867J198572J749756J793104J499332
40112B2995517J164506R50361P93316N98857M51488N12760P30180Q04962N21977
40103B9523924J09m84655q37031j174973j582638j984448k251265k275730j935887
40094A6997406j179041k28687M62041O08223L39705o3760n28018j072073j474525
40085A3861271j385511q17464k42878o3354j78602k40513j72878k29851o04592
40076I925628j161674j554741j501795r76402k40785L23808N10584M03673J67388
40067E895684j73225o17360r59445r08265m67489q586J42659R7620K88169R85425
40057D275187J964711K620563K432745J406826R1769q66522j179934r27717k67710
$$ y = [19976794, 18591987, 17236114, 16501886, 16754753, 17953325, 19703081, 21496185, 22995517, 24160023, 25110384, 25903700, 26502557, 26954045, 27466805, 28196985, 29001947, 29523924, 29524033, 29039378, 28202347, 27027374, 25444736, 23460288, 21209023, 18933293, 16997406, 15818365, 15589678, 16051719, 16659942, 16999647, 16935887, 16407869, 15335796, 13861271, 12475760, 11658296, 11415418, 11352064, 11173462, 10932949, 10760071, 10530220, 9925628, 8763954, 7209213, 5707418, 4731016, 4490231, 4814039, 5324623, 5728296, 5895684, 5722459, 5105099, 4145654, 3237389, 2769900, 2761314, 2903973, 3001593, 3289762, 4275187, 6239898, 8860461, 11293206, 12700032, 12791801, 11925279, 10745345, 9817628, 9549918]
40048I549918O52942J530382J921554J591565P37160k41463j091588j738100k104840
40039A0807530k108209j816926j466105j266120j252049j308180j279356j093849
40031g83264q60657q04817r85069j091604o90862K45140J159938J382589P57002
40022a671604k58469j065762j391246j300193r35607l96535J76265N77519O93313
40013e572319O11357N04027M53334M60906N64476Q15585J141526J339194J233394
40004A551480P69885k7776j047682j993683k466438k289508j693057j052142m88786
39995h737707J37023Q70618J476082J694306J586072J477335J544725J557847
39987A606301J138176K66692n88816r38445p76036m80265k69549J0264M88060
$$ y = [9549918, 10202860, 11733242, 13654796, 15246361, 15983521, 15742058, 14650470, 12912370, 10807530, 8699321, 6882395, 5416290, 4150170, 2898121, 1589941, 310585, -783264, -1643921, -2448738, -3433807, -4525411, -5216273, -4971133, -3811195, -2428606, -1671604, -1930073, -2995835, -4387081, -5687274, -6622881, -7019416, -6843151, -6265632, -5572319, -4960962, -4456935, -4003601, -3542695, -2978219, -2162634, -1021108, 318086, 1551480, 2321365, 2293589, 1245907, -747776, -3214214, -5503722, -7196779, -8248921, -8737707, -8600684, -7730066, -6253984, -4559678, -2973606, -1496271, 48454, 1606301, 2744477, 3011169, 2422353, 1483908, 707872, 227607, -41942, -31678, 456382]
39978D56382Q99676Q34815K44386n13333j089095j403005j510451j451498j317054
39969d849177j270525j351520j353989j030593l67599M38474J208751J849043
39961f727135K214416K085976J397700M28143l55979o87123o75552n67989l99556
39952c287099K75O54539J232996J311553P92731j8858p22834j114670j217782
39943b369149j175287j150642j222655j293518j139258o08333K29977J127952
39935g600913J815683K136820K104042J836525J400618P41497j37029r54732j288540
39926E3971j008459m65391j35801j57436l26847m68859o17724q20798r56242q75273
39916e778859o30271m04777k31901N3974N11856Q75245Q00397K94952k67511n71015
$$ y = [456382, 1356058, 2190873, 2435259, 1921926, 832831, -570174, -2080625, -3532123, -4849177, -6119702, -7471222, -8825211, -9855804, -10223403, -9784929, -8576178, -6727135, -4512719, -2426743, -1029043, -600900, -956879, -1644002, -2319554, -2887543, -3287099, -3286824, -2632285, -1399289, -87736, 704995, 686137, -36697, -1151367, -2369149, -3544436, -4695078, -5917733, -7211251, -8350509, -8958842, -8728865, -7600913, -5785230, -3648410, -1544368, 292157, 1692775, 2434272, 2297243, 1342511, 53971, -954488, -1419879, -1555680, -1713116, -2039963, -2508822, -3126546, -3947344, -4903586, -5778859, -6409130, -6813907, -7045808, -6991834, -6479978, -5604733, -4804336, -4509384, -4776895, -5347910]
39906e347910o16057n04849j97357L39839R20110J337930J689615K183191K632391
39897B436903K482967J484755Q6969j011531j518034j591317j446515j180414
39889b56217q85121o65887n42832n01721o01701q54231j043472q93502m31522
39880f676206K3752K88304N34356R94408J606760K085740K234908K046546J550645
39871D689213P36352l17148j318380j892740j892905j533603j113533o06966K93130
39862b956580J603031K674170K657767J381777m05374j716458k119945j844638
39854g26250j319205p84860k74575K18719O25167Q23606P70567N79209M13410
39845C25788K99515J03890k89772q25969j281040j361318q66604Q1146R70896
$$ y = [-5347910, -5963967, -6468816, -6666173, -6326334, -5406224, -4068294, -2378679, -195488, 2436903, 4919870, 6404625, 6491594, 5480063, 3962029, 2370712, 924197, -256217, -1141338, -1807225, -2350057, -2851778, -3453479, -4307710, -5351182, -6244684, -6676206, -6652454, -6364150, -5829794, -4835386, -3228626, -1142886, 1092022, 3138568, 4689213, 5425565, 5108417, 3790037, 1897297, 4392, -1529211, -2642744, -3249710, -2956580, -1353549, 1320621, 3978388, 5360165, 4954791, 3238333, 1118388, -726250, -2045455, -2830315, -3104890, -2886171, -2261004, -1437398, -666831, -87622, 325788, 625303, 729193, 439421, -386548, -1667588, -3028906, -3895510, -3814364, -2843468]
39836b843468J256496Q75289K99635L880P968K4227j12025l19804m64910m76749
39826a749461l10970K0175L54448M49508K02881k46695o33866p32672m59255O8665
39816c037242N54366O98901M24644o5796m29724l82848J39173R02518J490139
39807B94131J619829J378955J077078Q70810O36243K39944j87217l72732k78231
39798E278810k25422n60444j231994j810963j957366j758803j518541j322527
39790e107250j013394n65918k31571j89528k40271l0925N06701J105810J490066
39781d276280J599664J543156J476360J497626J517551J264715N90306k31100
39773D981998o78508n15070j5052L86214N46362O46823Q58833J075572R83234
$$ y = [-2843468, -1586972, -711683, -412048, -408168, -400200, -375973, -487998, -807802, -1272712, -1749461, -2060431, -2040256, -1685808, -1236300, -1033419, -1280114, -1913980, -2646652, -3105907, -3037242, -2482876, -1783975, -1359331, -1425127, -1854851, -2237699, -2098526, -1196008, 294131, 1913960, 3292915, 4369993, 5240803, 5877046, 6116990, 5929773, 5557041, 5278810, 5053388, 4492944, 3260950, 1449987, -507379, -2266182, -3784723, -5107250, -6120644, -6686562, -6918133, -7107661, -7347932, -7378857, -6872156, -5766346, -4276280, -2676616, -1133460, 342900, 1840526, 3358077, 4622792, 5213098, 4981998, 4303490, 3788420, 3773368, 4159582, 4705944, 5352767, 6211600, 7287172, 8270406]
39764H270406L96337m70425j124834j258091j030234q26031q27219r59938j141548
39755A028423j320537j297946q13234P8336R23268J281813J062589L94459n63696
39746G73475j511977j973663j697770j013482n12020m11956m80120n37852p23923
39737h089288j146250j520685j368263n08281P52328J865447K413702K331916
39729e269374J886516J431871J117030Q15857L45225k92965r05991j286344j353246
39720c511421j179522r47269q38201q77504q77379o00961m319P25685J373821
39711f737070J859707K165940K206087J898083J359819Q92800O92596O41533M61736
39702E441231L0921n17927r61284j157005j075295p65082l23718J47324N66003
$$ y = [8270406, 8666743, 8196318, 7071484, 5813393, 4783159, 3957128, 3129909, 2169971, 1028423, -292114, -1590060, -2403294, -2324958, -1401690, -119877, 942712, 1337171, 773475, -738502, -2712165, -4409935, -5423417, -5935437, -6347393, -6827513, -7365365, -8089288, -9235538, -10756223, -12124486, -12632767, -11880439, -10014992, -7601290, -5269374, -3382858, -1950987, -833957, -18100, 327125, 34160, -871831, -2158175, -3511421, -4690943, -5638212, -6476413, -7353917, -8231296, -8832257, -8836576, -8110891, -6737070, -4877363, -2711423, -505336, 1392747, 2752566, 3645366, 4337962, 4979495, 5441231, 5472152, 4954225, 3992941, 2835936, 1760641, 995559, 671841, 819165, 1385168]
39693A385168Q25669P83762L95066j56781n73803p18076o91356o31356n33624
39684H4669l14171M6716M74719Q35096R57284P32614K67534j43493k95709k80913
39674B364346l42419n68181q01921q20596n25938P686N89455J008340J128545
39665B039317R27817M77843p1279n23600p60874q50186r27726r59035p53302k77875
39655a678900J83271K96737J2985m47699q20691r15947o77777k98597j39284l21741
39645d807643m97115k58379K86935O36297N65634L65571L32727L43566J27206
39636b905201k67273n20432m37640q1134M07031Q94606J202061J168049Q22524
39627B82591L74755J2314j81606j36866J84627O05511P44284L83930k30789o16834
$$ y = [1385168, 2210837, 2994599, 3389665, 3232884, 2659081, 1941005, 1249649, 618293, 84669, -229502, -182786, 291933, 1127029, 2084313, 2816927, 3084461, 2940968, 2645259, 2364346, 2021927, 1453746, 651825, -168771, -694709, -687023, -97568, 910772, 2039317, 2967134, 3444977, 3373698, 2850098, 2089224, 1239038, 311312, -647723, -1401025, -1678900, -1495629, -1198892, -1185907, -1633606, -2454297, -3370244, -4048021, -4346618, -4485902, -4807643, -5304758, -5563137, -5276202, -4639905, -4074271, -3708700, -3375973, -3032407, -2905201, -3172474, -3692906, -4130546, -4211680, -3804649, -2910043, -1707982, -539933, 282591, 657346, 669660, 488054, 351188, 535815, 1141326, 1885610, 2269540, 2038751, 1421917]
39617A421917n55387k31711J08558M28894P29406Q14477M87680p4398m04663k63763
39607B461010J25856M49069O85517R51343J119327Q62220O0860j020121j967529
39598C727552k477439k406641j796304r36875k54054K901q1213k69550m13095
39589d904718m61095l63764j06072J90345L19098J94035k1028k1395L60879R57635
39579c856080J368410J321782R46483O63963Q23807J441104K200809K644488K440414
39570I995180J624692N87830k66604q42107j269304j599071j744438j692452j564418
39561C229308j415633j143340o71328j07247L38920M90401K49534l32931r97279
39552c59595j458284j714025j997312k348725k452621k040817j274550n45529
$$ y = [1421917, 866530, 634819, 743377, 1172271, 1901677, 2716154, 3203834, 3129436, 2724773, 2461010, 2586866, 3035935, 3721452, 4672795, 5792122, 6654342, 6715202, 5695081, 3727552, 1250113, -1156528, -2952832, -3889707, -4143761, -4140860, -4222073, -4491623, -4904718, -5365813, -5729577, -5835649, -5645304, -5326206, -5132171, -5153199, -5174594, -4813715, -3856080, -2487670, -1165888, -219405, 444558, 1268365, 2709469, 4910278, 7554766, 9995180, 11619872, 12207702, 11941098, 11098991, 9829687, 8230616, 6486178, 4793726, 3229308, 1813675, 670335, -993, -108240, 230680, 721081, 970615, 637684, -359595, -1817879, -3531904, -5529216, -7877941, -10330562, -12371379, -13645929, -14191458]
39544a4191458m0811L15773O28465R41405J269003J491974J321533O25876k49692
39535g887932p47084o91521m06399k35929k07889k21347k94268m54250n49090
39526a1695709l56014J59645P76441J162573J087112O25159K02441K67620P93954
39517f976778J223186J043245L45543l05985m62691j00739N52135J251738J774472
39508a655874J944987J767348J433657J100192P26441K24355l22069p36296j018383
39499C464358j359439j830318k198039k166819j715900j073665m28737J55882
39491g152677N59654N72531J78257k78180l94352j39915J76464L62699N97633
39482e517886J156972K000425K755776L092804L010512K713067K270612J520823
$$ y = [-14191458, -14232269, -13916496, -13288031, -12346626, -11077623, -9585649, -8264116, -7638240, -7887932, -8635016, -9326537, -9732936, -9968865, -10176754, -10398101, -10692369, -11146619, -11695709, -12051723, -11892078, -11115637, -9953064, -8865952, -8240793, -8038352, -7770732, -6976778, -5753592, -4710347, -4364804, -4670789, -5133480, -5234219, -4682084, -3430346, -1655874, 289113, 2056461, 3490118, 4590310, 5316751, 5541106, 5219037, 4482741, 3464358, 2104919, 274601, -1923438, -4090257, -5806157, -6879822, -7308559, -7152677, -6593023, -6020492, -5842235, -6120415, -6514767, -6654682, -6478218, -6115519, -5517886, -4360914, -2360489, 395287, 3488091, 6498603, 9211670, 11482282, 13003105]
39474A3003105L60007r52430j921934k272436k148949j812203j281210m41362
39466B532588N74431J342639J550244J295849R12139N99372L29867K0658l48549
39457H809238p80105j287728j817347k203565k287256k081342j771856j530615
39449d950576j358536j154281r14023p78696q37012r39856q04941l29191K49140
39440a1817972N38548L58512o2795k46547J35347R56794J731171K039570J867822
39431d499550J514442J221454R66261N88528J6781o59064j248090j525301j314452
39422d938991o37536J82192O51008M42871l46656j282431j924783k086188j805230
39413a1745744j167739k29494R10545K050307K943864L409393L393596K986308
$$ y = [13003105, 13363112, 12410682, 10488748, 8216312, 6067363, 4255160, 2973950, 2532588, 3107019, 4449658, 5999902, 7295751, 8207890, 8807262, 9137129, 9157787, 8809238, 8029133, 6741405, 4924058, 2720493, 433237, -1648105, -3419961, -4950576, -6309112, -7463393, -8377416, -9156112, -9993124, -10932980, -11737921, -12067112, -11817972, -11279424, -10920912, -10983707, -11230254, -11094907, -10138113, -8406942, -6367372, -4499550, -2985108, -1763654, -797393, -208865, -192084, -851148, -2099238, -3624539, -4938991, -5576527, -5394335, -4743327, -4300456, -4647112, -5929543, -7854326, -9940514, -11745744, -12913483, -13142977, -12232432, -10182125, -7238261, -3828868, -435272, 2551036]
39405B551036K380412J752515J143420M89468k18303q76607j413887j915030k498165
39396A394859l067572l271985k772176j578240j40569R14721J223555R37381N60046
39387e799980N21736Q89768J417906J776191J742584J307531O83269J66053p1905
39378B633153n4877R0981K15213J62628j12720m16682m83180l58562m19029q52594
39368D04331j307988j275513o79479J46027R32123J591167J912363J562129N59242
39359C844402n26659j086254j069318r27740j053002j381997j480167r30848K63660
39350d347923J570519K284105K085092J225575J82463p35608j419392j813185
39342i68354j902569j752210j420869q95353j97638N18368J059719J299128J127891
$$ y = [2551036, 4931448, 6683963, 7827383, 8316851, 8098548, 7221941, 5808054, 3893024, 1394859, -1672713, -4944698, -7716874, -9295114, -9435683, -8520962, -7297407, -6360026, -5799980, -5278244, -4388476, -2970570, -1194379, 548205, 1855736, 2539005, 2705058, 2633153, 2578276, 2669257, 2884470, 3047098, 2934378, 2517696, 2034516, 1675954, 1256925, 404331, -903657, -2179170, -2858649, -2712622, -1780499, -189332, 1723031, 3285160, 3844402, 3317743, 2231489, 1162171, 234431, -818571, -2200568, -3680735, -4611583, -4347923, -2777404, -493299, 1591793, 2817368, 2999831, 2264223, 844831, -968354, -2870923, -4623133, -6044002, -6939355, -7136993, -6618625, -5558906, -4259778, -3131887]
39333c131887M67932n10657j313251j495835j115416o53960m98609o17760p12728
39324i582171n27458p519O83557J248659J457349J310881R74086N91431K61808
39315c589377J15707K24508M26976M36518J84229r7572k02763k11547l27522n87452
39305c628295q51066r74762q76829n34591o8754K43798K19023J1279m6906J41862
39295f365241L33405K80140L7572j35078q2132J12017K28610J09489j85253l77166
39285f043637k16731K09502N10212M10401N6831k01688k57335l11974n28317p77482
39275g150218p81211l99268K66189R60396J427359J565378J508338J509184J685306
39266E91453J891947J859143J428286O70329j70572q63866j395195j963078k683946
$$ y = [-3131887, -2663955, -3174612, -4487863, -5983698, -7099114, -7753074, -8251683, -8869443, -9582171, -10109629, -10117148, -9433591, -8184932, -6727583, -5416702, -4442616, -3851185, -3589377, -3473670, -3249162, -2822186, -2385668, -2201439, -2299011, -2501774, -2713321, -3040843, -3628295, -4479361, -5454123, -6330952, -6865543, -6934297, -6690499, -6471476, -6460197, -6507103, -6365241, -6031836, -5751696, -5714124, -5849202, -5931334, -5819317, -5590707, -5481218, -5666471, -6043637, -6260368, -6050866, -5540654, -5130253, -5073422, -5275110, -5532445, -5844419, -6372736, -7150218, -7931429, -8330697, -8064508, -7104112, -5676753, -4111375, -2603037, -1093853, 591453, 2483400, 4342543, 5770829, 6441158, 6270586, 5406720, 4011525, 2048447, -635499]
39257f35499l337642l552339l236460k653097k047633j420867p50261j83591J84602
39248a7632787N47795J152214J914093K483257K624182K348202J760018J016828
39240c786198L98419J55572K50676M38777O11425Q55837J169294J363840J335567
39231B793209J229636J243648J413517J634725J714712J372109M35894q28386
39223A1009064j805605k118581j993499j915557k078480k302531k297404j803390
39215e305983o59683R52746K383034K928318K473652J564746Q10178L68798O9624
39206E585430j72715k67908k24375k88250o66621j195278j475013j375594j209577
39197a289901j270773j387464j192432p30553m57718o11067r06876r67380p48441
$$ y = [-635499, -3973141, -7525480, -10761940, -13415037, -15462670, -16883537, -17633798, -17817389, -17632787, -17084992, -15932778, -14018685, -11535428, -8911246, -6563044, -4803026, -3786198, -3387779, -3232207, -2981531, -2542754, -1931329, -1075492, 93802, 1457642, 2793209, 4022845, 5266493, 6680010, 8314735, 10029447, 11401556, 11837450, 11009064, 9203459, 7084878, 5091379, 3175822, 1097342, -1205189, -3502593, -5305983, -5965666, -5012920, -2629886, 298432, 2772084, 4336830, 5147008, 5515806, 5585430, 5412715, 5144807, 4920432, 4632182, 3965561, 2770283, 1295270, -80324, -1289901, -2560674, -3948138, -5140570, -5871123, -6328841, -6939908, -7846784, -8814164, -9562605]
39188i562605l98597K258L37557L54694k3325m43864m66463n9471M70229R03562
39178h886025J198093J280962J086022P66592N73456N01615K93660j97085q50846
39169d233556j462910j868042j929633j649722j259678r56236n99318L9630P89148
39160a3130317J212768J235580J201808J202565Q12584k34279j477700k185160
39152a1362151k126408j574637p77431J61487R92557J351275J148345O66636K41009
39143a1279318O2083K66621Q98146J666433K005124J576152O29636k49549o74921
39134e099593o64375m29965j18586K32562N77438P73188O59410K50145k06677
39125d026453m55391n20549o77042j097969j603842j807379j458535o23361L90396
$$ y = [-9562605, -9961202, -9958944, -9621387, -9266693, -9290018, -9733882, -10200345, -10259816, -9789587, -8886025, -7687932, -6406970, -5320948, -4554356, -3980900, -3479285, -3185625, -3382710, -4233556, -5696466, -7564508, -9494141, -11143863, -12403541, -13359777, -13959095, -13919465, -13130317, -11917549, -10681969, -9480161, -8277596, -7465012, -7699291, -9176991, -11362151, -13488559, -15063196, -15840627, -15679140, -14686583, -13335308, -12186963, -11520327, -11279318, -11217235, -10950614, -10052468, -8386035, -6380911, -4804759, -4175123, -4424672, -5099593, -5763968, -6193933, -6312519, -6079957, -5502519, -4729331, -4069921, -3819776, -4026453, -4481844, -5002393, -5679435, -6777404, -8381246, -10188625, -11647160, -12270521, -11880125]
39116a1880125J207591J558859J428085J071927Q16687P80055Q23116P95812P60827
39107b637166R01926J247727J586930J678984J476587J107816P09182L41123K5951
39098F439060k19304m15512o53645j051718j631947k208740k450760k166798j558308
39089e917672j089862j038991j223485j208077p08108K32578J319276K151927
39081g482414K419607K132317J631006J239204R47206N71199J56211J5416L49963
39072A979715R95174J577287J782150J461917O76216k74995j006895j369805j554503
39063D266261j814848k165878k414191k386949k042495j439240p13439n7229L88708
39054h379300O44172Q40133J033898J098502Q51934L39857o6061q00M19902O33494
$$ y = [-11880125, -10672534, -9113675, -7685590, -6613663, -5796976, -5016921, -4193805, -3397993, -2637166, -1735240, -487513, 1099417, 2778401, 4254988, 5362804, 6071986, 6413109, 6439060, 6219756, 5804244, 5150599, 4098881, 2466934, 258194, -2192566, -4359364, -5917672, -7007534, -8046525, -9270010, -10478087, -11186195, -10953617, -9634341, -7482414, -5062807, -2930490, -1299484, -60280, 886926, 1458125, 1614336, 1629752, 1979715, 2974889, 4552176, 6334326, 7796243, 8472459, 8197464, 7190569, 5820764, 4266261, 2451413, 285535, -2128656, -4515605, -6558100, -7997340, -8710779, -8768008, -8379300, -7735128, -6894995, -5861097, -4762595, -3910661, -3570804, -3636865, -3637665, -3217763, -2584269]
39044b584269K88523k66050l60928K05265R98185J523479J682944J619083J399972
39035D506204J010185M70435j68272q21764j297213j392006j151173q53875o63720
39026c61199m79980k11123M1569J95985L30056M37053L01016j39688n35216n28677
39016i50204k36550k127J70428N40209J061933J332574J172964Q84905P81627
39007D755759P70562O04001L14006J56471K39517M23619N61208O74067Q55742
38998I354952J068198J088384O91534r4817r65773j609221j936338j988913j748053
38989C859953j206756n64139j30105j1846n7883j35787l03127o58717j166372
38980c74779j677434k015201k017798j634124j011067l61896K61834R18948J505157
$$ y = [-2584269, -2295746, -2561796, -2922724, -2717459, -1719274, -195795, 1487149, 3106232, 4506204, 5516389, 5986824, 5818552, 4996788, 3699575, 2307569, 1156396, 302521, -361199, -841179, -1052302, -1010733, -814748, -484692, -47639, 253377, 113689, -421527, -950204, -1186754, -1188881, -1018453, -478244, 583689, 1916263, 3089227, 3974132, 4755759, 5526321, 6130322, 6444328, 6600799, 6840316, 7263935, 7825143, 8499210, 9354952, 10423150, 11511534, 12203068, 12108251, 11142478, 9533257, 7596919, 5608006, 3859953, 2653197, 2089058, 1958953, 1947107, 1889224, 1753437, 1450310, 791593, -374779, -2052213, -4067414, -6085212, -7719336, -8730403, -9092299, -8830465, -7911517, -6406360]
38971f406360J753459J583193J238986R54229O52954J41972n44694j166559j534593
38962c327413j580287j274240o97500j61768k7964l25142o75183o78567l26127
38953i074191M473p8067o16160j261438j569623j357443p85645j23764M94728
38944a4367130J062528J541082J821155J835358J642065J376349J128920Q64346
38936c095327M72693m0211m24092l72392Q5324M89851L90138j72123p44275r79450
38926d389864q90763n95107o1435P16613J464293J806697J694717J416510J119819
38917B281480N55365n13102j781642k552272k426393j672727q74440l86479j95575
38908g565785j05279J07186N89817J272670J856029K079530J981871J792508J623476
$$ y = [-6406360, -4652901, -3069708, -1830722, -876493, -223539, -81567, -626261, -1792820, -3327413, -4907700, -6181940, -6879440, -7041208, -7069172, -7394314, -8069497, -8748064, -9074191, -9069718, -9147785, -9763945, -11025383, -12595006, -13952449, -14738094, -14861858, -14367130, -13304602, -11763520, -9942365, -8107007, -6464942, -5088593, -3959673, -3095327, -2622634, -2662845, -3086937, -3459329, -3374005, -2884154, -2494016, -2666139, -3410414, -4389864, -5280627, -5875734, -5937169, -5220556, -3756263, -1949566, -254849, 1161661, 2281480, 2836845, 2323743, 542101, -2010171, -4436564, -6109291, -6983731, -7370210, -7565785, -7671064, -7563878, -6974061, -5701391, -3845362, -1765832, 216039, 2008547, 3632023]
38899C632023J400421J053540O25392K02520j24087k45537j29092O8522J18737
38890F602439k9218k22880l11658k46571j5020L26268N36836L24498l11405j000462
38880E652827j330156j149763n53815K42019R55818J367102J484300J438838J187528
38871I294698N63569k94191q70171q54069n67004n45114q72010j209555j353190
38862C292963j418045j509603j525852j336170r31407l68397K27650N93366M97288
38853b478207N2677l24321l40868o4822K91125O27752R23986J116976J129277
38844I33575R08368L86375m48724j358313j887279j742344j074320l01128K69294
38835d314496N67945O35110N09601K26730j65682n94077r39389j072629r36812
$$ y = [3632023, 5032444, 6085984, 6711376, 6913896, 6789809, 6544272, 6415180, 6483702, 6602439, 6573221, 6350341, 6038683, 5792112, 5777092, 6103360, 6640196, 6964694, 6653289, 5652827, 4322671, 3172908, 2619093, 2861112, 3816930, 5184032, 6668332, 8107170, 9294698, 9858267, 9564076, 8693905, 7839836, 7272832, 6727718, 5855708, 4646153, 3292963, 1874918, 365315, -1160537, -2496707, -3428114, -3796511, -3568861, -2975495, -2478207, -2425530, -2749851, -3090719, -3155541, -2864416, -2236664, -1312678, -195702, 933575, 1841943, 2228318, 1779594, 421281, -1465998, -3208342, -4282662, -4583790, -4314496, -3746551, -3111441, -2601840, -2375110, -2540792, -3134869, -4074258, -5146887, -6083699]
38826f083699n53897L7948P59094J396223J679489J541548J225533J071337J247594
38817B321170J696149K202852K463519K233656J551329P41240J04453l16348n90480
38808A2407540o60729m17949N7269N00197P07526O80345N64951N51248P60406
38799A5150804J093050J232167R39252L22280l06428p64133j020199r76248n18868
38790A5151677J50971N07657J94151n92852j315974j589596j403905j029957q24060
38781I248112r76237j292849j332181r02581l21478k1562j8420J2575K14061L78946
38771D988386L16129J21043j154L6268K56545O86935J189139J367381Q71525k16937
38761I615260j407032k156755k146492j365456j58537Q63524J214164R13277L65197
$$ y = [-6083699, -6637596, -6599648, -5840554, -4444331, -2764842, -1223294, 2239, 1073576, 2321170, 4017319, 6220171, 8683690, 10917346, 12468675, 13209915, 13314368, 12998020, 12407540, 11746811, 11328862, 11386131, 11886328, 12593854, 13274199, 13839150, 14390398, 15150804, 16243854, 17476021, 18415273, 18737553, 18431125, 17666992, 16646793, 15670545, 15151677, 15302648, 15810305, 16004456, 15411604, 14095630, 12506034, 11102129, 10072172, 9248112, 8271875, 6979026, 5646845, 4744264, 4422786, 4401224, 4382804, 4395379, 4609440, 4988386, 5304515, 5425558, 5424404, 5460672, 5717217, 6404152, 7593291, 8960672, 9832197, 9615260, 8208228, 6051473, 3904981, 2539525, 2380988, 3244512, 4458676, 5371953, 5737150]
38752E737150j33269n86442j007461j210622j054638o99550m06481j91575J00480
38743E47592M42898N98463M76088L01849L39404N83965Q25806Q89704O97791K08420
38733E911980n29798j270283j657892j503661r56377l94219j48290k87372o19960
38724a455872r01993j039061j050198q72573l65625L96788R89487J010509N71045
38715b717493K01667K25179M21345M09278J50485j32173l77872p11109j044488
38706c575181j000946m27659K28292L40303j61429p33413r17290q33146q51769
38697g932238j005317r81647o18134j19323K63465N30968P76684R01388P07142
38688g477012K44691j19728n0179M21924R34414J110317Q35669L13278j03672
$$ y = [5737150, 5603881, 5017439, 4009978, 2799356, 1744718, 1045168, 638687, 447112, 547592, 990490, 1588953, 2065041, 2366890, 2706294, 3290259, 4116065, 5005769, 5703560, 5911980, 5382182, 4111899, 2454007, 950346, -6031, -400250, -548540, -835912, -1455872, -2357865, -3396926, -4447124, -5319697, -5685322, -5288534, -4299047, -3288538, -2717493, -2515826, -2290647, -1869302, -1460024, -1309539, -1441712, -1819584, -2530693, -3575181, -4576127, -5003786, -4775494, -4435191, -4596620, -5330033, -6247323, -7080469, -7932238, -8937555, -9919202, -10537336, -10656659, -10393194, -9862226, -9085542, -8184154, -7477012, -7232321, -7352049, -7402228, -6980304, -6045890, -4935573, -4099904, -3786626, -3890298]
38679c890298j69989J06763N58398J053326J548973J972217K155996J970448J498471
38670F804305J033704Q76354J091438J427966J501377J124994M73018j24031n24010
38661A3685115q43922j214412j590226j841947j927074j906094j871779j916258
38653E73403k064628k152243j862853j025970J40235J163095J672257J593915
38645a962789J097178M58971q9721n07862q93099j208385j190484p08808r5268
38636e100267J71196R9224J99969P77697J481068J732526J390970P75187J86782
38627A714352l32785q24439j221407j370810j129565m60406M49545J203172J478888
38618d93455J327105J095051J061086J213164J339945J230489Q21325K72031j26575
$$ y = [-3890298, -4060287, -3953524, -3395126, -2341800, -792827, 1179390, 3335386, 5305834, 6804305, 7838009, 8714363, 9805801, 11233767, 12735144, 13860138, 14333156, 14209125, 13685115, 12841193, 11626781, 10036555, 8194608, 6267534, 4361440, 2489661, 573403, -1491225, -3643468, -5506321, -6532291, -6392056, -5228961, -3556704, -1962789, -865611, -406640, -496361, -1004223, -1897322, -3105707, -4296191, -5004999, -5100267, -4929071, -4829847, -4629878, -3852181, -2371113, -638587, 752383, 1527570, 1714352, 1381567, 557128, -664279, -2035089, -3164654, -3625060, -3175515, -1972343, -493455, 833650, 1928701, 2989787, 4202951, 5542896, 6773385, 7594710, 7866741, 7740166]
38609G740166k47708l17214o71192j329026j949453k217612k121887j825592j445997
38600d385515j042234o59232k45354L74651J291787K295344K962210K979803K364308
38591E935768J405556M37588l70165j032514j565766j841254j710730j244779
38583A3704p11434l14060r4160q6245l35077o68896p03348k74191L08883O68662
38573b196162Q65432J202397J625680J687934J153224L06079m62059j074630j583471
38564A524424j816286j513171p28905J44639P43081R63361Q96605P18887O26629
38555A559264O90273P43265N55318J32722k76364m69336m40602k57367L5947L61683
38545B634803O37811R05539J230265J412940J055517R4394r26704j347417j042211
$$ y = [7740166, 7492458, 7175244, 6504052, 5175026, 3225573, 1007961, -1113926, -2939518, -4385515, -5427749, -6086981, -6332335, -5957684, -4665897, -2370553, 591657, 3571460, 5935768, 7341324, 7778912, 7408747, 6376233, 4810467, 2969213, 1258483, 13704, -697730, -1011790, -1105950, -1192195, -1527272, -2196168, -2899516, -3173707, -2864824, -2196162, -1330730, -128333, 1497347, 3185281, 4338505, 4644584, 4182525, 3107895, 1524424, -291862, -1805033, -2533938, -2389299, -1646218, -682857, 213748, 932635, 1559264, 2249537, 2992802, 3548120, 3680842, 3404478, 2935142, 2494540, 2237173, 2273120, 2634803, 3272614, 4178153, 5408418, 6821358, 7876875, 7971269, 7044565, 5697148, 4654937]
38536D654937m02049J61355M23627K29111m04523j037376j075990m68399J65434
38527B246127K93248J01514J30419N03603Q35639P90126M10458q2688n31579q18975
38517C877892q31325n62597j56894J98558L53469K06083k14243o70627q81114
38508A319202q01348o25435m83022k80445J02689N98402J024904J285038J403777
38499C543762J427688J357721J150503P60016K25973k71701n23367m82166k83061
38490F905368n5618K10662N95389J098785J559225J671795J172629J58157q26601
38481A2489791j240402j132273j081074j478880k070532k313264k005324j414005
38473b45963r52888r09470j334410j960951k308777k100603j574094j219709j231585
$$ y = [4654937, 4252888, 4414243, 4837870, 5066981, 4662458, 3625082, 2549092, 2080693, 2246127, 2539375, 2640889, 2771308, 3274911, 4110550, 4900676, 5311134, 5228446, 4696867, 3877892, 3046567, 2483970, 2327076, 2525634, 2879103, 3085186, 2870943, 2200316, 1319202, 517854, -107581, -590603, -871048, -768359, -169957, 854947, 2139985, 3543762, 4971450, 6329171, 7479674, 8239690, 8465663, 8193962, 7670595, 7188429, 6905368, 6849750, 7060412, 7655801, 8754586, 10313811, 11985606, 13158235, 13316392, 12489791, 11249389, 10117116, 9036042, 7557162, 5486630, 3173366, 1168042, -245963, -1198851, -2108321, -3442731, -5403682, -7712459, -9813062, -11387156, -12606865, -13838450]
38464a3838450j367368j305036r45549l67724L10756R60279J475485J873308K281584
38455a0922715K781453L302569L667184L681976L235952K423332J556105R42156
38447A0668012O43364N18585M40516L46086J54151j52417l68513k17314K75176
38438A2307646P37488Q55009O45013K70587j95033o70445r29898p93125l59990
38429A1867252J38875O48327J227103J709799J678501Q72799m94507j899483k891472
38420A2857194l277128l064377k385303j486646o99539l19894m47871r15537j411128
38411a150229j737155j947513k189061k426646k407527j931766j101312k51210
38403a5142419L40578O41157Q01086R75577J211669J450268J599394J632643J648171
$$ y = [-13838450, -15205818, -16510854, -17456403, -17824127, -17513371, -16553092, -15077607, -13204299, -10922715, -8141262, -4838693, -1171509, 2510467, 5746419, 8169751, 9725856, 10668012, 11311376, 11829961, 12270477, 12616563, 12770714, 12618297, 12249784, 12032470, 12307646, 13045134, 13900143, 14545156, 14815743, 14620710, 13950265, 13020367, 12227242, 11867252, 12006127, 12654454, 13881557, 15591356, 17269857, 18142656, 17648149, 15748666, 12857194, 9580066, 6515689, 4130386, 2643740, 1944201, 1624307, 1176436, 260899, -1150229, -2887384, -4834897, -7023958, -9450604, -11858131, -13789897, -14891209, -15142419, -14801841, -14160684, -13359598, -12384021, -11172352, -9722084, -8122690, -6490047, -4841876]
38394d841876J797488K097028K328333K218537J758139J258502J016494R76217
38386H608862Q24124L94384j40292n00290o09012o21023p38131j073500j618449
38377D526673k232828k691714k835269k682615k356682j934133j442304r57995
38369a2606867n73087k37569K32079Q97995J529799J792977J583723J092704N57638
38360e730608O2397l87376o88939o48113j75297N51064J130215J186823O58105
38351d041729j20375o68626p63922n66191l19947l6631L93439Q42331R43075N52920
38341c785656M2705o7033L07125P64777R31449Q16792O29601M44463J96742j14745
38331A66220l99154o11253p67423q35075p62359o49474p27993j065202j403762
$$ y = [-4841876, -3044388, -947360, 1380973, 3599510, 5357649, 6616151, 7632645, 8608862, 9432986, 9827370, 9687078, 9186788, 8577776, 7956753, 7218622, 6145122, 4526673, 2293845, -397869, -3233138, -5915753, -8272435, -10206568, -11648872, -12606867, -13179954, -13417523, -13185444, -12287449, -10757650, -8964673, -7380950, -6288246, -5730608, -5668211, -6055587, -6744526, -7392639, -7567936, -7016872, -5886657, -4699834, -4041729, -4162104, -4830730, -5594652, -6160843, -6480790, -6517421, -6123982, -5281651, -4338576, -3785656, -3742951, -3809984, -3502859, -2738082, -1806633, -989841, -360240, 84223, 280965, 166220, -232934, -844187, -1611610, -2446685, -3209044, -3858518, -4586511, -5651713, -7055475]
38322g055475j436708j177786r03415p58754o17574l80785k07925k82276m57508
38313a3278206l57913J48363P30935R22719N91940N0378k48471q5691L97970R09488
38303a0218488J324054J750244K242460K557717K360837J647072P81328R1268
38295B536492l91678p19873p78894m41084J45223O30669Q21124Q28758Q79077
38286C509814J069609J302510J367708J112488N95175K9154m73710r98927j571941
38277E941880j943152j827616j288959o63504j25348M27657J009889J324940J074367
38268C930154L61853l66420p38322p25391n61636n05604o78241j050914j517014
38259a851535j917816k011964j573836o77331J89905N11948K86664K3374J54010
$$ y = [-7055475, -8492183, -9669969, -10573384, -11332138, -11949712, -12330497, -12538422, -12820698, -13278206, -13636119, -13487756, -12756821, -11834102, -11242162, -11191784, -11440255, -11525946, -11127976, -10218488, -8894434, -7144190, -4901730, -2344013, 16824, 1663896, 2445224, 2536492, 2144814, 1424941, 646047, 204963, 350186, 980855, 1801979, 2630737, 3509814, 4579423, 5881933, 7249641, 8362129, 8957304, 8986458, 8512748, 7513821, 5941880, 3998728, 2171112, 882153, 218649, 93301, 520958, 1530847, 2855787, 3930154, 4292007, 3925587, 3187265, 2461874, 1900238, 1394634, 716393, -334521, -1851535, -3769351, -5781315, -7355151, -8032482, -7842577, -7330629, -7043965, -7020591, -6866581]
38250f866581O07870J032264J240717J290545J252191J107414Q58157N90134L96833
38241A509544K96892K16482J8978l89474r06393j223411j072120n07927R4879
38232a962550L66838K77559J49090L06407P01353R55897Q37242N81116N86496
38223B799448Q62242J016894Q23078N36977N30518Q11503J087188J153342J012981
38214A0634171P04107K40694k75018o56929p96715p33423n61082l47674j38905
38205H069226K5055Q6004o9034n45977j270348j950307k314284k338393k166004
38196b474062j897390j578643j302147j142725j041059r25230r10122j160728
38188a2432106j533428j575296r95093l378R04419J378156J349736R34745M27967
$$ y = [-6866581, -6258711, -5226447, -3985730, -2695185, -1442994, -335580, 522577, 1112711, 1509544, 1806436, 2022918, 2041896, 1652422, 746029, -477382, -1549502, -2057429, -1962550, -1595712, -1318153, -1169063, -862656, -161303, 794594, 1631836, 2212952, 2799448, 3661690, 4678584, 5501662, 6038639, 6569157, 7380660, 8467848, 9621190, 10634171, 11338278, 11578972, 11303954, 10647025, 9850310, 9116887, 8555805, 8208131, 8069226, 8094281, 8180285, 8111251, 7565274, 6294926, 4344619, 2030335, -308058, -2474062, -4371452, -5950095, -7252242, -8394967, -9436026, -10361256, -11271378, -12432106, -13965534, -15540830, -16535923, -16539301, -15634882, -14256726, -12906990, -11972245, -11544278]
38179a1544278L21123J019252K379559L660473M110374L611812K658908J749571
38171G966794R66049J68366o24789j220831j492373j435733j075701n44177k07901
38162B499704m16808j040309j498172j381032q51979l32489k2541J12649J23445
38153b807532Q7590J63825L73001M61415K47029k1958M9580M55333Q46598J078030
38143I32911J317134J577987J527916R08451j31466j262495k266736k937749k967148
38134c301195k221865j022318R0069Q23041J228169J409082J323370Q75991P8863
38125g16793r17571j891766k616263k858240k368969j042641P67453K230324K655214
38116f759252K196848J701333J754086K116668K228730J978988J705197J613029
$$ y = [-11544278, -11223155, -10203903, -7824344, -4163871, -53497, 3558315, 6217223, 7966794, 8932843, 9101209, 8476420, 7255589, 5763216, 4327483, 3251782, 2707605, 2499704, 2082896, 1042587, -455585, -1836617, -2688596, -3021085, -3043626, -2930977, -2807532, -2719942, -2556117, -2183116, -1721701, -1474672, -1496630, -1447050, -991717, -145119, 932911, 2250045, 3828032, 5355948, 6264399, 6132933, 4870438, 2603702, -334047, -3301195, -5523060, -6545378, -6455309, -5632268, -4404099, -2995017, -1671647, -795656, -716793, -1634364, -3526130, -6142393, -9000633, -11369602, -12412243, -11644790, -9414466, -6759252, -4562404, -2861071, -1106985, 1009683, 3238413, 5217401, 6922598, 8535627]
38108H535627J537432J261329P97554K94648j56337n47967q94895j195414j400107
38099H231870j419463j218945q95099o17909n26670o86873j041596j352754j328849
38090h56288r29526m38018j14120R4700L34207M82066K81060j95597m90407k56917
38080b088840L71024R75756J256716J146165O78379r1735j047342j949435k441664
38071c190976k201872j234898k1146P90467R33891O98120N16315N11650N30750
38062b667699M74496L90987K66726n5987o28623j163720j225064o92300O8333
38053e232851N78666P25811P57042Q62244R62269R51486R22051R71388R35733
38044B433839N51621j65368r15521j469417j811993j929935j714323j178939n66123
$$ y = [8535627, 10073059, 11334388, 12131942, 12426590, 12270253, 11722286, 10827391, 9631977, 8231870, 6812407, 5593462, 4698363, 4080454, 3553784, 2866911, 1825315, 472561, -856288, -1785814, -2223832, -2337952, -2243252, -1909045, -1426979, -1145919, -1341516, -1831923, -2088840, -1717816, -742060, 514656, 1660821, 2339200, 2247465, 1200123, -749312, -3190976, -5392848, -6627746, -6648892, -5858425, -4924534, -4226414, -3710099, -3198449, -2667699, -2193203, -1802216, -1535490, -1591477, -2220100, -3383820, -4608884, -5301184, -5232851, -4654185, -3928374, -3171332, -2309088, -1346819, -395333, 526718, 1498106, 2433839, 2985460, 2820092, 1904571, 435154, -1376839, -3306774, -5021097, -6200036, -6766159]
38035f766159q3027L23345P82748J219360J414448J258887P85072L8300q77572
38026a904598j654805j906977j527679q18404k07063Q3596P6769j18595m16660
38017h394416p52752j048524j193235j073620o61422o1447N77859J183101J711948
38008i712508K017656J898417J346643O55022J93768J38691M64852J084513J834768
37999g8178K382653K363804J730355Q68144K49183j7107k11111n93607j062615
37990E631521j275354j071770o94774n57106q28612j293444j577591j446648r07150
37981d020928j54259N08099Q14256P63247O75902Q80761J320956J598349J445206
37972C831589J021496O72344N14872L82858R4656l62204q70191j270331j421080
$$ y = [-6766159, -6849186, -6525841, -5743093, -4523733, -3109285, -1850398, -1065326, -1027026, -1904598, -3559403, -5466380, -6994059, -7812463, -8019526, -7935930, -7859161, -7977756, -8394416, -9147168, -10195692, -11388927, -12462547, -13123969, -13185416, -12607557, -11424456, -9712508, -7694852, -5796435, -4449792, -3794770, -3601002, -3462311, -2997459, -1912946, -78178, 2304475, 4668279, 6398634, 7266778, 7515961, 7498854, 7287743, 6694136, 5631521, 4356167, 3284397, 2589623, 2032517, 1203905, -89539, -1667130, -3113778, -4020928, -4175187, -3667088, -2852832, -2089585, -1413683, -532922, 788034, 2386383, 3831589, 4853085, 5525429, 6040301, 6423159, 6517815, 6155611, 5285420, 4015089, 2594009]
37963B594009j287013r83377o52870l10557J00578N28745Q14795Q75471P54346
37954B434127M76600R487n68502j007605j116459r68152p73393o22305m67678
37945b603880l11969k71959m32309p02338q42669o37276r6128M88535P83777P91450
37935c834766Q89064J369237K001358K216141J730226Q48249J22000j56327q0880
37926E104302R3751J77302J04890j02350m10463q25403j344409j839787k067124
37917a109291j876689j405405r87964q51951r18821q98659n52735J26499R38892
37908g536124J630750K023470K036560J669068J032223L84353K5438O6764L18229
37899A650731M63622L51912Q4422j51789k47569j63936J12281M96594P46584O15110
$$ y = [2594009, 1306996, 323619, -329251, -639808, -539230, -10485, 804310, 1679781, 2434127, 2910727, 2920214, 2351712, 1344107, 227648, -740504, -1513897, -2136202, -2603880, -2915849, -3187808, -3620117, -4322455, -5165124, -5802400, -5898528, -5409993, -4626216, -3834766, -2945702, -1576465, 424893, 2641034, 4371260, 5219509, 5341509, 5185182, 5104302, 5198053, 5375355, 5480245, 5377895, 4967432, 4142029, 2797620, 957833, -1109291, -2985980, -4391385, -5379349, -6231300, -7150121, -8048780, -8601515, -8475016, -7536124, -5905374, -3881904, -1845344, -176276, 855947, 1240300, 1265738, 1332502, 1650731, 2114353, 2466265, 2550687, 2398898, 2151329, 1987393, 2099674, 2596268, 3342852, 3957962]
$$ [...]
##END NTUPLES=NMR SPECTRUM
##END=
