##TITLE=31Pdec_SRR167_C2TFA
 CDCl3 64 sc
 5.9.2023
##JCAMPDX= 6.0         $$ Bruker NMR JCAMP-DX V2.0
##DATA TYPE= NMR SPECTRUM
##DATA CLASS= NTUPLES
##ORIGIN= UXNMR, Bruker Analytische Messtechnik GmbH
##OWNER= root
$$ XWIN-NMR		Version 3.5
$$ Tue Sep  5 14:31:11 2023 Russian Standard Time (UT+4h)  she@DPX200
##.OBSERVE FREQUENCY= 81.013821
##.OBSERVE NUCLEUS= ^31P
##.ACQUISITION MODE= SIMULTANEOUS
##.ACQUISITION SCHEME= undefined
##.AVERAGES= 64
##.DIGITISER RES= 16
##SPECTROMETER/DATA SYSTEM= spect
##.PULSE SEQUENCE= zgpg30
##.SOLVENT NAME= DMSO
##.SHIFT REFERENCE= (INTERNAL, DMSO, 0, 248.564)
##AUDIT TRAIL= $$ (NUMBER, WHEN, WHO, WHERE, WHAT)
$$ ##TITLE= Audit trail, XWIN-NMR		Version 3.5
$$ ##JCAMPDX= 5.01
$$ ##ORIGIN= Bruker BioSpin GmbH
$$ ##OWNER= she
$$ F:/spectra/data/she/nmr/P31/1/pdata/1/auditp.txt
$$ ##AUDIT TRAIL=  $$ (NUMBER, WHEN, WHO, WHERE, WHAT)
(   1,<2023-09-05 14:30:10.89 +0400>,<she>,<DPX200>,
      <continue with go, POWCHK disabled, PULCHK disabled
       configuration hash MD5:
       00 E9 B6 7A A2 85 ED C7 34 08 36 98 17 FE 4E 26
       data hash MD5: 32K
       E4 0E E6 D3 92 8A F1 49 19 60 92 33 2B 9F F3 22>)
(   2,<2023-09-05 14:30:15.03 +0400>,<she>,<DPX200>,
      <Start of raw data processing
       efp BC_mod = 2 LB = 5 FT_mod = 6 PKNL = 1 PHC0 = -10615.86 PHC1 = -13.31499 SI = 64K 
       data hash MD5: 64K
       24 3F 08 A7 4E 50 6E 88 FD CA EE 3A 11 98 94 3A>)
(   3,<2023-09-05 14:30:30.84 +0400>,<she>,<DPX200>,
      <pk PHC0 = 1.15478 PHC1 = 0 
       data hash MD5: 64K
       ED AF 58 3A 64 78 CD 3E 33 76 2D 23 5B 34 C1 89>)
(   4,<2023-09-05 14:30:35.67 +0400>,<she>,<DPX200>,
      <abs ABSG = 5 
       data hash MD5: 64K
       0F 99 F7 C7 5C C3 83 34 FE 1B 9A B0 E8 4E 96 44>)
$$ ##END=
$$ 
$$ hash MD5
$$ B1 24 8F 28 0B 6C 8E D6 2F EF 34 B0 3B 64 A5 43
##$RELAX= 
##$RELAX= 
##$RELAX= 
##$RELAX= 
##$RELAX= 
##$RELAX= 
##$RELAX= 
##$RELAX= 
##$RELAX= 
$$ Bruker specific parameters
$$ --------------------------
##$DU= <F:/spectra>
##$EXPNO= 1
##$NAME= <P31>
##$PROCNO= 1
##$TYPE= <nmr>
##$USER= <she>
##$AMP= (0..31)
100 100 100 100 100 100 100 100 100 100 100 100 100 100 100 100 100 100 
100 100 100 100 100 100 100 100 100 100 100 100 100 100 
##$AQSEQ= 0
##$AQ_mod= 1
##$AUNM= <au_zg>
##$AUTOPOS= <>
##$BF1= 81.014009
##$BF2= 200.13
##$BF3= 200.13
##$BF4= 200.13
##$BF5= 200.13
##$BF6= 200.13
##$BF7= 200.13
##$BF8= 200.13
##$BYTORDA= 1
##$CFDGTYP= 0
##$CFRGTYP= 5
##$CHEMSTR= <none>
##$CNST= (0..31)
1 1 145 1 1 1 1 1 1 1 1 1 1 1 1 1 1 1 1 1 1 1 1 1 1 1 1 1 1 1 1 1 
##$CPDPRG= <waltz16>
##$CPDPRG1= <>
##$CPDPRG2= <waltz16>
##$CPDPRG3= <>
##$CPDPRG4= <mlev>
##$CPDPRG5= <mlev>
##$CPDPRG6= <mlev>
##$CPDPRG7= <mlev>
##$CPDPRG8= <mlev>
##$CPDPRGB= <>
##$CPDPRGT= <>
##$D= (0..31)
0 1 0 0 0 0 0 0 0 0 0 0.03 2e-05 3e-06 0 0 0 0 0 0 0 0 0 0 0 0 0 0 0 0 
0 0 
##$DATE= 1693909732
##$DBL= (0..7)
120 120 120 11 120 120 24 19 
##$DBP= (0..7)
150 150 150 150 150 150 150 150 
##$DBP07= 0
##$DBPNAM0= <>
##$DBPNAM1= <>
$$ [...]
##$SUBNAM3= <"">
##$SUBNAM4= <"">
##$SUBNAM5= <"">
##$SUBNAM6= <"">
##$SUBNAM7= <"">
##$SUBNAM8= <"">
##$SUBNAM9= <"">
##$SW= 501.771253377433
##$SWIBOX= (0..15)
0 1 3 0 0 0 0 0 0 0 0 0 0 0 0 0 
##$SW_h= 40650.406504065
##$TD= 32768
##$TD0= 1
##$TE= 0
##$TE2= 300
##$TE3= 300
##$TEG= 300
##$TL= (0..7)
0 120 53 12 22 120 120 120 
##$TP= (0..7)
150 150 150 150 150 150 150 150 
##$TP07= 0
##$TPNAME0= <>
##$TPNAME1= <>
##$TPNAME2= <>
##$TPNAME3= <>
##$TPNAME4= <>
##$TPNAME5= <>
##$TPNAME6= <>
##$TPNAME7= <>
##$TPOAL= (0..7)
0.5 0.5 0.5 0.5 0.5 0.5 0.5 0.5 
##$TPOFFS= (0..7)
0 0 0 0 0 0 0 0 
##$TUNHIN= 0
##$TUNHOUT= 0
##$TUNXOUT= 0
##$USERA1= <user>
##$USERA2= <user>
##$USERA3= <user>
##$USERA4= <user>
##$USERA5= <user>
##$V9= 5
##$VALIST= <valist>
##$VCLIST= <CCCCCCCCCCCCCCC>
##$VD= 0
##$VDLIST= <DDDDDDDDDDDDDDD>
##$VPLIST= <PPPPPPPPPPPPPPP>
##$VTLIST= <TTTTTTTTTTTTTTT>
##$WBST= 1024
##$WBSW= 4
##$XGAIN= (0..3)
0 0 0 0 
##$XL= 0
##$YL= 0
##$YMAX_a= 2289
##$YMIN_a= -6616
##$ZGOPTNS= <>
##$ZL1= 120
##$ZL2= 120
##$ZL3= 120
##$ZL4= 120
##$ABSF1= 248.5645
##$ABSF2= -253.2056
##$ABSG= 5
##$ABSL= 3
##$ALPHA= 0
##$AQORDER= 0
##$ASSFAC= 0
##$ASSFACI= 0
##$ASSFACX= 0
##$ASSWID= 0
##$AUNMP= <proc_1d>
##$AZFE= 0.1
##$AZFW= 0.5
##$BCFW= 0
##$BC_mod= 2
##$BYTORDP= 0
##$COROFFS= 0
##$CY= -3
##$DATMOD= 1
##$DC= 0
##$DFILT= <>
##$DTYPP= 0
##$F1P= 0
##$F2P= 0
##$FCOR= 1
##$FTSIZE= 65536
##$FT_mod= 6
##$GAMMA= 0
##$GB= 0
##$INTBC= 1
##$INTSCL= 6.047779e-11
##$ISEN= 30
##$LB= 5
##$LEV0= 0
##$LPBIN= 0
##$MAXI= 10000
##$MC2= 0
##$MEAN= 0
##$ME_mod= 0
##$MI= 50
##$NCOEF= 0
##$NC_proc= -11
##$NLEV= 6
##$NOISF1= 182.463
##$NOISF2= 159.3651
##$NSP= 0
##$NTH_PI= 0
##$NZP= 0
##$OFFSET= 248.5645
##$PC= 4
##$PHC0= -10614.71
##$PHC1= -13.31499
##$PH_mod= 1
##$PKNL= yes
##$PPARMOD= 0
##$PSCAL= 0
##$PSIGN= 0
##$REVERSE= no
##$SF= 81.0140089999694
##$SI= 65536
##$SIGF1= 159.3651
##$SIGF2= -187.1042
##$SINO= 113.3802
##$SIOLD= 16384
##$SREGLST= <1H.CDCl3>
##$SSB= 0
##$STSI= 65536
##$STSR= 0
##$SW_p= 40650.406504065
##$SYMM= 0
##$S_DEV= 0
##$TDeff= 32768
##$TDoff= 0
##$TI= <>
##$TILT= no
##$TM1= 0
##$TM2= 0
##$TOPLEV= 0
##$USERP1= <user>
##$USERP2= <user>
##$USERP3= <user>
##$USERP4= <user>
##$USERP5= <user>
##$WDW= 1
##$XDIM= 65536
##$YMAX_p= 506486035
##$YMIN_p= -97237545
$$ End of Bruker specific parameters
$$ ---------------------------------
##NTUPLES= NMR SPECTRUM
##VAR_NAME=  FREQUENCY,     SPECTRUM/REAL,   SPECTRUM/IMAG
##SYMBOL=    X,             R,               I
##VAR_TYPE=  INDEPENDENT,   DEPENDENT,       DEPENDENT
##VAR_FORM=  AFFN,          ASDF,            ASDF
##VAR_DIM=   65536,         65536,           65536
##UNITS=     HZ,            ARBITRARY UNITS, ARBITRARY UNITS
##FACTOR=    0.620285442955139, 1,           1
##FIRST=     20137.2065510682, 0,            0
##LAST=      -20513.1999529968, 0,           0
##MIN=       -20513.1999529968, -97237545,   0
##MAX=       20137.2065510682, 506486035,    0
$$ Real data points
##PAGE= N=1
##DATA TABLE= (X++(R..R)), XYDATA
$$ [...]
44722 47181409 52015203 55477958 56689697 55058698 50945876 46190703 43114936 42346578
44714 42346578 41989948 39569666 34631854 28884240 23987811 20069658 16622208 14016472
44706 14016472 13343102 14952034 17727270 19813196 19705499 16778446 11416388 4976050
44698 4976050 -774051 -4764792 -7359387 -9847189 -13152903 -17105467 -20929257 -24252978
44690 -24252978 -27473819 -31141044 -35114540 -38454909 -40153182 -39864575 -37868304 -34473908
44682 -34473908 -29749250 -23889742 -17614063 -12018789 -8163143 -6879945 -8664658 -13308064
44674 -13308064 -19697333 -26471774 -33105828 -40109879 -48047707 -56645127 -64963521 -71957964
44666 -71957964 -76489384 -77301989 -73842101 -67160491 -59363363 -51927188 -44915034 -37837220
44658 -37837220 -30593739 -23296232 -15900101 -8638623 -2280566 2866723 7887110 14165614
44650 14165614 21276299 26946218 29674304 30803268 33363609 39087338 46961869 54447217
44642 54447217 59616238 62252416 63455937 64434477 65495252 66060178 65614168 64486246
44634 64486246 63608362 63698333 64835711 66589751 68236509 68972747 68296856 66280012 63344437
44625 63344437 59835055 55911877 51636412 46873116 41282253 34825759 28282669 22933510
44617 22933510 19669878 18550328 18997984 19993900 20206249 18607216 15305852 11541040
44609 11541040 8738680 7770050 8953736 12086693 16141391 19365583 20100216 17423121
44601 17423121 11082141 1462911 -9985143 -20865544 -29183815 -34709194 -38778641 -42857083
44593 -42857083 -47399929 -51725174 -54582656 -55104161 -53674466 -51795219 -50784570 -50749244
44585 -50749244 -51021515 -51138582 -50845604 -49550941 -46741895 -43154794 -40975339 -42600686
44577 -42600686 -49275193 -60471771 -73724191 -85020706 -90412416 -88159910 -79461663 -67192476
44569 -67192476 -54304286 -43215173 -35579759 -31713997 -30422040 -29955893 -29217973 -27999855
44561 -27999855 -26533728 -25290875 -24947517 -25914721 -27735832 -29187933 -29071892 -26871787
44553 -26871787 -22807326 -17487427 -11581181 -5827323 -1323853 596554 -582214 -3549355
44545 -3549355 -5869902 -6155635 -5195901 -4595254 -4753476 -4771168 -4031377 -3104314 -3011586 -4120539
44535 -4120539 -5889651 -7332933 -7682393 -7005312 -6343781 -6978315 -9374651 -12895947 -16375185
44526 -16375185 -18631491 -18548496 -15290076 -8898224 -621209 7515925 13554186 16374463
44518 16374463 16243496 14800278 14022037 14616289 15336107 14174177 10527436 6319761 4882483
44509 4882483 8302471 15389539 22183225 24840384 22435064 17158866 12008707 8455005
44501 8455005 6110693 3989741 1594813 -1074379 -4060090 -7638058 -11935501 -16475581
44493 -16475581 -20249076 -22373051 -22790974 -22431607 -22693097 -24487133 -27308893 -29117109
44485 -29117109 -27620653 -22238233 -14798377 -8057186 -3600779 -1312425 -356184 122045
44477 122045 1161145 3794324 8048640 12575201 15814927 17254805 17083600 15003163
44469 15003163 10232641 2833542 -5606656 -13022032 -18369975 -21875605 -24065349 -24930896
44461 -24930896 -23995896 -20895269 -15808240 -9552231 -3440548 1076509 2991730 2298387
44453 2298387 74082 -2137927 -3300025 -3456271 -3418456 -3843091 -4570112 -4828441 -3943446
44444 -3943446 -1604979 2538207 8990840 17452349 25786077 30773813 30600877 26511566
44436 26511566 21650442 18361981 16823094 15874063 14462756 12344386 10161247 9105715
44428 9105715 9852254 11360722 11199086 7636676 1325061 -5285082 -9777391 -10715595 -7553779
44419 -7553779 -821566 7484892 14722228 19525661 22655124 25579182 28535466 30418796
44411 30418796 30382529 29010713 27749949 27436249 27585209 27115982 25651333 23934399 22875079
44402 22875079 22414350 21712805 20390282 18954989 17662487 15479510 10890868 3645379
44394 3645379 -4877575 -12998158 -19762726 -24540697 -26493158 -25223780 -21690576 -17793216
44386 -17793216 -14997543 -13676987 -13583395 -14340120 -15411466 -16199633 -16533133 -16796922 -17381634
44377 -17381634 -18260367 -19247134 -20334268 -21558545 -22882328 -24513098 -27007182 -30604241
44369 -30604241 -34623396 -37954960 -40089984 -41303568 -41907127 -41737557 -40376473 -37468639
44361 -37468639 -32804908 -26542222 -19462371 -12552357 -6029668 935667 9235539 18685146
44353 18685146 27971278 35464954 39926452 40825371 38556296 34481743 30519630 28404250
44345 28404250 28961777 31562808 34098853 34075508 30530546 25063405 20593261 18825948
44337 18825948 18940241 18653799 16347387 12241877 7975303 5348139 5303335 7701411 11709235
44328 11709235 16131142 19356799 19527024 15594110 8605220 1559579 -2574966 -2901979
44320 -2901979 -731470 1948828 3780449 4135424 2799207 122540 -2737660 -4294922
44312 -4294922 -3762345 -1685536 364425 782240 -978640 -3843374 -5640705 -4605236
44304 -4605236 -731932 4182335 7695731 7966603 4442389 -1872861 -8698177 -13752880
44296 -13752880 -16420538 -18017010 -19987555 -21923739 -21798746 -18287521 -12648952 -8190884
44288 -8190884 -7746939 -11233036 -15265174 -15386098 -9306481 1646871 14114658 25379856
44280 25379856 34347773 40717584 44483244 46519200 48626960 52121431 56535461 60026304
44272 60026304 60671763 57116067 48784260 36544648 23026542 11237434 2418110 -4334513
44264 -4334513 -10247055 -15297427 -18683802 -20122830 -19985319 -18472982 -15476919 -11425826
44256 -11425826 -7761768 -6223212 -7770764 -12260853 -18797628 -26035469 -32322881 -36173574
44248 -36173574 -37069678 -35859507 -34290720 -34185171 -36953273 -43326149 -52805517 -63166019
44240 -63166019 -71021134 -73556972 -70054878 -61891514 -51320923 -40361595 -30452814 -22493600
44232 -22493600 -16799743 -13042236 -10421533 -8126882 -5876944 -4119301 -3545411 -4269125
44224 -4269125 -5625962 -6923998 -8161744 -9731273 -11673005 -13725482 -15975059 -18705095
44216 -18705095 -21335980 -22216078 -20143343 -15813006 -11113867 -7116099 -3429321 452966
44208 452966 4049684 6630762 8465897 10578641 13398305 16257288 18159887 18389027
44200 18389027 16253649 11042672 2895560 -6554200 -15014259 -21095900 -24859567 -27079335
44192 -27079335 -28487498 -29662148 -30946168 -32064253 -32140082 -30461700 -27037214 -22055882
44184 -22055882 -14996036 -4836962 8587703 23663671 37643401 48185122 54237058
44177 54237058 55714188 52808718 45880109 35819601 24113592 12359022 1779484
44170 1779484 -6861895 -13273511 -17853263 -21648063 -25590393 -29611807 -32698363 -33855829
44162 -33855829 -32821975 -29872843 -25351569 -19665771 -13521382 -7759373 -2822171 1537653
44154 1537653 5923491 10577028 14953537 18165623 20019733 21434692 23480220 26073219
44146 26073219 28075897 28713385 28319401 27432860 25769537 22643810 17971132 12106889
44138 12106889 4919841 -4014621 -14060532 -23206270 -29766150 -34003580 -37399956 -40498640
44130 -40498640 -42233443 -41554255 -39015798 -36193378 -33850748 -31313522 -27586653 -22447111
44122 -22447111 -16270109 -9426683 -2355222 4151409 9304432 12808457 14574443 14294757
44114 14294757 12084499 9461005 8704607 10749972 14193232 16728298 17153284 15791627
44106 15791627 13674800 11892405 11198020 11463726 11693792 11153880 10300061 10023218 10159469
44097 10159469 9418161 6804535 2606831 -1989389 -5734907 -7793769 -8021267 -6988525
44089 -6988525 -5379479 -3304480 -562436 2499940 4970683 6324178 6843613 6867385 6085268
44080 6085268 3917066 317532 -4045053 -8239681 -11605033 -14035717 -15737518 -16461972
44072 -16461972 -15209068 -11346393 -6089018 -2101960 -1143979 -2454622 -3728629 -3205070
44064 -3205070 -488547 3999377 9518288 15080901 19764406 23241542 25815017 27871552
44056 27871552 29358336 29630503 27715128 23073862 16466753 9899889 5402146 3905632
44048 3905632 5328035 9135165 14197486 18451469 19706498 17243259 12364052 7291215
44040 7291215 3815806 2864105 4533916 7985815 11712407 14639606 17034165 19896982
44032 19896982 23378906 26224078 27045357 25874458 24121162 23167815 23382680 24405428
44024 24405428 25820670 27306556 28571478 29600012 30806211 32641257 35255878 38874816
44016 38874816 44190397 51743490 60837161 69429881 75084113 75780426 70308094 58955672
44008 58955672 44157240 29705780 18697862 12314532 10435608 12595182 17950128 25036293
44000 25036293 32226653 38157588 41511232 41205076 37564692 32778655 29248520 27543106
43992 27543106 26461133 24718607 21906252 18256521 14487489 11715494 10478144 9811437
43984 9811437 8358548 6654003 7282876 12205731 20613729 29899142 38029390 44364000
43976 44364000 48852624 51456707 52260593 51404337 48824323 44562774 39421829 34906103
43968 34906103 32320667 32012987 33379470 35305938 36612483 36466904 34705806 31781686
43960 31781686 28242551 24125413 18895276 12218390 4928566 -1072300 -4302352 -5033354
43952 -5033354 -4767815 -4504776 -4119674 -3472514 -3197004 -3724344 -4100231 -2730211 699301
43943 699301 4716376 7534554 8400551 7376804 4653765 839012 -2394780 -2891375 266462
43934 266462 5771217 11045616 14171816 14938349 14327994 13283568 11866287 9268975 4563386
43925 4563386 -2299981 -10033187 -16643867 -20641959 -21606222 -19780295 -15718262 -10665618
43917 -10665618 -6756862 -5951449 -8497742 -12760498 -16679701 -19197736 -20403220 -20919903
43909 -20919903 -21564008 -23354845 -27393282 -34417861 -44183266 -55043830 -64383494 -70023883
43901 -70023883 -71436375 -69444625 -64994235 -58827555 -52265148 -47236527 -44806332 -44097969
43893 -44097969 -43222510 -40872676 -36472325 -29367378 -19034028 -6239474 6826605 17940058
43885 17940058 25933842 30327024 30597022 26387897 18201318 7515981 -3622619 -12951134
43877 -12951134 -18358597 -18583312 -13770823 -5186863 5677986 17654039 29672773 40302776
43869 40302776 47712199 50191116 46891304 38324824 26312353 13372118 1825547 -6982715
43861 -6982715 -12981095 -17007176 -20034306 -22595917 -24774373 -26477044 -27564876 -27885527
43853 -27885527 -27448393 -26502382 -25160769 -22993546 -19414827 -14693332 -10300172 -7915931
43845 -7915931 -8083095 -9904723 -11903665 -13035502 -13077232 -12360724 -11180548 -9394841 -6776072
43836 -6776072 -3935320 -2616578 -4545036 -9885352 -17162529 -24707140 -31689487 -37589319
43828 -37589319 -41347052 -41778983 -38703726 -33092425 -26128497 -18639927 -11457973 -5618361
43820 -5618361 -1747691 441449 1701272 2526614 3136761 3827983 4846141 5992127 6762224
43811 6762224 6919357 6714401 6639658 7180917 8562711 10289261 11084471 9885877 7021594
43802 7021594 3981907 1981115 1257868 1856772 4283932 8748732 14160504 18622258
43794 18622258 20972880 21469560 21025852 20230253 19169921 17781972 16100891 14336476
43786 14336476 12958504 12684401 14145012 17309427 21187140 24373388 26232380 27483979
43778 27483979 29250348 31506185 32951957 32650702 31382059 31027820 32882247 36819230
43770 36819230 41692455 46032873 48624111 49081121 48027004 46458366 45008691 43994873
43762 43994873 43718897 44059469 44001156 42480210 39965607 38588974 40307614 45131264 51103866
43753 51103866 55514378 56162848 52381482 45532747 38239455 32617681 29187938 27328786
43745 27328786 26172371 24931068 23232055 21815344 22328140 25585983 30293387 34213773
43737 34213773 36376291 37348471 37554089 36416109 33421238 29096866 24376565 19611106
43729 19611106 14782603 10249444 6666527 4435069 3804236 5328996 9562578 16181765
43721 16181765 23878865 31330890 38039854 44122658 49534025 53656322 55493571 54171526
43713 54171526 49485595 42251200 34126390 26894129 21755199 19190675 19254521 21649601
43705 21649601 25381346 28649050 29635646 27700529 23641670 18623410 13104263 7125754
43697 7125754 1310563 -3235547 -6271674 -9081538 -13299457 -19365562 -26496000 -33728065
43689 -33728065 -40287724 -45099403 -46774631 -44368019 -37732210 -27159200 -13455584 1306298
43681 1306298 13943325 21973579 25215036 25213479 23436768 20604993 17450142 15154438
43673 15154438 14699389 16175825 18784625 21041732 21020264 17233146 9847341 730366
43665 730366 -8049644 -15569357 -21875747 -27143200 -31480974 -35015443 -37362556 -37224205
43657 -37224205 -33404300 -26551701 -19482588 -15487568 -16326223 -21531363 -28986518 -36066117
43649 -36066117 -40938737 -43452863 -44790245 -46066730 -47307788 -47748889 -46783979 -44459537
43641 -44459537 -41444376 -38916057 -38190360 -39806223 -42805133 -45366712 -46562769 -47378155
43633 -47378155 -49644131 -53853036 -58251800 -60315631 -59037311 -55550813 -51624422 -48059995
43625 -48059995 -44831811 -42247460 -41103981 -41520956 -42231515 -41513032 -38657071 -34265957
43617 -34265957 -29335322 -24436526 -19735140 -15366556 -11475501 -7862674 -3751456 1731505
43609 1731505 8372691 14082571 15840385 12042044 3925909 -5643838 -14740088 -23407514
43601 -23407514 -32344126 -41237698 -48636007 -52895560 -52825033 -47889951 -38624661 -26967391
43593 -26967391 -15625532 -6719743 -1067685 1356713 766347 -2389226 -7014355 -11306090
43585 -11306090 -13095670 -10510068 -3153518 6760585 15002191 18172071 16377808 12758470
43577 12758470 10374305 10054822 11102743 12883236 14946017 16367213 16203049 14640814
43569 14640814 12886446 11720712 10724538 9052172 6378140 2833712 -1429290 -6115063
43561 -6115063 -10451657 -13414147 -14365450 -13475248 -11672862 -10186898 -9798717 -10324805 -10939899
43552 -10939899 -11056796 -10732811 -10279867 -9822051 -9271417 -8364385 -6672210 -4072360 -1422517
43543 -1422517 -285314 -1621253 -5070669 -9777192 -15459725 -22261918 -30002975 -38197857
43535 -38197857 -46548398 -54728731 -61724376 -65969344 -66268403 -62350434 -54785618 -44944584
43527 -44944584 -34899401 -26559635 -20588664 -16548791 -14137670 -13642804 -14931394 -16672015
43519 -16672015 -17211095 -16070469 -14246501 -13263421 -14258157 -17619084 -22721549 -27712165
43511 -27712165 -30002282 -27671414 -20860290 -11894034 -3805993 1620333 4569383 6088544
43503 6088544 6540213 5456338 2830713 66291 -680815 1962653 7714711 15032665
43495 15032665 22240058 28505149 33980102 39021660 43335635 46076025 46750712 45688264
43487 45688264 43486279 40338512 36176803 31243863 26160320 21390583 16748736 11403776
43479 11403776 4464264 -4057244 -12662317 -19106785 -22161394 -22595855 -22206417 -22032655
43471 -22032655 -21769771 -20636478 -18283081 -14915280 -11170488 -8169241 -7236025 -8989620
43463 -8989620 -12588465 -16048549 -17439876 -15935733 -12027325 -7027384 -2365247 952361
43455 952361 2599041 2921820 2692506 2700280 3426933 4997186 7231309 9520550 10764376
43446 10764376 9914714 6907114 2876871 -810697 -3639942 -5944507 -8248214 -11150431
43438 -11150431 -15636102 -22584260 -31494494 -40183771 -46358711 -49412189 -50314629 -49935894
43430 -49935894 -48052772 -44051142 -37954301 -30329416 -21617558 -12286407 -3677584 2024566
43422 2024566 3282268 594919 -3947545 -8498333 -12579746 -16469210 -20019110 -22456796
43414 -22456796 -23038053 -21324144 -16818083 -9009886 1671705 13193708 22860192 29160161
43406 29160161 32396477 33426307 32399956 29344811 25622083 23743919 25274530 29442371
43398 29442371 34288585 38720423 42801778 46378163 48381745 47736400 44351900 38988351
43390 38988351 32702704 26780804 22664904 21219689 21979073 23344747 23520566 21311039
43382 21311039 16540396 10248109 4429574 1162699 1695129 6087246 13217696 20887346
43374 20887346 26462642 28252302 26553962 23211448 20139310 18298196 17717236 18003888
43366 18003888 18824989 20213479 22440128 25423637 28406497 30462050 31195286 30762161
43358 30762161 29530153 28091732 27189334 26888192 25965968 22950475 17930580 12703182
43350 12703182 8970720 7025348 6321936 6398391 6600148 5610923 2274887 -3080205 -8602165
43341 -8602165 -12162901 -12539934 -9993113 -6436154 -4776375 -7141629 -13421913 -21874671
43333 -21874671 -31047732 -40465600 -49438006 -56204605 -59032334 -57854499 -54289095 -50292147
43325 -50292147 -47310405 -46345902 -47648822 -49780997 -49762091 -45287156 -37074499 -28532496
43317 -28532496 -22825651 -20409216 -19281138 -16959003 -11926946 -3964563 5844967 15314427
43309 15314427 22109754 25008412 24204197 20606008 15407687 10320839 7303477 7278083
43301 7278083 9289910 11461816 12842428 14134670 16736423 21270390 26874019 31642842
43293 31642842 33877985 33220903 30676792 27549271 24502362 21627270 19006043 16959102
43285 16959102 16047314 17062486 20574513 26011434 31522166 35401995 37602587 39337160
43277 39337160 41307461 42941156 43393356 42609890 41172794 39744800 39124800 40342022
43269 40342022 43913190 48881066 52954266 53832802 50498245 43494298 34333285 24775228
43261 24775228 16501540 11064076 9579643 12046344 17035990 22521083 27307258 31595069
43253 31595069 36072707 40604573 43917327 44508744 41900689 37233034 32703376 30149251
43245 30149251 29882925 30874848 32082252 33411263 35210453 36981922 36992064 33467340 26250431
43236 26250431 17200282 8902538 3039241 28 -343877 1811954 5690688 9645506
43228 9645506 12162818 13143980 13713857 14769551 16176103 17362893 18046535 18038250 16819959
43219 16819959 13837437 9141425 3498827 -2036167 -6564057 -9631373 -11339557 -11994853
43211 -11994853 -11426489 -8825934 -3531721 4101815 12768656 20936129 27235904 30380493
43203 30380493 29373801 24310661 16978424 10329351 6900955 7370345 10501176 14491250
43195 14491250 18281489 21497418 23443944 22750377 18300884 10421406 1113088 -6821596
43187 -6821596 -11197247 -11629917 -9535198 -6654578 -3551856 35116 3469129 4774357
43179 4774357 2518990 -2323374 -6931591 -8754163 -6764295 -1309116 6386840 14778677
43171 14778677 22869664 30532845 37468758 42236583 43409751 41829273 40626662 42293804
43163 42293804 46137330 49059617 48526865 44520086 39094369 34553204 31776984 29770576
43155 29770576 26753180 21839013 15623924 9269550 3547395 -1007240 -3618429 -3624373
43147 -3624373 -1178041 2898665 7941874 13794993 20433583 27663937 35255896 43095505
43139 43095505 51159859 59511309 68181009 76678170 83619572 87326417 87135674 84046114
43131 84046114 79963510 76424173 74065418 72972713 73096346 74240451 75889321 77274051
43123 77274051 77645129 76433563 73190848 67556040 59498235 49679447 39483951 30499609
43115 30499609 23779612 19446129 16896897 15383905 14485273 14149893 14397725 15023704 15541753
43106 15541753 15361523 14144940 12234603 10712790 10615151 11733617 12373486 10719686 6561133
43097 6561133 1557244 -2087855 -3048067 -1328697 2009445 5387475 7449972 7706054
43089 7706054 6488070 4400201 2114296 588068 828846 3089019 6603446 10292307
43081 10292307 13317118 14835122 13985873 10752569 6270609 1388594 -4827552 -14150128
43073 -14150128 -26544203 -39154139 -48192330 -51422448 -48930274 -42563354 -35265307 -30090879
43065 -30090879 -28477195 -29071816 -28786316 -25418284 -19277197 -12422101 -6692614 -2520297
43057 -2520297 814076 4224218 8108387 12244743 16130399 19435418 22287663 25203849
43049 25203849 28665135 32648266 36572551 39727581 41654744 42068824 40708061 37717358
43041 37717358 34222269 32026898 32261107 34320400 36396007 37121893 36597822 35856427 35627388
43032 35627388 35826455 36035815 35956171 35070633 32176646 25955489 16384407 5324540 -4679105
43023 -4679105 -12152152 -17083128 -19843529 -20256896 -17845576 -12620724 -5439920 2164658
43015 2164658 8372645 11613733 11111802 7027041 207195 -7901122 -15125244 -18991840
43007 -18991840 -17975076 -12503623 -4628179 3278035 9556412 13517876 15227086 15065499
42999 15065499 13218071 9567238 4273869 -1632467 -6537770 -9180204 -9281226 -7602052
42991 -7602052 -5810843 -5995184 -9355942 -14863667 -19590344 -20884781 -18275279 -13371873
42983 -13371873 -8598317 -6439136 -9057176 -17125504 -28533080 -39128511 -45654262 -47924114
42975 -47924114 -47875909 -46984288 -45283478 -42570178 -39359603 -36124175 -32337299 -27093176
42967 -27093176 -20424597 -13308333 -6512786 -294827 4571437 6378826 3907473 -2040553
42959 -2040553 -9286399 -16474947 -23993301 -32498264 -41144671 -47844269 -51083232 -50981766
42951 -50981766 -48610359 -44827393 -40048226 -34733134 -29563619 -25120035 -21701162 -19486404
42943 -19486404 -18529801 -18412435 -18161712 -16840641 -14236804 -10873270 -7446312 -4427576
42935 -4427576 -2166016 -1174096 -2168662 -5643643 -11082240 -16523403 -19399262 -18346540
42927 -18346540 -14131051 -8475508 -2255707 4541432 11289698 16224030 18007692 17201954
42919 17201954 15589010 14407291 13764730 13362199 13023325 12621860 12182175 12097772 12671147
42910 12671147 13357045 13001233 10951316 7431505 2723082 -3371909 -10875777 -18934292
42902 -18934292 -26272255 -32140105 -36480603 -39397132 -40800591 -40368575 -37490978 -31471200
42894 -31471200 -22326576 -11535863 -1736364 4535135 6047216 3387482 -1248744 -5041953
42886 -5041953 -6119369 -4679947 -2579572 -1706044 -2681059 -4818578 -6839730 -7494085 -5947191
42877 -5947191 -2153754 2972978 8056048 12359576 16614388 22553062 31250709 41800199
42869 41800199 51790134 59125490 63201450 64428186 63238023 59927782 54988704 48908737
42861 48908737 41713604 33226571 23827595 14575720 6581833 604027 -2872647 -3748118
42853 -3748118 -2595119 -306588 2689636 6331414 9890823 11829701 11377157 9941375
42845 9941375 10320779 14489172 22284907 31749291 40140181 45055850 45737702 43760462
42837 43760462 41900691 41753303 42412032 41469929 37093226 29270042 19730070 11077937
42829 11077937 5593130 4138276 5902034 9230199 12752152 15852537 18455069 20676895
42821 20676895 22602209 24132477 25061629 25493140 26202142 28382072 32834844 39297018
42813 39297018 46473841 52709866 56737864 57979867 56377955 52239001 46423365 40465371
42805 40465371 35980499 33593775 32495967 31219437 28866344 25596896 22138443 19070458
42797 19070458 16601372 14836107 14020508 14369796 15696378 17454610 19310037 21431548
42789 21431548 23903186 26015220 26597428 25008043 21255128 15135352 6100963 -5469468
42781 -5469468 -17438822 -27112531 -33122273 -35649441 -35165708 -31757265 -25575475 -17081404
42773 -17081404 -6695253 5001009 16404189 25008213 29066898 28936770 26485498 23488164
42765 23488164 20765857 18237985 15193943 10876151 5477570 440242 -2800550 -4313487
42757 -4313487 -5437428 -7145102 -9186262 -10845260 -11932582 -12835631 -14107759 -16300110
42749 -16300110 -19747797 -24046003 -27911684 -29989343 -29837055 -27929969 -24778693 -20380663
42741 -20380663 -14677676 -8292212 -2384804 2431568 6835048 12029391 18042094 23023167
42733 23023167 24557988 21718798 15775460 9081065 3454955 -606164 -3698683 -6790134
42725 -6790134 -10590521 -15406163 -21334743 -28155833 -34788872 -39317451 -40314539 -38326529
42717 -38326529 -35637422 -34385604 -35139108 -37239954 -39972123 -43141395 -46959957 -51713024
42709 -51713024 -57193698 -62072637 -64131326 -61734122 -55261911 -46977488 -39498925 -34341335
42701 -34341335 -31446792 -29631913 -27641245 -25289840 -23691320 -24031469 -25963351 -27417666
42693 -27417666 -26167699 -21589748 -15004726 -8553948 -3827753 -1369770 -1127905 -2953339
42685 -2953339 -6367675 -10040364 -12154855 -11734777 -9402566 -6516693 -3796947 -1182448
42677 -1182448 1236354 2821042 2969049 1513501 -1588530 -6288392 -11706515 -15897828
42669 -15897828 -17213229 -16051572 -14820787 -15921147 -19850058 -25155145 -29767889 -32151991
42661 -32151991 -31574518 -27955299 -21761458 -13823023 -4901437 4650781 14667111 24512853
42653 24512853 32739171 37577511 37958711 34180829 27674482 20190058 13237010 8129852
42645 8129852 6045432 7408696 11111911 14903166 17083886 17714622 17864213 18028889 17909705
42636 17909705 17461387 17063556 16302017 13594775 7975077 849465 -4905189 -7541583
42628 -7541583 -7523892 -6195477 -4239629 -1672536 1385557 4497036 7210894 9187509
42620 9187509 10069675 9435963 6984809 2932288 -1669126 -5359580 -7522848 -9119568
42612 -9119568 -11661864 -15455569 -19366014 -22299763 -24192648 -25293317 -25225574 -23372231
42604 -23372231 -19797443 -15254102 -10583123 -6628476 -4403803 -4469369 -5877809 -6223219
42596 -6223219 -3222917 3536074 12198280 19813485 24143042 24799156 22947487 20081602
42588 20081602 17241509 15242417 14957271 16729246 19564465 21399333 20468816 16534429
42580 16534429 11003106 5959592 2762316 1199718 51660 -1389999 -2588951 -2701413
42572 -2701413 -1740947 -236281 1882512 5049626 8515177 9948798 7349796 1089680
42564 1089680 -6489321 -13344203 -19051989 -23913448 -27457766 -28380698 -25830271 -20365647
42556 -20365647 -13638466 -7439835 -3039709 -837404 -67103 958278 3579196 7456082
42548 7456082 10857338 12507077 12785695 12785562 12540973 10763202 6368995 -20952 -6138015
42539 -6138015 -9541839 -9341717 -6889057 -4777175 -4844374 -6939273 -9412324 -10439339 -8922030
42530 -8922030 -4963300 -229324 2524466 1220331 -4005652 -11312392 -18939784 -25945326
42522 -25945326 -31572285 -35048110 -36307754 -36027539 -34431025 -30690110 -24034808 -14990608
42514 -14990608 -5073713 4244582 11761945 16278042 16969983 14069599 8738235 2298120
42506 2298120 -4217513 -10113002 -15099582 -19112317 -21696621 -21941971 -19569596 -15734231
42498 -15734231 -11992896 -8651726 -4955080 -848344 2457438 3996541 4253329 4318142
42490 4318142 4523174 4577572 4515571 4680495 5033365 5313306 5830505 7294166 9726806
42481 9726806 12302656 14519930 16741538 19034491 20213872 19055560 16268405 14236209
42473 14236209 14492670 16093121 16769508 15086129 11124531 5843394 667001 -2629718
42465 -2629718 -2734736 71510 3978554 6989287 7967674 6644514 3495374 -32300
42457 -32300 -1887826 -763450 2976627 7927746 12873800 17095138 19944807 20816454 19477723
42448 19477723 15955650 10182674 2315369 -6532082 -14418849 -19765420 -22260537 -22579367
42440 -22579367 -21543950 -19661220 -17098865 -13808396 -9806355 -5478888 -1428519 2092291
42432 2092291 5313429 8283754 10371524 10872180 10021644 8878564 8003821 6659702 3701767
42423 3701767 -932665 -6059470 -10519866 -14107081 -17017913 -18843459 -18616168 -15746810
42415 -15746810 -10503431 -3638658 3953551 11128151 16638792 19939380 21749636 23455114
42407 23455114 25798983 28171620 29149256 27783465 24550555 21076223 18811618 18090324
42399 18090324 18724446 21207278 26469130 34133930 41736277 46371053 46926513 44350236
42391 44350236 40222118 35789673 32109080 30121810 30199148 32007317 35013369 38867975
42383 38867975 43301463 47998806 52551555 56109071 57091234 53863211 46148642 35757918
42375 35757918 25856676 19403861 17713811 19827499 23315402 26271118 28626941 31220411
42367 31220411 33899392 35306361 34319946 30570092 23344530 11392929 -5085412 -22906241
42359 -22906241 -37516399 -46259880 -49696907 -50100072 -49289126 -47656023 -44518454 -39276959
42351 -39276959 -32508337 -25751332 -19923110 -14340654 -7801292 -177123 7822046 16103158
42343 16103158 25301964 35294861 44537199 51357577 55409697 57551037 58749344 59340517
42335 59340517 58855512 56280940 50998880 43903999 37210191 32615190 29734515 26654034
42327 26654034 21967459 16137404 11045515 8342780 7953936 7928444 5929383 1114963
42319 1114963 -5464771 -12219811 -18328269 -23636600 -27982721 -31261892 -33810479 -35932811
42311 -35932811 -37011412 -35774071 -31784396 -26300058 -21296740 -17774641 -15245769 -12730601
42303 -12730601 -9889419 -7030476 -4249671 -1015185 3095658 7383304 10177935 10234330
42295 10234330 7838293 4449103 1528641 -62635 112906 2184664 5682304 9408913
42287 9408913 11868246 11884090 8956510 3311485 -4278878 -12868672 -21635759 -29762668
42279 -29762668 -36083323 -39129024 -37798072 -32107989 -23378827 -13730350 -5231050 840034
42271 840034 4240517 5500786 5586734 5822367 7722832 12235623 18795425 25315394 29508959
42262 29508959 30565240 29872495 30316266 34540736 43070500 53577460 62220749 66287497
42254 66287497 65807543 62680211 58531497 53680830 47835065 41066897 33948448 27288079
42246 27288079 22110630 19465243 19604700 21322512 22551737 21868146 19367684 16218218
42238 16218218 13726472 12878466 14259427 17875564 23031433 28676810 33981422 38488044
42230 38488044 41815862 43584322 43872639 43603486 44086923 45873388 47984565 48453586 45919531
42221 45919531 40853037 35138343 30387206 26848806 24131598 22658664 23782625 28312140
42213 28312140 35408088 43218733 50122643 54834746 55789501 51624881 42832028 32351807
42205 32351807 23786629 18905155 16992724 16265253 15433233 14135713 12698999 11904498
42197 11904498 12582171 14882961 17984600 20920396 23827358 28066939 34750038 43074597
42189 43074597 50340488 53891721 53217637 50229314 47612268 47023431 48625267 51633676
42181 51633676 54746501 56357827 55285933 51768226 47356152 43356556 39515390 34590790
42173 34590790 28082347 20959618 14687179 9980702 6714670 4733064 4438056 6638679
42165 6638679 11933665 20083901 29763907 38929520 45577920 48307425 46434953 40032937
42157 40032937 30096166 18401782 6736913 -3908378 -13311523 -21283768 -27278746 -30874192
42149 -30874192 -32417371 -32845345 -32692600 -31296716 -27090543 -18847350 -6875225 6785463
42141 6785463 19243156 27978852 31645831 30259593 24987036 17648273 9968618 2900921
42133 2900921 -3500495 -9600602 -15603635 -21327328 -26296788 -29961033 -32053527 -33029167
42125 -33029167 -34072860 -36306175 -39781861 -43383779 -45809794 -46501036 -45579156 -43315651
42117 -43315651 -40165162 -37173156 -35636793 -35922458 -36851713 -36640718 -34468122 -31013198
42109 -31013198 -27603116 -25008856 -22890683 -20099791 -15544681 -9028922 -1309422 6732571
42101 6732571 14787066 22712099 29635041 34042182 35007752 32998302 29153726 23964144
42093 23964144 17032914 8253274 -923555 -7611449 -9198005 -5274219 2016515 9610517
42085 9610517 15526328 19450670 22058728 24448034 27920627 33217823 39513356 44797744
42077 44797744 47707410 48470756 47712308 45108986 40020251 32909102 25175350 17852744
42069 17852744 11424417 6698325 4596984 4770081 5463578 5335171 4704014 4603804 5463981
42060 5463981 7381296 10809326 15783229 20730976 23232100 22299671 19353489 16756335
42052 16756335 15774159 15927812 15711164 13703246 9486580 3949703 -1379905 -5510912
42044 -5510912 -8557796 -11297611 -14421415 -18167653 -22306967 -26292613 -29577634 -31863365
42036 -31863365 -32912297 -32189184 -29065580 -23613981 -17042333 -11054452 -6548594 -2717837
42028 -2717837 2602976 11258884 22845215 34371410 42224793 44613018 41981721 35524841
42020 35524841 26359499 16492259 9450588 8529535 14142435 23452464 32720689 39651596
42012 39651596 43713822 45292501 45273565 44952943 45313005 45988610 45298924 41684197 35156771
42003 35156771 27293260 19900509 13794252 8758057 4345280 414961 -3075625 -6405230
41995 -6405230 -9848699 -13157433 -15632844 -16871286 -17201005 -17162732 -16757892 -15591845 -13777871
41986 -13777871 -12330489 -12444628 -14552225 -18186119 -22406620 -25970521 -27404815 -25823094
41978 -25823094 -22158437 -19120787 -19174108 -22383692 -26559714 -29544379 -31001164 -31901451
41970 -31901451 -32788059 -33021227 -31557990 -28017389 -22973473 -17621807 -13311241 -10963701
41962 -10963701 -10370899 -9904703 -7244763 -859765 8912352 20152757 30762000 39661273
41954 39661273 46775161 52192257 55784469 57724236 58848830 59882616 60274035 58327736
41946 58327736 52816345 44282112 34606261 25599233 18260712 13022625 10066964 9331498
41938 9331498 10620604 13797913 18522088 23795607 28334223 31629440 34137261 36036855
41930 36036855 36316883 33750334 28518548 22172630 16088283 10696547 6254752 3427637
41922 3427637 2544102 2812127 2864272 1830773 -497285 -4108688 -8621356 -12714005 -14332651
41913 -14332651 -11802148 -4772054 5615045 17073035 26886752 32965666 34579117 32083302
41905 32083302 26178281 17789183 8412982 -167326 -6783198 -11177220 -13435458 -13736398
41897 -13736398 -12857424 -12229986 -12833776 -14198881 -14905066 -13980109 -11620664 -8837219 -6742283
41888 -6742283 -5941028 -6141257 -6352583 -5728327 -4155345 -1850744 1371349 6062874 12496710
41879 12496710 20364631 28885241 36683277 41629666 41507316 35352794 24181314 10458363
41871 10458363 -2930387 -13400330 -19140467 -19514012 -15062091 -6956385 3586844 15446473
41863 15446473 27464634 38469715 47562809 54478996 59688654 63907186 67208832 68647547
41855 68647547 66923122 61287137 51610736 38022494 21340781 3988284 -10410040
41848 -10410040 -19132674 -22018918 -20816927 -17257123 -12228517 -6563605 -1822729 193311
41840 193311 -1260152 -5076404 -8831304 -10397987 -9359926 -6855000 -3966388 -458335
41832 -458335 4727436 11940584 20045345 27001614 31012007 31493923 29594992 27769465
41824 27769465 28135641 30680536 33119635 32768838 28676974 22097804 15138446 8978613
41816 8978613 3180804 -3375600 -10817845 -17591668 -21607092 -21968387 -19324819 -14747282
41808 -14747282 -8946293 -2795313 2131269 4419192 4289696 3755819 5091829 9209188
41800 9209188 15360674 21946712 27305530 29930399 28519803 22492114 12846705 2334579
41792 2334579 -5862881 -10138752 -11206696 -10806681 -9893997 -8277335 -5673557 -2516863
41784 -2516863 351539 2334975 3198948 2888679 1590584 -164259 -1844035 -3513750
41776 -3513750 -5992661 -10300028 -16800144 -24666057 -32096896 -37318902 -39726418 -40086769
41768 -40086769 -39425785 -37691411 -33764830 -26919109 -18036973 -9102622 -1526685 4799867
41760 4799867 10807832 16928381 22662419 27260531 30483633 32628393 34058087 34912497
41752 34912497 35146959 34535147 32522655 28372472 21901839 14214346 7381342 2972252
41744 2972252 794644 -749943 -3018310 -5951805 -8461441 -9643366 -9515508 -8951049
41736 -8951049 -9245106 -11496291 -15869927 -21333062 -26338346 -29758684 -30943966 -29109743
41728 -29109743 -23364826 -13612550 -988905 12874918 26628779 38979270 48347539
41721 48347539 53643113 55353245 55143670 54144788 52077933 48225169 42750497 36745250
41713 36745250 31379024 27422359 25304512 25077729 26268310 28019858 29330587 28987873
41705 28987873 25676185 18944605 10307083 2832939 -868631 -228370 3681797 9494329
41697 9494329 15926833 21286846 23774960 22856035 19862634 16733901 14426341 12964692
41689 12964692 12593977 13952200 16991419 20576890 23722401 26816144 31092616 37123595
41681 37123595 44305270 51601555 58138001 63046139 65431102 64961391 62295809 58684579
41673 58684579 55235399 52500680 50277123 47505899 42820070 35865459 28149392 22142718
41665 22142718 19294314 19013251 19543915 19503556 18426221 16186948 12470663 7046444 358807
41656 358807 -6481288 -12406622 -16965119 -20080955 -21420630 -20340930 -16626504 -11134900
41648 -11134900 -5512651 -1197971 1400342 2979221 4747856 7582681 11441819 15407479
41640 15407479 18236797 18904109 16864048 12222180 5846867 -937735 -7073473 -12184779
41632 -12184779 -16271203 -19314498 -21455170 -23205979 -24861335 -25608777 -23707597 -17889489
41624 -17889489 -8562909 2315639 12393191 20152683 25558860 29695778 33501765 36792743
41616 36792743 38809082 39596484 40149254 40937752 40967607 38801967 33983093 26856116 17581049
41607 17581049 6347377 -5570964 -16017634 -23469611 -27631081 -28386895 -25173654 -18076109
41599 -18076109 -8930339 -508694 5266165 7932878 7863580 5907606 3576370 2677698
41591 2677698 4253251 8014324 12836968 17528911 21183376 23286249 23710060 22414085
41583 22414085 19187242 14069098 8049018 2867571 -55267 -125759 2956075 9327438
41575 9327438 17888105 25725963 29788485 29362919 26294502 22693036 19195947 15736684
41567 15736684 13004459 12110467 13142732 15077495 17138792 19186708 20337918 18282928
41559 18282928 11219427 355218 -10462931 -17873190 -21289254 -22262032 -22650904 -23869377
41551 -23869377 -26788704 -30982056 -34161708 -33581049 -28582439 -21309120 -14600008 -9567077
41543 -9567077 -5401091 -913504 4320770 10019551 15669934 20788119 25010475 28070837
41535 28070837 29676618 29604658 28146820 26302916 25178299 25115048 25534156 25558628 24677154
41526 24677154 23057763 21617565 21697027 24135095 28438675 33195079 37568960 42126792
41518 42126792 47807171 54210078 59443210 61960279 62305021 62619393 64375066 66908101
41510 66908101 68332768 67533324 64866385 61199828 57034532 52793267 49249817 46883424
41502 46883424 44844623 41130453 34137849 24176873 13743497 6507489 5594829 11957724
41494 11957724 23776805 37323740 48584009 54569020 54016706 47656447 37812689 27196885
41486 27196885 17712120 10235451 5049331 1975778 376476 -221776 545964 3250503
41478 3250503 7215253 10440449 11430745 10619649 9593140 9429379 10349182 12502974 16191949
41469 16191949 21260605 26917944 32365190 37155806 40669766 41568648 38321766 30649460
41461 30649460 20540275 11533020 6388777 5095823 5261081 4542466 2487088 88984
41453 88984 -1671730 -2283104 -1259087 1779844 6486662 11898756 17387816 23045793 28859991
41444 28859991 33780906 35905606 33711470 27424314 19526123 13676419 12389177 15319889
41436 15319889 19826914 23038630 23078333 18720212 9085865 -5536013 -22956171 -39878876
41428 -39878876 -53576458 -62758704 -67267811 -67520819 -64207658 -57989208 -49234139 -38302231
41420 -38302231 -26320629 -15495747 -8199192 -5372738 -5750471 -6770932 -6332277 -3684969
41412 -3684969 1058289 7593183 15258992 22736891 28653387 32454678 34199763 33677260
41404 33677260 30519023 25294150 19635641 14801351 10682357 6693784 3021921 257873
41396 257873 -1789474 -4000746 -6688314 -9193403 -10889383 -11918402 -12560282 -12310559 -10119417
41387 -10119417 -5596801 172380 5076797 7398633 7081608 5702511 5073306 5840273
41379 5840273 7520371 9743526 13109763 18749522 27282496 38279275 50454849 62162454
41371 62162454 71901652 78823495 83141658 86172266 89736897 95023346 101600366 107471572
41363 107471572 110261754 108552528 102375321 92889965 81875790 71278912 62702708 56962292
41355 56962292 53929455 52581533 51181667 47889023 41818803 33735218 25626162 19546813
41347 19546813 16649692 16687725 17974301 18227098 16253058 12924447 10005874 7959553
41339 7959553 5416949 924787 -5331971 -11763645 -16803329 -19756287 -20670868 -19874286
41331 -19874286 -17539757 -13538604 -8034695 -2434241 842956 343324 -2628006 -4738104
41323 -4738104 -3395780 1347049 7537757 13476718 18897701 24341972 29887871 34756451
41315 34756451 38068240 39722908 40424766 41059047 42262292 44334504 46999767 49160586
41307 49160586 49434343 47320710 43648448 39745252 36531586 34546100 34137430 34926019
41299 34926019 35435898 34120118 30866355 27003241 23841167 21713098 20354432 19455785
41291 19455785 18619939 17497323 16465108 16686418 18870315 22123762 24504476 24698438
41283 24698438 22907775 20265728 17757108 15606457 13236619 9691092 4496569 -1521955
41275 -1521955 -6348440 -7996010 -5822013 -699102 6008082 13402866 20839377 26996382
41267 26996382 29835648 28054070 22560377 16118863 11346051 9114154 8757079 9420572
41259 9420572 11043855 14219440 19179541 24810882 28892593 29887992 28632943 27675153
41251 27675153 28574953 30266921 30409955 27792134 22806798 16129735 8075343 -632584
41243 -632584 -8456735 -13998857 -16937528 -17718614 -16872262 -15164769 -13991765 -14760485 -17596367
41234 -17596367 -20884628 -22206167 -19806931 -13607815 -5305356 2587274 8356756 12074101
41226 12074101 14876901 17265528 18357168 16882141 12610793 6613820 386471 -4972687
41218 -4972687 -8900097 -11217605 -12120894 -12114517 -11612324 -10515781 -8408092 -5390715 -2623133
41209 -2623133 -1609372 -2627030 -4017373 -3478590 -275734 3975993 6813066 7050138
41201 7050138 5431341 3652871 3178956 4725469 8084279 12033779 14796325 15157663
41193 15157663 13307066 10507979 8009335 6333713 5375206 4858264 4726397 5352868 7410143
41184 7410143 11326345 16829924 23184100 29804609 36330016 42029279 45516739 45331555
41176 45331555 40666820 31471742 18299290 2565028 -13215708 -26142773 -34316905
41169 -34316905 -37496800 -36452955 -32066830 -25276156 -17504689 -10493185 -5438958 -2457567
41161 -2457567 -979734 -450542 -430439 -248810 858307 2931993 4887440 5464686 4759866
41152 4759866 4524694 6661413 11416255 17076967 21312778 22863705 22395822 22105262 24195415
41143 24195415 29046905 34631175 38090492 38240811 36498629 35337430 36058677 38086892
41135 38086892 39939251 40405263 39016648 36102160 32761581 30443539 29972194 30770565
41127 30770565 31221649 30016291 27178283 23731928 20521176 17673817 15296413 14246407
41119 14246407 15623190 19419635 24175128 28353590 31850649 35676001 40109896 43635415
41111 43635415 44102364 40900630 35675916 30784816 27255914 24465425 21601395 18959301
41103 18959301 17643339 18403793 21143060 25281888 30036123 34357860 37271724 38686496
41095 38686496 39621064 41326706 44306686 48243428 52395581 55624863 56401688 53582744
41087 53582744 47461166 39773296 32567833 27234927 24422340 24178972 25761487 27685784
41079 27685784 28623252 28491321 28553194 30336114 34335501 39554269 44186343 46900889 47645479
41070 47645479 47186370 45882473 43208903 38790497 33783064 30787328 32090211 37936033
41062 37936033 46444934 55032401 61892822 66436632 68752930 68963888 67213202 64178161
41054 64178161 61169276 59122853 57244657 53100309 44775504 33193391 21960442 14604950
41046 14604950 11949220 12033891 12061195 10104346 5520348 -1271459 -8999878 -15893997 -20213719
41037 -20213719 -20572034 -16103990 -6938260 5378464 18519905 30905505 42406279 53358464
41029 53358464 63271953 70853204 74928328 74924557 70915700 64007341 56534597 50859967
41021 50859967 47422584 44382636 39670799 33326826 27682139 25405395 27415648 32368498
41013 32368498 37909225 42562221 46620633 51256483 56908050 62780141 67812269 71665311
41005 71665311 74613833 76892019 78426272 78879360 77589043 73671388 66628953 56958871
40997 56958871 46061097 35600597 26943176 20820056 17100964 14886455 13103285 11180543
40989 11180543 9239420 7810470 7437801 8333859 10184203 12280416 13829756 14037180
40981 14037180 12147562 8101514 3454091 1041828 2977828 8928266 16648276 23987642
40973 23987642 29939994 34068856 35941927 35727621 35002845 36316622 41564005 50539753
40965 50539753 60839494 69140446 72874860 71145831 64586947 54804749 43915366 33971954
40957 33971954 26230118 20942133 18015216 17623377 19902818 24359985 30055964 36231481
40949 36231481 42327471 47581334 51176266 52782596 52516039 50516604 47194265 43777684
40941 43777684 41710562 41187275 41004912 40320612 39986044 41590621 45540617 50564363 54844942
40932 54844942 57246964 57743848 57149203 56351592 55564603 54509799 53372411 52880917 52909569
40923 52909569 51641446 47102817 39427612 30820775 23329854 17448047 12897090 9685044
40915 9685044 7793962 6559263 5207605 3789581 2911622 2560324 1752836 -394936 -3423080
40906 -3423080 -5460556 -4411693 568463 8422097 16872450 23889388 28657516 31319633
40898 31319633 32146132 31278914 29175933 26819793 25170647 24571197 24955227 26481456 29490266
40889 29490266 33752363 38333666 42716645 47747877 54749822 63626547 72521998 79651866
40881 79651866 84853935 88758775 90878858 89412864 83115924 72855155 61041934 49700631
40873 49700631 39170023 28574238 17606485 7919655 2411128 2656835 7146955 12510471
40865 12510471 16429267 18900048 20840523 22415955 23177334 23154577 23048359 23491396 24620836
40856 24620836 26300744 28329744 30366519 31930034 32649742 32625677 32744768 34619014 39761644
40847 39761644 48420040 59214999 69927036 78426210 83062688 83135193 79692711 75352353
40839 75352353 72319735 70450352 67817520 63238478 57715320 53346446 51419718 51760490
40831 51760490 53334475 55008202 56025485 56275903 56243910 56640402 58039431 60570721 63486801
40822 63486801 65073920 63679279 59285146 53803512 49506062 47359281 47012117 47862216
40814 47862216 49573022 51825830 54215659 56404283 57928686 57927760 55659857 51479667 46845319
40805 46845319 43078633 40409154 38431519 37088952 36722212 37272608 37941066 37863197 36964633
40796 36964633 35976792 35606319 35761464 35666895 34774970 33497490 32936286 33943675 36600733
40787 36600733 40524029 45267558 50174082 54163290 56276183 56708177 57144043 59792748
40779 59792748 65806699 74248993 82280624 86524965 84898443 77665911 66800755 54211247
40771 54211247 40625787 26194863 11818530 -575087 -9096666 -12925727 -12235891 -7551128
40763 -7551128 385906 10229691 20076902 28365527 34873061 40784668 47694361 56390545
40755 56390545 66381149 76353813 84961930 91273338 94858433 95916289 95455062 95036528
40747 95036528 95946200 98467344 101904508 105075976 106651242 105458530 101214190 95113949
40739 95113949 89084322 83950691 78658662 71849076 64041751 57601472 54380486 53886194
40731 53886194 54009284 53088933 50901881 48135189 45684764 44454161 45089201 47507862
40723 47507862 51005538 55028292 59422280 63597071 65959609 64977344 60867958 55713230
40715 55713230 51785034 50165897 50983437 54179974 59450145 65834087 72105231 77600747
40707 77600747 82303237 86248446 89380532 91971468 94552871 97126299 98797709 98503763
40699 98503763 95979131 92009856 88138373 86227735 87645769 92123022 97410571 100565977
40691 100565977 99896692 95794426 89990704 84227843 79357841 75232835 71374935 67911448
40683 67911448 65758091 65718754 67642893 70732890 74260187 77308032 78067117 74540364
40675 74540364 66596260 56822728 48667995 43731188 41015089 38433100 34643723 29810850
40667 29810850 25358163 23142875 24368848 28913192 35660727 43411078 51394821 59296546
40659 59296546 67401543 76764820 88566743 102761635 117491289 130167857 139162842
40652 139162842 144449851 147036233 148242336 149279229 150636179 151329799 149107965 142099568
40644 142099568 130557709 116924625 104301829 95051341 90508885 91073775 95938544 103093432
40636 103093432 110335886 116471581 121365413 125102554 127716437 129738040 132235818 135749327
40628 135749327 139390594 141333196 140087296 135257146 127599502 118906793 111575764 107459308
40620 107459308 106654013 107504591 107988491 107188985 105623834 104447027 104477336 105952882 109075151
40611 109075151 114434738 122432905 132242450 141925235 150046039 156860807 163384129 169455899
40603 169455899 173291877 172886964 167311541 156729684 142100369 125473355 110094752
40596 110094752 99356182 95232970 97594427 104701786 114180609 123889939 132493859 139548630
40588 139548630 145115684 149332029 152262855 153882750 154095523 153074457 151835885 152214859
40580 152214859 155767119 162469200 170552567 177661629 182285399 184454817 185528000 187410566
40572 187410566 191609694 198473525 206937862 214995071 220784294 223648363 224253742 223669293
40564 223669293 222543682 221371869 221117270 222711036 225702091 228058396 227857814 224986182
40556 224986182 220958341 217552829 216140527 217952937 224099416 234995437 250052001 267983886
40548 267983886 287180860 305917700 322774256 337147318 349168241 358997318 366345242
40541 366345242 370727497 372076177 371213779 369941278 370390464 373602108 378440448 382262261
40533 382262261 383043072 380912870 377753030 375666334 375855032 378345323 382149007 385676125
40525 385676125 387399710 386497872 383215845 378983494 376156344 377031073 382472819 391319960
40517 391319960 401120276 409310803 413860192 413657129 409230248 403144151 398960893 399193839
40509 399193839 404024390 411650102 419399353 424628435 425502997 421896515 415707683 409850729
40501 409850729 406526460 406265640 408349883 411781163 415795371 419866223 423723634 427542908
40493 427542908 431988097 437906231 445826557 455523790 465886024 475340264 482774549 488233558
40485 488233558 492591446 496471106 499663526 501679405 502556454 502844967 503045317 503460924
40477 503460924 504400789 505822451 506486035 503959081 496119552 482926826 466761620 451052373
40469 451052373 438327214 429060281 422085805 416266206 411843126 409900694 410471808 411767389
40461 411767389 411790734 410398121 409163418 409342662 410614143 411847955 412386281 412153267 410910978
40452 410910978 407868000 401939018 392272633 378896579 363250770 347922063 335400453
40445 335400453 326920816 322479368 321613327 323695735 327542480 331350681 333521492 333549262
40437 333549262 331903551 329006610 324480080 317539185 308096229 297274332 286717587 277607119
40429 277607119 270615307 266510549 265961508 268345037 271356395 272596736 271511436 269254355
40421 269254355 266754057 263591798 258903633 252699395 245873924 239345715 233616394 228881863
40413 228881863 225131927 222282500 220541097 220503647 222617530 226726937 232386007 239295024
40405 239295024 247014942 254568231 260928585 265758172 269040748 270129300 268024025 262767236
40397 262767236 255680766 247724224 238379482 226999273 214862252 204869885 198948428 196247057
40389 196247057 194142380 190809162 186792215 184347034 185291308 189242861 193864962 196943080
40381 196943080 198137169 198550747 198903828 198733373 197405362 195188990 192815021 190306533
40373 190306533 186843601 181807271 175536682 168937546 162744794 157550356 154397331 154763606
40365 154763606 159508523 167877148 177874751 187769643 197063163 205850614 213391612 217584455
40357 217584455 216014411 207700543 194116392 178651949 164831832 154617132 148097525
40350 148097525 144542668 143484354 144820293 148273988 153013847 157645513 160538969 160607557
40342 160607557 158102282 154381096 150694744 147650971 146103158 147573647 152574443 158851131
40334 158851131 162823210 163319811 162934857 165072906 170396053 176794388 182036503 185381457
40326 185381457 186952298 186798239 185051235 182459320 180276397 179582344 180645495 182834054
40318 182834054 185317132 188053636 191922931 197716368 205305300 214047859 223533071 233315082
40310 233315082 242191028 248535352 251481556 251288229 248530129 243538452 236832699 229538578
40302 229538578 222940152 217813135 214413533 212875732 213316715 215572641 218970211 222451003
40294 222451003 225136203 226947458 228432793 229641413 229453216 226681119 221842670 217163700
40286 217163700 214645547 214779446 217409409 222931364 231691239 242547911 253093725 261607876
40278 261607876 268265352 274181442 279730076 284206767 286920951 288151144 288896405 289911554
40270 289911554 291179569 292220615 292583689 291866052 289546347 285288840 279500752 273209441
40262 273209441 267113981 260884550 253536416 244363503 233445651 221507946 209493968
40255 209493968 198104525 187545685 177826622 169386906 163190482 160031934 159986959 162687700
40247 162687700 167703649 174205604 180556302 184867992 186016047 183774901 178201988 169632967
40239 169632967 159420881 149937319 143243265 139870701 139016763 139475915 140045933 139536706
40231 139536706 137202285 133324439 128976764 125063778 121790444 119050077 116958743 115773682
40223 115773682 115388931 115029767 113459332 109670372 103721147 96960830 91086731 86676670
40215 86676670 82718957 77750867 71413102 64850166 59828147 57674040 58803771 62709400
40207 62709400 68150743 73596579 77816025 80248255 81043578 81018750 81506335 83759127 88055457
40198 88055457 93314974 97662834 99378111 97501578 92090608 84334544 76260416 69814953
40190 69814953 65934989 64423714 64530664 65452849 66406933 66548569 65031587 61359638 56032394
40181 56032394 50816663 47612820 46407800 44820802 40588545 34380031 29246136 27297574
40173 27297574 28009375 30026311 33256471 38191242 44125878 49431620 53247300 55647120
40165 55647120 56224453 53828425 48146650 40679867 33665883 28574443 25815278 25021220
40157 25021220 25023534 24288007 22403160 21183758 23758497 32304544 46482442 63539856
40149 63539856 79626107 91561987 98199023 100367072 99423587 95952591 89894967 81450710
40141 81450710 71350886 60445480 49537131 39596946 31698225 26565900 24249541 24001177
40133 24001177 24150397 22389250 16988497 8247450 -1317149 -8437888 -10985176 -8867850
40125 -8867850 -3572800 3119902 10280693 17908319 25937358 33421620 39002985 42084869
40117 42084869 43193100 43190877 42489212 41086002 39010604 36477060 33696214 30646681 27055889
40108 27055889 22810891 18639538 16227001 17226493 22061813 29910737 39701958 50604584
40100 50604584 61497444 70614122 76210702 77469762 74684108 68989748 62176034 56209167
40092 56209167 52162992 49465459 46521338 42241452 36977678 32199420 29543410 30032042
40084 30032042 33693066 39561578 46105920 52017475 56981042 61767634 67257961 73108263
40076 73108263 77657803 79586223 79436408 78878121 78583543 77672058 75374825 72205600 68886114
40067 68886114 65034650 59948109 54184822 49246325 45780410 42998092 39759606 35236863
40059 35236863 28518385 18883380 7154833 -4090473 -12561994 -18194030 -22492527 -26331246
40051 -26331246 -29050968 -29505040 -27246269 -22587319 -16083988 -8317036 40982 8288141
40043 8288141 15928904 22758840 28567466 32768181 34661073 34370271 33212980 32478681
40035 32478681 31818290 29577142 25081704 19998139 16858433 16582077 17957988 19203231
40027 19203231 19318811 18082928 15644689 12591717 10015865 8997632 9894420 12130348
40019 12130348 14654861 16741619 18525701 20671126 23319585 25507162 25925762 24203414
40011 24203414 21117723 17589895 13893895 10008965 6379867 3938593 3362401 4475099
40003 4475099 6436075 8471774 10350882 12100385 13357847 13202642 10623919 4961152
39995 4961152 -3972862 -15575230 -27931258 -38159539 -44007896 -45142430 -42646460 -37694189
39987 -37694189 -31327810 -25059582 -20402935 -17368656 -14257482 -9612824 -4019375 483953
39979 483953 2463610 2202783 1158034 856036 2134849 4866251 8164057 10880504 11884479
39970 11884479 10188367 5665497 95807 -3215671 -1880278 3429991 9772528 14785181
39962 14785181 18289796 21386621 24955439 29279844 34219190 39028535 42434166 43610534
39954 43610534 43074326 42254772 42253568 43246686 44828828 46520206 48105296 49952474 52891389
39945 52891389 57162160 61351388 62943933 60343543 54142634 46238643 38111098 30330630
39937 30330630 23341285 17973413 15060500 14981087 17655932 22520213 28280085 33203553
39929 33203553 36285921 38209986 40849434 45623203 52252645 58932460 63504337 64509575
39921 64509575 61414055 54256507 43567196 30890224 19027988 10963053 8043979 9340794
39913 9340794 12837563 16845350 20129038 21555949 20753355 19095704 19003306 21602515 25329221
39904 25329221 27167412 25127726 19468204 11947030 4296260 -2717155 -9099680 -14664582
39896 -14664582 -18373436 -18941833 -16285719 -12190857 -9291381 -9263475 -11809081 -15050476
39888 -15050476 -16830614 -15984560 -12739489 -8073364 -2903074 1950970 5434944 6736029
39880 6736029 6333917 5952383 6939626 8925890 10383118 10221968 8552492 6249023 4210208
39871 4210208 2796218 1556424 -323094 -2991934 -5671341 -7819642 -10116185 -13530558
39863 -13530558 -17579339 -20330163 -20287954 -17713856 -14027849 -10548635 -7929508 -6055106
39855 -6055106 -4057434 -1002424 2902018 6134714 7408447 7217437 7516964 10138801
39847 10138801 15865151 24554343 35186070 45527207 52527585 53979897 50188710 43971979
39839 43971979 38816332 36629707 36737635 36687501 34133659 28455451 21050746 14180778
39831 14180778 9302578 6307166 4334426 3220674 3888763 7291826 13348667 21103702
39823 21103702 29446055 37138389 42492519 43934742 41195904 35484334 28289400 20426764
39815 20426764 12350911 4709066 -1951778 -7646001 -12580173 -16563695 -19304663 -21097614
39807 -21097614 -22594331 -23903802 -24584770 -24801128 -25956007 -29640425 -36043223 -43714378
39799 -43714378 -50805389 -56213432 -59603270 -60968907 -60757903 -60282820 -61274253 -64426409
39791 -64426409 -68334779 -70108554 -67229991 -59115627 -47403351 -35059385 -24852544 -17974652
39783 -17974652 -13790364 -10977662 -8841114 -7358222 -6237068 -4534361 -1344153 3505299
39775 3505299 9517330 15893878 21740939 26344595 29455509 31036886 30789576 28535080
39767 28535080 25180283 22443055 20988829 19373164 15564830 9269074 2186076 -3682323
39759 -3682323 -7288681 -8478173 -7778633 -6484897 -6070750 -6865848 -7527846 -6137362 -1776037
39750 -1776037 4856924 11976300 17824454 21754736 24456632 26807307 28347615 27258943
39742 27258943 22157444 13783966 4774462 -2151288 -5870777 -7201303 -7870617 -9003007
39734 -9003007 -10439260 -11518837 -12282837 -13444373 -15156787 -16407826 -16047464 -14102790
39726 -14102790 -11555330 -8794844 -4714836 2256687 12097199 22387018 30073198 34343192
39718 34343192 37475525 42488039 50177898 58797645 66048740 70404377 70751583 66354762
39710 66354762 58151206 49340710 43596969 42584574 45379922 49725262 53316208 54540938
39702 54540938 53054868 49651205 44866774 37747723 26731492 11936376 -3949114 -17295434
39694 -17295434 -25897614 -30041217 -31941916 -34172797 -37863734 -41943946 -44373019 -44256705
39686 -44256705 -42440916 -40016298 -36883978 -32223330 -25933817 -18976012 -12344103 -6260453
39678 -6260453 -639173 4010621 6745105 7540596 8158467 10990207 16801255 24025070
39670 24025070 30466258 35057415 37496950 37127913 33650258 28897911 26402073 28359168
39662 28359168 33656517 39319314 43111622 44182272 42225455 37394199 30873805 24381389
39654 24381389 18783603 13789925 9079808 5092412 2537647 1717160 2590071 4947071
39646 4947071 7975713 9828703 8185372 1696601 -8809913 -20420902 -29660388 -34386158
39638 -34386158 -34545908 -31406718 -26485024 -21284470 -17313559 -15447086 -15200692 -15147204 -14162554
39629 -14162554 -12060890 -9365982 -7173309 -7114246 -10458232 -16738620 -23717660 -29014566
39621 -29014566 -31403342 -30548559 -26498899 -20201116 -13897184 -9968364 -9257954 -10872915
39613 -10872915 -13322427 -15294249 -15687388 -13882686 -10263007 -5943475 -1794595 1948536
39605 1948536 5272500 8347356 12071576 17801143 25819046 34380720 40924617 44289957
39597 44289957 45476815 46307350 47629272 48819481 48818344 47537432 46150911 45790841 46000568
39588 46000568 44942179 41388342 36093476 30785924 26213488 21876060 17499503 13849731
39580 13849731 11763918 11044823 10824933 10605255 10412441 10250057 9996433 9644060 8933698
39571 8933698 6800495 2123296 -4449360 -10063302 -11954357 -10231503 -7817481 -7458229
39563 -7458229 -9161630 -10720905 -10283768 -7910392 -4728593 -1150551 3603602 10157082
39555 10157082 17386505 22502860 23026851 18904619 12773329 8120928 6944096 8693047
39547 8693047 10982376 11256252 8241938 2425046 -4516101 -10742174 -15045655 -17150359
39539 -17150359 -17662092 -17710727 -18228781 -19238952 -19845951 -19049311 -16607689 -13196075 -9893144
39530 -9893144 -7501496 -6098944 -5143282 -4278379 -4210450 -6472052 -11908204 -19458892 -26773497
39521 -26773497 -32059376 -35129919 -36767420 -37523641 -37352861 -36139746 -34227918 -32311037
39513 -32311037 -30808321 -29369699 -27102808 -23385312 -18394445 -12830593 -7421351 -2966159
39505 -2966159 -572730 -1233393 -4977038 -10704787 -16926910 -22442290 -26441723 -28551674
39497 -28551674 -29051768 -28684049 -27986323 -27094136 -26351053 -26618125 -28486632 -31382733 -33880831
39488 -33880831 -34870470 -34237805 -32674071 -31188108 -30602655 -31023642 -31712012 -31662361 -30206707
39479 -30206707 -26915313 -21334705 -13416305 -4068689 5321009 13942700 21637373 27984586
39471 27984586 32102496 33687905 33635388 33090538 32220837 30365405 27073198 22428749 16542497
39462 16542497 9453042 1795729 -4891140 -9017349 -10136593 -9086851 -6866852 -3562877
39454 -3562877 1322639 7471595 13135404 16376174 16768192 15354620 12990835 9524000
39446 9524000 5025968 1183123 571651 4426476 11399193 18342112 21985497 20285134
39438 20285134 13180393 2589191 -8653615 -18328179 -25532390 -30196589 -32435535 -32548595
39430 -32548595 -31241826 -29445368 -27969407 -27473070 -28504652 -31131321 -34423343 -36589499
39422 -36589499 -35991694 -32269795 -26549578 -20524107 -15341542 -11433767 -9225727 -9464771
39414 -9464771 -12486214 -17436790 -22693920 -26940324 -29384286 -29120107 -25130381 -17331658
39406 -17331658 -7144259 3401970 12863342 20463915 25522765 27473830 26389423 23005988
39398 23005988 18130931 12168195 5101441 -3158392 -12026260 -19564700 -23152622 -21681043
39390 -21681043 -17001671 -12500994 -10215207 -9873188 -10446343 -11423107 -12212263 -11455857 -7935036
39381 -7935036 -1769271 5891025 13886185 21127926 26275698 28430611 28080974 26480538
39373 26480538 24079928 20402487 15493955 10480564 6315509 2844429 -321963 -2738147
39365 -2738147 -3658295 -3120401 -1686901 561516 3853833 7561926 10054149 10057174 7753427
39356 7753427 4376809 1140243 -1312773 -2936847 -4190665 -5673643 -7489053 -9020790
39348 -9020790 -9526905 -8896852 -7755153 -6981822 -7227425 -8686998 -11137982 -14254583 -17942381
39339 -17942381 -22223972 -26775819 -30855619 -33822058 -35450481 -35576183 -33831950 -30164359
39331 -30164359 -25342070 -20365092 -15359115 -9543962 -2404485 5523193 13139818 19556592
39323 19556592 24087756 25957550 24659903 20600302 14928601 8585049 1744678 -5700075
39315 -5700075 -13324123 -20026352 -24706294 -27116001 -28154230 -29290144 -31478821 -34477570
39307 -34477570 -37215755 -38805644 -39108723 -38424404 -36978834 -34901859 -32399207 -29510651
39299 -29510651 -25765415 -20636002 -14663734 -9785606 -7970549 -9414761 -12341187 -14572462
39291 -14572462 -14975564 -13438831 -10199588 -5806009 -1375393 1925488 3817738 4885958
39283 4885958 5573030 5703477 5078195 3852538 1948660 -1249823 -5895537 -10715918 -13888212
39274 -13888212 -14908554 -14972154 -15455908 -16696718 -18468762 -20915917 -24331346 -28232927
39266 -28232927 -31226097 -31910753 -29790471 -25398010 -19755056 -13705236 -7645101 -1836875
39258 -1836875 3201153 6946539 9556012 11887729 14513526 16838182 17382247 14804767
39250 14804767 8611032 -689424 -11677887 -22503462 -31838912 -39515462 -45964672 -50994007
39242 -50994007 -53377946 -51818007 -46298894 -38578546 -31411808 -27043640 -26028615 -27277801
39234 -27277801 -29213786 -30904647 -32315076 -33887281 -35945688 -38026161 -38567616 -35883493
39226 -35883493 -30068192 -23634371 -19639270 -19333856 -22059990 -26826083 -32833054 -38611592
39218 -38611592 -42140465 -42603150 -41285244 -40084833 -39684268 -39694080 -39872669 -40327432 -40900645
39209 -40900645 -41268255 -41565976 -42177410 -42888433 -42903533 -41811416 -39999040 -37952861 -35591404
39200 -35591404 -32502863 -28571506 -24228561 -20249441 -17282021 -15339328 -13828547 -12411487
39192 -12411487 -11800634 -13280685 -17282652 -22671319 -27542236 -30571495 -31679775 -31776011
39184 -31776011 -31980530 -32781553 -33707596 -33903729 -33074663 -31759307 -30800589 -30902696 -32721075
39175 -32721075 -36832283 -43073963 -49937721 -55048828 -56640639 -54695233 -50536200 -45166488
39167 -45166488 -38130199 -28332799 -15979699 -3224331 7355060 14501281 18224476 18709448
39159 18709448 16222230 11954026 7966690 5915622 6244105 8585584 12101191 15088993
39151 15088993 15165974 10825320 2833402 -6243243 -13749304 -18100197 -18922051 -16819640
39143 -16819640 -12936235 -8215772 -3026749 2314675 7019333 10478843 13440911 17812852
39135 17812852 24719143 32781666 38658906 39624624 35890647 30454228 26468138 24622773
39127 24622773 23172009 20417315 16756678 14182738 14238320 16726743 19875407 21229877
39119 21229877 18939326 13238437 6825702 2975445 2790074 4599453 6200172 7189695
39111 7189695 8818338 12124651 16906071 22341415 27858920 33111299 37631806 41126165
39103 41126165 44032335 47164751 50411413 52088452 50126748 43913202 34557011 23427248
39095 23427248 11216772 -1160838 -11554588 -17522321 -18294679 -15101625 -9576573 -2698435
39087 -2698435 4418216 9672648 11004151 8308664 3750862 -62484 -2099939 -3261190
39079 -3261190 -5185686 -8902376 -14335383 -20625307 -26663262 -31465619 -34452469 -35642750
39071 -35642750 -35484763 -34338011 -32273723 -29567475 -27072577 -25562972 -24748492 -23528447
39063 -23528447 -21356591 -18719022 -15874207 -11743290 -4897307 4384400 13648802 19986140
39055 19986140 21864216 19406941 13719123 6498814 -180655 -4674882 -6728422 -7266082
39047 -7266082 -6890279 -4813518 263608 8198758 16805457 23531153 27497789 29498105
39039 29498105 30167382 28836746 24480352 17322259 9012113 1426777 -4210035 -7196041
39031 -7196041 -7163278 -4503427 -647429 2597988 4071989 3571258 1530489 -1062884 -2526736
39022 -2526736 -1047620 3966341 11150244 18143647 23347352 26670230 28818027 30270417
39014 30270417 30927410 30307639 27908953 23697779 18496770 13673007 10156128 7816409
39006 7816409 5918096 3998925 2134501 576730 -554780 -1367272 -2342946 -4328896
38998 -4328896 -7926840 -12661152 -16932140 -19018393 -18212811 -15080301 -10724719 -5767965
38990 -5767965 60066 7298032 15668924 23715017 29583190 32084452 31122176 27684044
38982 27684044 23791292 21894655 23388386 27503095 32035403 35169745 36273414 35249560
38974 35249560 32034284 26978409 21015864 15021383 9436072 4832822 2360585 3164942
38966 3164942 7557634 14841894 23432083 30989024 35338071 36083183 34943368 33796844
38958 33796844 32668939 30262662 26052177 20904686 15740949 10563517 5033026 -749206
38950 -749206 -6308845 -11005719 -13896998 -14067871 -11622929 -8004060 -4945380 -3358659
38942 -3358659 -3382087 -4923904 -7600005 -10436517 -12202297 -12027274 -9532670 -4803749 1167926
38933 1167926 6241265 8132235 6015273 912213 -5470693 -11859062 -17353975 -20965378
38925 -20965378 -21835418 -19898057 -16072815 -11883102 -8943020 -8341870 -9911622 -12143222
38917 -12143222 -13407528 -13446599 -13237721 -13250149 -12461865 -9591542 -4815033 463933 5261413
38908 5261413 9512161 12896366 14214750 12561194 8591392 4050555 312273 -2310106
38900 -2310106 -4315463 -6624672 -10051839 -14582604 -19455958 -24397902 -30180885 -37104805
38892 -37104805 -43399925 -46405664 -45423033 -42333396 -39208222 -36421277 -33499072 -30562411
38884 -30562411 -27925036 -25049462 -21060613 -16024972 -10785852 -5641773 -38174 6320439
38876 6320439 12673418 17703900 20508084 21088078 20235749 18886860 17255010 14637884
38868 14637884 10291550 4276380 -2812783 -10461225 -17885089 -23356845 -24890759 -21994792
38860 -21994792 -16323418 -10402193 -5955259 -3279116 -1500378 786909 4553233 9613711
38852 9613711 15101300 20605146 26198092 31207830 33874702 32946757 29112075 24045400
38844 24045400 18227944 10476934 -273586 -13274588 -26210719 -36796232 -44043326
38837 -44043326 -48350448 -50643509 -51377323 -50304837 -47257321 -43015371 -39077447 -36374798
38829 -36374798 -34320849 -31371668 -26742740 -21669154 -18826230 -20198397 -25363093 -31910325
38821 -31910325 -37428877 -40814738 -41845861 -40336163 -36305936 -30588719 -24555357 -19248118
38813 -19248118 -15248894 -13268251 -14118127 -17739209 -22608709 -26498941 -27901216 -26886207
38805 -26886207 -24915383 -23751050 -24019807 -24580541 -23581535 -20304882 -15729652 -11299479
38797 -11299479 -7697569 -5042780 -3551944 -3267924 -3489745 -3360872 -3113167 -4036201 -6907810
38788 -6907810 -10878034 -14226938 -16037765 -17015870 -18942706 -23414724 -30666857 -39215606
38780 -39215606 -46776118 -51820388 -54267284 -54711062 -53382925 -50162462 -45295731 -39598687
38772 -39598687 -33921698 -28657012 -23700803 -18660415 -13250019 -7820953 -3345849 -399620
38764 -399620 1772151 4550717 8163773 11210985 12279897 11469713 9852166 7993220
38756 7993220 5763966 3232423 704924 -2176897 -6329988 -11665672 -16306907 -18083499
38748 -18083499 -16557907 -13120498 -9451524 -6479826 -4505384 -3429023 -2743253 -2036855
38740 -2036855 -1768740 -2874330 -5193844 -6916659 -6307183 -3732604 -1295008 -468437 -630172
38731 -630172 90992 3111467 8612776 15679573 22615273 27458317 28871742 26766355
38723 26766355 22055958 16043359 10138516 5538836 2324366 -1151478 -7181353 -16488786
38715 -16488786 -27253596 -36499692 -42201099 -44013029 -42650760 -39270330 -35268228 -31910114
38707 -31910114 -29776421 -28710662 -28288050 -28025748 -27171559 -24861965 -20943199 -16516290
38699 -16516290 -13342549 -12590137 -14086418 -16556173 -18461959 -18863241 -17799153 -15878870
38691 -15878870 -13373096 -9743178 -4207163 3220889 11322857 18284053 22736534 24452444
38683 24452444 24266999 23280824 21925542 19756738 16239519 11689904 7318497 4367602
38675 4367602 3259718 3409999 3616113 2734836 386186 -2811403 -5839410 -8129238 -9585630
38666 -9585630 -9838271 -8132318 -4508104 -728099 855629 -344673 -2441721 -3048342
38658 -3048342 -1470176 1604393 6063504 12776674 21634949 30154446 35054312 35015082
38650 35015082 31096095 24635548 15876958 5031318 -6410722 -16516476 -24753990 -32076549
38642 -32076549 -39120530 -44988638 -47966790 -46957306 -42125181 -34681252 -26270667 -18179037
38634 -18179037 -10895658 -4657081 -282984 1231444 214189 -1270315 -1086290 1223875
38626 1223875 4735243 8628294 12614223 16164069 18311718 18578874 17642992 16812361 16990363
38617 16990363 18046399 18797388 17676379 13986247 8632937 3144143 -2171308 -8515636
38609 -8515636 -16705356 -25412586 -31767517 -33587968 -30858364 -25377133 -19254183 -13362956
38601 -13362956 -6764356 2153250 13496729 24918737 33203990 36664997 35688330 31453084
38593 31453084 25095522 18097239 12228231 8212675 4969308 1082575 -3037018 -5191160
38585 -5191160 -3815699 15166 3155003 2715029 -2049987 -9434330 -16279201 -19603859
38577 -19603859 -18151124 -12963366 -6500895 -954260 2884629 5458685 7490096 9203499
38569 9203499 10189654 9773053 7606365 4220559 1130795 174178 2340331 6978304 12128962
38560 12128962 15795984 17136574 16688005 15683115 15234840 15983752 18102328 21276467
38552 21276467 24664202 27125294 27694702 25867550 21493435 14625430 5667745 -4357608
38544 -4357608 -13805335 -20714097 -23290551 -20576611 -13148140 -3195508 6519075 14238075
38536 14238075 19962442 24709853 29031644 32191913 32799143 30411717 26591759 24047919
38528 24047919 24312886 26286073 27357274 25866569 22064830 16839146 10373322 2540538
38520 2540538 -5945955 -13466370 -18415412 -19736642 -16870673 -10037521 -824266 8067019
38512 8067019 14166852 16433248 15310674 12078992 8281384 5295576 3887853 4032581
38504 4032581 5233747 6981192 8850107 10270753 10346649 8011007 2607307 -5362173
38496 -5362173 -14028242 -21026865 -24925882 -25937751 -25344860 -24344766 -23317290 -21845737
38488 -21845737 -19300830 -15635858 -11812518 -9338920 -9232574 -11428718 -15086658 -19128441
38480 -19128441 -22343992 -23394231 -21334211 -16396547 -10140428 -4626037 -1224773 53970
38472 53970 297446 734599 1803179 2896791 2907581 1178520 -1654827 -3496231 -1787786
38463 -1787786 4627445 14274971 23820319 30252390 32369032 30464368 25261474 17539442
38455 17539442 8472483 -230867 -6790940 -10106649 -10321797 -8761303 -7070009 -6212174
38447 -6212174 -6340481 -7450930 -9644528 -12635439 -15623715 -18098775 -20330757 -22537186
38439 -22537186 -23929814 -23309903 -20557422 -16932709 -13826619 -11623950 -9753966 -7336578
38431 -7336578 -3718022 1084863 6211396 10534301 13573253 15618306 16975470 17466851
38423 17466851 16664476 14122257 9333334 2159808 -6284661 -13706132 -18194497 -19573676
38415 -19573676 -18866072 -16757671 -13186525 -8315863 -3166427 1084667 4093862 6246570
38407 6246570 7644014 7564610 5173595 705380 -4302343 -8098031 -9965356 -10360510 -10112298
38398 -10112298 -9818013 -9814847 -10141023 -10367025 -9984016 -9348404 -9939827 -13217031 -19209545
38389 -19209545 -26401744 -32836986 -37114686 -38566600 -37004670 -32537297 -25539203 -16772275
38381 -16772275 -7593302 112001 4558853 4935655 1864169 -2865061 -7163604 -9782176
38373 -9782176 -11063925 -12581669 -15778696 -20880481 -27152249 -34006218 -41512168 -49747724
38365 -49747724 -57899959 -64292941 -67437441 -67062454 -64072092 -59561493 -54157845 -48479623
38357 -48479623 -43799185 -41488982 -41589110 -42394261 -41828143 -39114565 -35107146 -31392061
38349 -31392061 -29131210 -28149203 -26815314 -23470107 -18573453 -14926826 -14980085 -18198011
38341 -18198011 -21837434 -24025109 -25119799 -26223858 -27654536 -29307066 -31422741 -34155829
38333 -34155829 -36989850 -39364793 -41464787 -43579684 -44874928 -43569745 -38458909 -29866508
38325 -29866508 -19221840 -8299371 1044294 7069659 8766849 6478665 1931538 -2408273
38317 -2408273 -4376268 -3086830 805570 5836720 10747901 14767266 17162425 17065278
38309 17065278 14077816 8900610 3003247 -2499966 -7564238 -12672716 -17628747 -21197479
38301 -21197479 -22291430 -21504688 -21097916 -23161165 -27788379 -33031622 -36369900 -36147254
38293 -36147254 -32154398 -25588311 -18557689 -13026773 -9711191 -7947917 -6657780 -5252409
38285 -5252409 -3640471 -1900934 -458992 -359029 -2661418 -7240936 -12448536 -16242659
38277 -16242659 -17626235 -17045868 -15841208 -15604701 -17631869 -22206286 -28173900 -33544310
38269 -33544310 -36683321 -36827049 -33775905 -27930338 -20896076 -15181921 -12332794 -11438531
38261 -11438531 -10121277 -7037126 -3011760 76937 796558 -1529368 -7162786 -15977841
38253 -15977841 -27359731 -40388393 -53930571 -66381643 -75688406 -80080465 -78824742
38246 -78824742 -72285102 -61642174 -48823228 -36255161 -25913009 -18282226 -12382705
38239 -12382705 -6934712 -1573258 2848076 4898952 3553233 -1185485 -8316378 -16209264
38231 -16209264 -22877418 -26362733 -25640357 -21482429 -16112852 -11702108 -9231346 -8638718
38223 -8638718 -9417190 -10738573 -11516699 -10979920 -9171903 -6717444 -4326168 -2576562 -1551970
38214 -1551970 -291583 2678337 7442248 11786766 13216950 11752897 9760859 9083705
38206 9083705 9518219 10357412 12013194 15041327 18358675 19771247 18285803 15037574
38198 15037574 11834911 9530643 8062687 7335411 7269516 7066468 5200130 838256 -4664630
38189 -4664630 -8265370 -7847435 -4390873 -1161150 -684088 -2889778 -6204169 -9671814
38181 -9671814 -13400154 -17381706 -20783354 -22556100 -22238371 -20028247 -16570341 -12988041
38173 -12988041 -10740019 -10848303 -13080497 -16084568 -18554438 -20389177 -22753973 -26950394
38165 -26950394 -33083372 -39695263 -44663221 -46587738 -45642275 -43428778 -42049068 -42961430
38157 -42961430 -46313196 -51161966 -56229026 -60333659 -62240150 -60616264 -54687429 -45060223
38149 -45060223 -33740252 -23239179 -15556400 -11642285 -11331100 -13594509 -17050091 -20455689
38141 -20455689 -22831200 -23295670 -21088595 -15903163 -8106955 1470950 11935406 22453612
38133 22453612 32027441 39238794 42428602 40527670 34096783 25517832 17709579 12292471
38125 12292471 9050803 7269579 7278728 10242828 16492665 24588021 32279672 38059648
38117 38059648 41478282 42364968 40523654 36425719 31711622 28507649 28145908 30456194
38109 30456194 33941697 36511245 36593753 34270698 31416666 30286485 31711828 34752206
38101 34752206 37964291 40580634 42397273 43103224 42263352 39840995 36349803 32517375
38093 32517375 29115795 27077607 27263456 29712916 33231407 36064212 37142311 36660703
38085 36660703 35554291 34650424 34309678 34436378 34444379 33466224 31236400 28895987 28313249
38076 28313249 30121616 32722425 33728014 32278777 29531031 27036827 25255472 23727333
38068 23727333 22090870 20571092 19822875 20621294 23396623 27614527 31674621 33834228
38060 33834228 33484109 31540941 29555140 28331605 27306851 25363482 22426760 20090773
38052 20090773 20242699 23002043 26392287 28168381 27616795 25488183 22788206 20167295
38044 20167295 18154360 17229070 17367863 17713111 16920447 14063096 9466949 4607107 773427
38035 773427 -2223630 -5491165 -9002690 -10822440 -9027684 -3996944 1883364 6432025
38027 6432025 8795154 8729512 6131531 1812112 -2164958 -3832535 -2887385 -492269 2322446
38018 2322446 5716192 10622240 17560105 25789848 33443422 38570941 40294327 39122201
38010 39122201 36390005 33603670 32017358 32076922 32872164 32488107 29345527 23218057 14975481
38001 14975481 5802594 -3009812 -9968150 -13821262 -14285964 -12098034 -8375404 -4131815
37993 -4131815 -160924 3202643 6355232 10001453 14155555 17807162 19815267 19887296
37985 19887296 18413308 15705167 12083303 8776341 7999306 11472587 18898760 28187145
37977 28187145 37025364 43911374 47960965 48560865 45610299 39725814 31929688 23474574
37969 23474574 16129645 11925011 11827495 14829237 18895326 22586089 25139741 25380383
37961 25380383 21890684 14828244 6769205 986659 -885323 776672 4909519 10796354
37953 10796354 18130059 26739319 36104235 44561255 49213808 47576629 39761799 28698620
37945 28698620 17933249 9361075 2981278 -1855823 -5506907 -8034197 -9465332 -9774788
37937 -9774788 -8758666 -6078304 -1445122 5151503 13167641 21285758 27629844 30695636
37929 30695636 30531346 28988409 28382013 29611767 31693931 33195775 33789487 34076127 34156893
37920 34156893 33009873 29516946 23801882 17260733 11344992 6506515 2312001 -1647662
37912 -1647662 -5186000 -7826524 -9376230 -9954561 -9680328 -8831870 -8344904 -9515994 -12755202
37903 -12755202 -16963233 -20591421 -23042540 -24541204 -24986225 -23817533 -21096089 -17886798
37895 -17886798 -15196832 -13147518 -11617529 -11080273 -12059652 -14008788 -15459949 -15350253
37887 -15350253 -13737634 -11205154 -8076374 -4406608 -381698 3543159 6794071 8959072
37879 8959072 10194804 11429304 13799036 17554525 21608401 24403571 25267448 24856375
37871 24856375 24338136 24250769 24155342 23300454 21480662 19100424 16458074 13368630 9841225
37862 9841225 6872598 5917680 7351365 9847616 11539601 11529855 10131467 8130911 6269041
37853 6269041 5082170 4595984 4200011 3307674 2154849 1573880 2076258 3607732 6016422
37844 6016422 8997562 11503815 12070636 10136983 6388265 1402943 -5219912 -13642844
37836 -13642844 -22395923 -29278725 -33394208 -35332588 -35637607 -34422732 -32677657 -32518095
37828 -32518095 -35217674 -39730241 -43948020 -46834827 -48551405 -49117170 -48141558 -45805769
37820 -45805769 -43065056 -40598016 -38231544 -35620995 -32867601 -30194528 -27640887 -25526662
37812 -25526662 -24705318 -25649482 -27350884 -27687387 -25171262 -20315394 -15306005 -12361324
37804 -12361324 -12212040 -13909262 -16018846 -18025193 -20595684 -24601131 -30050739 -35870352
37796 -35870352 -40342385 -41719790 -38999456 -32711290 -24936082 -18158550 -13954763 -12817697
37788 -12817697 -14923603 -20469862 -29081611 -39273961 -48860627 -55913708 -59408971 -59366513
37780 -59366513 -56710059 -52780227 -48500364 -43872307 -38517278 -32816031 -28271858 -26440667
37772 -26440667 -27387974 -29212108 -29147062 -25370434 -18181722 -9783979 -2857842 1117914
37764 1117914 2649108 3537500 5248916 7694357 9495428 9417753 7412319 4115083 -422459
37755 -422459 -6848366 -14996335 -22738839 -27168254 -27069286 -23679427 -18833875 -13044796 -5976336
37746 -5976336 1712589 8022031 11345391 12014439 11870375 12647316 14896771 17956094 20440711
37737 20440711 20905911 18527945 13422619 6365032 -1751922 -10270163 -18843411 -27239761
37729 -27239761 -34864079 -40492319 -42933256 -42239519 -39922436 -37540541 -35211265 -31855917
37721 -31855917 -26769289 -20587066 -14864200 -11168222 -10485785 -12859870 -17348243 -22777432
37713 -22777432 -28859218 -36280985 -45412985 -55150344 -63274237 -67755859 -67602591 -63019858
37705 -63019858 -55478132 -47494040 -41460722 -38065043 -35881023 -32682458 -27190995 -19830120
37697 -19830120 -12364837 -7011416 -5332174 -7283760 -11207713 -15034723 -17684177 -19421908
37689 -19421908 -21196965 -23852234 -27597879 -31636163 -34287633 -34052499 -30839936 -25913265
37681 -25913265 -20547966 -15136490 -9778881 -5225762 -2661095 -2604130 -4312005 -6168387
37673 -6168387 -6497226 -4360997 -127267 4715064 8668507 11286396 13070471 14552859
37665 14552859 15771069 16415444 16063374 14448885 12023411 10089840 9645087 9978144 9107610
37656 9107610 5878794 1031357 -4083978 -9093459 -14252197 -19009972 -21811389 -21422686
37648 -21422686 -18072093 -13320377 -9063988 -6386916 -4846233 -2886457 628942 5193610
37640 5193610 9097332 10929631 10441668 8283380 5504545 3280884 2474984 3070158 4174686
37631 4174686 4712788 4032141 1908782 -1776510 -7247055 -14682078 -23610712 -32293843
37623 -32293843 -38125565 -39247409 -35786294 -29204225 -20692890 -10826402 -650591 7852646
37615 7852646 12922447 14260780 12840319 9938869 6718700 4182226 2681799 1417210
37607 1417210 -958060 -4873457 -9170775 -12112263 -12993964 -12641651 -12382813 -12693332 -12833421
37598 -12833421 -11500310 -7553583 -354776 9842590 21376394 31483492 37929605 40616348
37590 40616348 41374977 42173067 43694191 45360330 46045791 44647712 40674110 34888151
37582 34888151 29222267 25633452 24925633 26619340 29588478 32519942 34036587 33029986
37574 33029986 29333637 24129127 19446830 16842764 16233374 16078023 14956378 12993956
37566 12993956 11651843 12379004 15873410 22423250 32061990 43802299 55042334 62402883
37558 62402883 63550848 58473295 49346541 39365655 31449994 27506560 28176915 32479425
37550 32479425 37485086 39299218 35717911 28243517 20789596 16115471 14057924 13302792
37542 13302792 13866675 17109088 23861970 33274117 43181361 51049252 54958657 54468914
37534 54468914 50529748 44174340 35567169 24761393 12881276 1663574 -8057012 -16597832
37526 -16597832 -24182452 -30295026 -34509141 -37268866 -39491670 -41851261 -44674184 -48011543
37518 -48011543 -51428848 -54076881 -55339450 -55243161 -54096854 -52071883 -49363320 -46408828
37510 -46408828 -43589726 -40903050 -38222843 -35761163 -34051637 -33597356 -34691471 -37384679
37502 -37384679 -41365263 -45943844 -50345098 -53991020 -56486825 -57606333 -57531767 -56885447
37494 -56885447 -56068001 -54424234 -50338291 -42524969 -31457970 -19556507 -9803558 -3962865
37486 -3962865 -2043805 -3380671 -7833049 -15519649 -25564735 -35843341 -44401266 -50860278
37478 -50860278 -56120822 -60987608 -65535633 -69578694 -73018696 -75517208 -76421451 -75535977
37470 -75535977 -73669218 -71790621 -69666381 -66005972 -60314265 -54094832 -49567503 -47306848
37462 -47306848 -45762922 -43210394 -39599674 -36247932 -34324447 -34220723 -35992620 -39499313
37454 -39499313 -43870481 -47391976 -48337822 -45840618 -39979762 -31487053 -21704620 -12523739
37446 -12523739 -5733573 -2062342 -829186 -590885 -190773 676735 1713724 2656013 3642018
37437 3642018 5062238 7132190 9491794 11008776 10066267 5532405 -2135870 -10759282
37429 -10759282 -17590828 -20735390 -19792146 -15827146 -11101847 -8220760 -8522228 -10963221
37421 -10963221 -12934870 -12364929 -8927264 -3509663 2755732 8714139 13122891 15052122
37413 15052122 14320528 11223149 5904452 -1681782 -11127339 -21072940 -29507794 -34670303
37405 -34670303 -35840672 -33481210 -28796557 -23236857 -18196539 -14613109 -12391139 -10329064
37397 -10329064 -7016554 -1923434 4449966 11246542 17764827 23569611 28650156 33405173
37389 33405173 37877886 40923261 40722884 36384103 28664163 19092962 9034202 -196672
37381 -196672 -7179319 -11164649 -12683476 -12741678 -11601605 -8899192 -4768938 -246281 3407093
37372 3407093 5303909 5001824 2658979 -719595 -3740790 -5698318 -7007591 -8405303
37364 -8405303 -9884566 -10575877 -9650461 -7322671 -4860593 -3231718 -1553450 2540357
37356 2540357 10224274 19322495 25730559 27344078 26001836 25194197 26432470 28381726
37348 28381726 28975171 27418856 24163248 19867624 14973393 9985822 5742590 3403660
37340 3403660 4149463 8405570 14925446 20904183 23695689 22748222 19709924 16660986
37332 16660986 14620998 13815562 14646116 17576275 22106139 26519240 28971028 28690413
37324 28690413 26200566 22790556 19808849 17921082 16741787 15537010 14502512 14840284
37316 14840284 17133350 20152458 22054321 22581478 23184976 24740750 25866853 24014807
37308 24014807 17907305 8587888 -1482639 -9792692 -14579935 -15319532 -13081446 -10177261
37300 -10177261 -8842650 -9899536 -12643071 -15994339 -19645347 -24023757 -29229498 -34141688
37292 -34141688 -36687323 -35219937 -30017557 -23612478 -19291249 -18646330 -20357754 -21584895
37284 -21584895 -20619066 -17911248 -14536695 -10305785 -3927091 5217254 15978768 26056467
37276 26056467 33353707 36976201 37602849 37074378 37095745 37929385 38488314 37829814 36298889
37267 36298889 35035995 34617839 34397601 32974974 29141103 22706211 14877395 7791957
37259 7791957 3249946 1640921 2085699 3489327 5231254 6926606 7975234 7695547
37251 7695547 5868508 3012954 174267 -1485201 -1069975 1735145 6575767 12705557
37243 12705557 19353040 25708135 30650197 32936127 32044805 28768522 24675738 20919702
37235 20919702 17615647 14111402 9477637 2933414 -5434474 -13991588 -20129726 -22275162
37227 -22275162 -21494727 -20856699 -23023167 -28256456 -34335863 -38173149 -37868442 -33725306
37219 -33725306 -27446945 -20496493 -13670835 -8240695 -6385198 -9342585 -15380512 -20754595
37211 -20754595 -23029694 -22868673 -22529373 -23516204 -26040756 -29795843 -34334125 -39042034
37203 -39042034 -43524083 -47991647 -52857660 -58077458 -63222715 -67970162 -72118608 -75341569
37195 -75341569 -77332230 -77938140 -76639913 -72148441 -63333328 -50828554 -37278979 -25622184
37187 -25622184 -17055464 -10491551 -3745700 4538255 13613856 21137157 25190736 25830467
37179 25830467 24511442 22373373 19720302 17035627 15591888 16588000 20058837 24839257
37171 24839257 29127934 30894366 28485038 21610117 11593328 210595 -11493649 -22848428
37163 -22848428 -32498674 -38649547 -40500898 -38747423 -34395947 -27727694 -18956769 -9523763
37155 -9523763 -2008269 1446927 481090 -3542156 -8543645 -12732114 -15228720 -16270211
37147 -16270211 -16822195 -17677502 -18743643 -19230138 -18510166 -16679633 -14309170 -11937071 -10002766
37138 -10002766 -9028793 -9365151 -10545107 -11156577 -9708540 -5733396 3663 6332714
37130 6332714 12619182 18918820 25331269 31274102 35410618 36334889 33392288 26900234
37122 26900234 17707390 6707030 -5239158 -17177322 -28111383 -37171406 -43699273
37115 -43699273 -47404033 -48751211 -49151540 -50338003 -53206232 -57256359 -61273732 -64514413
37107 -64514413 -67143372 -69596613 -71705282 -72551004 -71178573 -67448102 -62213731 -56691805
37099 -56691805 -51705435 -47614475 -44910113 -44566101 -47477138 -53518480 -61347458 -69140341
37091 -69140341 -75282952 -78364474 -77168097 -71483087 -63016697 -54863118 -49556887 -47656408
37083 -47656408 -48149200 -49624560 -50650638 -49685857 -45785573 -39658401 -33265123 -27848189
37075 -27848189 -22692281 -16209597 -7974960 680594 7876408 12591818 14989083 15700276
37067 15700276 14880133 11970982 6646784 26701 -5599074 -8714874 -9933097 -10962224
37059 -10962224 -12621024 -14543818 -16479281 -18736914 -21056482 -21959894 -19945754 -15067453
37051 -15067453 -9024698 -4029433 -1736352 -2606471 -5654801 -9071735 -11659064 -13622841
37043 -13622841 -15701886 -17822519 -19078377 -18832888 -17311332 -15195877 -13219866 -12277584
37035 -12277584 -13398081 -17144963 -22999493 -29396481 -34390032 -36489224 -35227926 -31242425
37027 -31242425 -25969645 -21218445 -18541222 -18321275 -19341059 -19825126 -19238674 -18603173 -18712730
37018 -18712730 -18648192 -16746030 -12722755 -8146420 -4922244 -3791131 -3979540 -3616414 -804378
37009 -804378 4692929 10677912 14188957 14103334 11509816 7728838 3149285 -1730712 -5485201
37000 -5485201 -7032869 -7105559 -7544577 -9471141 -12837096 -17377757 -23122218 -29995210 -37565041
36991 -37565041 -45250569 -52368195 -58009480 -61252931 -61551280 -58871021 -53829050 -47948706
36983 -47948706 -43229234 -40741009 -39703341 -38355105 -35614366 -31668364 -27445362 -24097437
36975 -24097437 -22548261 -22618742 -22583024 -20263532 -14659706 -6177432 4283429 15570065
36967 15570065 25867902 33348544 37699366 40217701 41995501 42774764 42088081 40781258
36959 40781258 40591709 42446819 45654859 48538424 49534727 48035417 44580334 40028396
36951 40028396 34371670 26866681 17634279 8431235 1162072 -3879174 -7579759 -10416641
36943 -10416641 -12407065 -14334226 -17523417 -21901460 -25340802 -25642950 -22463909 -16674476
36935 -16674476 -8739227 1013056 10814621 17575232 19168295 16047135 10370602 4284217
36927 4284217 -432949 -1824255 1804409 10372077 21274042 30530662 34968890 33834238
36919 33834238 28943639 23433761 19912445 19247898 20679566 22663778 23520574 21945102
36911 21945102 17837663 12742045 8729428 6484609 4988603 3410767 2739542 4967823
36903 4967823 11003871 19901166 29767490 38737790 45348832 48991396 50340050 50746476
36895 50746476 50825326 49917383 47078052 42192929 35898561 28774127 20993742 12757444
36887 12757444 4984417 -429006 -1357192 3028680 11408511 21286277 30701929 38591455
36879 38591455 43918249 45746190 44622416 42769283 41866309 41146762 38656540 34071364
36871 34071364 29190207 25649754 23220252 20699576 17601342 14399552 11811151 10611779
36863 10611779 11710284 15387457 20331489 24206581 25639623 25288077 24563758 23581038
36855 23581038 20869193 15105355 6763156 -1965507 -8476871 -10914084 -8670651 -2458066
36847 -2458066 6048825 14992958 22977809 29053104 32482823 33030330 31451011 29220499
36839 29220499 27503460 26484234 25678222 24626839 23263358 21922545 21110707 20988134
36831 20988134 20928519 19816709 16934738 12424035 6916572 1089229 -4282126 -8233182
36823 -8233182 -9957956 -9183832 -6112619 -1234232 4596012 10055446 13529810 13434712 8642692
36814 8642692 -838264 -13427131 -26616269 -38273447 -47028865 -51550411 -50565738 -44475341
36806 -44475341 -36409912 -30585788 -29376676 -32315676 -37551900 -43375504 -48415227 -51585007
36798 -51585007 -52613619 -52107980 -50389847 -46489556 -38953505 -27795506 -15355722 -5114099
36790 -5114099 323793 438133 -3233822 -7888868 -10617230 -9707625 -5489099 72647
36782 72647 4878016 7962841 9515053 10216700 11009609 13053732 16923901 21573472 24784589
36773 24784589 25128064 23150645 20437665 18109180 16636695 16417677 17634773 19735264
36765 19735264 21712620 22778033 22291225 19496009 14297377 8256715 3844055 2324810
36757 2324810 2847102 3637017 3414803 1555967 -2190331 -7455764 -13088293 -17752355 -20678794
36748 -20678794 -21872521 -22030797 -22298798 -23409281 -24649087 -24154984 -20717149 -15087155
36740 -15087155 -9341081 -5406412 -4425648 -6809738 -12105789 -19002192 -26043797 -32251101
36732 -32251101 -36695926 -37878277 -34324735 -25941756 -14403243 -2211711 8389497 16000991
36724 16000991 20443778 22764525 24339621 25737681 26775902 27646010 29257438 32012335
36716 32012335 34652534 34880208 31117666 23542260 13811849 4303304 -2622913 -5543731
36708 -5543731 -4855887 -2720744 -1808127 -3857726 -9160944 -16901324 -25601777 -33442201
36700 -33442201 -38737980 -40497444 -38552822 -33220695 -25053712 -14903968 -3841099 7275771
36692 7275771 18033345 28172200 37288185 44961013 50851527 54384477 54679426 51333181
36684 51333181 45220273 38123557 31607185 26516901 23250077 21791720 21476433 21465709
36676 21465709 21751958 23128125 25834859 28744415 30317639 30039432 28575167 26880850
36668 26880850 25539610 24591040 23489833 21445950 18284984 14813607 11860314 9045454
36660 9045454 4972943 -1295599 -9198247 -16995617 -22877012 -25997977 -26969023 -27418529
36652 -27418529 -28773019 -31331823 -34435966 -37031209 -37654899 -34430817 -26163607 -13757647
36644 -13757647 -19053 12213617 21472794 27376118 29815192 28918576 25359640 20182415
36636 20182415 14470177 9350656 5833432 4124749 3387415 2752068 2435179 3274511 5211588
36627 5211588 7009972 7877856 8810656 11574777 16367141 21088644 23250739 22270310 19487563
36618 19487563 16126256 11879011 5800297 -1806290 -8935901 -13344729 -14158487 -12057794
36610 -12057794 -8377075 -4401503 -1287859 18255 -704322 -2516301 -3704722 -2911400
36602 -2911400 -78946 3539998 6190124 6644971 5045974 3167388 3533809 7482129
36594 7482129 13752188 19323956 21885153 21250051 18423820 14158711 9178867 5292910
36586 5292910 5003292 9481766 17390417 26062939 33616327 39790892 45195220 50237156
36578 50237156 54808370 58775386 62572107 66997747 72108281 76463877 78065534 76322759
36570 76322759 72825779 70007121 69289908 70543085 72689426 74324043 74149111 71635021
36562 71635021 67522954 63393492 60553128 59294558 58955735 58367651 56404934 52597972
36554 52597972 47386176 41590423 35662128 29763853 24611645 21753131 22550064 26872525
36546 26872525 33006893 38915560 43545933 46995481 49669454 51570558 52490453 52619208
36538 52619208 52527395 52414547 51699921 49670342 46403680 42771662 39630269 37320745 35870797
36529 35870797 35185112 34848614 34158904 32772585 31205834 30356350 30501087 30948525 30620401
36520 30620401 28688930 24608231 17949041 8712807 -2088623 -12493338 -20586588 -25533104
36512 -25533104 -27600420 -27368825 -25296077 -22074294 -18800848 -16118260 -13200011 -8208906
36504 -8208906 -207513 9453157 17794365 22207573 21937976 18168289 13133442 8956313
36496 8956313 6680879 5993003 5849786 5434290 4524577 3137838 1146213 -1647342 -5210590
36487 -5210590 -9151797 -12813981 -15518373 -16891249 -17034512 -16337091 -15229083 -14328368 -14694436
36478 -14694436 -17452219 -22955269 -30634322 -39854354 -50467670 -62024367 -72705829 -79782839
36470 -79782839 -81452675 -78082807 -71738087 -64871964 -59414828 -56426168 -56047756 -57806121
36462 -57806121 -61048885 -64858040 -67551118 -66978489 -62037446 -53804974 -44655551 -36221204
36454 -36221204 -28549267 -21093547 -13827419 -7094014 -864272 5335372 11830571 18369770
36446 18369770 24166650 28208158 29772159 29020391 27060935 25126319 23569480 21697737
36438 21697737 18457210 13149749 5813441 -2455604 -9341374 -11970500 -8433980 977483
36430 977483 13921054 27281546 38429955 45774218 48788540 47896821 44276262 39491617
36422 39491617 34951722 31329480 28305490 25043555 21251004 17878020 16607891 18508709
36414 18508709 23129430 28754067 33326848 35282623 34079288 30406655 25776548 21533038
36406 21533038 18141148 15469591 13525028 12568698 12642853 13488274 15048433 17585430 20984677
36397 20984677 24289194 26368974 26943838 26611245 25987781 25212556 24212534 22941633 21236415
36388 21236415 18923745 16362968 14466280 13694931 13236397 11765743 9183203 7252384
36380 7252384 8257365 13043296 20294732 27463539 32378362 34374026 34320377 33680886 33433372
36371 33433372 33694046 33962217 33254573 30103958 23248019 12979198 1576598 -8188275
36363 -8188275 -15007386 -19271066 -21768907 -22936584 -23297652 -23625237 -24179601 -24493762 -24514152
36354 -24514152 -25360399 -28149580 -32391283 -36384015 -39098379 -40893874 -42381437 -43394340
36346 -43394340 -43305693 -41705833 -38515219 -34042810 -29245644 -25368794 -22970980 -21787027
36338 -21787027 -21767929 -23410919 -26353684 -28342582 -26807766 -21573254 -15278203 -10968573
36330 -10968573 -9745805 -10670668 -12116331 -12822485 -12230267 -10501500 -8289046 -6252387
36322 -6252387 -4689424 -3549548 -2676447 -2123684 -2439450 -4538310 -8964391 -15267442 -22380426
36313 -22380426 -29591151 -36805797 -43833526 -49792350 -53367676 -53445733 -49585762 -42413231
36305 -42413231 -33743997 -25779383 -19633511 -14714428 -9762509 -4314806 1030528 5437111
36297 5437111 8412473 9602137 8429506 4196887 -3385217 -13554548 -24130973 -31922398
36289 -31922398 -34039981 -29430459 -19558147 -7733725 2513440 9069459 11919112 12554216
36281 12554216 12773952 13884911 16531449 20641716 25361545 29455807 32132717 33412900
36273 33412900 33682901 33253421 32532529 32156693 32417689 32705375 31983026 29818757 26639854
36264 26639854 23050658 19300624 15471110 11863138 9126479 8220970 10142450 15190155
36256 15190155 22304171 29467619 35046038 38593351 40242713 39628586 35753671 27837029
36248 27837029 16089784 1843463 -12677517 -24724719 -31820205 -32994023 -29598723
36241 -29598723 -24656630 -20879100 -18955528 -17650850 -15427426 -11760545 -6988018 -1483067
36233 -1483067 4530640 10599615 16081986 20613668 24029347 25682058 24402124 19610823
36225 19610823 12282720 4439040 -2252393 -7249398 -10904206 -13984721 -17296596 -21166608
$$ [...]
##END NTUPLES=NMR SPECTRUM
##END=
