##TITLE=31Pdec_SRR167_A
 CDCl3 64 sc
 4.9.2023
##JCAMPDX= 6.0         $$ Bruker NMR JCAMP-DX V2.0
##DATA TYPE= NMR SPECTRUM
##DATA CLASS= NTUPLES
##ORIGIN= UXNMR, Bruker Analytische Messtechnik GmbH
##OWNER= root
$$ XWIN-NMR		Version 3.5
$$ Mon Sep  4 14:35:37 2023 Russian Standard Time (UT+4h)  she@DPX200
##.OBSERVE FREQUENCY= 81.013821
##.OBSERVE NUCLEUS= ^31P
##.ACQUISITION MODE= SIMULTANEOUS
##.ACQUISITION SCHEME= undefined
##.AVERAGES= 64
##.DIGITISER RES= 16
##SPECTROMETER/DATA SYSTEM= spect
##.PULSE SEQUENCE= zgpg30
##.SOLVENT NAME= DMSO
##.SHIFT REFERENCE= (INTERNAL, DMSO, 0, 248.564)
##AUDIT TRAIL= $$ (NUMBER, WHEN, WHO, WHERE, WHAT)
$$ ##TITLE= Audit trail, XWIN-NMR		Version 3.5
$$ ##JCAMPDX= 5.01
$$ ##ORIGIN= Bruker BioSpin GmbH
$$ ##OWNER= she
$$ F:/spectra/data/she/nmr/P31/1/pdata/1/auditp.txt
$$ ##AUDIT TRAIL=  $$ (NUMBER, WHEN, WHO, WHERE, WHAT)
(   1,<2023-09-04 14:34:13.23 +0400>,<she>,<DPX200>,
      <continue with go, POWCHK disabled, PULCHK disabled
       configuration hash MD5:
       00 E9 B6 7A A2 85 ED C7 34 08 36 98 17 FE 4E 26
       data hash MD5: 32K
       D4 4E 32 FE FE 4D 69 D9 F1 29 1E A8 C5 4C 3D E7>)
(   2,<2023-09-04 14:34:15.39 +0400>,<she>,<DPX200>,
      <Start of raw data processing
       efp BC_mod = 2 LB = 5 FT_mod = 6 PKNL = 1 PHC0 = -10614.24 PHC1 = -13.31499 SI = 64K 
       data hash MD5: 64K
       56 35 B2 67 BB 9D 7C FC 61 A8 4F 7A 9D 74 DC 45>)
(   3,<2023-09-04 14:34:28.48 +0400>,<she>,<DPX200>,
      <pk PHC0 = -1.624054 PHC1 = 0 
       data hash MD5: 64K
       20 F9 68 FC 59 43 37 4D 9E 4B 89 06 2E 8D 23 33>)
$$ ##END=
$$ 
$$ hash MD5
$$ BA AC 41 41 A3 DB A5 F3 37 C5 21 E4 11 E4 9C 08
##$RELAX= 
##$RELAX= 
##$RELAX= 
##$RELAX= 
##$RELAX= 
##$RELAX= 
##$RELAX= 
##$RELAX= 
##$RELAX= 
$$ Bruker specific parameters
$$ --------------------------
##$DU= <F:/spectra>
##$EXPNO= 1
##$NAME= <P31>
##$PROCNO= 1
##$TYPE= <nmr>
##$USER= <she>
##$AMP= (0..31)
100 100 100 100 100 100 100 100 100 100 100 100 100 100 100 100 100 100 
100 100 100 100 100 100 100 100 100 100 100 100 100 100 
##$AQSEQ= 0
##$AQ_mod= 1
##$AUNM= <au_zg>
##$AUTOPOS= <>
##$BF1= 81.014009
##$BF2= 200.13
##$BF3= 200.13
##$BF4= 200.13
##$BF5= 200.13
##$BF6= 200.13
##$BF7= 200.13
##$BF8= 200.13
##$BYTORDA= 1
##$CFDGTYP= 0
##$CFRGTYP= 5
##$CHEMSTR= <none>
##$CNST= (0..31)
1 1 145 1 1 1 1 1 1 1 1 1 1 1 1 1 1 1 1 1 1 1 1 1 1 1 1 1 1 1 1 1 
##$CPDPRG= <waltz16>
##$CPDPRG1= <>
##$CPDPRG2= <waltz16>
##$CPDPRG3= <>
##$CPDPRG4= <mlev>
##$CPDPRG5= <mlev>
##$CPDPRG6= <mlev>
##$CPDPRG7= <mlev>
##$CPDPRG8= <mlev>
##$CPDPRGB= <>
##$CPDPRGT= <>
##$D= (0..31)
0 1 0 0 0 0 0 0 0 0 0 0.03 2e-05 3e-06 0 0 0 0 0 0 0 0 0 0 0 0 0 0 0 0 
0 0 
##$DATE= 1693823579
##$DBL= (0..7)
120 120 120 11 120 120 24 19 
##$DBP= (0..7)
150 150 150 150 150 150 150 150 
##$DBP07= 0
##$DBPNAM0= <>
##$DBPNAM1= <>
##$DBPNAM2= <>
##$DBPNAM3= <>
##$DBPNAM4= <>
##$DBPNAM5= <>
##$DBPNAM6= <>
##$DBPNAM7= <>
##$DBPOAL= (0..7)
0.5 0.5 0.5 0.5 0.5 0.5 0.5 0.5 
##$DBPOFFS= (0..7)
$$ [...]
##$SUBNAM2= <"">
##$SUBNAM3= <"">
##$SUBNAM4= <"">
##$SUBNAM5= <"">
##$SUBNAM6= <"">
##$SUBNAM7= <"">
##$SUBNAM8= <"">
##$SUBNAM9= <"">
##$SW= 501.771253377433
##$SWIBOX= (0..15)
0 1 3 0 0 0 0 0 0 0 0 0 0 0 0 0 
##$SW_h= 40650.406504065
##$TD= 32768
##$TD0= 1
##$TE= 0
##$TE2= 300
##$TE3= 300
##$TEG= 300
##$TL= (0..7)
0 120 53 12 22 120 120 120 
##$TP= (0..7)
150 150 150 150 150 150 150 150 
##$TP07= 0
##$TPNAME0= <>
##$TPNAME1= <>
##$TPNAME2= <>
##$TPNAME3= <>
##$TPNAME4= <>
##$TPNAME5= <>
##$TPNAME6= <>
##$TPNAME7= <>
##$TPOAL= (0..7)
0.5 0.5 0.5 0.5 0.5 0.5 0.5 0.5 
##$TPOFFS= (0..7)
0 0 0 0 0 0 0 0 
##$TUNHIN= 0
##$TUNHOUT= 0
##$TUNXOUT= 0
##$USERA1= <user>
##$USERA2= <user>
##$USERA3= <user>
##$USERA4= <user>
##$USERA5= <user>
##$V9= 5
##$VALIST= <valist>
##$VCLIST= <CCCCCCCCCCCCCCC>
##$VD= 0
##$VDLIST= <DDDDDDDDDDDDDDD>
##$VPLIST= <PPPPPPPPPPPPPPP>
##$VTLIST= <TTTTTTTTTTTTTTT>
##$WBST= 1024
##$WBSW= 4
##$XGAIN= (0..3)
0 0 0 0 
##$XL= 0
##$YL= 0
##$YMAX_a= 1681
##$YMIN_a= -5308
##$ZGOPTNS= <>
##$ZL1= 120
##$ZL2= 120
##$ZL3= 120
##$ZL4= 120
##$ABSF1= 0
##$ABSF2= 0
##$ABSG= 0
##$ABSL= 0
##$ALPHA= 0
##$AQORDER= 0
##$ASSFAC= 0
##$ASSFACI= 0
##$ASSFACX= 0
##$ASSWID= 0
##$AUNMP= <proc_1d>
##$AZFE= 0.1
##$AZFW= 0.5
##$BCFW= 0
##$BC_mod= 2
##$BYTORDP= 0
##$COROFFS= 0
##$CY= -3
##$DATMOD= 1
##$DC= 0
##$DFILT= <>
##$DTYPP= 0
##$F1P= 0
##$F2P= 0
##$FCOR= 1
##$FTSIZE= 65536
##$FT_mod= 6
##$GAMMA= 0
##$GB= 0
##$INTBC= 1
##$INTSCL= 6.047779e-11
##$ISEN= 30
##$LB= 5
##$LEV0= 0
##$LPBIN= 0
##$MAXI= 10000
##$MC2= 0
##$MEAN= 0
##$ME_mod= 0
##$MI= 50
##$NCOEF= 0
##$NC_proc= -9
##$NLEV= 6
##$NOISF1= 182.463
##$NOISF2= 159.3651
##$NSP= 0
##$NTH_PI= 0
##$NZP= 0
##$OFFSET= 248.5645
##$PC= 4
##$PHC0= -10615.86
##$PHC1= -13.31499
##$PH_mod= 1
##$PKNL= yes
##$PPARMOD= 0
##$PSCAL= 0
##$PSIGN= 0
##$REVERSE= no
##$SF= 81.0140089999694
##$SI= 65536
##$SIGF1= 159.3651
##$SIGF2= -187.1042
##$SINO= 113.3802
##$SIOLD= 16384
##$SREGLST= <1H.CDCl3>
##$SSB= 0
##$STSI= 65536
##$STSR= 0
##$SW_p= 40650.406504065
##$SYMM= 0
##$S_DEV= 0
##$TDeff= 32768
##$TDoff= 0
##$TI= <>
##$TILT= no
##$TM1= 0
##$TM2= 0
##$TOPLEV= 0
##$USERP1= <user>
##$USERP2= <user>
##$USERP3= <user>
##$USERP4= <user>
##$USERP5= <user>
##$WDW= 1
##$XDIM= 65536
##$YMAX_p= 154182373
##$YMIN_p= -235166447
$$ End of Bruker specific parameters
$$ ---------------------------------
##NTUPLES= NMR SPECTRUM
##VAR_NAME=  FREQUENCY,     SPECTRUM/REAL,   SPECTRUM/IMAG
##SYMBOL=    X,             R,               I
##VAR_TYPE=  INDEPENDENT,   DEPENDENT,       DEPENDENT
##VAR_FORM=  AFFN,          ASDF,            ASDF
##VAR_DIM=   65536,         65536,           65536
##UNITS=     HZ,            ARBITRARY UNITS, ARBITRARY UNITS
##FACTOR=    0.620285442955139, 1,           1
##FIRST=     20137.2065510682, 0,            0
##LAST=      -20513.1999529968, 0,           0
##MIN=       -20513.1999529968, -235166447,  0
##MAX=       20137.2065510682, 154182373,    0
$$ Real data points
##PAGE= N=1
##DATA TABLE= (X++(R..R)), XYDATA
$$ [...]
##PAGE= N=2
##DATA TABLE= (X++(I..I)), XYDATA
15106 -3620968 -4091955 -4345867 -4493111 -4608773 -4730245 -4750096 -4437913 -3703134 -2766175 -1935225
15096 -1935225 -1241839 -411517 811884 2399023 4071767 5513694 6556657 7257376 7802269
15087 7802269 8265626 8461419 8090131 6986543 5124458 2462014 -964676 -4706602 -7876220
15078 -7876220 -9686522 -10013069 -9349510 -8299320 -7232771 -6330621 -5703621 -5369644 -5210674
15069 -5210674 -5014214 -4532970 -3572280 -2181831 -784387 52757 88923 -400295 -937661
15060 -937661 -1260995 -1410723 -1566173 -1905962 -2507931 -3241525 -3832303 -4158307 -4383710 -4617000
15050 -4617000 -4516662 -3512597 -1491387 944479 3022513 4473975 5570720 6658262
15042 6658262 7841909 9049196 10163528 11032547 11481413 11401994 10765622 9507399 7492822
15033 7492822 4712510 1507771 -1475511 -3610012 -4598331 -4541810 -3792271 -2736007 -1616463
15024 -1616463 -467825 784873 2130769 3401529 4437299 5294383 6212977 7373521
15016 7373521 8742321 10146553 11408344 12386806 13003463 13314470 13505918 13745652 14064374
15007 14064374 14408924 14741846 15031615 15204656 15155848 14737318 13717722 11922497 9549714
14998 9549714 7204104 5401802 4088910 2827134 1383559 -94636 -1436340 -2648151
14990 -2648151 -3668469 -4208668 -4045521 -3328910 -2446926 -1698153 -1196916 -931531 -756340
14981 -756340 -478860 -159360 -215806 -1001265 -2316368 -3542317 -4246238 -4488572 -4572049 -4712864
14971 -4712864 -4990774 -5392880 -5769090 -5874353 -5611785 -5213714 -5092329 -5489555 -6276278
14962 -6276278 -7068912 -7537602 -7634769 -7549187 -7464513 -7414471 -7363451 -7297692 -7142502 -6693349
14952 -6693349 -5793522 -4567850 -3353295 -2389484 -1662172 -1016586 -304614 544943 1429992
14943 1429992 2020320 1961838 1230586 217305 -572027 -842421 -599367 -123915 70801
14934 70801 -545093 -2144601 -4381582 -6639316 -8380160 -9266487 -9170756 -8283744 -7145828
14925 -7145828 -6350401 -6132747 -6297280 -6522013 -6633423 -6581251 -6263625 -5476249 -4057528
14916 -4057528 -2088751 59739 1932313 3270756 4068682 4365091 4124162 3424845 2656156
14907 2656156 2301649 2471054 2782862 2809153 2563353 2440687 2695786 3085520 3085847 2432966
14897 2432966 1403060 552977 216670 272211 364734 300042 222701 480805 1356367 2858138
14887 2858138 4667423 6270773 7254505 7596576 7702173 8082347 8907579 9842647 10330849
14878 10330849 10041485 9044036 7629887 6101533 4751030 3859475 3527989 3532170 3486544
14869 3486544 3172945 2618757 1888834 985776 32540 -591510 -458907 543715 2079171
14860 2079171 3536161 4337809 4201805 3228150 1761950 179416 -1168727 -1909495 -1794158
14851 -1794158 -1016982 -233153 -65405 -604098 -1462827 -2219672 -2671487 -2779712 -2629609
14842 -2629609 -2480634 -2655305 -3261453 -4091920 -4821115 -5192879 -4988614 -3969473 -2000429
14833 -2000429 779547 3975959 7130035 9899265 12121943 13766606 14818021 15211506
14825 15211506 14898402 13951081 12548156 10865175 9022540 7087743 5026601 2704521
14817 2704521 133871 -2217657 -3559614 -3428453 -2207774 -909342 -435031 -1069786 -2569472
14808 -2569472 -4539343 -6664142 -8693419 -10355771 -11355671 -11467039 -10646658 -9087946 -7187734
14799 -7187734 -5426513 -4159722 -3398650 -2796576 -1965659 -869998 146344 746649 936172
14790 936172 966771 1014590 1070313 1101035 1184946 1462230 2037375 2951774 4175508 5582085
14780 5582085 6974812 8176511 9077279 9592908 9631026 9148420 8239009 7137712 6111615
14771 6111615 5308303 4665221 3953680 2937805 1531877 -146620 -1823182 -3162158 -3909596
14762 -3909596 -4059022 -3901781 -3838493 -4062629 -4407853 -4513374 -4154150 -3453251 -2828122 -2725602
14752 -2725602 -3317088 -4348940 -5273077 -5600152 -5221758 -4440731 -3695999 -3249127 -3100853
14743 -3100853 -3114137 -3106362 -2827159 -2010506 -606293 1065015 2517630 3476939 3958757
14734 3958757 3997267 3486692 2400879 1035388 -133277 -795228 -928559 -691159 -394774
14725 -394774 -544606 -1618769 -3628362 -5981315 -7908606 -9010890 -9364926 -9219830 -8734663
14716 -8734663 -7973716 -6980182 -5749147 -4171941 -2102169 460830 3225953 5652019
14708 5652019 7192477 7598202 7071844 6159104 5436968 5205267 5418895 5924966 6740908
14699 6740908 7991911 9528095 10762266 11106532 10581098 9828396 9489574 9714747 10306674
14690 10306674 11088185 11916186 12476698 12358261 11381815 9710675 7619836 5315430 3022464
14681 3022464 1070828 -256726 -912631 -1027534 -703234 47854 1158851 2366458 3233729
14672 3233729 3316805 2372148 503246 -1837330 -4013297 -5464231 -5937279 -5582815 -4851516
14663 -4851516 -4230771 -3986373 -4076334 -4231562 -4074056 -3230649 -1504960 940938 3600966
14654 3600966 5918693 7626621 8812107 9676673 10269147 10464136 10170502 9506502 8720752
14645 8720752 7940799 7067945 5980595 4791324 3783722 3075402 2469192 1731716 935010
14636 935010 378524 183216 111954 -140533 -585023 -973175 -1140202 -1173957 -1221737 -1260208
14626 -1260208 -1167017 -970319 -895610 -1123902 -1573057 -1959604 -2021978 -1650405 -899269 -10116
14616 -10116 597700 546336 -137545 -899842 -1017394 -156956 1397234 3023823 4199727
14607 4199727 4663444 4297091 3062480 1158075 -864566 -2343210 -2966514 -2959541 -2791784
14598 -2791784 -2780511 -3011233 -3489587 -4172683 -4862954 -5251927 -5145647 -4558194 -3554471
14589 -3554471 -2132462 -347172 1552951 3237765 4511672 5347380 5763025 5760369 5346015
14580 5346015 4522123 3291093 1765739 237939 -985378 -1810613 -2310890 -2467955 -2130985
14571 -2130985 -1306636 -362586 173901 -30205 -1015879 -2669886 -4798078 -7080493 -9122448
14562 -9122448 -10658567 -11691904 -12413624 -13021290 -13623753 -14251866 -14878224 -15409889 -15702485
14553 -15702485 -15620300 -15089153 -14078917 -12540709 -10407533 -7716773 -4751661 -2025197
14545 -2025197 -65607 841573 767969 56089 -897947 -1860030 -2818803 -3828734 -4794462
14536 -4794462 -5463646 -5659742 -5457490 -5069701 -4630460 -4210838 -4022861 -4417822 -5537639
14527 -5537639 -7009752 -8114002 -8308281 -7590532 -6384652 -5134678 -3999680 -2863555
14519 -2863555 -1594685 -314969 576260 685069 -31335 -1198727 -2304558 -3039774 -3423606
14510 -3423606 -3708880 -4210314 -5121377 -6366972 -7628542 -8581169 -9097368 -9163172 -8662931
14501 -8662931 -7428274 -5562766 -3572413 -2031695 -1159932 -812404 -809787 -1122494 -1758733
14492 -1758733 -2670442 -3850781 -5365235 -7120359 -8661001 -9389681 -9082787 -8151707 -7349101
14483 -7349101 -7203714 -7685287 -8322357 -8617515 -8433104 -8073064 -8008841 -8488086 -9376923 -10350961
14473 -10350961 -11193398 -11894213 -12521696 -13074013 -13451037 -13501113 -13072219 -12082344 -10607587
14464 -10607587 -8892518 -7220543 -5747392 -4464765 -3313867 -2297238 -1460088 -790629
14456 -790629 -196784 381259 855630 1047555 894089 575842 413051 656565 1391181 2559713
14446 2559713 3974403 5333938 6373050 7043957 7442164 7496267 6858121 5231554 2759491
14437 2759491 -16362 -2530395 -4436653 -5581541 -5950302 -5692061 -5079658 -4399450 -3933213
14428 -3933213 -3972910 -4639190 -5618470 -6252134 -6037174 -5023597 -3725639 -2766318 -2610892
14419 -2610892 -3397332 -4810045 -6196284 -6991248 -7048224 -6510741 -5475756 -3924573 -1915521
14410 -1915521 319617 2464639 4212600 5354525 5950248 6377972 7008200 7774991 8218535
14401 8218535 8012817 7323592 6570137 5946711 5299620 4449226 3546436 3066117 3407688
14392 3407688 4457815 5574166 6074582 5756537 4920629 3954458 2979305 1841765 327289
14383 327289 -1564639 -3386945 -4318206 -3726670 -1793340 561012 2482000 3821546 4910081
14374 4910081 5853367 6231608 5443716 3221456 -131607 -3829877 -6924972 -8747743 -9247894
14365 -9247894 -8959896 -8577359 -8468066 -8534328 -8511661 -8357416 -8271565 -8346777 -8376674 -8162700
14355 -8162700 -7884663 -7903936 -8203617 -8315026 -7930267 -7363297 -7210473 -7704507 -8609233 -9627251
14345 -9627251 -10624090 -11425708 -11639797 -10858572 -9044033 -6691824 -4596358 -3345829 -2913052
14336 -2913052 -2719932 -2142942 -945683 750069 2735957 4820916 6794595 8513130
14328 8513130 10020474 11420144 12618422 13350617 13488079 13169186 12578566 11746526 10668198
14319 10668198 9525927 8671503 8388072 8695891 9348385 9984769 10334493 10334050 10062147 9575870
14309 9575870 8834280 7772982 6436314 5059112 4006114 3507691 3362293 3013222 2107486
14300 2107486 966080 341068 705014 1938178 3687305 5727213 7783885 9225178
14292 9225178 9292764 7748851 5174274 2565585 677861 -287881 -548391 -457946 -339533
14283 -339533 -424592 -794786 -1333717 -1802801 -2043113 -2102486 -2132658 -2195506 -2227619 -2153158 -1929989
14272 -1929989 -1502895 -860340 -202753 71673 -304065 -1153561 -1955690 -2276816 -2085603
14263 -2085603 -1670539 -1313013 -1066765 -832320 -604804 -602274 -1120768 -2276139 -3905337
14254 -3905337 -5678532 -7256363 -8395230 -9037311 -9343870 -9547864 -9700108 -9602098 -9038801
14245 -9038801 -8041050 -6872745 -5781886 -4785486 -3660261 -2130416 -144884 1947823
14237 1947823 3521271 4054956 3470216 2142447 622046 -697256 -1756975 -2762091
14229 -2762091 -3894551 -5039860 -5805158 -5826588 -5046541 -3722120 -2263478 -1091825 -522974
14220 -522974 -638044 -1255490 -2097343 -2999038 -3942157 -4914679 -5777068 -6249757 -6036636 -5049361
14210 -5049361 -3577566 -2181355 -1328283 -1135558 -1476048 -2237192 -3368626 -4722126 -5975804
14201 -5975804 -6756512 -6818079 -6169669 -5139396 -4279393 -4048506 -4493066 -5247575 -5828488
14192 -5828488 -5878391 -5193919 -3692118 -1428039 1420971 4608015 7764714 10305736 11592756
14183 11592756 11374283 10015325 8163946 6216289 4207827 2156822 298428 -1096106
14175 -1096106 -1980203 -2475894 -2621978 -2307623 -1442910 -81611 1639755 3573194 5520615
14166 5520615 7245945 8677531 10095998 11989613 14629319 17781041 20821642 23082777
14158 23082777 24109118 23758303 22229445 19993477 17547587 15127297 12651939 9952256
14150 9952256 7012659 3998136 1136646 -1361657 -3340243 -4779572 -5872620 -6923409
14142 -6923409 -8072095 -9104323 -9573552 -9153510 -7901966 -6213024 -4543510 -3194854
14134 -3194854 -2325286 -2084210 -2623348 -3920421 -5635446 -7227989 -8258009 -8573636 -8253323
14125 -8253323 -7472056 -6471932 -5567887 -5031782 -4908527 -4981265 -4960011 -4724778 -4411878 -4280516
14115 -4280516 -4467319 -4845808 -5162393 -5340255 -5584334 -6118140 -6891524 -7669735 -8346553
14106 -8346553 -8971595 -9456015 -9480289 -8819210 -7607430 -6165836 -4732820 -3538314 -2964603
14097 -2964603 -3306616 -4336434 -5319859 -5551564 -4814127 -3411988 -1993980 -1331967 -1953314
14088 -1953314 -3772043 -6157251 -8442058 -10282159 -11550728 -12177496 -12283345 -12282832 -12580156
14079 -12580156 -13167251 -13637005 -13518281 -12494280 -10468202 -7702240 -4881708 -2773249
14071 -2773249 -1685714 -1344609 -1304020 -1361895 -1581438 -2094268 -2963890 -4098421 -5181349
14062 -5181349 -5777398 -5634658 -4880246 -3885838 -2989859 -2369092 -2056269 -1944169 -1796835
14053 -1796835 -1388379 -693900 83240 680394 937888 809428 309821 -461981 -1277133
14044 -1277133 -1871449 -2159552 -2314618 -2571738 -2986430 -3466139 -3998775 -4703412 -5621925
14035 -5621925 -6605225 -7489804 -8251544 -8847286 -9013755 -8425518 -7034417 -5078655 -2756200
14026 -2756200 -83273 2867960 5785391 8312313 10317276 11828531 12774595 12960874
14018 12960874 12321222 11078348 9610884 8219850 7035001 6047541 5137142 4101184
14010 4101184 2803963 1414247 461561 504218 1633021 3331195 4882729 5887719 6349314
14001 6349314 6388641 6070323 5507002 4936454 4579623 4499018 4646795 4939768 5207988 5194404
13991 5194404 4760157 4052313 3347339 2754293 2185507 1591639 1072828 713639 419439
13982 419439 -14571 -730344 -1736978 -2925114 -4060887 -4797117 -4794087 -3909763 -2325260
13973 -2325260 -518171 929616 1628693 1604158 1239573 962569 953652 1104580 1154440 819483
13963 819483 -95604 -1537186 -3106854 -4227995 -4498952 -3889322 -2617888 -952714 796845
13954 796845 2200064 2827766 2571513 1806242 1153120 1026190 1366171 1767806 1851450 1551446
13944 1551446 1107514 826390 869239 1235512 1874426 2754416 3830685 4965138 5864903
13935 5864903 6120767 5424232 3853062 1893477 51540 -1569050 -3212512 -5003111
13927 -5003111 -6657892 -7710182 -7927817 -7481159 -6812081 -6391914 -6480146 -6994311 -7640154
13918 -7640154 -8189056 -8524104 -8398678 -7391543 -5331767 -2675727 -229431 1499734 2516642
13909 2516642 2981036 2928738 2435256 1820566 1498392 1693796 2400685 3502453 4785501
13900 4785501 5886056 6392981 6094108 5140567 3994278 3189555 3026536 3400263 3946166
13891 3946166 4392570 4754303 5195865 5801418 6516974 7206632 7663648 7641657 7026240 6004829
13881 6004829 4983654 4281787 3897885 3536872 2811664 1445425 -613540 -3172037 -5852262
13872 -5852262 -8214768 -9916513 -10827004 -10990431 -10444722 -9122858 -7022802 -4466529 -2069149
13863 -2069149 -368073 504608 794189 852587 910984 1008301 1048188 941202 708704 397269
13853 397269 -106940 -1065220 -2617506 -4584082 -6567284 -8168533 -9092936 -9218033 -8706059
13844 -8706059 -7948015 -7225740 -6452567 -5358692 -3875048 -2197419 -531534 1036458 2428264
13835 2428264 3557809 4522240 5642172 7150289 8887945 10424227 11460214 12023785
13827 12023785 12254508 12096010 11327402 9955213 8493822 7687124 7868469 8677881 9474178
13818 9474178 9900864 9920537 9450109 8267372 6322092 3899869 1363853 -1093502 -3321623
13809 -3321623 -5005550 -5793829 -5604096 -4706776 -3583471 -2792113 -2802951 -3686045 -4934140
13800 -4934140 -5817271 -6034047 -5912863 -5904843 -6007009 -5811269 -5036188 -3830185 -2531159
13791 -2531159 -1289641 -51989 1154857 2087762 2491852 2349616 1857242 1232466 651975
13782 651975 305136 301428 457250 340137 -324449 -1347607 -2271373 -2776877 -2762789 -2124848
13772 -2124848 -736980 1259618 3345409 4979708 6037686 6830447 7771099 9085000
13764 9085000 10711915 12305938 13358804 13509068 12803766 11581479 10089606 8326290
13756 8326290 6279287 4167725 2336275 997264 191605 -74142 166192 663872 930060
13747 930060 507253 -723678 -2512568 -4481035 -6394201 -8253176 -10151631 -12014325
13739 -12014325 -13476969 -14082777 -13619868 -12217233 -10117270 -7487135 -4550081 -1792566
13731 -1792566 169342 1004065 872886 198303 -701816 -1736690 -2925665 -4260272 -5623599
13722 -5623599 -6753191 -7345400 -7355143 -7221625 -7643496 -8980182 -10866671 -12468222 -13105649
13713 -13105649 -12630184 -11322660 -9629278 -8028031 -6936707 -6510879 -6512814 -6525250 -6355346
13704 -6355346 -6137022 -5998103 -5787884 -5321204 -4843847 -5006050 -6218854 -8120757 -9816898
13695 -9816898 -10618220 -10444929 -9574759 -8236736 -6574393 -4836376 -3332587 -2125383 -887868
13686 -887868 822835 3143795 5739407 7985650 9321787 9545467 8872786 7697428 6253663
13677 6253663 4559277 2714172 1126806 274685 242555 638555 1008224 1223657 1432671
13668 1432671 1784178 2344725 3194826 4404404 5860615 7235550 8204847 8661492 8685889
13659 8685889 8372275 7755700 6884767 5895177 4998366 4433917 4426222 5109397 6414942 8016195
13649 8016195 9417646 10150442 9953135 8859831 7181917 5378572 3847293 2763688
13641 2763688 2102419 1788923 1783657 2019152 2331692 2522061 2483453 2271446 2095647 2233909
13631 2233909 2824581 3638547 4132399 3871772 2906065 1640337 383925 -821982 -1934985
13622 -1934985 -2679670 -2724953 -2022174 -876159 273729 1092853 1454422 1402879 1004981
13613 1004981 222719 -987189 -2406694 -3494676 -3695057 -2781442 -900825 1551317 3979670
13604 3979670 5700738 6309497 5985615 5277815 4561139 3844201 3091223 2483419 2208771
13595 2208771 2122796 1800343 933035 -390205 -1782655 -2902376 -3728529 -4531337 -5552654
13586 -5552654 -6733804 -7819215 -8692748 -9473314 -10255456 -10924224 -11336093 -11550564 -11714056
13577 -11714056 -11768072 -11436069 -10506545 -9015802 -7158677 -5154868 -3236334 -1629137 -434472
13568 -434472 434028 1110321 1565196 1580010 968908 -148782 -1308843 -2010947 -2152022
13559 -2152022 -2148294 -2561362 -3591860 -4977152 -6343987 -7546677 -8650368 -9732628 -10808395
13550 -10808395 -11860118 -12804252 -13460105 -13693483 -13616218 -13530023 -13614523 -13735990 -13593715 -12961454
13540 -12961454 -11731479 -9864686 -7511005 -5210562 -3796071 -3904113 -5505988 -7899410
13532 -7899410 -10136220 -11495420 -11700613 -10881458 -9425924 -7825219 -6538917 -5883189 -5944820
13523 -5944820 -6531854 -7193282 -7354814 -6576854 -4824408 -2537667 -378356 1189631 2145605
13514 2145605 2830533 3714811 5207597 7458792 10122352 12360425 13322416 12741071 10999154
13505 10999154 8639007 5995800 3343496 1100633 -394939 -1229610 -1783659 -2264633
13497 -2264633 -2570524 -2614763 -2552562 -2594908 -2779617 -3058537 -3489969 -4192605 -5143783 -6110673
13487 -6110673 -6746112 -6706937 -5780087 -4041760 -1912850 19913 1297278 1766597 1577386
13478 1577386 1053941 503516 68004 -236710 -350447 -138023 423112 1125807 1694152
13469 1694152 1994915 2019024 1766245 1297648 839142 651520 778462 1038309 1250242 1328712
13459 1328712 1168277 634073 -254610 -1285377 -2308125 -3424070 -4811254 -6439981 -8063231
13450 -8063231 -9430912 -10441505 -11179893 -11916818 -12962959 -14329387 -15550512 -16029113 -15611931
13441 -15611931 -14714801 -13863590 -13253618 -12813209 -12545845 -12659290 -13375335 -14664232 -16122215
13432 -16122215 -17092808 -17032465 -15880982 -14054201 -12040863 -10105216 -8446440 -7446504 -7448549
13423 -7448549 -8234910 -8948465 -8706586 -7272949 -5110422 -2902226 -1113400 105458 816845
13414 816845 1215719 1608104 2360233 3732161 5640527 7580716 8898263 9220899 8607887
13405 8607887 7298102 5446176 3163851 655506 -1872608 -4376610 -6858971 -9090901
13397 -9090901 -10641800 -11259297 -11091484 -10465804 -9586521 -8561021 -7590513 -6920226 -6586624
13388 -6586624 -6360929 -5994771 -5423090 -4671795 -3667478 -2261483 -441681 1549739 3323021
13379 3323021 4539913 5055795 4987454 4698611 4632227 5020334 5699350 6223489 6177686 5428889
13369 5428889 4208977 3083193 2779765 3811454 6074355 8822483 11130107 12438759
13361 12438759 12731622 12333919 11652939 11018876 10566464 10160745 9495143 8373400 6959469
13352 6959469 5742397 5179820 5293747 5627689 5680562 5377986 5022930 4813994 4622756
13343 4622756 4337053 4201427 4576356 5446004 6397210 7066154 7405563 7528183 7518244 7439273
13333 7439273 7311384 7000401 6323416 5369292 4543404 4173792 4220030 4480588 4900599 5480589
13323 5480589 6010885 6133308 5649585 4635035 3332363 2121372 1520324 1941351 3354639
13314 3354639 5334405 7476886 9636106 11730334 13522148 14726164 15224294 15047211
13306 15047211 14216100 12734433 10715621 8422376 6191212 4391914 3415591 3530700
13298 3530700 4631624 6167300 7435017 8025144 8006488 7711063 7395403 7126314 6909376
13289 6909376 6800526 6853977 7033338 7226934 7300400 7074727 6304442 4800204 2636284
13280 2636284 209845 -1953421 -3487748 -4331018 -4651060 -4691141 -4709651 -5016197 -5927914
13271 -5927914 -7558686 -9644036 -11663270 -13179585 -14038767 -14272717 -13928736 -13034921 -11633466
13262 -11633466 -9780844 -7594983 -5375982 -3596366 -2639849 -2523556 -2897268 -3284714 -3337118
13253 -3337118 -2985024 -2443396 -1998609 -1705818 -1361887 -832013 -261618 168911 546712
13244 546712 1036043 1436734 1203559 -26802 -2100272 -4558838 -6979558 -9047988 -10556514
13235 -10556514 -11531499 -12227933 -12797703 -13017472 -12506513 -11193898 -9441792 -7706993 -6168923
13226 -6168923 -4674219 -2955466 -905925 1284654 3260404 4820562 6106326 7412720
13218 7412720 8816476 10042553 10709165 10676787 10164039 9559251 9128014 8884591 8719371
13209 8719371 8592083 8530823 8456189 8109076 7204033 5603948 3340428 591332 -2272575
13200 -2272575 -4735988 -6422274 -7358245 -7864918 -8171816 -8211983 -7787708 -6826146 -5429340
13191 -5429340 -3766832 -2006215 -313219 1174284 2415049 3486136 4495743 5444781
13183 5444781 6176152 6491731 6335812 5840486 5176635 4394030 3437479 2296348 1117106
13174 1117106 208138 -40685 670032 2313989 4416212 6219142 7071432 6773945 5676148
13165 5676148 4482360 3848007 3982418 4560901 5036630 5044097 4526653 3615820 2541918
13156 2541918 1606195 1012386 628477 54290 -947056 -2146211 -3056587 -3375428 -3143409
13147 -3143409 -2579548 -1913190 -1317717 -818759 -261214 438001 931975 528393 -1169495
13138 -1169495 -3725471 -6084906 -7333584 -7225720 -6093701 -4446269 -2695054 -1092322
13130 -1092322 268075 1446827 2591092 3774099 4830857 5358797 4985352 3741111
13122 3741111 2153410 873498 176009 -142512 -415419 -787435 -1270017 -1961805 -3063478
13113 -3063478 -4679619 -6665234 -8631775 -10047183 -10407778 -9478253 -7448460 -4840170
13105 -4840170 -2248190 -153273 1133322 1512788 1137905 328188 -606019 -1425220 -1869535
13096 -1869535 -1646320 -635781 899412 2400772 3382120 3760085 3865925 4137925 4746943
13087 4746943 5462652 5875234 5769091 5299126 4821402 4571317 4503347 4416055 4204153 3966198
13077 3966198 3857327 3876545 3877223 3801510 3802916 4043785 4418123 4579368 4241614 3390824 2241249
13066 2241249 1096712 239705 -186564 -241899 -56999 367732 1105293 2014689 2683903
13057 2683903 2801290 2510536 2282234 2479576 3127459 4017472 4896586 5590744 6096304
13048 6096304 6579894 7200873 7923568 8570874 9031625 9296672 9283058 8755679 7506767
13039 7506767 5572661 3242352 893506 -1176584 -2838711 -4099885 -4942418 -5172547
13031 -5172547 -4497194 -2815356 -407559 2219184 4675772 6854771 8764959 10265830
13023 10265830 11048353 10936974 10190231 9409153 9089270 9299763 9820764 10476378 11205128
13014 11205128 11884695 12306501 12377692 12173911 11673653 10562104 8472879 5426238 1940391
13005 1940391 -1278102 -3694616 -5084092 -5515379 -5296604 -4834793 -4400884 -3991374 -3455353
12996 -3455353 -2754023 -2041149 -1476733 -1045564 -655341 -389769 -526014 -1217671 -2238738
12987 -2238738 -3154445 -3711984 -3947813 -3943772 -3672843 -3170537 -2687757 -2469142 -2396151 -2005910
12977 -2005910 -921061 786029 2628539 3997153 4431920 3800671 2393542 846282
12969 846282 -154287 -221260 557367 1699549 2597598 2860293 2552831 2124296 2017344
12960 2017344 2297981 2671391 2830684 2728166 2528940 2428470 2587537 3142373 4119605
12951 4119605 5311191 6306453 6666841 6043978 4224115 1276696 -2250296 -5454528 -7615540
12942 -7615540 -8627435 -8822690 -8444967 -7481180 -6013472 -4491526 -3457431 -3047194 -2896855
12933 -2896855 -2550466 -1903950 -1277074 -1124340 -1657944 -2664386 -3655281 -4234881 -4362522
12924 -4362522 -4311011 -4456681 -5120150 -6441606 -8203885 -9781742 -10468596 -9998272 -8723120
12915 -8723120 -7250927 -5968923 -4923801 -3997562 -3039715 -1886859 -438657 1218561
12907 1218561 2831808 4143881 4975631 5174178 4640334 3509121 2209570 1188907 544646
12898 544646 -9137 -804858 -1903382 -3095392 -4115755 -4793657 -5043704 -4806614 -4053924
12889 -4053924 -2864569 -1489550 -293094 449611 734612 780752 781574 747685 611493 394081
12879 394081 160069 -153423 -711867 -1533121 -2370656 -2941577 -3210868 -3346445 -3433267 -3383410
12869 -3383410 -3186225 -3131165 -3630448 -4775608 -6116338 -6928851 -6733297 -5587344 -3928937
12860 -3928937 -2178067 -496839 1116123 2594665 3746437 4429401 4744280 5022138 5604639
12851 5604639 6585639 7699344 8461248 8512547 7920318 7147472 6680808 6652809 6791953 6676156
12841 6676156 5996072 4642056 2670975 258723 -2348970 -4892725 -7127535 -8827869
12833 -8827869 -9834477 -10143565 -9941231 -9538245 -9281674 -9489355 -10336948 -11692997 -13094242
12824 -13094242 -14006291 -14167129 -13641221 -12538393 -10773433 -8172767 -4770317 -923008
12816 -923008 2835094 5969430 8022787 8723150 8180957 6941475 5685641 4797669 4234243
12807 4234243 3767351 3234404 2555484 1718305 924441 638024 1217862 2419847 3431089
12798 3431089 3527682 2645481 1270293 -80987 -1136240 -1767398 -1888009 -1530551 -890426
12789 -890426 -197824 420189 942655 1387077 1724711 1738014 934161 -1223643 -4807184
12780 -4807184 -9129315 -13050639 -15645314 -16642647 -16380083 -15471214 -14482336 -13737581 -13262626
12771 -13262626 -12852552 -12210976 -11093824 -9422293 -7327221 -5081483 -2968449 -1212118
12763 -1212118 20365 672613 906446 1043217 1275077 1473594 1388623 1000956 550208
12754 550208 213284 -115297 -687367 -1656110 -3013073 -4650295 -6379102 -7947622 -9163727
12745 -9163727 -10035628 -10761947 -11567329 -12505241 -13316328 -13419351 -12134066 -9091335 -4547881
12736 -4547881 666095 5535164 9306679 11739202 13038270 13540632 13411114 12653789 11406781
12727 11406781 10104587 9225596 8898188 8842663 8677469 8179932 7264229 5869283 3981897
12718 3981897 1722883 -669225 -2930277 -4818483 -6123514 -6713946 -6605500 -5970310 -5078365
12709 -5078365 -4224574 -3668427 -3585376 -4034926 -4936521 -6041288 -6950235 -7252797 -6733167
12700 -6733167 -5466421 -3720429 -1788905 87004 1708450 2910117 3584539 3719168
12692 3719168 3426386 2909239 2303937 1509634 257503 -1548513 -3583185 -5286510 -6314909
12683 -6314909 -6763362 -6977030 -7249409 -7709126 -8360392 -9119447 -9844561 -10410562 -10756287
12674 -10756287 -10830348 -10525043 -9728490 -8461237 -6957218 -5619868 -4860966 -4853733 -5339398
12665 -5339398 -5728965 -5536496 -4766650 -3837170 -3138494 -2760959 -2638625 -2766948 -3125485
12656 -3125485 -3493216 -3582993 -3415312 -3367257 -3698514 -4132352 -4097846 -3377942 -2344459 -1518692
12646 -1518692 -1087855 -969115 -1169929 -1830463 -2923867 -4139117 -5149020 -5867755 -6380610
12637 -6380610 -6758316 -7048823 -7336091 -7642888 -7803475 -7564243 -6823362 -5704388 -4440058
12628 -4440058 -3303839 -2624994 -2675883 -3424804 -4466760 -5291607 -5613089 -5420877 -4796729
12619 -4796729 -3787913 -2462107 -997052 359477 1435094 2220157 2791141 3159364 3241062
12610 3241062 2989044 2486129 1848426 1093790 206016 -701993 -1427894 -1915010 -2321040
12601 -2321040 -2774031 -3160621 -3276481 -3146738 -3083832 -3417795 -4226138 -5298339 -6262429
12592 -6262429 -6735811 -6478979 -5532835 -4233124 -3040131 -2288538 -2046031 -2178726 -2544502
12583 -2544502 -3118646 -3924059 -4865793 -5701709 -6208048 -6326570 -6111340 -5598838 -4828461
12574 -4828461 -3964259 -3260144 -2840662 -2598341 -2388404 -2264224 -2404466 -2818113 -3253307
12565 -3253307 -3457084 -3421590 -3270272 -2978860 -2381123 -1472061 -541925 103695 478644 862356
12555 862356 1443990 2092568 2430793 2060489 802845 -1120246 -3153537 -4815342 -6076105
12546 -6076105 -7218826 -8329200 -9122993 -9376184 -9357632 -9662927 -10683981 -12359596 -14355006
12537 -14355006 -16305869 -17907879 -18960867 -19424642 -19376387 -18867801 -17848020 -16235291 -14052554
12528 -14052554 -11522977 -9058404 -7099319 -5896108 -5438087 -5558788 -5986922 -6273426 -5898223
12519 -5898223 -4698119 -3154014 -2047328 -1771602 -2046993 -2245718 -1860859 -756666 749967
12510 749967 1980001 2303139 1648040 552264 -345772 -781296 -857700 -804155 -864443 -1247135
12500 -1247135 -1992673 -2948030 -3974700 -5082220 -6249840 -7244778 -7769602 -7685982 -6943561
12491 -6943561 -5436846 -3198675 -687320 1406554 2718449 3412352 3815812 4072676 4220015
12482 4220015 4365333 4596964 4825011 4861080 4599842 4036412 3207271 2245603 1422513 975631
12472 975631 894252 969987 1049770 1152371 1344301 1585099 1707081 1506077 881678 -45773
12462 -45773 -976455 -1650071 -2009705 -2128464 -2084073 -2026656 -2258872 -2980503 -3877839 -4173970
12452 -4173970 -3272877 -1316550 971847 2919086 4296919 5216259 5837820 6220476 6329187
12443 6329187 6121086 5653287 5109010 4678065 4429753 4353361 4484128 4903319 5642079 6689605
12433 6689605 8068324 9741159 11406703 12553903 12850983 12419267 11652339 10851661 10115496
12424 10115496 9456744 8857596 8249230 7588339 6934028 6313351 5553118 4449789 3139651
12415 3139651 2091682 1617854 1536773 1436846 1114577 576765 -246539 -1487138 -3002724
12406 -3002724 -4313657 -5037797 -5273139 -5404018 -5586835 -5565478 -4991421 -3819657 -2366421
12397 -2366421 -1056742 -148828 369659 701759 1059449 1491994 1833213 1810330 1243904
12388 1243904 191210 -1081972 -2274932 -3206848 -3814316 -4045173 -3824855 -3142884 -2112317
12379 -2112317 -905753 310881 1326582 1848790 1674441 941259 115590 -335203 -235203
12370 -235203 296522 974200 1400213 1163952 126371 -1370796 -2738361 -3654799 -4278973
12361 -4278973 -4935354 -5690740 -6273132 -6278632 -5366790 -3372672 -431644 2938782 5965377
12352 5965377 7944390 8553051 7952812 6637846 5124558 3691323 2359791 1077480
12344 1077480 -145057 -1271550 -2313688 -3304396 -4255651 -5206366 -6256709 -7455911 -8647369
12335 -8647369 -9483774 -9631145 -8984472 -7737675 -6267966 -4913089 -3834192 -3095201 -2786221
12326 -2786221 -2912156 -3180272 -3153246 -2769136 -2541660 -3041679 -4274387 -5747982 -7027950
12317 -7027950 -7944584 -8316428 -7854497 -6523447 -4800320 -3382684 -2678742 -2607400 -2757331
12308 -2757331 -2684293 -2214569 -1569186 -1089662 -790041 -344560 393067 1068131 1220600 864658
12298 864658 435896 222327 97917 -145917 -412754 -354888 284066 1459067 2890042
12289 2890042 4261066 5376021 6197295 6817804 7457537 8449448 10078777 12323192 14777740
12280 14777740 16888290 18236536 18625582 18071193 16858868 15514390 14519013 14008089 13803623
12271 13803623 13687496 13543993 13308201 12946308 12492576 11972723 11289955 10333017 9224956
12262 9224956 8317825 7864619 7786597 7818264 7789452 7694175 7553658 7307534 6857141 6222425
12252 6222425 5680520 5693975 6570311 8137517 9809617 10995685 11421852 11139029 10398992
12243 10398992 9553803 8882812 8371397 7742814 6827063 5839701 5180986 4986986 4973616
12234 4973616 4713465 4009208 3038930 2217037 1878172 2000959 2251363 2384673 2600303
12225 2600303 3400003 5051346 7228028 9181328 10233135 10175668 9377365 8591344 8524673
12216 8524673 9379373 10743329 12001677 12893066 13607325 14325658 14795813 14507899 13266756
12207 13266756 11437124 9572877 7941862 6530118 5400311 4827390 5031506 5909154
12199 5909154 7099492 8236052 9089491 9583284 9807620 10002437 10417806 11131876 11987199
12190 11987199 12660215 12785772 12130828 10789874 9207732 7880538 6949044 6102166 4896986
12181 4896986 3151026 1050333 -1012704 -2633805 -3510853 -3536235 -2889496 -2032645 -1525293
12172 -1525293 -1721939 -2536699 -3459009 -3863136 -3435761 -2409591 -1404388 -994267 -1347417
12163 -1347417 -2187481 -3026764 -3448810 -3285734 -2653163 -1831868 -1036597 -261665 590752
12154 590752 1393088 1683401 995111 -669512 -2729572 -4388320 -5087127 -4682710 -3363179
12145 -3363179 -1516839 369392 1843848 2650511 2803315 2503772 1967281 1302225 539721
12136 539721 -236054 -838416 -1129972 -1239188 -1548672 -2369871 -3598661 -4725174 -5215207
12127 -5215207 -4895721 -3998717 -2889485 -1792695 -750317 247095 1163133 1936929 2532186
12118 2532186 2931035 3115336 3094409 2937923 2755310 2660598 2776341 3217340 3980260 4831157
12108 4831157 5360792 5193496 4150444 2265161 -252617 -3039814 -5683307 -7932107
12100 -7932107 -9810307 -11438350 -12720541 -13276645 -12745543 -11163261 -9033082 -7027765
12092 -7027765 -5598921 -4794828 -4361835 -3982190 -3447813 -2676206 -1632979 -306018 1201073
12083 1201073 2568261 3345809 3257628 2472029 1542011 1020749 1092186 1531692 1974008 2209371
12073 2209371 2272116 2292333 2259091 1924779 996236 -516934 -2153677 -3258607 -3420593
12064 -3420593 -2677774 -1364880 142852 1530844 2514613 2853251 2463734 1515454 359975
12055 359975 -702293 -1629817 -2608101 -3793313 -5105968 -6295802 -7171109 -7719357 -8043227
12046 -8043227 -8266115 -8504720 -8839601 -9244344 -9570320 -9649575 -9412178 -8887119 -8115186 -7124188
12036 -7124188 -6039717 -5203345 -5070977 -5855867 -7246281 -8593060 -9468242 -9978628 -10452526
12027 -10452526 -10907755 -10976171 -10315405 -8929779 -7086162 -5111393 -3357008 -2186392 -1801338
12018 -1801338 -2084877 -2695499 -3310325 -3777918 -4151563 -4661687 -5560849 -6858974 -8233128
12009 -8233128 -9290255 -9889579 -10127397 -10067761 -9625959 -8707275 -7331191 -5603228 -3683709
12000 -3683709 -1818603 -287344 749064 1279966 1276478 564149 -1062601 -3625061 -6887850
11991 -6887850 -10447195 -13853784 -16725941 -18844939 -20148165 -20597312 -20093926 -18600900
11983 -18600900 -16346873 -13840498 -11627366 -9989678 -8807693 -7665962 -6174592 -4334151
11975 -4334151 -2623981 -1637261 -1569822 -2116942 -2873399 -3684172 -4492026 -4997638 -4756836
11966 -4756836 -3670367 -2157411 -697416 659867 2151206 3757285 5033394 5524364
11958 5524364 5205518 4474634 3845742 3703565 4185934 5121245 6098120 6723867 6868925
11949 6868925 6662108 6304333 5942285 5667369 5526311 5497812 5491702 5383968 5059618 4471531
11939 4471531 3686434 2810679 1811030 471749 -1366063 -3534835 -5599367 -7194318 -8248002
11930 -8248002 -8904200 -9336486 -9658621 -9900170 -9979925 -9730408 -8993633 -7694635 -5864739
11921 -5864739 -3697163 -1601086 -74076 602471 539803 86169 -455457 -926014 -1235186
11912 -1235186 -1324570 -1205797 -956164 -681709 -540108 -740094 -1368592 -2182044 -2680834 -2462602
11902 -2462602 -1465647 110873 1967523 3715757 4920650 5375998 5328050 5230957 5224918
11893 5224918 5013515 4356924 3567959 3371082 4285279 6211116 8549490 10588556 11808620
11884 11808620 12025711 11408235 10348964 9246948 8376105 7906429 7920401 8318046 8779203
11875 8779203 8966297 8795442 8418908 7918244 7136447 5907675 4360624 2835982 1514142
11866 1514142 285099 -963042 -2075887 -2760858 -2879234 -2498347 -1777072 -993722 -602683
11857 -602683 -961073 -1906505 -2836705 -3372129 -3789910 -4631806 -6000612 -7433565 -8385581
11848 -8385581 -8631241 -8260041 -7556427 -6934429 -6729219 -6885945 -6992479 -6773976 -6471495
11839 -6471495 -6590547 -7319401 -8314310 -9026483 -9118917 -8574480 -7559607 -6305611 -5080381
11830 -5080381 -4121055 -3460798 -2817716 -1782661 -237777 1433348 2650517 3155832 3161730
11821 3161730 3032473 2986300 3148392 3696559 4754842 6167150 7508615 8350464 8476378
11812 8476378 7886631 6697515 5066408 3167699 1219076 -465819 -1497851 -1571881 -657924
11803 -657924 962254 2859947 4684895 6263437 7502427 8242951 8308186 7765121 7061930
11794 7061930 6766173 7163245 8199976 9733663 11570580 13201953 13831346 13000077 11143310
11785 11143310 9285671 8145112 7661243 7362408 6965234 6515373 6092488 5548131 4554050
11776 4554050 2877610 632113 -1717244 -3602133 -4619722 -4615872 -3668557 -2135405 -638875
11767 -638875 250890 465928 496145 877971 1634642 2278589 2334441 1775517 946578 174811
11757 174811 -427046 -798398 -744361 -62106 1177401 2618017 3917288 4927732 5534027
11748 5534027 5495632 4657658 3285509 2012866 1404420 1642054 2616623 4162036 6094502
11739 6094502 8100096 9741944 10681248 10906343 10694504 10303219 9747602 8970269 8160357
11730 8160357 7667067 7501470 7140349 6046826 4289605 2440439 939046 -193392 -1052828
11721 -1052828 -1588314 -1754550 -1689579 -1557159 -1334258 -906138 -296376 324940 830891 1276072
11711 1276072 1902169 3022881 4750476 6709635 8118656 8329594 7332783 5714958 4187016
11702 4187016 3185035 2781451 2786267 2909638 2925141 2717187 2180805 1182622 -258037 -1790303
11692 -1790303 -2879432 -3184869 -2748387 -1835771 -704876 444182 1408492 1988453 2059756
11683 2059756 1613110 763736 -213765 -884570 -818657 116117 1619129 3214231 4713191
11674 4713191 6389744 8644100 11533490 14687254 17617461 19988622 21599078 22269910
11666 22269910 21878891 20489180 18409484 16139733 14210087 12926719 12177036 11522099
11658 11522099 10543548 9107809 7333200 5418320 3558796 1939765 703876 -76129
11650 -76129 -380696 -252145 166543 696052 1285578 2040380 3022148 4106298 5129796
11641 5129796 6094779 7064529 7860471 8035595 7288138 5901374 4696657 4466085 5372641
11632 5372641 6852482 8079738 8528605 8158480 7229236 6068727 4925311 3837779 2634762
11623 2634762 1243886 34309 -364708 291222 1551745 2714445 3406129 3598478 3289338
11614 3289338 2470500 1311170 55395 -1278662 -2847007 -4596822 -6174426 -7286785
11606 -7286785 -7952369 -8320107 -8451118 -8398571 -8315082 -8315719 -8353532 -8359854 -8364042 -8300673 -7838197
11595 -7838197 -6680858 -5057523 -3682774 -3125351 -3322779 -3774260 -4077384 -4163932 -4117721
11586 -4117721 -3969182 -3732375 -3530915 -3571480 -3987835 -4741913 -5637234 -6359216 -6539759 -5932236
11576 -5932236 -4617005 -2977023 -1388241 40939 1379205 2592969 3446679 3623072
11568 3623072 2834316 898834 -2055612 -5394088 -8173462 -9730693 -10071939 -9645592 -8843084
11559 -8843084 -7839197 -6826236 -6179948 -6294284 -7309494 -9036488 -11086688 -13033937
11551 -13033937 -14513066 -15280056 -15272583 -14651559 -13748956 -12874980 -12083224 -11115654 -9643016
11542 -9643016 -7627526 -5475951 -3814102 -3043767 -3043113 -3273813 -3217910 -2760263 -2188555 -1895226
11532 -1895226 -2159784 -3180688 -5112427 -7871346 -10921939 -13458517 -14961996 -15576239
11524 -15576239 -15871270 -16244138 -16596983 -16555651 -15874142 -14586593 -12909155 -11163128 -9763131
11515 -9763131 -9070425 -9111072 -9473022 -9556898 -8927748 -7450538 -5246529 -2671496 -280958
11506 -280958 1370889 1990571 1600721 408682 -1257269 -2919246 -4065971 -4425625 -4072765
11497 -4072765 -3237131 -2116691 -931725 -870 430359 428638 322429 408402 786642 1452647
11487 1452647 2402796 3577987 4782177 5751980 6316569 6462966 6248735 5675740 4668731
11478 4668731 3189376 1369733 -481191 -2006683 -2939180 -3162939 -2742961 -1933755 -1080289
11469 -1080289 -402948 146378 787824 1661246 2651559 3420109 3613351 3128484 2226469
11460 2226469 1312527 529889 -372787 -1680331 -3260751 -4582564 -5168328 -4940187 -4154818
11451 -4154818 -3161742 -2272575 -1701876 -1461803 -1315322 -935807 -174636 810653 1672616
11442 1672616 2124087 2129287 1900411 1727207 1827027 2347743 3412394 5037922 7019813
11433 7019813 9006768 10707323 11937896 12490753 12131366 10804726 8707445 6061543
11425 6061543 2966110 -367869 -3357976 -5276472 -5787362 -5170355 -4079059 -3240982 -3292160
11416 -3292160 -4520133 -6546258 -8436012 -9374677 -9242271 -8455100 -7378248 -6084375 -4593291
11407 -4593291 -3038307 -1493716 130254 1806087 3095498 3377502 2451087 816481
11399 816481 -706440 -1603406 -1918536 -2011657 -2170243 -2400703 -2450209 -1984437 -840289 799956
11389 799956 2490773 3823095 4653299 5066532 5213168 5241829 5300978 5459348 5614920 5596894
11379 5596894 5405544 5277527 5462656 5977330 6602007 7069956 7241372 7169832 7052666 7065238
11369 7065238 7189749 7233857 7033009 6573000 5904342 5067105 4199670 3612864 3572771 3991582
11359 3991582 4444784 4530265 4170256 3601664 3166299 3076895 3243531 3294982 2884697 2033536
11349 2033536 1110696 480637 279171 522592 1214101 2203341 3110998 3635546 3906631
11340 3906631 4317701 4955007 5361744 4977737 3722383 2050499 517067 -578751 -1159651
11331 -1159651 -1182609 -620586 419335 1685219 2921242 3950576 4582637 4528505 3554426
11322 3554426 1787854 -166579 -1492010 -1628132 -600153 1005630 2401196 3067118
11314 3067118 2996229 2511954 1862954 1044534 8690 -1094816 -2046834 -2925706 -4195866
11305 -4195866 -6303178 -9168683 -12121653 -14348776 -15413746 -15369796 -14435904 -12656415 -9951238
11296 -9951238 -6497046 -2967471 -284978 930015 700894 -452747 -1953713 -3494659
11288 -3494659 -5042680 -6614628 -8070764 -9119864 -9532668 -9358241 -8909625 -8494929 -8130836
11279 -8130836 -7515243 -6304850 -4466937 -2401763 -715170 186690 335425 45710 -491371
11270 -491371 -1443113 -3123015 -5550755 -8286386 -10729593 -12529673 -13672468 -14271543 -14420256
11261 -14420256 -14236123 -13891630 -13526544 -13227640 -13162758 -13609200 -14681525 -16045606 -17048498
11252 -17048498 -17202772 -16522117 -15415299 -14351906 -13644925 -13430823 -13712012 -14347367 -15004842
11243 -15004842 -15202186 -14542337 -13013697 -11018656 -9024880 -7225675 -5612993 -4274877
11235 -4274877 -3402613 -2982817 -2696681 -2251878 -1687528 -1213283 -830643 -274138 673617
11226 673617 1918000 3126757 4014657 4557668 4983001 5566288 6412836 7409575 8343234
11217 8343234 9008933 9236864 8951328 8292434 7621941 7317309 7542705 8208161 9076421
11208 9076421 9874309 10384475 10517534 10285932 9695819 8729645 7455246 6045936 4619473
11199 4619473 3140359 1561187 -20249 -1435222 -2594476 -3457420 -3928133 -3919491 -3488406
11190 -3488406 -2803840 -2041684 -1433953 -1325812 -1947769 -3101314 -4265539 -5101373 -5725950
11181 -5725950 -6428421 -7247704 -7918668 -8124845 -7702148 -6686512 -5300730 -3875043 -2662540
11172 -2662540 -1679387 -739891 342390 1561751 2665577 3286461 3224353 2679599 2177431
11163 2177431 2185338 2762925 3548028 4023578 3807901 2830958 1392863 68632 -577306
11154 -577306 -336515 497537 1315842 1565891 1022611 -193428 -1754126 -3245053 -4249344
11145 -4249344 -4487373 -3975515 -3018448 -1993868 -1148087 -568367 -214868 120537 788578
11136 788578 2031426 3707798 5338680 6439595 6761737 6255800 4942118 2877815 193297
11127 193297 -2869575 -5915327 -8409910 -9854778 -10035043 -9104116 -7440976 -5465386 -3556438
11118 -3556438 -2036721 -1168770 -1163073 -2131101 -3925120 -6032905 -7778425 -8743331 -9001441
11109 -9001441 -8958166 -9029692 -9467609 -10352166 -11621636 -13086560 -14444236 -15312014 -15330381
11100 -15330381 -14338425 -12461283 -9978359 -7147741 -4251183 -1741074 -121757 411210
11092 411210 106240 -623354 -1488612 -2275933 -2698340 -2518165 -1809525 -950810 -304841 52635
11082 52635 298446 611651 954975 1072251 709827 -153974 -1327506 -2623552 -3948147
11073 -3948147 -5148068 -5929555 -6095867 -5847307 -5724722 -6211754 -7399445 -8978438 -10476189
11064 -10476189 -11534990 -12083324 -12313963 -12494421 -12781588 -13190199 -13672826 -14176326 -14638310
11055 -14638310 -14979494 -15129747 -15083222 -14932371 -14783097 -14550773 -13868672 -12328178 -9868335
11046 -9868335 -6883988 -3966546 -1629386 -227006 119697 -316359 -906674 -1049419 -526768
11037 -526768 533167 1919097 3465653 5062055 6710516 8519072 10490684 12373458
11029 12373458 13865925 14919356 15678757 16168929 16225634 15740803 14811692 13638261 12436719
11020 12436719 11467684 10948973 10835475 10797007 10500959 9868615 9064445 8355910 7977136
11011 7977136 7939530 7898937 7372543 6205460 4721651 3345102 2222911 1329998 763569
11002 763569 705622 1149109 1848914 2525852 2972235 3002167 2505803 1599754 574646 -362509
10992 -362509 -1184154 -1863458 -2265447 -2311246 -2125399 -1884328 -1572216 -998383 -28880 1286807
10982 1286807 2782291 4249974 5437781 6078460 6012853 5306557 4255734 3275970 2718479
10973 2718479 2704281 3114579 3764480 4567165 5509038 6547409 7647609 8885173 10355415
10964 10355415 11951199 13384577 14510894 15483579 16436940 17117348 17039178 16009667 14322867
10955 14322867 12394766 10388226 8320301 6402719 5051888 4513245 4594730 4855096 5004430
10946 5004430 5031311 4955541 4604660 3773018 2576716 1501673 1027917 1277202 2054739
10937 2054739 3082970 4061356 4628950 4528513 3863968 3048869 2443775 2135045 2059137
10928 2059137 2169275 2407066 2653894 2821635 2909406 2895035 2662255 2117551 1295835 278739
10918 278739 -883440 -2061933 -2966134 -3336111 -3215373 -2945648 -2906255 -3285160 -3985159
10909 -3985159 -4628073 -4742408 -4134540 -3084687 -2059579 -1237359 -411661 684118 2104422
10900 2104422 3707768 5242236 6364573 6768878 6463103 5877967 5592952 5906899 6622059
10891 6622059 7158473 6891697 5536340 3334184 869410 -1333786 -3033264 -4160881
10883 -4160881 -4661055 -4541190 -4006021 -3389593 -2882683 -2352622 -1492323 -203027 1165885
10874 1165885 2033615 2112426 1659110 1094884 415428 -836188 -2927907 -5399156 -7300633
10865 -7300633 -7956791 -7447059 -6420861 -5549788 -5090213 -4772237 -4016020 -2373761 59997
10856 59997 2617156 4513269 5442268 5761645 6085907 6707793 7438295 7964662 8240309
10847 8240309 8462716 8772899 9117433 9379092 9486087 9350048 8846851 7986091 7025354
10838 7025354 6266883 5735538 5178921 4432333 3683363 3273273 3270548 3363981 3240290 3004457
10828 3004457 3117165 3879943 5041686 5980135 6264931 5996546 5599853 5355296 5168940
10819 5168940 4741882 3880038 2650972 1359420 465153 455465 1585210 3563456 5502010
10810 5502010 6336822 5483528 3200586 381035 -1995899 -3307625 -3403557 -2487417 -954645
10801 -954645 731317 2151000 3054848 3439605 3477126 3330352 3055248 2707693 2485008
10792 2485008 2644420 3239449 3997645 4511474 4539938 4126361 3481635 2797007 2144492 1510005
10782 1510005 890493 324953 -179436 -681014 -1174040 -1449893 -1202141 -310210 1037881
10773 1037881 2504586 3802071 4746009 5264038 5438661 5450916 5376227 5052458 4182800
10764 4182800 2535200 67610 -2993787 -6118207 -8618696 -9958566 -9909650 -8446857
10756 -8446857 -5687280 -2063617 1605779 4480862 6196096 6936136 7073698 6829098 6207475
10747 6207475 5094058 3387263 1147422 -1357517 -3802513 -5963819 -7657378 -8611593
10739 -8611593 -8603917 -7792363 -6802173 -6365224 -6807214 -7817265 -8687012 -8856261 -8320909 -7502076
10729 -7502076 -6720442 -5926154 -5008382 -4175036 -3791373 -3906174 -4183795 -4343532 -4473431
10720 -4473431 -4823479 -5419028 -5988216 -6233047 -6115439 -5872274 -5737876 -5661904 -5383452 -4803281
10710 -4803281 -4135389 -3595685 -3105891 -2478440 -1746889 -1076952 -467337 160988 641488
10701 641488 693141 422612 322954 583434 671344 -157804 -2071822 -4530899 -6757705 -8144185
10691 -8144185 -8383437 -7545722 -6089431 -4625504 -3570943 -3016870 -2846481 -2898387 -3087539
10682 -3087539 -3478898 -4218882 -5334205 -6654331 -7983630 -9242211 -10325878 -10928712 -10695096
10673 -10695096 -9569386 -7892563 -6153694 -4737871 -3889066 -3743891 -4286253 -5324997
10665 -5324997 -6621357 -8053944 -9607407 -11191331 -12546417 -13405240 -13713371 -13583126 -13013650
10656 -13013650 -11794791 -9794826 -7263107 -4724007 -2611823 -1115449 -316117 -298507
10648 -298507 -1090471 -2594084 -4582904 -6689094 -8456523 -9575732 -10065152 -10067649 -9490742
10639 -9490742 -8071999 -5855673 -3381769 -1272439 208944 1067694 1244696 629199 -619316
10630 -619316 -1956742 -2739769 -2601276 -1599991 -124912 1307031 2241224 2412302 1813833
10621 1813833 696565 -572661 -1748449 -2802729 -3761694 -4549391 -5107403 -5582134 -6220965
10612 -6220965 -7117057 -8211603 -9473479 -10828538 -11925534 -12284703 -11806314 -10902920 -9979282
10603 -9979282 -8978748 -7621924 -5922780 -4220822 -2747040 -1361610 232310 2102829
10595 2102829 3947207 5311045 5945573 5926327 5412452 4422868 3011597 1564849 636127
10586 636127 426205 650922 1003436 1529384 2433666 3720570 5164618 6456967 7231913
10577 7231913 7136612 6104252 4492594 2791678 1228056 -269768 -1819383 -3397962
10569 -3397962 -4804780 -5713213 -5868664 -5345392 -4528188 -3764880 -3125409 -2541453 -2031416
10560 -2031416 -1701178 -1656028 -1993334 -2750045 -3788786 -4879210 -5940231 -7014651 -7949959
10551 -7949959 -8361808 -8065471 -7327129 -6508224 -5648778 -4603797 -3442545 -2505487 -2161048
10542 -2161048 -2658272 -4086003 -6257943 -8656837 -10639705 -11778075 -12104727 -12164177 -12717616
10533 -12717616 -14098811 -15819985 -17060699 -17550607 -17675455 -17752370 -17671587 -17360570 -17081973
10524 -17081973 -16990577 -16829131 -16416224 -16093604 -16323874 -17104521 -18098026 -19099250 -20094814
10515 -20094814 -21116065 -22289081 -23742509 -25209510 -26040556 -25907453 -25242452 -24804939 -25157330
10506 -25157330 -26655596 -29366985 -32741653 -35988961 -39103315 -42866844 -47548533 -52487322
10498 -52487322 -57459875 -63523692 -71925614 -83290939 -98642474 -119865906 -148117570
10491 -148117570 -183327852 -226312000 -278026895 -332410070 -371522868 -374514122 -335270158
10484 -335270158 -269195422 -200508603 -144574543 -103372176 -73400604 -52355489 -38713067
10477 -38713067 -30036445 -24226292 -20652711 -18824947 -17389483 -15390686 -13274982 -11733207
10469 -11733207 -10496415 -9008125 -7394134 -5997834 -4643776 -3045213 -1380979 114785
10461 114785 1630795 3333542 4930273 6163772 7264279 8381736 8989911 8448220 6911404
10452 6911404 5184577 3859664 3013396 2563172 2447419 2488432 2433572 2176272 1763951
10443 1763951 1231916 563894 -256466 -1237271 -2286499 -3055515 -3077201 -2215872 -856329
10434 -856329 453362 1429490 2109964 2716759 3546190 4761993 6157171 7281692 7879468
10425 7879468 8007949 7699871 6830539 5492110 4233542 3694876 4147288 5511935 7573457
10416 7573457 9935561 11970399 13149271 13432492 13169262 12635019 11774239 10343318 8210316
10407 8210316 5564944 2888339 637951 -1072773 -2390134 -3344442 -3772691 -3672060 -3384135
10398 -3384135 -3250726 -3218499 -2917541 -2018926 -431624 1677209 3905164 5789928 7123705
10389 7123705 8035645 8719669 9253843 9769269 10530529 11593141 12533635 12811004 12360432
10380 12360432 11600249 10881914 10193857 9471008 8955323 9029607 9708601 10429705 10445481 9450805
10370 9450805 7803873 6125299 4745245 3589027 2485495 1408727 449990 -239333
10362 -239333 -447390 -73882 573466 830671 218498 -1094285 -2430605 -3139123 -2982675
10353 -2982675 -2186930 -1240941 -528142 3588 760860 2002031 3471013 4586652 4889203
10344 4889203 4231843 2711351 633004 -1484981 -3064265 -3727959 -3441320 -2466827 -1205418
10335 -1205418 31772 1185193 2325864 3355839 3990515 4154291 4256415 4888922 6270799
10326 6270799 8068228 9673205 10562189 10524302 9760285 8758432 7938230 7405710 7095871
10317 7095871 7018930 7201091 7479854 7582344 7395563 6981632 6365366 5553057 4797042 4573533
10307 4573533 5126588 6165984 7147329 7735240 7864782 7496224 6570947 5242924 3974492
10298 3974492 3295710 3506257 4597688 6315084 8196375 9670664 10325957 10142158 9377162
10289 9377162 8200576 6546291 4386038 2036589 52995 -1180584 -1676000 -1677477 -1361634
10280 -1361634 -708144 392150 1903646 3486653 4625447 5020074 4860526 4654507 4803083
10271 4803083 5394401 6321318 7431276 8558213 9567559 10432794 11174129 11685763 11704790
10262 11704790 10970148 9359618 6948861 4110305 1519487 -201297 -980795 -1325997
10254 -1325997 -1797472 -2579237 -3541866 -4437412 -4900976 -4556130 -3418457 -2066818 -1144956
10245 -1144956 -751911 -537124 -294027 -153711 -201941 -245603 -109803 61245 1551 -293410
10235 -293410 -569144 -658954 -663769 -759861 -954066 -1115358 -1192932 -1298860 -1561175 -1979592
10225 -1979592 -2475497 -3008719 -3553328 -4008185 -4258678 -4329172 -4360333 -4415164 -4403451 -4197415
10215 -4197415 -3696133 -2775179 -1358804 378293 2045449 3395595 4536779 5681400
10207 5681400 6815714 7759727 8446277 8966930 9388223 9667272 9731969 9555806 9203222
10198 9203222 8871112 8775158 8866895 8762731 8116266 6998811 5765884 4636273 3600650
10189 3600650 2678887 1996896 1548060 1090664 413890 -389872 -1012662 -1251307 -1201585 -1166906
10179 -1166906 -1394694 -1898067 -2547701 -3278466 -4043360 -4539187 -4239238 -2927665 -1068328
10170 -1068328 602122 1777510 2666708 3492127 4217611 4736509 4969457 4705471 3693130
10161 3693130 2068605 443764 -617493 -1022074 -914068 -290285 867001 2225752 3202062
10152 3202062 3457137 3138040 2645248 2304603 2218533 2239231 2040845 1347663 163986 -1250656
10142 -1250656 -2621651 -3831049 -4901808 -5910274 -6914007 -7894611 -8755689 -9398802 -9780971
10133 -9780971 -9889888 -9732362 -9386704 -8982072 -8545427 -7922554 -6925191 -5520697 -3851656
10124 -3851656 -2186089 -939328 -598619 -1391211 -2994485 -4704164 -5931960 -6505443 -6583418
10115 -6583418 -6468473 -6491563 -6844728 -7388391 -7736337 -7664867 -7392533 -7358193 -7748744 -8319049
10105 -8319049 -8647110 -8481844 -7848263 -6909815 -5788763 -4493418 -2970971 -1224916 589085
10096 589085 2162360 3148792 3334686 2741119 1587030 180211 -1147080 -2066258 -2342521
10087 -2342521 -1951196 -1051489 177341 1581219 2856939 3467349 2932094 1245171 -1081940
10078 -1081940 -3397524 -5261976 -6496503 -7097789 -7198640 -6981324 -6508086 -5701571 -4572595
10069 -4572595 -3369420 -2361185 -1514100 -525315 810835 2376485 3877125 5095341
10061 5095341 5942747 6345550 6176845 5327316 3855564 2092613 557419 -332238 -510501
10052 -510501 -197089 400984 1230726 2223743 3123203 3619768 3663283 3568454 3771839 4446971
10042 4446971 5288276 5664279 5096995 3696560 2090414 843869 -26227 -903602 -2001158
10033 -2001158 -3064789 -3662423 -3674435 -3457500 -3565919 -4304322 -5465559 -6458297 -6732470
10024 -6732470 -6132498 -4876490 -3278196 -1568452 79632 1522452 2697932 3594550
10016 3594550 4103968 4004854 3193606 1876942 435494 -888546 -2096305 -3244059 -4235017
10007 -4235017 -4824112 -4788848 -4079004 -2835188 -1308162 214452 1423619 2023922 1867995
9998 1867995 1090195 46936 -928018 -1707639 -2330019 -2838472 -3189742 -3274067 -2992941 -2340401
9988 -2340401 -1411292 -288992 1063747 2715633 4527318 6057647 6764563 6319036 4807830
9979 4807830 2773597 1059981 410305 1025310 2506278 4264592 5915092 7252601 8060799
9970 8060799 8208952 7940689 7851229 8427644 9606393 10786793 11257663 10667665 9206267
9961 9206267 7399942 5721633 4361634 3305886 2514747 1969454 1648127 1585379 1925928
9952 1925928 2794703 4086208 5457586 6574601 7362059 8030024 8855413 9867998 10707683
9943 10707683 10870336 10184830 9020106 7978072 7445024 7473386 7938478 8630867 9263466
9934 9263466 9591300 9561786 9254136 8706810 7933041 7067577 6333864 5863776 5686136 5862514
9924 5862514 6439815 7248628 7944830 8310024 8339909 7993231 7093443 5641747 4058754
9915 4058754 2895859 2341457 2137012 1928248 1581894 1209608 1023517 1188237 1744052
9906 1744052 2662043 3986119 5873367 8469418 11803529 15814745 20365783 25176750
9898 25176750 29857595 34053047 37372309 39054247 37976155 33447159 26131478 17959742
9890 17959742 10919068 5894283 2583308 237037 -1716031 -3561503 -5375005 -6992925
9882 -6992925 -8052152 -8295997 -7898977 -7391474 -7207092 -7349345 -7513191 -7428155 -7010718 -6304181
9872 -6304181 -5471356 -4866614 -4934850 -5892184 -7504109 -9196930 -10363095 -10609861 -9875829
9863 -9875829 -8420369 -6667162 -4990899 -3624958 -2684757 -2129888 -1688716 -987036 141946
9854 141946 1545781 2976400 4283756 5332767 5941369 6096481 6109256 6340651 6830195
9845 6830195 7376249 7887110 8377983 8635429 8207919 6866269 4850276 2505994 -110797
9836 -110797 -3027420 -5864869 -7850868 -8404859 -7591002 -5966390 -4101355 -2282395 -544070
9827 -544070 1146279 2731476 4023831 4809819 5025851 4838507 4537871 4338351 4249275
9818 4249275 4076901 3525233 2364417 617647 -1373736 -3137794 -4409005 -5289721 -6051730
9809 -6051730 -6805387 -7421532 -7755624 -7842857 -7829838 -7803382 -7768187 -7721510 -7611852 -7225701
9799 -7225701 -6274634 -4710174 -2892770 -1329371 -246502 465591 857800 626767 -596669
9790 -596669 -2656303 -4742050 -5990722 -6186427 -5804925 -5452333 -5402167 -5628613 -6035181
9781 -6035181 -6491369 -6770196 -6660394 -6167704 -5501544 -4854404 -4288234 -3835819 -3576823 -3549284
9771 -3549284 -3704912 -4063627 -4806668 -6002593 -7213028 -7585586 -6531030 -4275856 -1629503
9762 -1629503 751785 2738546 4436849 5801678 6682910 7079619 7123001 6837157 6082155
9753 6082155 4740473 2855473 637329 -1502418 -2961779 -3270182 -2563997 -1622086 -1270006
9744 -1270006 -1754279 -2721822 -3681845 -4364033 -4714326 -4737418 -4415161 -3717450 -2638012 -1204876
9734 -1204876 550834 2598723 4801603 6800886 8122393 8482140 7964724 6893584 5603168
9725 5603168 4339552 3217376 2136077 805489 -1010254 -3246757 -5527869 -7308455
9717 -7308455 -8025452 -7334107 -5427579 -3089506 -1250971 -430634 -591860 -1380221 -2335426
9708 -2335426 -3003355 -3145207 -2922337 -2731266 -2819020 -3170931 -3729399 -4487172 -5299826 -5826295
9698 -5826295 -5810899 -5311675 -4543725 -3629654 -2649290 -1815225 -1362415 -1221379 -945251 -70431
9688 -70431 1437573 3094859 4261053 4656513 4593076 4698394 5379112 6513039 7575300
9679 7575300 7966977 7288584 5547463 3271183 1302441 245984 39670 132397 73745
9670 73745 -164340 -421486 -710205 -1202757 -1924844 -2629797 -3043194 -3152121 -3155768 -3149522 -2979544
9659 -2979544 -2490348 -1856694 -1550283 -1951351 -3061392 -4605722 -6302446 -7945434 -9316018
9650 -9316018 -10193458 -10520512 -10488768 -10399097 -10454491 -10691419 -11026314 -11273676 -11140433 -10331814
9640 -10331814 -8773037 -6742597 -4748240 -3226843 -2297369 -1711401 -1009535 173547 1802015
9631 1802015 3375026 4220934 3912327 2439241 108595 -2554865 -4829594 -5994679 -5758316
9622 -5758316 -4481320 -2840335 -1254748 298275 1987277 3821908 5655809 7329696
9614 7329696 8729536 9802088 10605076 11294805 11990024 12655564 13139018 13294600 13085598
9605 13085598 12657681 12340481 12452956 12977237 13461146 13382742 12670144 11808379 11386830 11554273
9595 11554273 11919550 11928013 11286173 10073177 8576800 7108701 5917968 5139898 4751252
9586 4751252 4600078 4507992 4337457 4002950 3522979 3089903 2978530 3296787 3878789 4477570
9576 4477570 4968083 5256516 5093034 4190817 2591602 803730 -491867 -859055 -290648
9567 -290648 877713 2185298 3280257 4061756 4661924 5334442 6333851 7739893 9249917
9558 9249917 10222398 10142139 9116069 7827260 6994961 6962097 7738615 9205087 11159573
9549 11159573 13290665 15228982 16621390 17202058 16944876 16169880 15322801 14559394 13681719
9540 13681719 12566311 11495522 10917340 10971977 11389601 11784581 11930532 11812386 11542212
9531 11542212 11208488 10734101 9925003 8716912 7303983 5965775 4866196 4095727 3773293
9522 3773293 3960527 4564202 5455958 6579613 7766193 8550637 8440327 7403367 5921210
9513 5921210 4538050 3505262 2842260 2493435 2304682 2014601 1442367 650337 -149392
9504 -149392 -781607 -1129205 -1063230 -526623 247654 688499 202346 -1360268 -3552839 -5703467
9494 -5703467 -7428408 -8710262 -9534788 -9701141 -9131061 -8176559 -7370587 -6924513 -6683586
9485 -6683586 -6542534 -6651408 -7149926 -7904920 -8623689 -9106205 -9315363 -9327735 -9303713 -9401149
9475 -9401149 -9616685 -9757242 -9608429 -9080603 -8214342 -7185660 -6323701 -5924698 -5910659 -5774625
9465 -5774625 -4992369 -3457454 -1493105 417228 1819681 2395395 2129437 1393395 715526
9456 715526 402396 388690 395271 181822 -262925 -662208 -630625 -40780 788111 1347007
9446 1347007 1366169 929823 236070 -613860 -1581269 -2568441 -3397226 -3891964 -4006970 -3918614
9436 -3918614 -3939275 -4234924 -4627657 -4759660 -4458891 -3882760 -3317478 -2904994 -2535155 -1908681
9426 -1908681 -737713 966906 2771359 4110694 4790311 5141799 5647729 6487997 7475093
9417 7475093 8294445 8693967 8537690 7866134 6951554 6183893 5795869 5668375 5414158 4696055
9407 4696055 3536381 2331258 1478727 930328 178649 -1210932 -3081509 -4780469 -5734728
9398 -5734728 -5812560 -5159177 -3926355 -2337544 -887644 -202758 -585271 -1760159 -3110410
9389 -3110410 -4129363 -4686939 -5011098 -5490907 -6383537 -7549901 -8449785 -8477303 -7370946
9380 -7370946 -5361870 -3030266 -1059404 28460 149814 -221567 -310817 465526 2208539
9371 2208539 4632582 7267756 9505149 10641528 10175131 8178290 5300447 2328001
9363 2328001 -227591 -2095439 -2960097 -2469301 -650520 1813914 3964034 5295466 6022251
9354 6022251 6580188 7021250 7007014 6247580 4737830 2649905 291221 -1776332 -2878750
9345 -2878750 -2739322 -1758260 -616057 351058 1270597 2343276 3534587 4625088 5366115
9336 5366115 5551462 5113934 4249431 3334946 2607945 1954052 1067948 -195978 -1644699
9327 -1644699 -2855817 -3434869 -3239263 -2436434 -1355536 -266673 696173 1438773 1831929
9318 1831929 1776408 1282859 440119 -636438 -1752318 -2578288 -2776488 -2245962 -1212370
9309 -1212370 -53853 921941 1519698 1588589 1071552 160664 -720039 -1219182 -1340931 -1347711
9299 -1347711 -1400407 -1402809 -1213721 -869604 -492887 -69913 524173 1269413 1887568 2056407
9289 2056407 1712789 1107797 559121 159284 -241788 -727974 -1030706 -684672 450582
9280 450582 1903847 2934515 3144022 2702280 2064812 1606443 1484182 1654983 1928583
9271 1928583 2081615 2000347 1718587 1356160 1089429 1128160 1562375 2184420 2572669 2420181
9261 2420181 1732930 705994 -481331 -1699896 -2802161 -3602611 -3906401 -3572114 -2632355
9252 -2632355 -1331605 102564 1741822 3823064 6244159 8368551 9482385 9340574
9244 9340574 8158901 6252827 3912439 1514947 -562661 -2228270 -3703197 -5199074
9236 -5199074 -6671837 -7911395 -8747383 -9142502 -9213935 -9200454 -9275074 -9318504 -8973807 -7993901
9226 -7993901 -6472471 -4710423 -2968014 -1414589 -217122 437921 389102 -477101 -2176501
9217 -2176501 -4511624 -7041978 -9276830 -10953728 -12135946 -13045478 -13778410 -14121332 -13637943
9208 -13637943 -12025918 -9474435 -6662463 -4350667 -2927256 -2274992 -1971730 -1587319 -883260
9199 -883260 143606 1336473 2463507 3235730 3342212 2615256 1201055 -514120 -2180864
9190 -2180864 -3631342 -4777293 -5545054 -6013232 -6468861 -7134032 -7856026 -8205210 -7878213
9181 -7878213 -6897253 -5448412 -3719818 -1985822 -692212 -245088 -665241 -1537177 -2370277
9172 -2370277 -3014772 -3717916 -4803088 -6339895 -8132809 -9963869 -11749621 -13426423 -14743260
9163 -14743260 -15266213 -14667797 -13069440 -11107953 -9575690 -8850876 -8616379 -8191434 -7195264
9154 -7195264 -5874910 -4796708 -4308732 -4345064 -4637079 -4968668 -5237373 -5399272 -5421830 -5244904
9144 -5244904 -4740324 -3729329 -2097999 38072 2239516 3855334 4357131 3658944 2112103
9135 2112103 201042 -1678878 -3163480 -3857632 -3533285 -2352858 -753947 868939 2262842
9126 2262842 3196233 3508288 3364166 3269620 3668340 4579271 5699300 6752203 7615827
9117 7615827 8201926 8412000 8256961 7905541 7543297 7226520 6915655 6613903 6405568 6329395
9107 6329395 6239814 5852281 4966971 3628331 2029581 300263 -1528751 -3366866 -5002219
9098 -5002219 -6268480 -7190966 -7883046 -8356209 -8526317 -8359530 -7885884 -7076032 -5860316
9089 -5860316 -4360274 -3002912 -2246270 -2145261 -2254469 -2019438 -1267323 -317694 335218
9080 335218 402474 -77538 -849068 -1584355 -1999800 -1992747 -1740490 -1602801 -1829307 -2319358
9070 -2319358 -2667764 -2455397 -1532144 -88476 1484779 2797367 3580509 3717940 3260635
9061 3260635 2427222 1509525 706337 62325 -414282 -644631 -558631 -228979 164682 479409
9051 479409 637185 554437 165329 -488195 -1295500 -2197185 -3156260 -4044931 -4736432 -5319295
9041 -5319295 -6009135 -6768813 -7220398 -7067874 -6426325 -5562109 -4485297 -3060743 -1437948
9032 -1437948 -80450 678359 923548 973507 1072122 1291945 1562098 1699111 1511882 948891
9022 948891 101908 -908512 -1945554 -2802738 -3340842 -3728259 -4359657 -5414410 -6592852
9013 -6592852 -7373951 -7460812 -6952195 -6228397 -5743515 -5757393 -6103556 -6297200 -6011504 -5414088
9003 -5414088 -4962513 -4951838 -5337103 -5855518 -6157292 -5923789 -5090623 -3969485 -2998999 -2365686
8993 -2365686 -1973544 -1714630 -1566313 -1439016 -1187549 -884743 -894339 -1500704 -2540892 -3526809
8983 -3526809 -4099941 -4312874 -4536105 -5140672 -6162576 -7176809 -7595636 -7236015 -6562842
8974 -6562842 -6258347 -6571170 -7171308 -7565645 -7484566 -6887425 -5823255 -4407055 -2800415
8965 -2800415 -1083893 772883 2699142 4360951 5371063 5643695 5394237 4787501 3766680
8956 3766680 2299125 603953 -1045655 -2653778 -4425895 -6368245 -8160761 -9487807
8948 -9487807 -10328599 -10832060 -11075223 -11102446 -11056954 -11016356 -10718930 -9710656 -7860071 -5561998
8938 -5561998 -3341087 -1418597 197907 1363402 1783137 1343098 274935 -1034754 -2269618
8929 -2269618 -3217634 -3769977 -4005947 -4191350 -4569973 -5151359 -5730080 -6077778 -6102766 -5893993
8919 -5893993 -5654999 -5534605 -5470178 -5246836 -4752200 -4111407 -3532184 -3112898 -2884020 -2936391
8909 -2936391 -3367123 -4150204 -5200263 -6511908 -8044999 -9476302 -10306940 -10346849 -9945268
8900 -9945268 -9597179 -9418140 -9144952 -8564322 -7753358 -6905691 -6086799 -5215834 -4195987
8891 -4195987 -3027292 -1861894 -956332 -466603 -239714 118917 912245 2116960 3477679
8882 3477679 4717445 5570724 5721736 4943767 3421351 1845910 1013516 1228094 2121152
8873 2121152 3099830 3940649 4891789 6250495 7990370 9851773 11656417 13393358 15060025
8864 15060025 16579704 17887600 18972505 19793294 20242201 20224881 19709412 18698149 17270928
8855 17270928 15700307 14398686 13636817 13348369 13264683 13185069 13063575 12908173 12682212
8846 12682212 12262692 11437990 10031091 8143614 6239125 4852471 4179372 3984806 3868105
8837 3868105 3546749 2958767 2254778 1712015 1521541 1589112 1600643 1303854 680543 -101167
8827 -101167 -750305 -875956 -185922 1161708 2498199 3094065 2661670 1373231 -462384
8818 -462384 -2539053 -4453917 -5784877 -6429375 -6737594 -7167226 -7859572 -8639523 -9340042
8809 -9340042 -9974859 -10615869 -11255010 -11829519 -12270909 -12461270 -12214176 -11368009 -9853853
8800 -9853853 -7628308 -4626361 -908681 3137323 6833736 9506228 10772728 10643734
8792 10643734 9467940 7776434 6045206 4524342 3318711 2600967 2595158 3275721 4204950
8783 4204950 4806343 4768421 4114181 2982837 1513514 -100684 -1663844 -3164571 -4774827
8774 -4774827 -6558825 -8263243 -9496937 -10092161 -10237875 -10295104 -10513220 -10852079 -10998235
8765 -10998235 -10588263 -9510634 -8041144 -6711911 -6068799 -6465533 -7873168 -9754754 -11243535
8756 -11243535 -11654645 -10886288 -9294269 -7259383 -5005848 -2759694 -813095 700860
8748 700860 1957029 3200874 4400295 5253866 5546051 5406674 5192238 5156118 5262088
8739 5262088 5315077 5270095 5387104 6015991 7192086 8487892 9312296 9334927 8609768 7395663
8729 7395663 5993977 4731105 3908513 3635367 3744537 3951894 4097336 4210258 4397904
8720 4397904 4745838 5294603 5989090 6582888 6662740 5906148 4405451 2728426 1577608
8711 1577608 1302707 1706141 2319278 2851255 3350650 3977583 4726656 5422565 5909142 6147659
8701 6147659 6162718 6015207 5875022 6034775 6745403 8003320 9508558 10844850 11737705
8692 11737705 12202172 12481217 12833650 13357848 13983330 14551494 14827584 14476325 13184424
8683 13184424 10929539 8129967 5486406 3637261 2852125 2867701 2954803 2332884 764722
8674 764722 -1217501 -2788259 -3556966 -3754319 -3732399 -3449299 -2531608 -746111 1690438
8665 1690438 4214066 6229553 7367682 7581957 7104301 6314341 5583043 5137626 4995498
8656 4995498 5025457 5110416 5244629 5451084 5664750 5786756 5809166 5741412 5410562 4531456
8646 4531456 3106506 1641842 794261 799830 1321333 1809274 1922026 1660210 1261131 1010771
8636 1010771 1065273 1391098 1883584 2517794 3348988 4423855 5757914 7307748 8817870
8627 8817870 9763409 9689323 8681181 7309542 5979192 4474385 2307691 -574482 -3610694
8618 -3610694 -6097823 -7656538 -8234511 -7899796 -6819202 -5358438 -3990941 -3003085 -2334664
8609 -2334664 -1776240 -1300875 -1106016 -1278450 -1502839 -1247674 -272629 1156823 2618441
8600 2618441 3981350 5381788 6837888 8104749 8977386 9587547 10271715 11197931 12214038
8591 12214038 13016345 13368312 13201312 12669478 12168391 12167535 12867964 14011624 15097151 15788683
8581 15788683 16068060 16026314 15642690 14843332 13696218 12423139 11195921 9977204 8585989
8572 8585989 6898944 4993132 3126430 1576776 461655 -299042 -833444 -1152741 -1159650
8563 -1159650 -772047 41265 1322613 3100258 5254839 7503066 9583797 11397594 12904810
8554 12904810 13980010 14494786 14505808 14214421 13714527 12900918 11683174 10183951 8618400
8545 8618400 7022207 5215088 3053830 636811 -1799384 -4134105 -6413466 -8622067
8537 -8622067 -10502039 -11730905 -12294382 -12555936 -12847362 -13038893 -12635798 -11308019 -9222070
8528 -9222070 -6826884 -4439445 -2151398 -80982 1446448 2063224 1697822 719950 -272188
8519 -272188 -842492 -937052 -753487 -448180 -35482 444933 800535 850901 693927 692649
8509 692649 1160475 2112024 3320538 4514860 5457466 5913843 5677464 4669654 3004040
8500 3004040 982700 -942426 -2292209 -2813775 -2689746 -2418072 -2377443 -2488888 -2321387
8491 -2321387 -1502560 71 1927453 3910671 5540144 6354500 5955770 4290652 1848450
8482 1848450 -506261 -2028942 -2531300 -2397220 -2213476 -2364484 -2848862 -3309059 -3204347
8473 -3204347 -2122712 -106558 2306029 4426514 5810475 6327682 6005813 5004504 3721917
8464 3721917 2693149 2224005 2163100 2087182 1663597 836018 -202882 -1140280 -1769646 -2220683
8454 -2220683 -2886055 -3975693 -5179572 -5904393 -5833286 -5151873 -4271679 -3484131 -2861642
8445 -2861642 -2286252 -1494470 -266648 1277417 2652182 3410734 3545814 3393372 3184375
8436 3184375 2821649 2091505 937141 -561011 -2356727 -4417964 -6531512 -8291968 -9404637
8427 -9404637 -9925985 -10066045 -9785432 -8766475 -6825099 -4170548 -1160251 1996678 5078210
8418 5078210 7561442 8870770 8984563 8526564 8128626 7905274 7681626 7501810 7651528
8409 7651528 8281868 9274723 10485404 11913940 13577951 15347002 16965763 18175562 18803905
8400 18803905 18826082 18386764 17732596 17116446 16760537 16809168 17200628 17628545 17775199 17622607
8390 17622607 17461523 17575838 17951991 18242240 17923861 16580742 14248548 11553232 9366712
8381 9366712 8211309 8016000 8408448 9073726 9785475 10308071 10483454 10359728 10068862
8372 10068862 9590677 8778748 7633505 6420473 5459480 4872847 4588504 4512699 4611502
8363 4611502 4854823 5189516 5613921 6212821 7028838 7891381 8437687 8341457 7503790 6040888
8353 6040888 4192019 2306527 821722 83001 126604 679550 1370777 1912807 2155128
8344 2155128 2103971 1905784 1699399 1457073 1071518 623995 450830 892031 2063547 3894874
8334 3894874 6224341 8733719 10893666 12138811 12128745 10851430 8605004 5959997 3582344
8325 3582344 1882514 838343 255714 125065 572377 1530974 2680143 3733812 4620544
8316 4620544 5351231 5894934 6264657 6561128 6805119 6836261 6510690 5928149 5328373 4788833
8306 4788833 4138559 3168109 1830143 223510 -1522750 -3283181 -4891608 -6150855 -6959666
8297 -6959666 -7448677 -7932188 -8641527 -9499631 -10221732 -10629781 -10750467 -10558198 -9783396 -8183216
8287 -8183216 -6001896 -3972892 -2739702 -2328551 -2263043 -2123119 -1866443 -1636178 -1448996
8278 -1448996 -1191073 -815310 -372269 143378 816084 1624138 2361951 2850166 3146484 3446549
8268 3446549 3835664 4251163 4648902 5079445 5607017 6264490 7073135 7962774 8651514 8768658
8258 8768658 8199867 7224678 6235517 5404867 4706301 4148876 3814947 3660733 3418625 2793357
8248 2793357 1757607 632283 -163548 -514651 -799825 -1628205 -3321260 -5653333 -8088643
8239 -8088643 -10181861 -11695102 -12434706 -12147195 -10636211 -7954915 -4497000 -921056 2101739
8230 2101739 4215867 5520510 6344673 6858679 6910194 6213874 4684285 2650729 806144
8221 806144 -151244 -8094 768107 1393547 1370242 721709 -274112 -1415171 -2622428 -3838154
8211 -3838154 -4998064 -6016649 -6702043 -6778623 -6147334 -5108398 -4196601 -3771094 -3850872
8202 -3850872 -4343000 -5273540 -6685910 -8402213 -10048906 -11348749 -12287794 -12951372 -13299271
8193 -13299271 -13215407 -12737316 -12095822 -11485231 -10889163 -10194404 -9406176 -8679737 -8182722 -7965781
8183 -7965781 -7872965 -7484172 -6256692 -3942664 -920117 2005607 4169284 5346884 5556770
8174 5556770 4807093 3168562 941089 -1441347 -3641622 -5456861 -6708046 -7258999 -7144327
8165 -7144327 -6550013 -5647908 -4545993 -3400515 -2435307 -1761622 -1233967 -551957 507255
8156 507255 1968488 3708938 5562499 7375046 9007589 10344445 11337966 12024955 12426826
8147 12426826 12414458 11762844 10418831 8657768 6879762 5280606 3807552 2388146 1066700
8138 1066700 -77522 -1004463 -1681053 -2108117 -2407035 -2712429 -2896098 -2573402 -1560780
8129 -1560780 -234547 757667 1127575 1146081 1246053 1612663 2192549 2889590 3582451 4042444
8119 4042444 4031867 3539592 2839769 2263738 1935738 1750620 1569319 1365303 1145486 776706
8109 776706 3254 -1277672 -2768205 -3862967 -4029629 -3118519 -1368732 777742 2826330
8100 2826330 4293116 4788581 4172800 2676521 836252 -771040 -1805869 -2229274 -2140356
8091 -2140356 -1618391 -747114 278966 1171982 1703570 1834331 1733096 1710215 2067083 2889076
8081 2889076 3963112 4972219 5785546 6495925 7199498 7876878 8528425 9271694 10178791
8072 10178791 11096854 11751830 11987804 11815069 11304199 10582868 9888673 9431188 9175542
8063 9175542 8940639 8774763 9042414 9974604 11236273 12130505 12234421 11721300 11078032
8054 11078032 10642710 10423519 10194773 9656409 8601631 7094662 5509519 4300230 3669072
8045 3669072 3459982 3357916 3137389 2713161 2042592 1086047 -121887 -1425286 -2608905
8036 -2608905 -3487154 -3932806 -3895997 -3471855 -2910096 -2430997 -1971642 -1188072 194467 2034882
8026 2034882 3839429 5177893 5984148 6426351 6544699 6106286 4859777 2922935 884721
8017 884721 -515769 -853537 -215518 984784 2308791 3412724 4009709 3907008 3163025
8008 3163025 2132179 1243304 697737 392750 117139 -211171 -474910 -465417 -60791 645284
7998 645284 1364647 1798609 1839321 1604686 1309828 1150980 1283548 1789970 2593470 3479098
7988 3479098 4317191 5259509 6619575 8545051 10888612 13408205 15967385 18450476 20573063
7979 20573063 21933779 22286578 21695183 20420090 18747415 16963759 15390034 14290494
7971 14290494 13693670 13346068 12900504 12174847 11228727 10199414 9102102 7830962 6342746
7962 6342746 4773208 3336738 2154538 1225728 520614 16234 -366475 -797185 -1480201
7953 -1480201 -2565933 -4050324 -5660769 -6874376 -7230476 -6746357 -5966707 -5513175 -5603668
7944 -5603668 -6034879 -6526108 -6959299 -7340803 -7685676 -7960798 -8022826 -7575840 -6311845 -4203811
7934 -4203811 -1646148 750113 2531571 3642348 4407630 5305658 6630732 8240545 9617037
7925 9617037 10244258 9994228 9211211 8486157 8323456 8874171 9851760 10719474 11077806 10956564
7915 10956564 10756030 10907000 11542896 12389248 12895715 12548511 11210389 9239061 7259847
7906 7259847 5794138 5060830 5001676 5341675 5626852 5389690 4452993 3086328 1788622
7897 1788622 879027 299700 -207090 -770656 -1250465 -1413197 -1249767 -1087619 -1309731 -1913928
7887 -1913928 -2414304 -2287375 -1523992 -645135 -137760 12228 118184 210793 -129832 -1280670
7877 -1280670 -3057168 -4828574 -6077613 -6695526 -6792104 -6484703 -5983025 -5646707 -5678533
7868 -5678533 -5787666 -5389507 -4220890 -2638414 -1267167 -490843 -351205 -768741 -1641081
7859 -1641081 -2730387 -3634198 -3982458 -3648156 -2742193 -1439598 144889 1913677 3681346
7850 3681346 5220479 6493512 7778694 9392395 11220747 12679410 13292025 13226847 13084083
7841 13084083 13198035 13375304 13354771 13263213 13422989 13847197 14141063 13858823 12786891 10938952
7831 10938952 8540469 6095888 4228293 3225564 2803648 2482153 2173525 2253774 3031704
7822 3031704 4275807 5331134 5646190 5175738 4391011 3996819 4554936 6177669 8437287
7813 8437287 10551724 11734168 11505465 9837616 7096567 3818915 457667 -2697428
7805 -2697428 -5369319 -7149805 -7641783 -6812572 -5154942 -3410509 -2092557 -1261168 -708213
7796 -708213 -284954 -35141 -90194 -535641 -1388892 -2611330 -4061570 -5479902 -6617379
7787 -6617379 -7374512 -7711855 -7429785 -6221504 -4078708 -1527481 736532 2426722 3703957
7778 3703957 4647256 4937927 4221736 2632494 754773 -891653 -2172244 -3171797 -3901720
7769 -3901720 -4260572 -4193844 -3804295 -3327003 -3034184 -3130086 -3673359 -4561412 -5570877 -6415772
7759 -6415772 -6809908 -6538539 -5526189 -3888357 -1946614 -124528 1317037 2496450 3758323
7750 3758323 5218191 6543759 7291113 7376819 7083670 6676822 6214748 5731793 5376496
7741 5376496 5254420 5264211 5199446 4937139 4463726 3827477 3174109 2750297 2736555 3071362
7731 3071362 3493926 3742314 3694353 3395128 3007164 2659754 2265147 1535826 265294 -1437014
7721 -1437014 -3233273 -4818733 -6060650 -7000410 -7840698 -8855747 -10168522 -11622981 -12945675
7712 -12945675 -13958554 -14527445 -14423087 -13483285 -11957168 -10514685 -9804848 -10008893 -10744958
7703 -10744958 -11275942 -10909354 -9508055 -7743931 -6658385 -6782703 -7720613 -8623861 -8931667
7694 -8931667 -8573630 -7678461 -6363768 -4792590 -3220428 -1903794 -1025576 -688833 -862525
7685 -862525 -1312120 -1697623 -1815946 -1711968 -1514377 -1197165 -561373 517036 1828784
7676 1828784 2872912 3227099 2894661 2258210 1719858 1458467 1494189 1815408 2368688 3053693
7666 3053693 3822951 4673036 5437782 5737650 5324285 4404290 3440538 2697978 2205572 2125055
7656 2125055 2840585 4538947 6892107 9307422 11354467 12810077 13463729 13171994 12122652
7647 12122652 10815127 9640482 8541549 7151769 5218882 2847901 403002 -1715866
7639 -1715866 -3202444 -3894844 -3843884 -3339997 -2755050 -2260301 -1713022 -861953 363401
7630 363401 1796001 3190489 4359503 5222141 5863450 6548507 7540621 8853641 10263299
7621 10263299 11566931 12705479 13606857 14090244 14051110 13619789 12985146 12132605 10908353
7612 10908353 9303889 7531702 5841142 4409345 3407295 2984762 3100626 3489781 3906839
7603 3906839 4333848 4843001 5293719 5287957 4471992 2846785 766816 -1322884 -3112165
7594 -3112165 -4437090 -5198649 -5392002 -5207884 -4966701 -4841264 -4673651 -4138306 -3063072
7585 -3063072 -1533509 257652 2136124 3923769 5427584 6519227 7160928 7325204 6985412
7576 6985412 6241094 5334586 4395580 3194422 1302257 -1423852 -4567781 -7431051 -9577800
7567 -9577800 -11077065 -12230755 -13147026 -13653147 -13600586 -13132330 -12553183 -11970957 -11165757
7558 -11165757 -9833992 -7900203 -5579440 -3213515 -1094791 604674 1809915 2484701
7550 2484701 2632096 2401034 2154199 2283014 2850101 3458319 3561987 2916518 1708303
7541 1708303 302821 -1071469 -2438335 -3972870 -5798371 -7836324 -9857717 -11694997
7533 -11694997 -13331762 -14702583 -15473795 -15196953 -13747907 -11526862 -9153836 -7013245
7525 -7013245 -5147302 -3528156 -2302872 -1702472 -1744626 -2120122 -2456369 -2693157 -3110510
7516 -3110510 -3926034 -4932920 -5644038 -5785727 -5556932 -5393413 -5565047 -6022510 -6539184
7507 -6539184 -6942999 -7270244 -7747761 -8585495 -9754253 -11011489 -12154199 -13151665 -13977691
7498 -13977691 -14425124 -14230037 -13377474 -12193124 -11100344 -10292380 -9598100 -8632359 -7139673
7489 -7139673 -5259964 -3414991 -1881567 -560572 738356 1894191 2556890 2613032 2347360
7480 2347360 2056847 1667569 853949 -566856 -2459654 -4474079 -6185276 -7229014 -7503330
7471 -7503330 -7270660 -6948822 -6774437 -6734593 -6784386 -6980922 -7368637 -7859668 -8300313 -8576347
7461 -8576347 -8602726 -8314053 -7763201 -7144969 -6567498 -5801912 -4413123 -2244759 259726
7452 259726 2284798 3201439 2924671 1843678 553362 -346866 -415638 393097 1583877
7443 1583877 2373646 2273131 1448265 469438 -261284 -794940 -1459697 -2569905 -4285755
7434 -4285755 -6530696 -8896536 -10731093 -11502024 -11136137 -10005562 -8651668 -7554272 -7010046
7425 -7010046 -7007117 -7182608 -7062927 -6463607 -5633436 -4982554 -4706666 -4662301 -4498689 -3851901
7415 -3851901 -2507664 -526812 1725642 3706581 4918115 5103566 4336933 2985652 1567599
7406 1567599 570340 297855 754319 1597862 2280136 2382403 1878589 1043014 132688 -746158
7396 -746158 -1483714 -1858739 -1707986 -1159159 -624066 -555052 -1147808 -2130002 -2804621 -2494020
7386 -2494020 -1139700 540172 1561832 1336776 -102679 -2257605 -4355977 -5611910
7378 -5611910 -5669168 -4854040 -3796857 -2779314 -1624711 -203420 1226885 2271098 2755190
7369 2755190 2709388 2201634 1367914 460561 -332356 -1036221 -1700397 -2148583 -2106986 -1541266
7359 -1541266 -686756 253986 1291882 2521107 3942960 5432441 6744830 7519480 7410814
7350 7410814 6318177 4460753 2199128 -186951 -2569260 -4931051 -7318404 -9781719
7342 -9781719 -12293854 -14694790 -16703332 -18001302 -18388636 -17927964 -16906954 -15596638 -14069818
7333 -14069818 -12297678 -10347914 -8371381 -6424526 -4443439 -2432009 -597925 724700
7325 724700 1252744 911647 -50220 -1089582 -1635611 -1410131 -483324 907115 2446258
7316 2446258 3679715 4093989 3418601 1808845 -294582 -2377389 -3919089 -4507100 -4133428
7307 -4133428 -3326580 -2781152 -2799522 -3162080 -3496111 -3632325 -3605365 -3467893 -3192976 -2696089
7297 -2696089 -1911342 -916584 -30781 294474 -199064 -1317737 -2507221 -3231071 -3297539
7288 -3297539 -2881992 -2299661 -1780954 -1425214 -1281673 -1395446 -1773183 -2371014 -3153701 -4114794
7278 -4114794 -5171730 -6059261 -6415577 -6038953 -5062895 -3863012 -2793388 -2014862 -1542306
7269 -1542306 -1373330 -1491488 -1759965 -1935403 -1887390 -1757176 -1773539 -1893684 -1741917 -973614
7259 -973614 374310 1968077 3531419 4975504 6176266 6784895 6413221 5022435 3047965
7250 3047965 1084768 -530590 -1796316 -2760663 -3284548 -3156044 -2391921 -1360183 -622671
7241 -622671 -672145 -1701585 -3458432 -5324755 -6721953 -7567546 -8297687 -9373246 -10774243
7232 -10774243 -11985459 -12426359 -11898453 -10728289 -9559402 -8937603 -8960789 -9247762 -9221161
7223 -9221161 -8448913 -6846410 -4727009 -2687247 -1292892 -751310 -889824 -1423716 -2120213
7214 -2120213 -2692580 -2753405 -2066016 -786230 674788 1990075 3033948 3753293 4089928
7205 4089928 4030286 3611762 2855896 1754740 311333 -1445551 -3419205 -5337044 -6758361
7196 -6758361 -7316330 -6945734 -5830995 -4240778 -2522211 -1094289 -165435 547776 1576641
7187 1576641 3077822 4584449 5422217 5250605 4205603 2749745 1504990 1027286 1485937
7178 1485937 2544292 3659473 4512277 5126470 5649859 6108288 6348567 6173176 5568386
7169 5568386 4832399 4406719 4504657 4932343 5317143 5471151 5495727 5598158 5884285 6301293
7159 6301293 6711455 7018616 7250114 7492643 7720357 7727989 7300548 6458286 5494818 4743934
7149 4743934 4313631 4087569 4024943 4413432 5690933 7942370 10661066 13105473 14821330
7140 14821330 15717357 15767195 14904078 13244446 11198375 9234194 7610199 6350515 5342927
7131 5342927 4428543 3560494 2939769 2834452 3187171 3573894 3664656 3564694 3566762 3729493
7121 3729493 3882519 3917064 3847373 3645170 3230508 2634450 2012024 1464046 926290 211266
7111 211266 -895578 -2469942 -4242153 -5654314 -6312781 -6352015 -6206247 -6098888 -5954325
7102 -5954325 -5742554 -5632495 -5766286 -6122274 -6677974 -7491910 -8512371 -9494854 -10266338
7093 -10266338 -10956601 -11826086 -12923282 -13992827 -14652471 -14621574 -13914958 -12917143 -12147036
7084 -12147036 -11800667 -11566006 -10970900 -9838143 -8312567 -6561252 -4630985 -2575651 -555160
7075 -555160 1241465 2696028 3779616 4539107 5044250 5263338 5024059 4235838 3182800
7066 3182800 2464874 2531206 3272441 4091646 4340303 3692708 2227427 299291 -1650434
7057 -1650434 -3293742 -4583221 -5766738 -7158717 -8797263 -10316974 -11234790 -11403790 -11133745
7048 -11133745 -10814118 -10473182 -9798254 -8562755 -6903269 -5128403 -3372392 -1565019 295191
7039 295191 1992257 3288028 4190778 4934675 5691130 6353172 6624352 6311257 5544067
7030 5544067 4732728 4281154 4286111 4486445 4501851 4101871 3252661 2011318 504398 -1005571
7020 -1005571 -2181396 -2826768 -3002948 -2917755 -2775667 -2745268 -2928522 -3253258 -3483332 -3457776
7010 -3457776 -3274022 -3136525 -3092864 -3063364 -3099167 -3440516 -4265594 -5459787 -6630293 -7264684
7000 -7264684 -6946029 -5647841 -3920224 -2631929 -2360210 -3025230 -4126176 -5231533 -6200228
6991 -6200228 -7085541 -7987191 -8949703 -9877919 -10574417 -10956553 -11190033 -11468397 -11660848 -11332304
6981 -11332304 -10202010 -8516797 -6886104 -5751503 -5053315 -4408232 -3567615 -2659084 -1973340
6972 -1973340 -1578230 -1245117 -777626 -305228 -150171 -449321 -1016813 -1568618 -1963812 -2192350
6962 -2192350 -2241331 -2075598 -1719663 -1289915 -957903 -916362 -1320200 -2142412 -3061176 -3588750
6952 -3588750 -3415063 -2640593 -1661585 -875502 -547994 -883279 -2016845 -3802567 -5682237
6943 -5682237 -6952043 -7257798 -6801150 -6031960 -5182517 -4136910 -2696006 -872954 1086428
6934 1086428 2891381 4339279 5289144 5607984 5224674 4231764 2883884 1478071 248010
6925 248010 -653434 -1149918 -1273857 -1183833 -1109924 -1250740 -1660592 -2162732 -2406832 -2163880
6915 -2163880 -1651878 -1485956 -2201420 -3839682 -6008439 -8206614 -9985864 -10971451 -11025925
6906 -11025925 -10449430 -9842568 -9703546 -10257537 -11634858 -13942751 -17002787 -20171467 -22627563
6897 -22627563 -23862238 -23880922 -23044711 -21787819 -20365268 -18754581 -16871642 -14940438 -13490933
6888 -13490933 -12835306 -12665232 -12366535 -11674665 -10836510 -10181925 -9757291 -9373407 -8774124
6879 -8774124 -7690659 -5944266 -3643470 -1186671 1015763 2754939 3963865 4626721
6871 4626721 4836496 4781970 4545077 4041386 3315174 2773616 2906126 3782731 4995070 6086642
6861 6086642 6882858 7406946 7690916 7774927 7733123 7528079 6881437 5422074 2995995 -184228
6851 -184228 -3632775 -6763890 -9048571 -10175321 -10166220 -9342744 -8165582 -7078979 -6395895
6842 -6395895 -6174447 -6149173 -5869762 -5016881 -3627612 -2036675 -631992 358220 949634
6833 949634 1349832 1765201 2173375 2314914 1991753 1345085 723061 266190 -239108 -1024251
6823 -1024251 -1978817 -2761478 -3196374 -3366798 -3288337 -2689958 -1290865 766259 2913349
6814 2913349 4587852 5541947 5736405 5154045 3896754 2364406 1095928 353354 -44982
6805 -44982 -463358 -1134061 -2103400 -3294418 -4499320 -5448552 -6058326 -6533189 -7047902 -7375285
6795 -7375285 -7036475 -5854698 -4207547 -2701164 -1742633 -1443320 -1699767 -2199092 -2488116
6786 -2488116 -2271322 -1677889 -1154680 -1091950 -1560473 -2304925 -2892973 -2945810 -2358500 -1303653
6776 -1303653 9951 1489109 2990508 4151413 4608423 4375392 3822452 3257003 2684510
6767 2684510 2005200 1240908 441914 -490746 -1716096 -3209459 -4699713 -5818256 -6250083
6758 -6250083 -5828675 -4649830 -3125918 -1816728 -1117115 -1100199 -1636398 -2575371 -3759957
6749 -3759957 -4927138 -5715839 -5841865 -5271652 -4233863 -3097128 -2231465 -1886001 -2072965
6740 -2072965 -2547145 -2978491 -3190304 -3191445 -2981392 -2438095 -1470967 -195632 1147895 2384160
6730 2384160 3379779 3884095 3594003 2463985 849199 -750557 -2060670 -3133149 -4162178
6721 -4162178 -5246540 -6263354 -6906150 -6879918 -6115431 -4799336 -3219858 -1654622 -404783
6712 -404783 196049 -69058 -1128872 -2606184 -3947452 -4649707 -4566768 -4088763 -3869257
6703 -3869257 -4214297 -4800028 -5089005 -4896446 -4379869 -3626584 -2589342 -1446591 -671809
6694 -671809 -535824 -732161 -700579 -195791 645330 1650870 2745015 3772401 4491145
6685 4491145 4837287 4996082 5100116 5017928 4573193 3843657 3076783 2369257 1580335 551688
6675 551688 -689975 -1931372 -2885511 -3340099 -3298576 -2955333 -2436864 -1612727 -312494
6666 -312494 1277742 2625711 3354470 3625822 3946176 4688246 5869649 7247629 8441178
6657 8441178 9016666 8693403 7594966 6231194 5135597 4498522 4144044 3812871 3428625
6648 3428625 3115253 3027017 3220232 3673860 4324401 4978715 5249395 4759866 3504952 1923440
6638 1923440 542286 -374129 -775783 -600282 200164 1458448 2849616 4218669 5705890
6629 5705890 7462006 9347229 11016208 12249219 13121510 13877246 14687137 15485089 15978505
6620 15978505 15847497 15002715 13649565 12057751 10270126 8085309 5362999 2353710
6612 2353710 -294182 -1917607 -2313865 -1883849 -1309614 -1089113 -1352242 -2001126 -2871442
6603 -2871442 -3738343 -4305619 -4315203 -3680355 -2514195 -1093024 193602 984905 1187836
6594 1187836 1074611 1034874 1166840 1124652 381506 -1354834 -3940073 -6918523 -9798885
6585 -9798885 -12224308 -13939036 -14696499 -14318154 -12885984 -10803205 -8560791 -6423420 -4392161
6576 -4392161 -2474677 -899907 26371 276346 236946 439585 1152385 2225597 3259334
6567 3259334 3853043 3764505 3027585 2042809 1466764 1827997 3159969 5009914 6773785
6558 6773785 7977429 8317285 7635806 5992814 3720449 1306881 -815525 -2383445 -3263243
6549 -3263243 -3371937 -2679784 -1305559 411065 2002586 3113942 3673472 3840580 3847957
6540 3847957 3918226 4210788 4701197 5152357 5362415 5443651 5700373 6206610 6672286 6780809
6530 6780809 6474597 5806581 4715794 3167936 1416393 -108165 -1166114 -1820290 -2219424
6521 -2219424 -2441713 -2525104 -2444646 -2033141 -1137039 60075 1058354 1534141 1686509 1928446
6511 1928446 2308865 2424471 1915206 923415 36262 -157918 506085 1629097 2469513
6502 2469513 2444881 1588997 560169 142423 664991 1821232 2948606 3458216 3124819
6493 3124819 2162590 1108705 546025 783238 1702532 2888569 3917892 4574594 4870995
6484 4870995 4929559 4854132 4679210 4402158 4030194 3579715 3060715 2525124 2143151 2154408
6474 2154408 2654782 3416618 3950475 3764566 2608507 572692 -1963578 -4524326 -6791943
6465 -6791943 -8717928 -10365371 -11671076 -12417571 -12411737 -11623126 -10184765 -8365236 -6521052
6456 -6521052 -4924756 -3576624 -2282061 -968109 174129 929513 1348685 1705688 2225823
6447 2225823 2938545 3742978 4516854 5180338 5732957 6221391 6625176 6819942 6739072 6558192
6437 6558192 6637298 7255996 8428260 9949512 11560274 13044093 14190978 14706866 14250424
6428 14250424 12676733 10254835 7533464 4954654 2705400 955313 -2785 -54119 424227
6419 424227 802486 749937 380774 -111994 -742268 -1611282 -2703097 -3886589 -4975523
6410 -4975523 -5717725 -5894681 -5572327 -5158473 -5079254 -5426842 -5967398 -6388170 -6450591 -6035759
6400 -6035759 -5242031 -4440552 -4079440 -4346571 -5035789 -5724392 -6040331 -5810924 -5080371 -4046817
6390 -4046817 -2949590 -1968614 -1192795 -627931 -205773 153619 399981 271882 -568456
6381 -568456 -2272036 -4672222 -7392642 -10035333 -12266421 -13819157 -14555211 -14597915 -14348838
6372 -14348838 -14231625 -14330413 -14328186 -13892835 -13109661 -12439900 -12242851 -12428632 -12602269 -12449193
6362 -12449193 -11937544 -11261292 -10686849 -10369365 -10178483 -9725974 -8691005 -7141987 -5470965
6353 -5470965 -4032645 -2946424 -2225317 -1920509 -2039770 -2420623 -2801084 -2995817 -2956437
6344 -2956437 -2731146 -2460106 -2358443 -2571633 -3036890 -3591567 -4236849 -5178269 -6541909
6335 -6541909 -8138802 -9594749 -10661777 -11341099 -11789122 -12235184 -12952072 -14133822 -15726330
6326 -15726330 -17444710 -18991020 -20209135 -21060322 -21586178 -21921966 -22181346 -22221090 -21645406
6317 -21645406 -20190447 -18040772 -15647953 -13323930 -11171248 -9315535 -7914846 -6851843
6309 -6851843 -5635322 -3798552 -1349901 1259365 3550383 5313507 6558953 7306280
6301 7306280 7465642 6911522 5690195 4154120 2812679 1979336 1586467 1374348 1202284
6292 1202284 1119087 1198265 1417828 1696659 1946770 2053611 1880648 1370698 645340 -31895
6282 -31895 -422150 -476258 -374871 -417123 -832631 -1643201 -2672941 -3699686 -4607908 -5368551
6272 -5368551 -5853668 -5766188 -4928556 -3693999 -2896124 -3179045 -4366122 -5607618 -6159255
6263 -6159255 -5934318 -5353431 -4852571 -4581414 -4378557 -3882428 -2766525 -1040179 874190
6254 874190 2446004 3425307 3912450 4121041 4163416 4039041 3740823 3340831 2965219 2638686
6244 2638686 2159501 1258383 -15590 -1145948 -1529717 -1027212 -75696 721621 1063173
6235 1063173 1065999 1042167 1183170 1399791 1449460 1228316 882566 581238 259480 -289399
6225 -289399 -1089300 -1872468 -2315560 -2298794 -1923059 -1367141 -759429 -104244 729183 1918807
6215 1918807 3558097 5594652 7829862 9904105 11340440 11762715 11148074 9835244 8300388
6206 8300388 6981940 6225707 6142592 6399748 6323411 5418991 3779594 1878440 25510
6197 25510 -1797071 -3572474 -4956436 -5514052 -5170120 -4270047 -3212147 -2178333 -1273884
6188 -1273884 -759109 -945047 -1858916 -3142065 -4310570 -5032100 -5159462 -4677018 -3749950
6179 -3749950 -2741479 -2027274 -1773134 -1935207 -2412564 -3109978 -3918833 -4779714 -5759173
6170 -5759173 -6951006 -8310894 -9715526 -11189112 -12911928 -14918592 -16881562 -18298644
6162 -18298644 -18899272 -18864521 -18682327 -18753649 -19041861 -19099151 -18523364 -17389306 -16134219 -15043341
6152 -15043341 -14019531 -12896209 -11771929 -10887738 -10307083 -9909933 -9672510 -9795866 -10514081
6143 -10514081 -11813251 -13307518 -14352225 -14366004 -13170966 -11043516 -8429599 -5691171
6135 -5691171 -3161426 -1266820 -362883 -434809 -1099218 -1934911 -2736181 -3468112 -4118632
6126 -4118632 -4658067 -5077598 -5426356 -5839228 -6505985 -7524082 -8747512 -9817869 -10359871
6117 -10359871 -10163322 -9284720 -8085519 -7098169 -6646485 -6510022 -6054635 -4772343 -2674348
6108 -2674348 -170486 2340701 4732881 7095326 9480387 11688229 13320715 14123938
6100 14123938 14265750 14173222 14095438 13946783 13583894 13052529 12464668 11788996 10927249 9919742
6090 9919742 8911548 7930573 6818564 5375477 3485127 1139837 -1520565 -4177672
6082 -4177672 -6469235 -8239657 -9637492 -10949948 -12352651 -13771232 -14899439 -15358120
6074 -15358120 -14933325 -13706966 -11931883 -9805543 -7445948 -5070984 -3052943 -1694156
6066 -1694156 -1000636 -761137 -831596 -1277945 -2242582 -3713719 -5408914 -6819721 -7374638
6057 -7374638 -6689993 -4837238 -2438760 -403821 621423 680085 410320 511332 1291363
6048 1291363 2665942 4415485 6291179 7922251 8830328 8686065 7561393 5908482 4304341
6039 4304341 3186967 2728183 2853329 3350306 3973926 4483846 4671602 4459987 4004956
6030 4004956 3636802 3641922 4078297 4749387 5286114 5286648 4517299 3055739 1178628 -934916
6020 -934916 -3304298 -5874958 -8217335 -9627410 -9559665 -7947804 -5175588 -1842598 1475521
6011 1475521 4416958 6928627 9172945 11272709 13100274 14305280 14578490 13957118 12910427
6002 12910427 12071931 11794697 11925072 11995113 11595494 10564751 8943892 6890871 4625800
5993 4625800 2342616 160031 -1751194 -3013983 -3194998 -2213168 -502013 1348462 3060996
5984 3060996 4695275 6288334 7656012 8591405 9112958 9398939 9537627 9462808 9123495
5975 9123495 8579189 7855320 6809873 5296934 3460431 1716902 373923 -624516 -1470963
5966 -1470963 -2116716 -2296739 -1905735 -1150258 -261793 769763 2037920 3399732 4491188
5957 4491188 5057780 5135432 4867909 4254792 3177922 1662520 33885 -1251312 -1951290
5948 -1951290 -2190543 -2234954 -2147474 -1730856 -791853 634339 2325385 4003107 5365555
5939 5365555 6140474 6274860 6036831 5811345 5820623 6127264 6803188 7869552 9049403 9795429
5929 9795429 9699405 8802392 7455900 6002058 4672915 3663949 3115835 3007845 3151965
5920 3151965 3300976 3254294 2958539 2610027 2592047 3150572 4088683 4847850 4901607 4044299
5910 4044299 2406196 396881 -1334372 -2125296 -1739579 -592508 591758 1395444 1943674
5901 1943674 2571339 3392128 4248696 4954883 5414390 5496166 4957717 3634121 1697140
5892 1697140 -348097 -1944443 -2761987 -2795302 -2340742 -1909274 -2005368 -2814790 -4064228
5883 -4064228 -5205141 -5706313 -5176858 -3386049 -402743 3243737 6707909 9260466 10573074
5874 10573074 10627510 9556016 7724970 5851041 4763932 4916742 6142461 7870493 9510494
5865 9510494 10672370 11202762 11143605 10629038 9762064 8606884 7302616 6085372 5111530
5856 5111530 4312446 3526692 2756821 2178250 1854282 1530156 798217 -528753 -2224888
5847 -2224888 -3795747 -4775679 -4920023 -4211978 -2776599 -807642 1469643 3816380 5971624
5838 5971624 7626577 8462051 8304125 7276328 5744228 4066525 2431287 953019 -159630
5829 -159630 -647287 -414908 362366 1349830 2224290 2781404 3007859 3102404 3338532 3815156
5819 3815156 4347978 4628883 4458869 3817825 2799093 1568400 353730 -631635 -1301915
5810 -1301915 -1714034 -1973281 -2157146 -2318440 -2486213 -2600860 -2463953 -1831648 -639728
5801 -639728 841774 2132496 2892418 3167353 3270289 3448181 3719862 4011253 4329854
5792 4329854 4737990 5200811 5512296 5364325 4523260 3050116 1374379 11687 -900355
5783 -900355 -1696978 -2704976 -3757541 -4345938 -4185898 -3422929 -2292787 -861311 755942
5774 755942 2139477 2818347 2778688 2545874 2724453 3569078 5018336 6970536 9352467
$$ [...]
##END NTUPLES=NMR SPECTRUM
##END=
