##TITLE=31Pdec_SRM-1.oil
 CDCl3, 64 sc
 11.5.2023
##JCAMPDX= 6.0         $$ Bruker NMR JCAMP-DX V2.0
##DATA TYPE= NMR SPECTRUM
##DATA CLASS= NTUPLES
##ORIGIN= UXNMR, Bruker Analytische Messtechnik GmbH
##OWNER= root
$$ XWIN-NMR		Version 3.5
$$ Thu May 11 13:55:13 2023 Russian Standard Time (UT+4h)  she@DPX200
##.OBSERVE FREQUENCY= 81.013821
##.OBSERVE NUCLEUS= ^31P
##.ACQUISITION MODE= SIMULTANEOUS
##.ACQUISITION SCHEME= undefined
##.AVERAGES= 64
##.DIGITISER RES= 16
##SPECTROMETER/DATA SYSTEM= spect
##.PULSE SEQUENCE= zgpg30
##.SOLVENT NAME= CDCl3
##.SHIFT REFERENCE= (INTERNAL, CDCl3, 0, 248.564)
##AUDIT TRAIL= $$ (NUMBER, WHEN, WHO, WHERE, WHAT)
$$ ##TITLE= Audit trail, XWIN-NMR		Version 3.5
$$ ##JCAMPDX= 5.01
$$ ##ORIGIN= Bruker BioSpin GmbH
$$ ##OWNER= she
$$ F:/spectra/data/she/nmr/P31/1/pdata/1/auditp.txt
$$ ##AUDIT TRAIL=  $$ (NUMBER, WHEN, WHO, WHERE, WHAT)
(   1,<2023-05-11 13:53:41.79 +0400>,<she>,<DPX200>,
      <continue with go, POWCHK disabled, PULCHK disabled
       configuration hash MD5:
       00 E9 B6 7A A2 85 ED C7 34 08 36 98 17 FE 4E 26
       data hash MD5: 32K
       CC DE CA DC EE 95 1E 47 BB 96 A4 50 E2 BA 46 2B>)
(   2,<2023-05-11 13:53:43.64 +0400>,<she>,<DPX200>,
      <Start of raw data processing
       efp BC_mod = 2 LB = 1 FT_mod = 6 PKNL = 1 PHC0 = -11100.92 PHC1 = 425.4849 SI = 64K 
       data hash MD5: 64K
       5E 24 C4 96 72 87 E9 F4 37 2A FB 36 D3 AD 7F 54>)
(   3,<2023-05-11 13:54:00.14 +0400>,<she>,<DPX200>,
      <pk PHC0 = 18.38522 PHC1 = -71.6 
       data hash MD5: 64K
       D1 E5 BD 03 12 29 61 90 DA 87 69 25 25 E2 E1 36>)
(   4,<2023-05-11 13:54:04.09 +0400>,<she>,<DPX200>,
      <abs ABSG = 5 
       data hash MD5: 64K
       4B 89 ED C5 7F D0 F0 85 AE 7C 2C 9D 96 BF C5 C6>)
$$ ##END=
$$ 
$$ hash MD5
$$ 57 E5 A7 D9 CA 0C 28 C0 AF 66 CF EE DD 79 99 7B
##$RELAX= 
##$RELAX= 
##$RELAX= 
##$RELAX= 
##$RELAX= 
##$RELAX= 
##$RELAX= 
##$RELAX= 
##$RELAX= 
$$ Bruker specific parameters
$$ --------------------------
##$DU= <F:/spectra>
##$EXPNO= 1
##$NAME= <P31>
##$PROCNO= 1
##$TYPE= <nmr>
##$USER= <she>
##$AMP= (0..31)
100 100 100 100 100 100 100 100 100 100 100 100 100 100 100 100 100 100 
100 100 100 100 100 100 100 100 100 100 100 100 100 100 
##$AQSEQ= 0
##$AQ_mod= 1
##$AUNM= <au_zg>
##$AUTOPOS= <>
##$BF1= 81.014009
##$BF2= 200.13
##$BF3= 200.13
##$BF4= 200.13
##$BF5= 200.13
##$BF6= 200.13
##$BF7= 200.13
##$BF8= 200.13
##$BYTORDA= 1
##$CFDGTYP= 0
##$CFRGTYP= 5
##$CHEMSTR= <none>
##$CNST= (0..31)
1 1 145 1 1 1 1 1 1 1 1 1 1 1 1 1 1 1 1 1 1 1 1 1 1 1 1 1 1 1 1 1 
##$CPDPRG= <waltz16>
##$CPDPRG1= <>
##$CPDPRG2= <waltz16>
##$CPDPRG3= <>
##$CPDPRG4= <mlev>
##$CPDPRG5= <mlev>
##$CPDPRG6= <mlev>
##$CPDPRG7= <mlev>
##$CPDPRG8= <mlev>
##$CPDPRGB= <>
##$CPDPRGT= <>
##$D= (0..31)
0 1 0 0 0 0 0 0 0 0 0 0.03 2e-05 3e-06 0 0 0 0 0 0 0 0 0 0 0 0 0 0 0 0 
0 0 
##$DATE= 1683798740
##$DBL= (0..7)
120 120 120 11 120 120 24 19 
##$DBP= (0..7)
150 150 150 150 150 150 150 150 
##$DBP07= 0
##$DBPNAM0= <>
##$DBPNAM1= <>
$$ [...]
##$SUBNAM3= <"">
##$SUBNAM4= <"">
##$SUBNAM5= <"">
##$SUBNAM6= <"">
##$SUBNAM7= <"">
##$SUBNAM8= <"">
##$SUBNAM9= <"">
##$SW= 501.771253377433
##$SWIBOX= (0..15)
0 1 3 0 0 0 0 0 0 0 0 0 0 0 0 0 
##$SW_h= 40650.406504065
##$TD= 32768
##$TD0= 1
##$TE= 0
##$TE2= 300
##$TE3= 300
##$TEG= 300
##$TL= (0..7)
0 120 53 12 22 120 120 120 
##$TP= (0..7)
150 150 150 150 150 150 150 150 
##$TP07= 0
##$TPNAME0= <>
##$TPNAME1= <>
##$TPNAME2= <>
##$TPNAME3= <>
##$TPNAME4= <>
##$TPNAME5= <>
##$TPNAME6= <>
##$TPNAME7= <>
##$TPOAL= (0..7)
0.5 0.5 0.5 0.5 0.5 0.5 0.5 0.5 
##$TPOFFS= (0..7)
0 0 0 0 0 0 0 0 
##$TUNHIN= 0
##$TUNHOUT= 0
##$TUNXOUT= 0
##$USERA1= <user>
##$USERA2= <user>
##$USERA3= <user>
##$USERA4= <user>
##$USERA5= <user>
##$V9= 5
##$VALIST= <valist>
##$VCLIST= <CCCCCCCCCCCCCCC>
##$VD= 0
##$VDLIST= <DDDDDDDDDDDDDDD>
##$VPLIST= <PPPPPPPPPPPPPPP>
##$VTLIST= <TTTTTTTTTTTTTTT>
##$WBST= 1024
##$WBSW= 4
##$XGAIN= (0..3)
0 0 0 0 
##$XL= 0
##$YL= 0
##$YMAX_a= 3693
##$YMIN_a= -6388
##$ZGOPTNS= <>
##$ZL1= 120
##$ZL2= 120
##$ZL3= 120
##$ZL4= 120
##$ABSF1= 248.5645
##$ABSF2= -253.2056
##$ABSG= 5
##$ABSL= 3
##$ALPHA= 0
##$AQORDER= 0
##$ASSFAC= 0
##$ASSFACI= 0
##$ASSFACX= 0
##$ASSWID= 0
##$AUNMP= <proc_1d>
##$AZFE= 0.1
##$AZFW= 0.5
##$BCFW= 0
##$BC_mod= 2
##$BYTORDP= 0
##$COROFFS= 0
##$CY= -3
##$DATMOD= 1
##$DC= 0
##$DFILT= <>
##$DTYPP= 0
##$F1P= 0
##$F2P= 0
##$FCOR= 1
##$FTSIZE= 65536
##$FT_mod= 6
##$GAMMA= 0
##$GB= 0
##$INTBC= 1
##$INTSCL= 6.047779e-11
##$ISEN= 30
##$LB= 1
##$LEV0= 0
##$LPBIN= 0
##$MAXI= 10000
##$MC2= 0
##$MEAN= 0
##$ME_mod= 0
##$MI= 50
##$NCOEF= 0
##$NC_proc= -8
##$NLEV= 6
##$NOISF1= 182.463
##$NOISF2= 159.3651
##$NSP= 0
##$NTH_PI= 0
##$NZP= 0
##$OFFSET= 248.5645
##$PC= 4
##$PHC0= -11082.54
##$PHC1= 353.8849
##$PH_mod= 1
##$PKNL= yes
##$PPARMOD= 0
##$PSCAL= 0
##$PSIGN= 0
##$REVERSE= no
##$SF= 81.0140089999694
##$SI= 65536
##$SIGF1= 159.3651
##$SIGF2= -187.1042
##$SINO= 113.3802
##$SIOLD= 16384
##$SREGLST= <1H.CDCl3>
##$SSB= 0
##$STSI= 65536
##$STSR= 0
##$SW_p= 40650.406504065
##$SYMM= 0
##$S_DEV= 0
##$TDeff= 32768
##$TDoff= 0
##$TI= <>
##$TILT= no
##$TM1= 0
##$TM2= 0
##$TOPLEV= 0
##$USERP1= <user>
##$USERP2= <user>
##$USERP3= <user>
##$USERP4= <user>
##$USERP5= <user>
##$WDW= 1
##$XDIM= 65536
##$YMAX_p= 391407577
##$YMIN_p= -135905365
$$ End of Bruker specific parameters
$$ ---------------------------------
##NTUPLES= NMR SPECTRUM
##VAR_NAME=  FREQUENCY,     SPECTRUM/REAL,   SPECTRUM/IMAG
##SYMBOL=    X,             R,               I
##VAR_TYPE=  INDEPENDENT,   DEPENDENT,       DEPENDENT
##VAR_FORM=  AFFN,          ASDF,            ASDF
##VAR_DIM=   65536,         65536,           65536
##UNITS=     HZ,            ARBITRARY UNITS, ARBITRARY UNITS
##FACTOR=    0.620285442955139, 1,           1
##FIRST=     20137.2065510682, 0,            0
##LAST=      -20513.1999529968, 0,           0
##MIN=       -20513.1999529968, -135905365,  0
##MAX=       20137.2065510682, 391407577,    0
$$ Real data points
##PAGE= N=1
##DATA TABLE= (X++(R..R)), XYDATA
$$ [...]
39578A1128302j984975k159621l561030j608214J208659J671971J055463j96909
39570E553646m385835r027385o233785M882869J2942199Q179326l965674r920870
39562a975509n058434K654559M481759R12525j027084K431708O918309N829930
39554A5167763O0725k241152K502166O947161L370925m105229n483300k8528L858043
39545B0048574K886179K630037N337816M327571m404186j2942005j0697221J338574
39537H525339J1449634J0461053M33689q696121r077218k354268K787621J608982
39529A5138711o94223K360644P480015O384487l11473l398659J04151K458646
39521B9522299j230598m671294j414235L876473K780275l871779q253936p320955
$$ y = [11128302, 9143327, 6983706, 3422676, 1814462, 3023121, 4695092, 5750555, 5553646, 1167811, -7859574, -14093359, -9210490, 3731709, 11911035, 7945361, -1975509, -7033943, -4379384, 102375, 1014900, -12184, 2419524, 9337833, 15167763, 15228488, 12987336, 15489502, 22436663, 25807588, 21702359, 16219059, 16190531, 20048574, 22934753, 25564790, 30902606, 35230177, 30825991, 17883986, 7186765, 8525339, 19974973, 30436026, 30869715, 22173594, 13096376, 10742108, 13529729, 15138711, 14444488, 16805132, 24285147, 30669634, 30358161, 26959502, 27063653, 29522299, 28291701, 23620407, 22206172, 26082645, 28862920, 24991141, 16737205, 9416250]
39513I416250m803341l180880n70625M071870P607400N983611j091263q858604
39505H574418j0576451l943681M905322P015339J393152l704377k021603K785478
39497D427597L657141K72702j744660R40692O090458R229224P296267P27125n844818
39488B5051728p274281m239136k783362n445179p045131k739156M013711O462965
39480F002159M287479K600328L232364L069701O05316j708351k688812m858214
39472A0541970r111893j0806456n218895M447056Q879854L933346l265934l121572
39464c722524L377038O070394N88771n281832m031468M5532r57991m796947l593196
39455a2302223J598987K658665l97314R15697P317863Q757712J752561l584143
$$ y = [9416250, 4612909, 1432029, 861404, 4933274, 12540674, 18524285, 17433022, 8574418, -2002033, -5945714, -1040392, 5974947, 7368099, 3663722, 1642119, 4427597, 8084738, 8357440, 6612780, 7553472, 13643930, 22873154, 30169421, 30896546, 25051728, 17777447, 13538311, 10754949, 5309770, -1735361, -4474517, -460806, 6002159, 10289638, 12889966, 16122330, 19192031, 19797347, 18088996, 15400184, 10541970, 1430077, -9376379, -14595274, -10148218, -1268364, 2664982, -600952, -3722524, -345486, 5724908, 6313679, 1031847, -2999621, -2954089, -3912080, -8709027, -12302223, -10703236, -8044571, -8441885, -7526188, -208325, 8549387, 10301948, 6717805]
39447F717805m92751L067498j010711o538043m475765P40953n18014n447974l577958
39438a1534960M827612Q982636M805374o33292k053037k043732k870415k161919
39430b681733Q66124K792941J806225J08387m60721j29193Q78480J229908k224522
39421B185896q209008q185504K079643J2424309J0377361r579m079206M64489
39413G048401J309133o361431j1091182m014225P122392J0737738P229016L357306
39405A5337148N7334m686770p793301n366296l60219J948490K093981L202933
39397D433300M022033K117655m7925O39310J276056k159197o374627n034095N45453
39388e82037K839200l42097l102020r23642L472535N331161L817230O97533k989749
$$ y = [6717805, 6225054, 9292552, 8281841, 1743798, -2731967, -1991014, -2509028, -7957002, -11534960, -6707348, 2275288, 7080662, 6447370, 4394333, 2350601, -519814, -2681733, -1815609, 977332, 2783557, 2891944, 2431223, 2302030, 3180510, 4410418, 2185896, -6023112, -14208616, -12128973, 295336, 10672697, 10663118, 6583912, 7048401, 8357534, 1996103, -9095079, -13109304, -5986912, 4750826, 11979842, 15337148, 15394482, 10707712, 2914411, -2451885, -2812104, -863614, 1230367, 4433300, 8455333, 10572988, 10525063, 11164373, 12440429, 10281232, 3906605, -1127490, -582037, 2257163, 1915066, -1186954, -2110596, 1361939, 6693100, 10510330, 11207863, 8218114]
39379H218114o426823p612249n022162o9363L642593L900670K170385J448550
39371B49715J979562J183219j197328j249440K664689N275310J772211l233838
39363G444100j911179L465626L457908j962756j949910O157177R227598j571749
39355B2356815j4289398j2372905L57873N834892o71410n079159J872932J0467832
39347H477472P978101k368938p570536l453944K321401L089412L80637j977723
39339F875882l696817m964965k696856M916348J2088668R867436j529812j0276793
39331A0583091p169773J828679L800801k818357o881435k059034L957168K163762
39323C404902m256495o238938k614830O33698J142839J783630L263050K909706
$$ y = [8218114, 1791291, -5820958, -10843120, -10912483, -7269890, -3369220, -1198835, 249715, 2229277, 3412496, 2215168, 965728, 3630417, 8905727, 10677938, 7444100, 5532921, 8998547, 12456455, 10493699, 8543789, 14700966, 23928564, 22356815, 8067417, -4305488, -3947615, 1887277, 1215867, -3863292, -1990360, 8477472, 16455573, 14086635, 6516099, 3062155, 5383556, 8472968, 8853605, 6875882, 3179065, -1785900, -4482756, 433592, 12522260, 22389696, 20859884, 10583091, 3413318, 5241997, 9042798, 6224441, -656994, -2716028, 1241140, 3404902, -851593, -7090531, -9705361, -9071663, -7928824, -6145194, -2882144, 27562]
39315B7562N38098j007709j001658o77249J338539O815035J1387992P841718k428988
39306B2833340q406627l258312O536184R849282M257251l569589p421782o656353
39298A4163394l478985P1177K006718O19282l545192p184293o993831k891315
39290g233045J995098M611974M708201L881712K791072P68223k108800m403416
39282E011019n040805m111891k082981j0069J36509j859657k253309K176888P756462
39273b77834P292883O50917l980203j556066L098410L361260q3253k368501j553555
39264D584058J710238O639304J0167927P799742J190430j409452K271231K860531
39256C5814009o263218j6340766j4918351m122130L966026N321315M969783L719703
$$ y = [27562, 565660, -442049, -1443707, -2120956, -782417, 6032618, 17420610, 25262328, 22833340, 14426713, 11168401, 17704585, 27553867, 31811118, 28241529, 20819747, 14163394, 10684409, 10755586, 12762304, 13381586, 9836394, 2652101, -4341730, -7233045, -5237947, -625973, 4082228, 7963940, 10755012, 11523235, 9414435, 5011019, -29786, -4141677, -6224658, -6234727, -6098218, -7957875, -10211184, -8034296, -277834, 7015049, 7665966, 3685763, 2129697, 5228107, 8589367, 8506114, 6137613, 4584058, 6294296, 12933600, 23101527, 30901269, 32091699, 30682247, 32953478, 35814009, 29550791, 13210025, -1708326, -5830456, -1864430, 3456885, 8426668, 12146371]
39248A2146371k035806q536475p132382L35645K417599l224459n618270Q85575
39240a0762202P140439M690519j134039j447075K625402M793989M087284K736980
39232A2731297M08835k368485j449473L554093N590422O26352m724200l377776
39224A0991065O72488o65327o134193p554056k568828L067094M176171Q14300
39216B798714m071142o752284m721202k94376J162357m85471R23110P123695J0881056
39207F564457P383098K180586Q38672p08722o229840q321362K7084R751028O546489
39198A8031490o196629j1128884l129608M154710P05350n976911n361946L90714
39190h511714L288246K544543K175083K328283J059544o7625P90966P97357k838134
$$ y = [12146371, 10110565, 1574090, -5558292, -5222647, -2805048, -6029507, -11647777, -10762202, -3621763, 1068756, -65283, -1512358, 1113044, 5907033, 9994317, 12731297, 13140132, 10771647, 9322174, 12876267, 18466689, 19093041, 14368841, 10991065, 11663553, 10998226, 4864033, -2690023, -5258851, -2191757, 1984414, 2798714, -1272428, -8024712, -12745914, -13040290, -11877933, -12363404, -11440294, -4316599, 6564457, 13947555, 16128141, 16966813, 16258091, 10028251, 1706889, 1733973, 11485001, 18031490, 11834861, 705977, -2423631, 1731079, 2436429, -3540482, -8902428, -8511714, -5223468, -2678925, -503842, 1824441, 2883985, 2816360, 3607326, 4404683, 1566549]
39181A566549o350850m051390K562697O391472M698781K124294L189855O104330
39173A6235738N886231J240735l998086n917299n014344m229480l840882j650581
39165a287968J519909J243550l110805n428878j931550J639764j283071o323469
39157a4962518m220677L634457O648355K278257n9740M393739P253580J841033
39149F806486m281090j560269M946687L369159n339246q604368j951772N118352
39141a496061N031464K390872L393651M660442J99224o954169q618448l717794
39133e110819J317416K923293L456120L808676Q93010n026690p580232l458898
39125h778124J244209j94555m335233l098714K439738L035825l327452o698192
$$ y = [1566549, -4784301, -8835691, -6272994, 118478, 4817259, 6941553, 10131408, 16235738, 22121969, 23362704, 19364618, 13447319, 8432975, 4203495, 362613, -1287968, 231941, 1475491, -1635314, -7064192, -8995742, -7355978, -8639049, -14962518, -19183195, -15548738, -8900383, -6622126, -6681866, -2288127, 4965453, 6806486, 2525396, 965127, 5911814, 9280973, 3941727, -4662641, -6614413, -1496061, 3535403, 5926275, 9319926, 13980368, 14179592, 7225423, -1393025, -5110819, -3793403, -870110, 2586010, 6394686, 7287696, 2261006, -5319226, -8778124, -7533915, -7728470, -12063703, -15162417, -12722679, -9686854, -13014306, -19712498]
39117a9712498j14613Q881845Q816665Q01682m063702j034623L470553L324943
39109C70252N30198p62402j081777k420925l182156j143204J513772Q99725k144268
39100g420785k573252J684740O314728N706471j61838n413374m720240P53767
39092e829783M592155K440219k925290m996026j381570L654573M831221J949838
39084B335337j143141k182048k407884k850979j754949K137663N801939N087968
39076E023906J229806j41372K335530K859704k568713q773676q206710j923485
39068a0165010K605470K664232K018524K231796M24671l105668l150314J549160
39060d927139M830308K286646k227096l121174n20484K367557L802468K387909
$$ y = [-19712498, -19827111, -10945266, -2128601, -1326919, -5390621, -6425244, -2954691, 370252, 900450, 138048, -943729, -3364654, -6546810, -7690014, -6176242, -5276517, -7420785, -9994037, -8309297, -1994569, 3711902, 3550064, -1863310, -6583550, -5829783, -1237628, 1202591, -1722699, -6718725, -8100295, -4445722, 385499, 2335337, 1192196, -989852, -3397736, -6248715, -8003664, -5866001, -64062, 5023906, 6253712, 6112340, 8447870, 11307574, 8738861, -34815, -8241525, -10165010, -7559540, -4895308, -2876784, -644988, -220317, -3325985, -6476299, -4927139, -96831, 2189815, -37281, -3158455, -3678939, -1311382, 2491086, 4878995]
39052D878995k300964n106503Q12857J1576255J3309903J256141j1300699j1066755
39044B059230k427429K445156J990402J791424P87166m649328q441857k111535
39036h556771Q625106R877068R12307n634575m686918m183314p824070q117746
39028a9588913j238952N124114M706614J640697Q13049K02212j544360m47502
39020a0333041L965158N129884P45187k037405J191931M318029J746739k064742
39012B661740j439816P28287k61451k030732o95543J533174J566377J636140L370688
39003G068864K508221l200139p395833m099828K479949M488986J497973j677776
38995A670417k888404k141475J184191M825441L632821j482887k351339K684390
$$ y = [4878995, 2578031, -2528472, -1715615, 9860640, 23170543, 24426684, 13125985, 2059230, -368199, 2076957, 4067359, 5858783, 6645949, 1996621, -6445236, -8556771, 68335, 9945403, 10857710, 5223135, 536217, -3647097, -11471167, -19588913, -20827865, -15703751, -10997137, -9356440, -8543391, -8341179, -9885539, -10333041, -6367883, -1237999, -492812, -2530217, -1338286, 2979743, 4726482, 2661740, 1221924, 1950211, 1688760, -341972, -1037515, 495659, 2062036, 3698176, 7068864, 9577085, 6376946, -1018887, -5118715, -2638766, 1850220, 3348193, 1670417, -1217987, -3359462, -2175271, 2650170, 6282991, 4800104, 2448765, 5133155]
38987E133155L322307o027157j4079187q508008M437922R283984M022804n18580
38979b932760K24468O41190j451456j240765K139181L124184K25756j105860J548735
38970A172673L438962R60782l086656m769298l730466j262715J306907J742057
38962d227754j027982m017951l398660K60592L534996M958640M727893K606756
38954C416530J0206L74439L292745K971527k859966q102566p578475m607244l172289
38945a6255093k23177O296290R805069N324277j96826J088403L839969r05878
38937H773034q781338q986306k823041q7200r85957K281719Q498594Q534937K467358
38928H891800n88271O28462r42634m400738j461116N679792N216698l001588n803275
$$ y = [5133155, 8455462, 2428305, -11650882, -20158890, -15720968, -6436984, -2414180, -2932760, -2708292, -2067102, -3518558, -4759323, -2620142, 504042, 729798, -376062, 1172673, 4611635, 5572417, 2485761, -2283537, -6014003, -7276718, -5969811, -4227754, -5255736, -9273687, -12672347, -12411755, -8876759, -3918119, 809774, 3416530, 3426736, 3801175, 7093920, 10065447, 7205481, -897085, -8475560, -13082804, -16255093, -16478270, -10181980, -376911, 4947366, 4750540, 5838943, 9678912, 8773034, -8304, -8994610, -11817651, -11904851, -12890808, -10609089, -2110495, 6424442, 8891800, 8303529, 8931991, 7989357, 3588619, 2127503, 7807295, 13023993, 10022405, 4219130]
38919D219130l31954L34447q156368j1207523m6093J1669631R235057p08747l820295
38910A187285j000090j865188n449873l834213J472181K030120k302628l632982
38902a3395388O05014N099321N728718K777253k566209p681524p480302n93234
38894a7506351O536235P516826M211646J990359J607153J115635O91239K52543
38886F415285k307887n738704m649488J236448M718961L010913K633041O087023
38878A1405592M691242n927824j4187301q797980K672204N715858J549466J707474
38870a171269N791469L090625n445173o012792M472075J1195694M358750n709632
38862A0569747n717793J62568r85149q913740j0237716Q35579J3046860J2999321
$$ y = [4219130, 3887176, 4221623, -3934745, -15142268, -15188361, -3518730, 5716327, 5007580, 1187285, 187195, -1677993, -7127866, -10962079, -9489898, -7459778, -9762406, -13395388, -12790374, -7691053, -1962335, 814918, -1751291, -9432815, -16913117, -17506351, -10970116, -3453290, 758356, 2748715, 4355868, 5471503, 6162742, 6415285, 4107398, -1631306, -6280794, -5044346, -325385, 2685528, 5318569, 11405592, 16096834, 10169010, -4018291, -12816271, -10144067, -4428209, -2878743, -1171269, 4620200, 7710825, 2265652, -3747140, 724935, 11920629, 16279379, 10569747, 4851954, 5014522, 4029373, -4884367, -15122083, -14286504, -1239644, 11759677]
38854A1759677K392827n631313m229630K11853j56862l184083k401448J094975
38846a44004J016338k079660j099143M594172O793501K044132k439579j310634
38838G375123J18805l648315p670231m741419K466129N912356L827997K79167
38830C919612k387522l862164l074684j045971j638237m407843l196346K894645
38822a2798510N382209r1600n306221k750887K246997K442194J663644N135846
38814d076328O880750R05987m339821R10114Q187657K977390r503683j1171551
38806i229485n56802O007354K441912K78938M869596N661069l020355j0546843
38798d094616q072530j674712J391666M160351Q196093N441959o581522j4567750
$$ y = [11759677, 14152504, 8521191, 4291561, 4503414, 4346552, 1162469, -1238979, -144004, 872334, -1207326, -2306469, 2287703, 9081204, 11125336, 8685757, 7375123, 7493928, 3845613, -3824618, -8566037, -6099908, -187552, 3640445, 3919612, 1532090, -2330074, -5404758, -6450729, -8088966, -12496809, -15693155, -12798510, -7416301, -7507901, -12814122, -15565009, -13318012, -10875818, -9212174, -4076328, 2804422, 3710409, -629412, 280702, 8468359, 11445749, 1942066, -9229485, -9786287, -3778933, -1337021, -1058083, 3811513, 9472582, 6452227, -4094616, -12167146, -13841858, -12450192, -8289841, -93748, 5348211, -1233311, -15801061]
38790a5801061p526377N249737P578680l61727n378192j927107L527921N516801
38782i121325N166953L689680j99193n464307p653329l751003M588718J1796235
38774i47571J1551090K775396o591526o950482N37440N085318J309116m441889
38766B326892n186373k329062R3485J783699K439237m7893l170736m96025O398436
38757A811660O830871j888230p408636j089016P267108M893778l486795m663830
38749B266910R99949K211308k788315m729770j436236j566457p720310r976243
38741b2739164j682115R474535J2695589P953216K056128k467103p159940j0370720
38733a2239574p803190P3242O638123O747164K780403Q47245K311160K406016
$$ y = [-15801061, -23327438, -18077701, -10499021, -10860748, -16238940, -18166047, -14638126, -9121325, -3954372, -264692, -463885, -5928192, -13581521, -17332524, -12743806, -947571, 10603519, 13378915, 6787389, -163093, 374347, 5459665, 6768781, 2326892, -2859481, -5188543, -5095058, -3311359, -872122, -920015, -4090751, -4586776, 1811660, 8642531, 6754301, -654335, -1743351, 5523757, 10417535, 6930740, 2266910, 3266859, 5478167, 2689852, -2039918, -3476154, -5042611, -12762921, -22739164, -24421279, -14946744, -2251155, 5702061, 7758189, 5291086, -1868854, -12239574, -20042764, -19969522, -13331399, -6584235, -3803832, -2956587, -645427, 1760589]
38725A760589j710768n382494k987369K747117M300723J048938n61055R37152
38717A52833o70481o779424q938818k497393M114927K184630l418433l361774
38709a9213933J77341j158908n485823l228197N638848J0323859O128795N36088
38701f281930j8657J426206O49525o27827j08769O08917P54767K249152L649518
38692B300902J22906o805964p839475N34663Q817947P290626o55997n254262m663960
38683f152614l981109l903108m7526P085478J0127672M838683l879290q454311
38675d366125p014849k945100P24709L502813N332021N059155J884090k494527
38667c17813m566429k724038N30074J683961R89121J724996M564553N759758K503265
$$ y = [1760589, 49821, -5332673, -8320042, -5572925, -1272202, -223264, -784319, 152833, -517648, -7297072, -16235890, -18733283, -14618356, -12433726, -15852159, -19213933, -19036592, -20195500, -25681323, -28909520, -23270672, -12946813, -6818018, -6281930, -6300587, -4874381, -4224856, -4852683, -4961452, -4352535, -3597768, -1348616, 2300902, 2423808, -4382156, -12221631, -11686968, -2869021, 4421605, 3765608, -1488654, -6152614, -10133723, -14036831, -14084357, -6998879, 3128793, 7967476, 4088186, -4366125, -11380974, -14326074, -13601365, -10098552, -4766531, 292624, 2176714, -317813, -4884242, -7608280, -7078206, -5394245, -4405124, -2680128, 1884425, 7644183, 10147448]
38658A0147448k412479l675126J48660N378261P538062N112243l78415o118334
38650A5740320r535300r338848o010920j553317J655539K829449L798117O411258
38642C996298Q368041M689621m300358j0071989n874971K927747N328672M81173
38634E544234j561174L527267O791902O32721p799708p050837O18713K864016
38626C567134l363789p755551l235405M096443N698543K546708P02207J484452
38618C740742K223834K113686J546323o00379l787656l784770P48524L684903
38610E885207k35483o285541o398377j765066j41161k603247k756003J129504
38602a3170167L416036K056726K153954N534733O505673K265132j745649j864234
$$ y = [10147448, 7734969, 4059843, 4208503, 9586764, 17124826, 22237069, 21858654, 15740320, 6205020, -3133828, -9144748, -10698065, -9042526, -6213077, -2414960, 3996298, 12364339, 17053960, 12753602, 2681613, -3193358, -265611, 5063061, 5544234, 3983060, 7510327, 14302229, 14934950, 7135242, 84405, 703118, 3567134, 203345, -7552206, -10787611, -6691168, -992625, 1554083, 2256290, 3740742, 5964576, 8078262, 9624585, 9024206, 5236550, 1451780, 2200304, 5885207, 5649724, -635817, -7034194, -8799260, -8940421, -11543668, -14299671, -13170167, -9754131, -7697405, -5543451, -8718, 6496955, 8762087, 7016438, 5152204]
38594E152204k083897l964808j064402Q101777J1880676K055115r815435o973733
38586C287497P019899J2942526L785053p911237j1148782r126713p180481k901528
38578a1233766M808290Q815552M283536k566839l805067p28140J201048J431340
38570B205954J615646J59571l764850o340904n402821m798094o402245m548077
38562b7275820L985741J1024899P582230j524083m118836J274828M734638J423258
38554b893145k086033J53208M395616M210068P8984k548680j103767J924747K959794
38545E090792J214887q83440n60007J899317L476440K310342p70250m634988q104311
38536i61218p417622O20668J0526669J0422079k011934j2574115p767118O064074
$$ y = [5152204, 3068307, -896501, -1960903, 6140874, 18021550, 20076665, 10261230, 3287497, 10307396, 23249922, 27034975, 19123738, 7974956, -1151757, -8332238, -11233766, -6425476, 2390076, 6673612, 4106773, 301706, -426434, 774614, 2205954, 3821600, 3981171, 216321, -6124583, -11527404, -16325498, -22727743, -27275820, -23290079, -12265180, -4682950, -6207033, -10325869, -9051041, -4316403, -2893145, -4979178, -4825970, -430354, 3779714, 3858698, 1310018, 206251, 2130998, 5090792, 6305679, 5422239, 4862232, 6761549, 10237989, 12548331, 11778081, 7143093, -961218, -8378840, -7758172, 2768497, 13190576, 11178642, -1395473, -9162591, -3098517]
38528c098517J1060129K688639n453696k743590M044445K805633n727271r811745
38520f235973l266909O967188J0305360N022515j213606j831022R24889O94197
38512A1366639l017796m472625j371011J258355l86133k334215L28095M905839
38504F277148N253500Q95317l903819o913747p729935m288385L274737Q143454
38496A008270M093181m560049p980864m087764J130780M440410O935100O169237
38488G148301j775681j1238445r984868K806358J2520958Q780456p37434l341502
38480D178143P46661K832556J310272J644502L999184K097114m958430r084779
38472B765223m675903K942679M895813N00881l261529k239586J37067l80365j941379
$$ y = [-3098517, 7961612, 10650251, 5196555, 2452965, 6497410, 9303043, 3575772, -6235973, -9502882, -2535694, 7769666, 12792181, 11578575, 9747553, 10672442, 11366639, 8348843, 3876218, 2505207, 3763562, 3377429, 1043214, 1371309, 6277148, 11530648, 12425965, 8522146, 1608399, -6121536, -10409921, -7135184, 1008270, 5101451, 541402, -7439462, -11527226, -10396446, -5956036, 979064, 7148301, 5372620, -5865825, -15850693, -13044335, -523377, 8257079, 7519645, 4178143, 4924804, 7757360, 9067632, 10712134, 14711318, 16808432, 11850002, 2765223, -1910680, 1031999, 5927812, 6428693, 3167164, 927578, 1064645, 684280, -1257099]
38463a257099l34704L041805K836988q00806j336009L140140N237346j92194o521215
38454C814252n101621Q15794J738224k100600k068156K663424L029427l582619
38446g91875p298942j390029O662040O943249J511127j153406K59467M81438k109600
38437C113469l871121k573235N60291M129932P026768P060091L165607k272507
38429A6339295o005555o871535m597642O06690N264492M327228j354403m411521
38421C297049j273642K639809K215051M45682R98944q1414o705137j2272314p463612
38412a8199584M179877R345179L546196l470796k782570K325910L829252P12428
38404e14108j810687o62834K040027K587334j63995l303015k202120L872124R053322
$$ y = [-1257099, -1591803, 1450002, 4286990, 3486184, 2150175, 5290315, 10527661, 10335467, 3814252, -1287369, -471575, 1266649, -833951, -2902107, -238683, 2790744, -791875, -8090817, -9480846, -2818806, 4124443, 5635570, 4482164, 4741631, 5223069, 3113469, -757652, -3330887, -2770596, 1359336, 8386104, 15446195, 18611802, 16339295, 10333740, 3462205, -1135437, -528747, 4735745, 9062973, 7708570, 3297049, 2023407, 4663216, 6878267, 7323949, 8322893, 8241479, 1536342, -10735972, -18199584, -14019707, -4674528, -1128332, -4599128, -7381698, -5055788, -1226536, -514108, -2324795, -2987629, -947602, 1639732, 1475737, -1827278, -4029398, -157274, 8896048]
38395H896048O787666j716528q315929p559680k302307R90795k57677k986453
38387f464065k577642J777561N294220K720202l825194n649075R53901Q055789
38379B85697O270842j864973n887392k810389J12129j714634l839697k284787
38371a1733204q87890l664963o500768l351572L633016P313896O243543N034134
38363c913808N294934L642972l46994j329456L164882O641604J728925q169306
38355F713753j1534272l726762O066941O189265k688762r060148n689139K455510
38347a1273614O728704N782290M010513K949980J90566m119995n506969j447776
38339b686301M451563O615678L586702j417849m235355l102839J64281J781815
$$ y = [8896048, 15683714, 13967186, 5651257, -1908423, -4210730, -3219935, -3477612, -6464065, -9041707, -7264146, -1969926, 750276, -3074918, -8723993, -7770092, 285697, 6556539, 4691566, -1195826, -4006215, -3894086, -5608720, -9448417, -11733204, -12621094, -16286057, -22786825, -26138397, -22505381, -15191485, -8947942, -3913808, 1381126, 5024098, 4677104, 3347648, 6512530, 13154134, 14883059, 6713753, -4820519, -8547281, -2480340, 3708925, 1020163, -8039985, -13729124, -11273614, -4544910, 1237380, 5247893, 8197873, 8388439, 4268444, -1238525, -2686301, 1765262, 8380940, 11967642, 10549793, 6314438, 3211599, 3375880, 5157695]
38331E157695J18414k065308j340892J272585J855097l77320k423142k811000
38323f13871k950602k457732J388943P240101Q354208J781962n893592p163975
38315c14558l882170k662820l335470j56655O415539Q135179J452728n995741
38307c43968n669868O39231M782547L504021M52177p21428k14172K59208j82261
38298B505487j446695k325210j322688N75564m0964l803854o026416k862601K445626
38289a2301751L947395J723025R79932L374893M999870L376009J018852P29470
38281G847695J868304K639901K182952k58084m115380n508211j676806K784092
38273E764463R23800m795807m298773M052148Q868221K556584o603855p233997
$$ y = [5157695, 5276109, 3210801, 1869909, 3142494, 4997591, 4620271, 2197129, -613871, -3564473, -6022205, -4633262, 2606839, 10961047, 12743009, 6849417, -314558, -4196728, -6859548, -10195018, -10351673, -3936134, 4199045, 5651773, -343968, -6013836, -5374605, -592058, 2911963, 3364140, 2642712, 2428540, 2687748, 2505487, 1058792, -1266418, -2589106, -2013542, -2054506, -5858360, -11884776, -14747377, -12301751, -8354356, -6631331, -5651399, -2276506, 2723364, 6099373, 7118225, 7847695, 9715999, 12355900, 14538852, 14280768, 10165388, 4657177, 2980371, 5764463, 6688263, 1892456, -2406317, 1645831, 10514052, 13070636, 6466781, -767216]
38265g67216j671915J66883k399626k111463J549407J652822k576591l488185
38257i645884J645983N688903L605932J17383O78439K501888K04345n107718p834900
38248h145629n483036k49543M260602N244649K392381q75036q14593J171114K98504
38239b200587l828566o066576l467771R65113L821453N378176O239721N056736
38231E897699J954087l23038o27731m59280O4965J956339K635455j605619p311774
38222B181103o227507J636151O129224J962630l520170k793299P68189J059840
38214A196161k03495O14603N26661l270011n049527M36432O607195M290484k523267
38205B625236k837906K800650L805784j476927k952740K971921O402337N16448
$$ y = [-767216, -2439131, -2272248, -4671874, -6783337, -5233930, -3581108, -6157699, -9645884, -7999901, -2310998, 1294934, 1412317, 2090756, 4592644, 4796989, -310729, -8145629, -13628665, -13878208, -9617606, -4372957, -1980576, -2855612, -3670205, -2499091, -2200587, -6029153, -12095729, -15563500, -14598387, -10776934, -5398758, 840963, 5897699, 7851786, 7528748, 6901017, 6441737, 6506702, 8463041, 11098496, 9492877, 2181103, -4046404, -2410253, 3718971, 5681601, 2161431, -631868, 136321, 1196161, 992666, 1607269, 2133930, -1136081, -6185608, -5749176, 858019, 5148503, 2625236, -212670, 2587980, 6393764, 4916837, 1964097, 4936018, 11338355, 11854803]
38197A1854803o889790n883870Q26245L973684J876110k12196o17588k448091
38189B479307n774235o138937j813468K708850K516465j354440l511271j050438
38181a1938167L157892M584282K968300J905653K807406K754802j08415k767158
38173C364595k001680M67354J554839K353120M771245N364817l39961q168276
38165G366053p911029K412627J1739046R219524k467765j1292210j0287618l568634
38157d790006P11461l47833k838452j972965J969796M347828K256314k054668
38149b718525m548867l942820j554893R02165J631718l95000k906611j885052
38141a5417885K178646L816476J205365k78009K457024L726262r11868m599329
$$ y = [11854803, 4965013, -918857, -92612, 3881072, 5757182, 5544986, 4927398, 2479307, -3294928, -9433865, -11247333, -8538483, -6022018, -7376458, -10887729, -11938167, -8780275, -4195993, -1227693, 677960, 3485366, 6240168, 6131753, 3364595, 1362915, 1830269, 3385108, 5738228, 10509473, 15874290, 15534329, 7366053, -544976, 1867651, 13606697, 22826221, 20358456, 9066246, -1221372, -4790006, -4078545, -4426378, -7264830, -9237795, -7267999, -2920171, -663857, -2718525, -7267392, -11210212, -12765105, -11862940, -10231222, -10626222, -13532833, -15417885, -13239239, -9422763, -8217398, -8495407, -6038383, -2312121, -3223989, -7823318]
38133g823318Q24885R506194Q522929j887716q200102m181057J766279K593880
38125A121974K441913M910875M212714l399741r691852o134424K065047M099763
38117c73731Q5153j309157J917100L157418n30612l967708k781775O90813K201637
38108i10862R13412j440228k796006j709891P67103Q90517k792631n907510l899254
38099a6885350N84646J292647j696553j802021L726221R214121Q490581K858469
38091E782761j693767k121997k40603J219045J730998K208003K495099O96551
38083A0076090l974077q035058o236184J236217P130851N878550J246514O31661
38075G954564L643058K673308m847798j1415961r533230j571334M571419N754051
$$ y = [-7823318, -6998433, 2507761, 11030690, 9142974, 942872, -3238185, -1471906, 1121974, 3563887, 8474762, 12687476, 9287735, -404117, -6538541, -4473494, -373731, -288578, -1597735, 319365, 3476783, 2946171, -1021537, -3803312, -3112499, -910862, 2550, -1437678, -4233684, -5943575, -5176472, -4285955, -7078586, -12986096, -16885350, -16300704, -15008057, -16704610, -18506631, -14780410, -5566289, 2924292, 5782761, 4088994, 1966997, 1726394, 2945439, 4676437, 6884440, 9379539, 10076090, 6102013, -1933045, -8169229, -6933012, 197839, 6076389, 7322903, 7954564, 11597622, 14270930, 9423132, -1992829, -11526059, -13097393, -8525974, -2771923]
38067b771923M555335K606604r94895m935916n204451j233232J994753R08025
38059e075700j111314R09781N047644M563686j745556o675382m331562J499231
38051f919172K669138j954034n218939j818097M685743P052823L737460k39904
38043A995018r82476n93097k656210n535069m126150J883520O102192M078473
38035A66201k83732j142436J28417j328772l364862R80404J0187565J3068100
38027A8410885M873246m551635n088086o39262p03231m723879n467046k982391
38019h71399l065041m428401l57683P060437P690209O62390k242811M417731R786698
38010A8652130L740585o515470p394643O11588M964040K88126n278182l107459
$$ y = [-2771923, 1783412, 4390016, 3395121, -1540795, -6745246, -7978478, -5983725, -5075700, -6187014, -5277233, -229589, 4334097, 2588541, -4086841, -8418403, -6919172, -4250034, -6204068, -11423007, -13241104, -8555361, -1502538, 2234922, 1995018, 1012542, 419445, -2236765, -7771834, -11897984, -10014464, -3912272, 166201, -117531, -1259967, -1131550, -2460322, -5825184, -4844780, 5342785, 18410885, 23284131, 18732496, 13644410, 13005148, 12301917, 7578038, 2110992, -871399, -3936440, -8364841, -8722524, -1662087, 6028122, 6690512, 4447701, 8865432, 18652130, 22392715, 15877245, 8482602, 9094190, 14058230, 14346356, 9068174, 5960715]
38002E960715M898245J0331034Q222395J202834l635576j721052L694315M666789
37994C3619699j547945q667440r790212n949976k653238j549815o09192o664j973606
37985H71611n504269o339771k670574K749276O370736O877953M691383J117454
37977H163799k121018m336145o086466o654598l532272L291873R029406R329345
37969G083924N828880L037391J656733q64487m503914o058887m219694j139878
37961H20068J411317L743267N407909M388100R31741o09057L404050J0078473
37953B9575868J1633699M029512p276224j2326705p609414N58476M731063M683056
37945B7999331L672987O39060o796219j3557562j0645396J039629R300189O729015
$$ y = [5960715, 10858960, 21189994, 29412389, 30615223, 26979647, 25258595, 28952910, 33619699, 32071754, 23404314, 13614102, 7664126, 5010888, 3461073, 2851881, 2845217, 871611, -4632658, -10972429, -13643003, -10893727, -4522991, 2354962, 7046345, 8163799, 6042781, 1706636, -4379830, -11034428, -14566700, -11274827, -2245421, 7083924, 12912804, 15950195, 17606928, 16742441, 12238527, 6179640, 1959946, 820068, 2231385, 5974652, 11382561, 15770661, 16702402, 16093345, 19497395, 29575868, 41209567, 45239079, 37962855, 25636150, 18026736, 18585212, 23316275, 27999331, 31672318, 32311378, 25515159, 11957597, 1312201, 2351830, 11652019, 18381034]
37937A8381034N407j763443K64743N91197M13460L373067N684649J148139o758810
37928B1339443q292393k104144L313732L055077J051557M70429j561389o254936
37920A1017376q625243n481882j226221m19392k40731L624776P982195O095112
37912A2725990j286003n818386l067967J649862J489231j979992j461349M740389
37904F991775R214314N445881k519913n096219k83288M037804J731535l661146
37896A5860743n554081l579712j745675j464094j653934k767188n240456o121940
37888a2266337k677633K264016L785146K182735J567085K715940K978889K038411
37880B588252J802317J522547p65309k793518q91869K215484J62574n939046p432377
$$ y = [18381034, 18386441, 16622998, 16887741, 17478938, 17892398, 21265465, 26950114, 28098253, 21339443, 13047050, 10942906, 14256638, 17311715, 18363272, 18833701, 17272312, 11017376, 2392133, -3089749, -4315970, -4735362, -4976093, -1351317, 6630878, 12725990, 11439987, 5621601, 2553634, 4203496, 5692727, 3712735, 2251386, 6991775, 16206089, 21651970, 19132057, 14035838, 13752550, 17790354, 19521889, 15860743, 10306662, 6726950, 4981275, 3517181, 1863247, -903941, -6144397, -12266337, -14943970, -12679954, -8894808, -6712073, -5144988, -2429048, 549841, 2588252, 4390569, 5913116, 5147807, 2354289, 1462420, 3677904, 3840478, -2098568, -9530945]
37871i530945j272687M958400M829194K174069L228329O103695M721256q65787
37863A4345524m604875k940797J871507N728909O226099L495677L46985K4243
37855B4493272J751442R85207l757008p740008o759175l423142k470480l034167
37847D5941r82478L106146M435795J951314l00969n86832k144909n883906o212557
37838f572455P34433Q537120P159381k483051q057808k559365N279075L363808
37830E401138n724254q133718P38553R298932O717537k257875o104874l107970
37822c172531k37847R3248J896540N486434N431396j255n540336p101480o157103
37813i302934m033523O80650O237705O764390J334387k715426l87313L229553
$$ y = [-9530945, -10803632, -5845232, -1016038, 1158031, 4386360, 10490055, 15211311, 14345524, 9740649, 6799852, 8671359, 14400268, 20626367, 24122044, 24469029, 24493272, 26244714, 27229921, 23472913, 15732905, 8973730, 5550588, 3080108, 45941, -936537, 2169609, 6605404, 8556718, 8255749, 7668917, 5524008, -359898, -6572455, -5838022, 2699098, 9858479, 7375428, -682380, -3241745, 2037330, 5401138, -323116, -8456834, -7718281, 1580651, 8298188, 6040313, -64561, -3172531, -3410378, -3317130, -1420590, 4065844, 9497240, 9495985, 3955649, -3145831, -9302934, -13336457, -12655807, -6418102, 346288, 1680675, -1034751, -1422064, 1807489]
37805A807489J458742l280010m028748l33916K464733K229369J242616J56287
37797A716562k304262m246253j959448L162936N142668K100070j028011k51485
37789B332777K007507J807272k75295j376084j325019j572370j427816M36545
37781F07517K010514J46283l197786k027586M282993P594319J636264p449020
37773C603498p990712Q12450P431687M820889P8871J842960N828544K298688o774448
37764A1952427r647890l243785K136013n27613m385077r52969N644367N277080
37756F252553k338207p396683m104297K523101M602982P33739m089850m643634
37748h460296k83128M786538N584702J274551m509869q000482p890541l898395
$$ y = [1807489, 3266231, -13779, -4042527, -4376443, -1911710, 317659, 1560275, 1716562, -587700, -4833953, -6793401, -3630465, 1512203, 3612273, 2584262, 2332777, 4340284, 6147556, 5872261, 4496177, 3171158, 1598788, 170972, 607517, 2618031, 2764314, -433472, -2461058, 1821935, 9416254, 11052518, 3603498, -4387214, -3574764, 3856923, 8677812, 8756683, 10599643, 16428187, 18726875, 11952427, 2304537, -939248, 1196765, 669152, -3715925, -4668894, 975473, 6252553, 3914346, -3482337, -7586634, -5063533, -460551, 273188, -3816662, -8460296, -8743424, -3956886, 1627816, 2902367, -1607502, -9607984, -17498525, -21396920]
37740b1396920L352783R885622J0208798M170147j796113k945465j729777j914002
37732b164927j865262J444119N530374N393799J259519k170536k738973k063987
37724B624126j092373N18168J540618N50292o77977K41088J450756m29831l886442
37715H38425m345865j579191P08386K010836M820943P226394L764494m388046
37707I056376q257315l899168J298916N30089j485074K729645R211348P267408
37699A6452225l456521j0843992o896431K113963N692584K358490k180849m580452
37691a340983n062936k502324M092583R800188O961922l761307j1526617q096823
37683a1436297K029400Q427090P739763M427787J398147k976577q525658j0805874
$$ y = [-21396920, -18044137, -8158515, 2050283, 6220430, 4424317, 1478852, -250925, -2164927, -4030189, -2586070, 2944304, 8338103, 9597622, 7427086, 4688113, 2624126, 1531753, 2049921, 3590539, 4140831, 3462854, 3703942, 5154698, 4724867, 838425, -3507440, -5086631, -4378245, -2367409, 2453534, 9679928, 13444422, 9056376, 799061, -3100107, -1801191, -1271102, -2756176, -26531, 9184817, 16452225, 12995704, 2151712, -4744719, -2630756, 3061828, 5420318, 3239469, -1340983, -6403919, -8906243, -4813660, 4986528, 11948450, 8187143, -3339474, -11436297, -9406897, -979807, 6759956, 11187743, 12585890, 9609313, 1083655, -9722219]
37675i722219p313463j298687L083207N298707N850639L694674n11326k715789
37667c634257j000537Q46857l08163p59554L932384R399503O587971m672190j3452470
37658c060456j1182023j600564N633298O512607M032344J431606j166379m212679
37650c612246o367292n387371l63230O547917J0349495P052689j272360o961387
37642a3785m430458L371725Q140553N472114r63158m558546l060775L87276K150145
37633F495091J988019J748958K010975J819259J164372J422447K714028K987353
37625B2350502J183782o18627m39290j52063k803990o847815o976005j701548
37617C994946L455569K732059k354262n204469k581456K227732M399832K719464
$$ y = [-9722219, -17035682, -18334369, -15251162, -9952455, -4101816, -407142, -918468, -3634257, -4634794, -3787937, -4096100, -4855654, -923270, 8476233, 15064204, 10392014, -3060456, -14242479, -15843043, -10209745, -3697138, 335206, 1766812, 600433, -3612246, -9979538, -15366909, -15730139, -9182222, 1167273, 8219962, 6947602, -13785, -4444243, -1072518, 7068035, 12540149, 11576991, 7018445, 3957670, 4344946, 6495091, 8483110, 10232068, 12243043, 14062302, 15226674, 16649121, 19363149, 22350502, 23534284, 22915657, 22476367, 22324304, 19520314, 12672499, 5696494, 3994946, 7450515, 10182574, 7828312, 2623843, 42387, 2270119, 6669951, 9389415]
37609I389415r35143m489355o259022m604896K62494M621172M158219n73584l738798
37600b169498r15956N157871P640853L732368k641202o359854o531787n049809
37592g137014k430477J770504N480780M920537p1586m573022m484604j534516
37584h059398L24958J277530M055493P058503N066653j644321n187976j240247
37576A651195L272187K07773o404697n938104J889163O194657K081862k408553
37568E45483n26428K650988P82484k087523K83318M055480K012426l041195l148593
37559A526440O16617J070560q92740J631067O610045M639400l602630o345511
37551E253248l57556L415430p53873l457295K082652O702511J196645o630854
$$ y = [9389415, 8454272, 3964917, -2294105, -6899001, -6636507, -2015335, 2142884, 1569300, -2169498, -3085454, 2072417, 9713270, 13445638, 10804436, 4444582, -2087205, -7137014, -9567491, -7796987, -2316207, 2604330, 2532744, -2040278, -6524882, -8059398, -7734440, -6456910, -2401417, 4657086, 9723739, 8079418, 2891442, 1651195, 4923382, 5131155, -1273542, -7211646, -5322483, 872174, 2954036, 545483, 19055, 2670043, 3452527, 1365004, 1648322, 5703802, 7716228, 4675033, 1526440, 2143057, 3213617, 2320877, 3951944, 10561989, 15201389, 11598759, 5253248, 4895692, 8311122, 7557249, 4099954, 6182606, 12885117, 14081762, 7450908]
37543G450908m448233M252511O630269P13354m949893o749828p047917l884845
37535h033674N437164J2848688P110308p009536j2228990l375013O065956N631928
37527F446831J591390K546063M605239N79816n738448n380610J247921N274386
37519A1172588K092234m226455p613348n568755N21449O331144P126479K460045
37511A2295381k974918m828059l126510J3912K874041L110365q76549n428495
37503A059168l780730M157932R474248N795995j801592m500519k047500j199881
37495G157121m527777p152661m234388K966636Q768486Q259642J759163m147139
37487H849083k588751M368994O457033j105029r278915o750057L894810R853513
$$ y = [7450908, 3002675, 7255186, 13885455, 14598809, 9648916, 2899088, -4148829, -8033674, -2596510, 10252178, 17362486, 10352950, -1876040, -5251053, 814903, 6446831, 8038221, 10584284, 15189523, 15769339, 10030891, 4650281, 5898202, 11172588, 13264822, 9038367, 1425019, -4143736, -3622287, 2708857, 9835336, 12295381, 9320463, 4492404, 1365894, 1379806, 4253847, 7364212, 6487663, 1059168, -2721562, 1436370, 10910618, 16706613, 14905021, 10404502, 8357002, 7157121, 2629344, -4523317, -8757705, -5791069, 2977417, 11237059, 12996222, 8849083, 6260332, 10629326, 17086359, 15981330, 6702415, -47642, 3847168, 13700681]
37479A3700681O379578J605546J707395J542638m499121j0988923r552800k933307
37471c038313m47426j850401K198608J1963813J3675815j45073j5735501j4714222
37463h092700N11168J0864246P377442j58889j955898q17893j226286L6492L949801
37454A0487483K418199p464058j3025852l636118R816808R176148k940536p417180
37446b585106J094102P359115J454653o911810o430939o09087K552187L823206
37438b53679N839233M464528k239137o155013j333871M360640J450508m744371
37430A388838k767761N369331P113241m93893o850115m341166K467444O052960
37422G938879N157624K379136k74659j224653p8646M94429j773278m046140k340688
$$ y = [13700681, 20080259, 21685805, 23393200, 24935838, 20436717, 9447794, -105006, -3038313, -3485739, -5336140, -3137532, 8826281, 22502096, 22357023, 6621522, -8092700, -7581532, 3282714, 10660156, 10501267, 8545369, 7727476, 6501190, 6537682, 10487483, 12905682, 5441624, -7584228, -11220346, -1403538, 7772610, 4832074, -2585106, -1491004, 5868111, 7322764, 410954, -6019985, -6629072, -4076885, -253679, 5585554, 10050082, 7810945, 1655932, 322061, 4682701, 6133209, 1388838, -1378923, 3990408, 11103649, 10609756, 3759641, -581525, 1885919, 7938879, 13096503, 15475639, 15200980, 13976327, 13897681, 14392110, 12618832, 8572692, 6232004]
37413F232004J150311R40515k592107l890047j723275o95555k564999l213730
37405f356883o8047L697419M594442L228891J239867j459310m393297n570436
37397e087354m564655l140287j867158L89522L088617L812082J892734j068634
37389f545133l848112n072058j632211O874588J3242419R240886k283541r040814
37381I36024n014463K203962K862939k321282n329283k184804L388173N252814
37373b05920Q68554o126088q270104k142734N872175O219837q00760m673655N13708
37364h744987P522070O643186o87545n044166k361821K156505K393821j405461
37356D71602m090218j755309L590302N142098p38122p789563n994294M000806
$$ y = [6232004, 7382315, 8322830, 5730723, 1840676, 117401, -578154, -3143153, -6356883, -6424930, -2727511, 1866931, 5095822, 6335689, 4876379, 483082, -5087354, -9652009, -12792296, -14659454, -14269932, -11181315, -7369233, -5476499, -6545133, -10393245, -15465303, -17097514, -10222926, 3019493, 12260379, 9976838, 936024, -4078439, -1874477, 988462, -1332820, -6662103, -8846907, -5458734, -205920, 662634, -5463454, -13733558, -15876292, -10004117, -3784280, -4585040, -9258695, -8744987, -1222917, 5420269, 4732724, -311442, -2673263, -516758, 1877063, 471602, -3618616, -5373925, -1783623, 3358475, 2620353, -5169210, -11163504, -7162698]
37348g162698R231657J723756r103553r070280M59146N257755r0271m806002M49694
37339a3110796Q902099Q252064o97456n792583j711223L449876J632152l530947
37331b606814l658937J461142M867037L666099J916078K409918K623644O72508
37323A1350675r47163n24793m00792j524101n73979K850593K470234m511484r504540
37314a315350m120371M921471M257600m719884o529116M401690J4044308R201907
37306B0142255l739567r205957l431976M203674N342721m25445q791869j3333085
37298i239249q571625K523302P997535J120094r058496r464255j022336M925735
37290b0789295M828161N540233R335918R046609J274752o474387o931650k725942
$$ y = [-7162698, 2068959, 3792715, -5310838, -14381118, -13921972, -8664217, -8754488, -13560490, -13110796, -4208697, 4043367, 3345911, -2446672, -4157895, -708019, 924133, -2606814, -6265751, -4804609, 62428, 3728527, 5644605, 8054523, 10678167, 11350675, 10403512, 9878719, 9477927, 7953826, 7379847, 10230440, 12700674, 8189190, -1315350, -5435721, -514250, 3743350, -976534, -7505650, -3103960, 10940348, 20142255, 16402688, 7196731, 3764755, 7968429, 13311150, 12885705, 4093836, -9239249, -17810874, -15287572, -7290037, -6169943, -15228439, -24692694, -25715030, -20789295, -15961134, -10420901, -1084983, 7961626, 9236378, 2761991, -4169659, -6895601]
37282f895601L06382J869579L636194L785900J463573R28459M616063P158488
37274A6869037L534403j358852K44716N455166L932760n877098j3385093j0927734
37266a512695l670754k42064o01985N32023L049544J956508k947101n190372r48670
37257i575566N126202O315684K573960o54677m64492M78329j057248l928727m230929
37248e417464n99232L555928L463726j333577n227947k126118O444534J1163298
37240I923148N510938n234949r753042m853749J354533J540501j704878k367807
37232e585305q39861r39075j203686K528201P371243N525333k491425o095456
37224a730031m26717M738581o68317j0332121r535410K958647J2287649Q148155
$$ y = [-6895601, -6589219, -4719640, -1083446, 2702454, 4166027, 5094486, 9710549, 16869037, 20403440, 19044588, 19289304, 24744470, 28677230, 22800132, 9415039, -1512695, -5183449, -5425513, -6027498, -5495475, -2445931, -489423, -3436524, -8626896, -9575566, -4449364, 1866320, 4440280, 3785603, 3321111, 3799440, 2742192, -1186535, -5417464, -6016696, -2460768, 1002958, -330619, -5558566, -7684684, -1240150, 9923148, 15434086, 10199137, 446095, -4407654, -3053121, -1512620, -3217498, -5585305, -6425166, -7364241, -8567927, -6039726, 1331517, 6856850, 4365425, -1730031, -2156748, 2581833, 1913516, -8418605, -17954015, -14995368, -2707719, 5440436]
37216E440436k216647o315458l193453o49925j538236j894376l57212l43944k226015
37207a3294830j410565L203264N772294K534196j443710K15648N280289O636094
37199G492680L041880n46685j953383l819627o234500m653053K028378P344533
37191B700223N480908n79547l665699k103193J9959K18747O057M01841k4724j620288
37181H34284k026453J63960K895857L667778K940768K470283J832270q55575n315138
37172F608034q641698q688536n883548j354694M124822Q098888O642760j6962
37164H89066m611493p30236P263414Q405733Q5735p990336p488089j926100J283143
37155d819163K057584L646368L668685j332637o699107n471565m41841O72560
$$ y = [5440436, 3223789, -3091669, -6285122, -6935047, -8473283, -10367659, -10724871, -11068815, -13294830, -14705395, -11502131, -5729837, -3195641, -4639351, -4423703, 856586, 7492680, 10534560, 9987875, 8034492, 4214865, -2019635, -6672688, -4644310, 2700223, 8181131, 7601584, 3935885, 1832692, 1852651, 2071398, 2077455, 2479296, 2454572, 834284, -1192169, -1028209, 1867648, 5535426, 8476194, 10946477, 12778747, 11923172, 6608034, -2033664, -10722200, -16605748, -17960442, -13835620, -5736732, 906028, 889066, -3722427, -4452663, 2810751, 11216484, 11302219, 3311883, -4176206, -6102306, -4819163, -2761579, 884789, 4553474, 3220837, -3478270, -8949835, -9391676, -8719116]
37147h719116m19932L987671J0949533Q805024k372047q197172k595385K991650
37139D430226K53134k323067L148541Q262529L583306l781075l268925J66309
37131A0470978k943915p106129k259706N154019K407659m824857q08727J0907787
37123A0997109J0824416l629056j2904535o905803J445426P83522k388443q04593
37115b581957K11823k979611k640110M671837Q865542L559421k667917k382500
37107D056528j134549l209214j968914M792393O839663M12531k397621M767012
37099A2157829J0382823P074241M563883O799806J473102j0296741m146915K3324929
37091E1332957L5414650J6288839J4041471O8156239J22433027Q3740394l7844396
$$ y = [-8719116, -9139048, -5151377, 5798156, 14603180, 12231133, 4033961, 1438576, 4430226, 4683360, 2360293, 5508834, 13771363, 17354669, 13573594, 10304669, 10470978, 7527063, 420934, -1838772, 3315247, 5722906, 898049, 89322, 10997109, 21821525, 18192469, 5287934, -1617869, -172443, 611079, -1777364, -2581957, -2370134, -5349745, -7989855, -3318018, 5547524, 9106945, 6439028, 4056528, 2921979, -287235, -2256149, 2536244, 9375907, 9788438, 7390817, 12157829, 22540652, 29614893, 34178776, 40978582, 42451684, 32154943, 28008028, 51332957, 86747607, 103036446, 117077917, 185234156, 307667183, 391407577, 353563181]
37084C53563181j24975460j05414794l6697854o902531j7835504j8026155M68656
37077D4179539M265321j0236606j2685413K643774Q737869l099318j0282834k189998
37069B1332334L636576l146811q747673l879790O39447k223397k895789K653780
37061G368677K587327p028736j0985270p77979R044289M925128l810232k841546
37053a518342L433960K985894j982797j582968K813216K646696j475073k358572
37045B962014j72194m98424k572037j744269l4806k276261m749014J11497R114696
37036A41202J0464199J167696q392899r300076m215273K45145K890205N137749
37028a862052N173161Q88776m332316m161975K500696R292343R319541K651106
$$ y = [353563181, 228587721, 123172927, 86475073, 79572542, 61737038, 43710883, 44179539, 48444860, 38208254, 25522841, 28166615, 36904484, 33805166, 23522332, 21332334, 24968910, 21822099, 13074426, 9194636, 9834083, 7610686, 4714897, 7368677, 9956004, 2927268, -8058002, -8835981, 208308, 5133436, 1323204, -1518342, 1915618, 4901512, 2918715, 1335747, 4148963, 6795659, 5320586, 2962014, 2789820, 2291396, -280641, -2024910, -2059716, -4335977, -9084991, -8973494, 141202, 10605401, 11773097, 3380198, -5919878, -10135151, -9890006, -6999801, -1862052, 3311109, 4199885, -132431, -4294406, -1793710, 7498633, 16818174, 19469280]
37020A9469280m397113o648589m789747k395997p88840J023166L127533M394033
37012H993726M394069K954453q55377o192374q691897n432425j79262J197005
37004c812082o25349P4821M526549P584956N660594O34094m537919q195366p808633
36995f498335k097145M171469M520045N25324l20641L016202L915869N88539o59564
36986G161763K373143L303085n57847k764659n96856j341900p494809q183671
36978h101751K915136J2481889N619863r397837j1938358J63254R054546N242613
36970F039355r94016J68494L503873J429180k530746k104214M0596j660334n113810
36961a221622m694245p66852K392640L988920N272869M434057m05506n828654
$$ y = [19469280, 15072167, 8423578, 3633831, 1237834, 448994, 1472160, 4599693, 8993726, 13387795, 16342248, 15486871, 9294497, 602600, -4829825, -5009087, -3812082, -4437431, -4362610, 163939, 7748895, 13409489, 14043583, 9505664, 1310298, -6498335, -8595480, -4424011, 96034, 621358, 300717, 3316919, 7232788, 7821327, 7161763, 9534906, 12837991, 12280144, 9515485, 8918629, 7576729, 81920, -8101751, -5186615, 7295274, 12915137, 3517300, -8421058, -8257804, 796742, 6039355, 5045339, 5213833, 8717706, 10146886, 7616140, 5511926, 5552522, 3892188, -1221622, -5915867, -6682719, -4290079, -301159, 4971710, 9405767, 9000261, 3171607]
36953C171607o945418m522677k667948j449586J975855N978016N002186j385067
36945h43032n869847k765874L909458N472637k12005o318049n803607O21515O649883
36936e158921Q060669N580671J387808l398378p053639o799252k397568K231255
36928g547355L476785K244419J510918J949206K614861L530759M325060K739639
36920A4844292j611388m405619k226480J167502j68028m696406n332505n79041
36912c007673L373499K472259l95949k165410l888400n391345k971970L099021
36904h875968N500301J47971o079655m710001J819501M727439K532646J311414
36896c626352K801769J789599l256358n714033r27711N793763O430925J236637
$$ y = [3171607, -3773811, -8296488, -10964436, -12414022, -10438167, -4460151, 542035, -843032, -6712879, -9478753, -5569295, -96658, -308663, -6626712, -12430319, -11808804, -5158921, 2901748, 8482419, 9870227, 6471849, -581790, -7381042, -9778610, -7547355, -4070570, -1826151, -315233, 1633973, 4248834, 7779593, 12104653, 14844292, 13232904, 8827285, 6600805, 7768307, 7600279, 2903873, -2428632, -3007673, 365826, 2838085, 2442136, 276726, -3611674, -9003019, -11974989, -8875968, -3375667, -3227696, -9307351, -14017352, -12197851, -7470412, -4937766, -3626352, -824583, 965016, -2291342, -8005375, -8933086, -3139323, 3291602, 4528239]
36888D528239k702050j441673J979939K773416j38036l857176m673493j748114
36880e278948J624704J940420Q90391L287301Q230969P714654j575071j0227744
36872F606676p384646L012480O711877m08181o911596l829426K323780J231115
36864A352079n027758o716917j922065K637230L228307J856335q83274n827061
36856a1303124q504070k645208Q025548J1426077L830982m084978k470369M567313
36848a157829O877088K635256j897918k470149m73323Q33911n82221l810102m218095
36839d263382J450632P797144N299081n102933j0288929k988875P019908P219174
36831F141820J4931l394384m43767K441992K593444K795190K587175j138741n851945
$$ y = [4528239, 1826189, 384516, 2364455, 5137871, 4999835, 1142659, -3530834, -5278948, -3654244, -1713824, -823433, 2463868, 10694837, 18409491, 16834420, 6606676, -777970, 2234510, 8946387, 8538206, 1626610, -2202816, 120964, 1352079, -3675679, -10392596, -12314661, -9677431, -6449124, -4592789, -5476063, -11303124, -19807194, -22452402, -14426854, -3000777, 830205, -3254773, -5725142, -1157829, 5719259, 8354515, 6456597, 3986448, 3513125, 4347036, 3764815, -45287, -4263382, -2812750, 4984394, 10283475, 5180542, -5108387, -8097262, -1077354, 6141820, 6156751, 2762367, 2318600, 4760592, 7354036, 10149226, 12736401, 11597660, 5745715]
36822E745715n899765k697825k443842m256871j451166M897756N415370j806753
36814b497381o250050q34452P009370O823550J17162l701098j427979J504185
36806G43307O81965j541490o36582L267907N170267J912170k470911j529171L184609
36797H782071K501299o142299j2109380o333804M021656O005466P47463k27623
36789b755151M227117L255386n553870r780967j858672Q217894P957299o3602
36781C645434m385990j039215M335532N720637J882944l936983n967753j821054
36773a566448K427825m28197o289041m269401N343570R744921L461724l620314
36765D804639l474821j437584k826343j998909M750644Q245518J124923p438375
$$ y = [5745715, -154050, -2851875, -5295717, -9552588, -11003754, -6105998, -690628, -2497381, -8747431, -9581883, -2572513, 4251037, 4368199, 667101, -760878, 743307, 1425272, -116218, -752800, 2515107, 7685374, 9597544, 7126633, 5597462, 8782071, 11283370, 5141071, -6968309, -13302113, -9280457, -3274991, -2527528, -2755151, 1471966, 4727352, -826518, -10607485, -12466157, -4248263, 3709036, 3645434, -740556, -1779771, 2555761, 8276398, 10159342, 6222359, 254606, -1566448, 861377, 433180, -5855861, -10125262, -4781692, 4963229, 8424953, 4804639, 1329818, -107766, -2934109, -4933018, -182374, 8063144, 9188067, 1749692]
36757A749692n463476K791816N763663L932957M775376N790803l80988q830006
36749A0129837p747065J475580N918415J809149k087660j367742q88930k159850
36741E081734p60869K192511L84205m172697k392024M833006N805512k146637
36733H824741p126912k290384L618257K402203n83588J678075M930240K474618
36725A3927250k700495m271602l035851k268522l38760L449423L360298l147228
36717D974513p545438k258931N684994M409631l901080o135045J420188P910890
36709D559722M484349m100154q009790n078881m69480J729973J833233J329586
36701c721442K42681j574893k459691l69265L411655M337789L33445m669988n861759
$$ y = [1749692, -3713784, -921968, 4841695, 8774652, 13550028, 19340831, 18959843, 10129837, 2382772, 3858352, 9776767, 11585916, 9498256, 8130514, 7241584, 5081734, 4320865, 6513376, 6897581, 2724884, 332860, 5165866, 10971378, 8824741, 1697829, -592555, 3025702, 5427905, 4844317, 6522392, 11452632, 13927250, 11226755, 6955153, 3919302, 1650780, 1312020, 4761443, 8121741, 4974513, -2570925, -4829856, 855138, 5264769, 1363689, -4771356, -3351168, 4559722, 9044071, 4943917, -3065873, -8144754, -8614234, -6884261, -5051028, -3721442, -3478761, -5053654, -7513345, -7882610, -4470955, -133166, 200279, -4469709, -10331468]
36692a0331468l929483k323260r20306J739429K559863j644504n370125m00352
36684b0620206Q985756Q808347l071179j0853454l430148Q664236R547319J577634
36676c91695j013892L952445M596555m001768j1406690q122860J007833N511187
36668i868885L476822O20740K79814R52292J518659K885170M117657J677913m908653
36659G51529r408286n287757M322097Q363252K355517m407282k206743L740526
36651a777147J449112p017648o813573N366762J3397352N955678n136116l183175
36643B241245P588347J0117991J421356n901502o014291n730860p271621l024889
36635f574224P536187J1980987M170243m381298k443858L485782J659397m868052
$$ y = [-10331468, -14260951, -16584211, -17504517, -15765088, -13205225, -14849729, -20219854, -20620206, -11634450, -2826103, -5897282, -16750736, -20180884, -11516648, -1969329, -391695, -1405587, 2546858, 7143413, 3141645, -8265045, -16387905, -15380072, -9868885, -6392063, -5771323, -5491509, -4539217, -3020558, -135388, 3982269, 5660182, 751529, -8656757, -13944514, -9622417, -1259165, 1096352, -3310930, -5517673, -1777147, -328035, -7345683, -14159256, -8792494, 4604858, 10560536, 5424420, 2241245, 9829592, 19947583, 21368939, 15467437, 9453146, 3722286, -3549335, -6574224, 961963, 12942950, 17113193, 12731895, 10288037, 13773819, 15433216, 10565164]
36627A0565164m950209N37931J031979m142823m556270K114833N198800k13485
36619E585920m014243J422297O901151J089785r516912r464980J369607P377269
36611G49894J107788o799878n572688M84625K009392k86328l7910K245067J577586
36602d522452p90310L78343L455528J878522l262781l119122M263111Q959196
36594G240035L418872o045711p929559m86128P769184R260963M114265k365930
36586A4975991n191196l613423j345615j491909j427476L445383J0613596J1037830
36578B7003181J438032r565582j1795937n717956K85545J380876q7040m69802
36570B471317N94115J453356J317384J185187K321699L462044J113163m870270
$$ y = [10565164, 5614955, 6152886, 7184865, 3042042, -1514228, 600605, 5799405, 5585920, 1571677, 2993974, 9895125, 10984910, 1467998, -7996982, -6627375, 749894, 1857682, -4942196, -10514884, -10030259, -8020867, -8307195, -8345105, -6100038, -4522452, -5312762, -4934419, -1478891, 399631, -2863150, -5982272, -1719161, 7240035, 10658907, 4613196, -3316363, -3802491, 3966693, 13227656, 17341921, 14975991, 9784795, 6171372, 4825757, 3333848, 1906372, 5351755, 15965351, 27003181, 28441213, 18875631, 7079694, 1361738, 1647283, 3028159, 2941119, 2471317, 3065432, 4518788, 5836172, 7021359, 9343058, 12805102, 13918265, 9047995]
36562I047995q476955n244361k96585j185422m558920o01033Q791161R567391
36554G043271k137725j1052223n144674N502081M816392m229824o232825J281840
36546a0153687O085112K777464n33336J254710K103743k236885n758359k906164
36538i367402K013071K721521O12251L3143M4410k459919n464346l886913K786967
36529a2967217R217560R981968M674798j839185l745184l12980K918361J056723
36521H984844l671374n696113m257661k866672k187945L47506L943945L815291
36513a588179j334335o260530n551179L45510O416978P772960L401680k189528
36505A013377k710463J799663L913520l18914m438481j745674K990725J013714
$$ y = [9047995, 571040, -4673321, -4969906, -6155328, -10714248, -11315281, -2524120, 7043271, 4905546, -6146677, -11291351, -5789270, -972878, -5202702, -11435527, -10153687, -4068575, -1291111, -1824447, -569737, 1534006, -702879, -6461238, -9367402, -7354331, -4632810, -4020559, -3987416, -3943006, -6402925, -11867271, -15754184, -12967217, -3749657, 6232311, 10907109, 9067924, 5322740, 5009760, 7928121, 8984844, 5313470, -382643, -4640304, -7506976, -9694921, -9347415, -5403470, -1588179, -2922514, -9183044, -14734223, -14388713, -7971735, -198775, 3202905, 1013377, -1697086, 102577, 4016097, 3697183, -741298, -2486972, 503753, 1517467]
36497A517467n495925o963197k426608n0636k366632l275519m94941J178012N50623
36488a7827356J743716L474622p3738n147518l51497J2311221J4615530q43793
36480G901187j6136877j2735033K235806Q858674L173621k888469l087649j753742
36472a4432482p46784K725378O180440L779448j323792O05220R288895J2147634
36464A8223957K357083j0651223j3790562o279404K158377M291406J613076m50113
36456b527403J37241M11162k241583m935963k868770K349074L569338j043730
36448g150634m592275k235627J525613J193968j082073j285325j024564k082078
36440a6732995l84226O113696J0143486N508039j253694m93713M569470L655613
$$ y = [1517467, -3978458, -10941655, -13368263, -13418899, -15785531, -19061050, -19555991, -18377979, -17827356, -16083640, -12609018, -12682756, -17830274, -18181771, -5870550, 8744980, 7901187, -8235690, -20970723, -18734917, -9876243, -6702622, -9591091, -12678740, -14432482, -15179266, -12453888, -6273448, -2494000, -3817792, -3212572, 6076323, 18223957, 20581040, 9929817, -3860745, -10140149, -7981772, -3690366, -2077290, -2527403, -2390162, -1979000, -4220583, -9156546, -12025316, -9676242, -6106904, -7150634, -11742909, -13978536, -12452923, -11258955, -12341028, -13626353, -14650917, -16732995, -17117221, -11003525, -860039, 4648000, 3394306, 2900593, 7470063, 11125676]
36432A1125676k985466n996735l368922j914071l338116k279821J591567K560570
36424d605318P24106K032154N425718L206987l973614o215593j187996K094049
36416b499507j47931o76792L116379L063115l349157n644922J329724O351000
36408A541909M50958o878831l674674M035910L252390l685833m406827K093522
36400g271476N864600M015651K555491K477875p43055m725154k209926M122068
36392D086074L546956m265149p174479l55213N799040K935099k827641k780097
36384a035410J011083K264054J315032J017434n61421m790509o254979p00704
36376g735420N956068N426135k28572k632349o78267m81968l266615l254472J302759
$$ y = [11125676, 8140210, 2143475, -1225447, -3139518, -6477634, -8757455, -7165888, -4605318, -3881212, -1849058, 3576660, 6783647, 2810033, -3405560, -4593556, -2499507, -2647438, -3324230, -207851, 2855264, -493893, -6138815, -4809091, 1541909, 1992867, -4885964, -8560638, -4524728, -1272338, -4958171, -9364998, -7271476, -1406876, 2608775, 5164266, 7642141, 6899086, 2173932, -35994, 4086074, 7633030, 3367881, -3806598, -4161811, 1637229, 4572328, 1744687, -1035410, -24327, 2239727, 3554759, 4572193, 4010772, -779737, -7034716, -7735420, -1779352, 3646783, 3418211, 785862, 107595, -374373, -3640988, -6895460, -5592701]
36367e592701L968611K74149m775248l681455L291434Q766971O862176j356996
36359G756941r274206j0268393l868397K973719L262124j219428k228628L012273
36351i853995P287824L772606l705283n858615o54548M969323N327385K277411
36343C562108L63745N60734J134542J213024P47878q12120l226162m295946k228498
36334b980695J733747M658184M956735K885271m81846l200875l053118l42041
36326D175362J330332m15253k760066j434866K391807L073936j127681m944516
36318B89055l657178j32374m50916m520102n828717q61153N587100O690890K225067
36309f58328k128070k393011J93284K593255L185382J274395k717182n228522
$$ y = [-5592701, -1624090, -1349941, -6125189, -9806644, -6515210, 2251761, 9113937, 7756941, -1517265, -11785658, -15654055, -12680336, -9418212, -10637640, -12866268, -9853995, -2566171, 1206435, -2498848, -8357463, -9012011, -4042688, 1284697, 3562108, 3925853, 4486587, 5621129, 6834153, 7582031, 6769911, 3543749, -752197, -2980695, -1246948, 3411236, 8367971, 11253242, 10771396, 7570521, 4517403, 4175362, 5505694, 5090441, 2330375, 895509, 3287316, 6361252, 5233571, 289055, -3368123, -3500497, -3951413, -8471515, -14300232, -15161385, -9574285, -2883395, -658328, -2786398, -5179409, -4986125, -2392870, 792512, 2066907, -650275, -5878797]
36301e878797j747814O347293J0806448O131898k818169p278927n843835l691962
36293c973865k826481l69704L787447N492297M049175M004171O499596O009109
36285B2671745l89261p036293p696157l751772L16843L612226N638983K939969
36277A6306283m222843p897976l268307K085935q76912p464471o309339J758392
36269i889238M967022J92401k358461L102647Q139025L929966m974000p969030
36261d859668k780128L976002N947376J856789m761136p164197j350006O858790
36253b276178O505361l405776j0241149m191209P945868J2163350N657888j909753
36245A0248402l097234p91156j150979m460528n749233k112732L087387M030978
$$ y = [-5878797, -7626611, -1279318, 9527130, 15659028, 12840859, 5561932, -281903, -3973865, -6800346, -7170050, -3382603, 2109694, 6158869, 10163040, 16662636, 22671745, 22282484, 15246191, 7550034, 3798262, 4115105, 7727331, 13366314, 16306283, 12083440, 4185464, 917157, 3003092, 2126180, -5338291, -11647630, -9889238, -4922216, -4729815, -7088276, -3985629, 4153396, 8083362, 3109362, -4859668, -7639796, -3663794, 2283582, 4140371, -620765, -7784962, -9134968, -2276178, 4229183, 823407, -9417742, -13608951, -5663083, 6500267, 12158155, 10248402, 7151168, 6360012, 5209033, 748505, -5000728, -7113460, -4026073, 4905]
36237D905r1133l629152k016553K087969L582855K719326K702299K251829j999826
36228E612519p079100o240161j85699K982205J32038l303819l516707k822473
36220a4421197k055327J561239O202117N499556J52229j452634K150990K606740
36212B43713j933385j770945O008854R411066J840327m737624j38076N264366
36204A4188296j274022j0947119p608398L975297N947680k887785p535714l581997
36196i723762r85825k109574J369349Q069777O020391l783242n158360N392339
36188i08907J0429329O71670q577327k996525P421235O461412k082285l857126
36180F561476J572113L515897m3141k183522j827680l644572o174956l677571
$$ y = [4905, -86228, -3715380, -5731933, -3643964, -61109, 2658217, 5360516, 7612345, 5612519, -1466581, -7706742, -7892441, -4910236, -4778198, -8082017, -11598724, -14421197, -16476524, -14915285, -8713168, -3213612, -3061383, -4514017, -2363027, 243713, -1689672, -3460617, 2548237, 11959303, 13799630, 9062006, 8923930, 14188296, 12914274, 1967155, -5641243, -1665946, 4281734, 1393949, -6141765, -9723762, -10709587, -12819161, -11449812, -3380035, 2640356, -1142886, -6301246, -908907, 9520422, 10192092, 1614765, -1381760, 6039475, 12500887, 10418602, 6561476, 8133589, 11649486, 11606345, 9422823, 7595143, 3950571, -2224385, -5901956]
36172e901956J966588L309032M4311j231536J182156K821593K541910L125977
36164G858075L053261k022150r112393r323101j355437N515600M855483J400542
36156H69880K120605N732910O086495J534056l915365o490694n991922m268362
36148d322397k857272j927375n02145K089527M877891N865985L918653p5948l301742
36139C765177k590501K261886O580079M755150k862269r438837r346446m014405
36131a0890166J274618L718995L966761L046219J277676m31913m83344J584806
36123C063652L697209K663105j572911l794856O14621P025027M929970o452533
36115A0173284j3375673n873673O027755N793634m693860q250403P52037Q873344
$$ y = [-5901956, -3935368, -626336, -582025, -1813561, -631405, 2190188, 4732098, 7858075, 10911336, 8889186, -223207, -9546308, -10901745, -5386145, -530662, 869880, 2990485, 8723395, 14809890, 16343946, 12428581, 5937887, -54035, -4322397, -7179669, -9107044, -9609189, -7519662, -2641771, 3224214, 7142867, 7066919, 3765177, 1174676, 3436562, 10016641, 14771791, 11909522, 2470685, -6875761, -10890166, -9615548, -5896553, -1929792, 1116427, 2394103, 1962190, 1478846, 3063652, 6760861, 9423966, 7851055, 4056199, 4670820, 11695847, 16625817, 10173284, -3202389, -9076062, -3048307, 2745327, -1948533, -10198936, -9446899, -573555]
36107e73555O052635l94291j122225K07437k998466o824339m684449K14723J295837
36098h826693M53899K827567N625649K765781l582245n687110j475709M453454
36090c445407P586565N412716k257168r390052p093507L165497Q392739L110661
36082E482044j230253M482806J0399716M104094p174083p882497K83381K908900
36074A1374108k237743m369340j140159j177569n204341l917177L140188M882632
36066A350599j491253n203839j025964K761679R53085L0784L789739N561256K041490
36057H767576M49639M070939M609213k466845q306140n656687p85266p40247j128825
36048a186643K845891N238586J029333k331635K057186O224724J14428j0016427
$$ y = [-573555, 5479080, 5084789, 3962564, 4170001, 1171535, -5652804, -10337253, -10122530, -8826693, -8372794, -5545227, 80422, 2846203, -736042, -6423152, -7898861, -3445407, 4141158, 9553874, 7296706, -2093346, -9186853, -6021356, 2371383, 5482044, 4251791, 8734597, 19134313, 23238407, 16064324, 8181827, 8465208, 11374108, 9136365, 4767025, 3626866, 2449297, -2755044, -6672221, -3532033, 1350599, -140654, -5344493, -6370457, -3608778, -2655693, -2624909, 1164830, 6726086, 8767576, 9217215, 13288154, 17897367, 15430522, 7124382, 1467695, 682429, -57818, -1186643, 1659248, 6897834, 7927167, 5595532, 7652718, 13877442, 13991870, 3975443]
36040C975443j0958737l473618J381475J530480L740058P502198N057746k904573
36032E850472o250893j682446K674599J334031j142528O7466K487737K146576
36024E485014o51312m101368o966973o412385n32725N827218N037088j966095
36016d281538n596351j010269N673630P382370N107534K793641j69097n392671
36008D507249q994595n622269K506259O697888K743202l707513m871768q36605
36000g578152J719099l59948k548178k81302L675097L797685O73773o40423M32300
35991a110049l35155l456829m583197l160346l975439p243686n871148K587500
35983b7148349R575258P629806J461189n13405J063269P81705m24901J650557
$$ y = [3975443, -6983294, -10456912, -9075437, -7544957, -3804899, 3697299, 8755045, 5850472, -400421, -2082867, 591732, 1925763, 783235, 850701, 3338438, 5485014, 4833702, 732334, -6234639, -12647024, -13179749, -7352531, -2315443, -4281538, -9877889, -10888158, -5214528, 2167842, 7275376, 10069017, 9899920, 4507249, -4487346, -10109615, -7603356, -905468, 1837734, -1869779, -6741547, -7578152, -5859053, -6219001, -8767179, -9048481, -5373384, -1575699, -901926, -1542349, -1110049, -1445204, -4902033, -9485230, -12645576, -16621015, -23864701, -29735849, -27148349, -17573091, -9943285, -8482096, -8995501, -7932232, -7150527, -7575428, -5924871]
35975e924871M644629L163727o76557m52703K711223J783650l446850n514826
35967c712578j695934K278143K331060J123092J177943R69373o7367L5234N67941
35958C006907j400220l946097j644438M054848M537618k402266p322340k753626
35950g869614N391231O673417P85002l886842k886102J22620N03472j722868l682506
35941f572190l452266j420535N21568J094258J080965J570209J509772k59380
35933e927599j267175J929937O999875O981232K14420n846017m185019K339341
35925A238995N311773J905685k708481l077398K57325K637475J163828k298193
35917D431009l666819j894847m36946k013454l587071l43116N580532N566090
$$ y = [-5924871, -1280242, 1883485, 1206928, 754225, 3465448, 5249098, 1802248, -3712578, -5408512, -3130369, -799309, 323783, 1501726, 2471099, 2403732, 2438966, 3006907, 1606687, -2339410, -3983848, 71000, 4608618, 2206352, -5115988, -7869614, -2478383, 4195034, 4980036, 1093194, -1792908, -1670288, -1166816, -2889684, -6572190, -10024456, -11444991, -10923423, -9829165, -8748200, -7177991, -5668219, -5927599, -7194774, -5264837, 1735038, 8716270, 8930690, 3084673, -1100346, 1238995, 6550768, 8456453, 5747972, 2670574, 2927899, 5565374, 6729202, 4431009, 764190, -1130657, -1567603, -3581057, -7168128, -7511244, -1930712, 3635378]
35909C635378l633759j2779903r885058M268138J5464646J2337816m01512q260092
35901G45654m653078K403573K403911l704549o317524j250427N442261O936893
35893B006714L630219l41064k916300l523657j718269M45520m48008k812892p41232
35884f418969N585870P555974J387959m349540j946442K736479O08949m804342
35876C55938m004921J524860K701892n30218o64004J426279k060109q577099o415741
35867a6243123M319737R159556K691028k695506R92265L642910l445482j0257549
35859a1836164m833283N428301N731009k272444n657442k367827n48074j85312
35851a6541236O102810J4968090J3356758L81535q395459l986621L176406Q25928
$$ y = [3635378, 1619, -12778284, -22663342, -18395204, -2930558, 9407258, 9005746, 745654, -3907424, -1503851, 900060, -2804489, -9122013, -10372440, -4930179, 2006714, 5636933, 5295869, 2379569, -1144088, -2862357, -2416837, -2864845, -5677737, -6418969, -833099, 6722875, 8110834, 3761294, 1814852, 4551331, 5160280, 355938, -3648983, -2124123, 577769, 47551, -616453, 809826, -1250283, -9827382, -16243123, -11923386, -2763830, -72802, -2768308, -1776043, 1866867, -1578615, -11836164, -16669447, -11241146, -5510137, -7782581, -13440023, -15807850, -16355924, -16541236, -10438426, 4529664, 17886422, 18267957, 9872498, 5885877, 9062283, 9888211]
35843I888211p178949r907501o598611l884086k240080L105115J0283617J0719948
35835D187664K169673o361758n823138K025012Q167136P199469J412925l652781
35827I324202m351456p04290L769362M176767q61208o239789n461185O09369L962358
35818D224130L12792m591489l221762L068711O860249N233687J363066k397371
35810A0852013n942779o903956k486075L722117M495116j82802k716190l1061
35802H06383K300432Q39131J30490L131781M557254L03300m071992k040785K782424
35793H738418K535868k348778m799110k337031R76515J947442J050579o93259
35785E070644k195522j288330K213269M593837L273313P19900l16316j332697
$$ y = [9888211, 2709262, -7198239, -13796850, -17680936, -19921016, -16815901, -6532284, 4187664, 6357337, -4421, -5827559, -3802547, 4364589, 11564058, 12976983, 9324202, 4972746, 4268456, 8037818, 12214585, 11353377, 5113588, -347597, 261772, 4224130, 4536922, -54567, -3276329, -207618, 6652631, 11886318, 13249384, 10852013, 4909234, -1994722, -4480797, -758680, 3736436, 3553634, 837444, 806383, 3106815, 3945946, 4076436, 7208217, 11765471, 12068771, 7996779, 5955994, 8738418, 11274286, 8925508, 4126398, 1789367, 2765882, 4713324, 5763903, 5070644, 2875122, 1586792, 3800061, 8393898, 11667211, 12387111, 12070795, 10738098]
35777A0738098l762553m978572l209990j274556q03468J002541L866937J718273
35769C296710n781744q204928j91013P135697K837307m616352m41868J0784553
35761D818362J1064601k078691j1849298q585215j558949k91644j002829J852344
35753g631319N146325N467715N490577N511547Q98871n941386m587405M928690
35745I283615P144099n054688j5837784r303616N298790Q026636r02978l748878
35737e094804N211463J1992361O104740n156097j0325228q522927m585155O3095
35729a0312552M721154N437881R33851k808355m51513L997066K687826m277792
35721g2434q819539o112183k33420K585072J761594P77314R85627Q15236j59849
$$ y = [10738098, 6975545, 1996973, -1213017, -2487573, -3291041, -2288500, 1578437, 3296710, -2485034, -10689962, -10880975, -3745278, -907971, -5524323, -5966191, 4818362, 15882963, 13804272, 1954974, -6630241, -8189190, -8480834, -9483663, -7631319, -2484994, 2982721, 8473298, 13984845, 14883716, 8942330, 4354925, 9283615, 16427714, 11373026, -4464758, -13768374, -8469584, -442948, -1345926, -5094804, 116659, 12109020, 18213760, 13057663, 2732435, -5790492, -10375647, -10312552, -5591398, -153517, 780334, -2028021, -2479534, 1517532, 4205358, -72434, -8891973, -15004156, -15237576, -12652504, -10890910, -10113596, -9127969, -8312733, -8472582]
35712h472582m21696L136q54922k622018j842012K219589M975948L164869M19192
35703c430496J573300M493073L305257k179026o343358o097085l515112q30011
35695a3023458J478771K221867Q73549N13998L434109N490282K090457k234978
35687H44597L36795O580014N091497n281918j1930736o963425K339462O511695
35679b472019O120443M773380R58729n137785o576839l67584N449491M212661
35671F960477J252416K637205K973719l627388r321051l875659O235259O178473
35663I413451l403509p439485n60276O082827M186313p06397k122464l133325
35655B317135p192557r209056l612639N899211J1406553J0318666M943173k293817
$$ y = [-8472582, -8894278, -8891142, -9746064, -12368082, -14210094, -11990505, -7014557, -3849688, -3430496, -1857196, 2635877, 5941134, 3762108, -2581250, -8678335, -12193447, -13023458, -11544687, -9322820, -8449271, -7935273, -4501164, 989118, 3079575, 844597, 1181392, 7761406, 12852903, 7570985, -4359751, -11323176, -8983714, -2472019, 3648424, 8421804, 9380533, 4242748, -2334091, -2701675, 2747816, 6960477, 8212893, 10850098, 13823817, 10196429, 875378, -3000281, 3234978, 9413451, 6009942, -1429543, -1989819, 4093008, 8279321, 7572924, 5450460, 2317135, -4875422, -14084478, -17697117, -11797906, -391353, 9927313, 14870486, 12576669]
35647A2576669q415148r216881l908469K423654M500639K715815J097718J825866
35639C599863L524774L232879m33158m572495l937263J815417N608706K020112
35631A0858835m352721n628925k563621j860703l962462l052893J462726L678930
35623e420834K207662K118187L870397J098279o732456r966783k885899O766844
35615h944603Q941929M341662k34252k426915l063890q37622L873243M991521
35607F641073j436276r140621q824169p14037O588298P327223K956400k042474
35599A355417l470901M41001N429014L778098m428908q159153n12843Q940895
35591C372620O736815l948375p508491O11494P747312L955230l906406m182198
$$ y = [12576669, 4161521, -5055360, -8963829, -6540175, -2039536, 676279, 1773997, 3599863, 7124637, 10357516, 9924358, 5351863, 1414600, 3230017, 8838723, 10858835, 6506114, 877189, -1686432, -3547135, -7509597, -10562490, -9099764, -5420834, -3213172, -1094985, 2775412, 3873691, -2858765, -12825548, -15711447, -8944603, -2674, 4338988, 4104736, 1677821, -1386069, -2223691, 1649552, 6641073, 5204797, -3935824, -12759993, -13474030, -6885732, 441491, 3397891, 1355417, -2115484, -1674483, 3754531, 7532629, 3103721, -5055432, -5568275, 3372620, 10109435, 6161060, -1347431, -735937, 7011375, 10966605, 7060199, 2878001]
35583B878001K543439O345428K439679m892414r952019j0428618n816242K829828
35575a4052918J0823056J2096704N582317k869306o539481m647130j882218j975609
35567c464585l559524l019845J16117K707460K598155J166738L74570l93156k646645
35558f120715n474217o005513k621808L449189Q877887J0061672O158159J172936
35550I497590L59382L057646K482353m725341j2363519j2308753n432989M09209
35542a9024422J502323J266719K454801K822265L86525k269200j809830J286554
35534a3384265M360418N794082M711275O67857m082462m976488m17226N651205
35526a675604Q636149Q209620O069075J975113m350132r685713r934911n414380
$$ y = [2878001, 5421440, 11766868, 14206547, 9314133, -637886, -11066504, -16882746, -14052918, -3229862, 8866842, 14449159, 11579853, 5040372, 393242, -1488976, -3464585, -7024109, -10043954, -9927837, -7220377, -4622222, -3455484, -3080914, -3474070, -6120715, -11594932, -17600445, -20222253, -16773064, -7895177, 2166495, 8324654, 9497590, 9856972, 12914618, 15396971, 10671630, -1691889, -14000642, -19433631, -19024422, -17522099, -16255380, -13800579, -10978314, -10591789, -12860989, -14670819, -13384265, -9023847, -3229765, 1481510, 2149367, -1933095, -6909583, -7326809, -1675604, 6960545, 15170165, 21239240, 23214353, 18864221, 9178508, -756403, -6170783]
35518f170783j62651L062910L958975K405308q97047k658384n34730K270272J134676
35509B408546j824159l97797M420554M304284k105754m250222L953332J1332334
35501A7841118M183114j1661174j7230489p636456J865579J95802l762596K087507
35493a4117595J2516952J3505990M230468k936037j924356J96852k867107o686841
35485A918326m435228K107110N348158K312182k096628j731506K997995N200332
35477A1620741M66602n697145m077609M253601P531337M53639o803915m075982
35469C671269K451404N42965p424132q112601Q72113P587920N234004Q26382J114334
35460F763658K932032K390812J749507J639801k278969r040651j0003132l303846
$$ y = [-6170783, -6333434, -3270524, 688451, 3093759, 2196712, -461672, -996402, 1273870, 2408546, 584387, 186590, 4607144, 8911428, 6805674, 2555452, 6508784, 17841118, 22024232, 10363058, -6867431, -14503887, -12638308, -12442506, -16205102, -14117595, -1600643, 11905347, 16135815, 13199778, 11275422, 11472274, 8605167, 1918326, -2516902, -409792, 4938366, 7250548, 5153920, 3422414, 6420409, 11620741, 12087343, 6390198, 2312589, 6566190, 14097527, 14551166, 7747251, 3671269, 6122673, 6665638, -758494, -8871095, -7998982, -411062, 4822942, 5649324, 6763658, 9695690, 12086502, 13836009, 15475810, 13196841, 4156190, -5846942, -9150788]
35452i150788P84697l363279o317416M73786R567472R889151M339033K173446
35444H396102K326151j450745n517960j728446O229103O853832q03295o597292
35436G707450n937836l848866k954007k11545L979875N220252M058385M499864
35428A2513572M211320j850695q810488o424931L171293O535316j49617n631505
35420C564265k645398J993692J520705m32219r9987j080635m194367k447149N540872
35411A719779R161545K195218n950724n564742j825437k906838l892467K959468
35403d104198J0664769O683798n579290j0867602n313848M6016j210408k810618
35395a2491381N38998M622700M828373L021419J259953k041597n854129n183832
$$ y = [-9150788, -8366091, -11729370, -18046786, -17573000, -8005528, 1883623, 6222656, 8396102, 10722253, 9271508, 3753548, 2025102, 8254205, 15108037, 14304742, 7707450, 1769614, -2079252, -5033259, -5244804, -1264929, 3955323, 8013708, 12513572, 16724892, 14874197, 6063709, -361222, 2810071, 9345387, 9195770, 3564265, 918867, 2912559, 4433264, 4001045, 3901058, 2820423, -1373944, -3821093, 1719779, 10881324, 13076542, 7125818, 1561076, -264361, -3171199, -7063666, -4104198, 6560571, 13244369, 7665079, -3202523, -8516371, -8470355, -9680763, -12491381, -11952383, -7329683, -2501310, 520109, 1780062, -261535, -6115664, -11299496]
35387a1299496k955K730131K93274p30589M110674Q483740N027917k555494n274003
35378G83199k357964m08334j449519q67187K576723L333568j379635n604668l158626
35369h532443K641717L792276m43219k958097K17507M915684O354767N438160
35361A1426352M247286J043709m967902q529990m803011J983890L710670L51912
35353D462916j237856L86453n07821n128085o423623q01780N147855N011931K172904
35344C082894K660308M587481K066118m583693r566573r773055o409258j199566
35336a9135344L718115M902411J832783n62053J685105N597346O234398M038581
35328H311342K167030M26217k368372l789849j805509K40719r23206k045976N08090
$$ y = [-11299496, -11302451, -8572320, -8279046, -9009635, -4898961, 3584779, 8612696, 6057202, 783199, -1574765, -1983099, -3432618, -4299805, -1723082, 1610486, 230851, -5373817, -8532443, -5890726, -2098450, -2541669, -5499766, -5282259, -366575, 5988192, 11426352, 15673638, 16717347, 11749445, 3219455, -1583556, 400334, 4111004, 4462916, 3225060, 3611513, 3103692, -2024393, -8448016, -9249796, -4101941, 909990, 3082894, 5743202, 10330683, 12396801, 7813108, -1753465, -11526520, -17935778, -19135344, -15417229, -10514818, -8682035, -9244088, -7558983, -1961637, 4272761, 8311342, 10478372, 10904589, 8536217, 4746368, 2940859, 3181578, 2258372, 212396, 720486]
35319G20486K594889r25798n189123j853729N582774N083607m807265j1238586
35311a0032745n802787L666172N506429l15l865724j648275L076923N363801L752393
35302A5872j67735l652423m654042l026705L86295M755486P860077O287158M24362
35293H228345l490334r25192L982625M379506O63662j991198k934892m698841
35285C213681m956980L20845O832174N804299j699949n312866j675016J249130
35277C775318j018099k375004J119369K906544k491749r161363q915664k876033
35269a9036681L295780Q119372J1006043Q090095l91258n671413k143893L069576
35261F337621J272322l692789k910274J766588J381449m098558n847948j269252
$$ y = [720486, 3315375, 2389577, -2799546, -4653275, 929499, 6013106, 1205841, -10032745, -15835532, -12169360, -6662931, -6663246, -10528970, -12177245, -9100322, -3736521, 15872, -151863, -3804286, -8458328, -11485033, -11098738, -6343252, 1516825, 7803983, 8228345, 4738011, 3812819, 7795444, 12174950, 12838612, 10847414, 7912522, 3213681, -1743299, -1422454, 5409720, 11214019, 9514070, 4201204, 2526188, 3775318, 2757219, 382215, 1501584, 4408128, 1916379, -7244984, -16160648, -19036681, -15740901, -7621529, 3384514, 11474609, 11083351, 5411938, 3268045, 6337621, 7609943, 3917154, 1006880, 2773468, 4154917, 56359, -5791589, -7060841]
35253g060841K559679J305120r76873m71867Q73612Q21545N13427M70008p30288
35244b696478k033609k83954L276962K953415k648612p245697n119614J486364
35236a2311223N940886N018287Q31695k681584l359337k123823j375523j605264
35228a1665886p97126J828373M002521M274786M446890N257221L439958k681451
35220H105286q248800p703834k662960J262378K475301K617709J215131k180722
35212e120511l542780M26804N146675M154308r5613k26718L267280L287943o66626
35203F630762j575685J944001K721180k086149n759491l559878J56449Q56055
35195f72756Q83472K675827L310135J007404p55077n81025k513871o928962o844139
$$ y = [-7060841, -4501162, -3196042, -4172915, -4644782, -3771170, -2949625, -2436198, -1966190, -2696478, -4730087, -5014041, -1737079, 1216336, -1432276, -8677973, -13797587, -12311223, -6370337, -1352050, -520355, -3201939, -6561276, -8685099, -10060622, -11665886, -12463012, -10634639, -6632118, -2357332, 2089558, 7346779, 10786737, 8105286, -143514, -7847348, -10510308, -9247930, -6772629, -4154920, -2939789, -5120511, -8663291, -8236487, -3089812, 1064496, 968883, 742165, 4009445, 7297388, 6630762, 5055077, 6999078, 9720258, 7634109, 1874618, -1685260, -1528811, -672756, 210716, 2886543, 6196678, 7204082, 6449005, 5867980, 3354109, -3574853, -10418992]
35186a0418992L75304O406051M551677N14419J978510N380309L094940k829401
35178I052817m812907k296300L14862L086654O920883N767649m646733j4304841
35170i17916r601133N149736J1926583N044277k467915j115015K280694m2401
35162A0256910l318906j176476J974740l9243l089045o02195L780516K438914
35154A0225215k818872m422335j960303p43403o34578K594612O472442L818337
35146A2531115m086800p167002j661565M058369K323840l471106n720909k966841
35138f160899J221885M030489L638527j089962o690584n992634K084621Q547183
35130d11374N923046q16166k029414J877153K586693j158461j399870M464393
$$ y = [-10418992, -10043688, -3637637, 914040, 1428459, 3406969, 8787278, 11882218, 9052817, 4239910, 1943610, 2258472, 5345126, 12266009, 18033658, 13386925, -917916, -10519049, -5369313, 6557270, 11601547, 9133632, 8018617, 10299311, 10256910, 6938004, 5761528, 7736268, 7697025, 4607980, 4005785, 7786301, 10225215, 7406343, 2984008, 1023705, 280302, -354276, 2240336, 8712778, 12531115, 8444315, 1277313, -384252, 3674117, 5997957, 2526851, -3194058, -6160899, -4939014, -908525, 2730002, 1640040, -5050544, -11043178, -8958557, -411374, 5511672, 4695506, 2666092, 4543245, 7129938, 5971477, 4571607, 9036000]
35122I036000P412066P30478q042550p437266Q64569N031167J207390j901261
35114F900593J627580N164419J038098n999185n844638O59589K995066k019623
35106D521899n336977r71861L961987J269071m514178m027206P04614n2142n800820
35097a0245613m917933N667299J2670264N445607p241157r359600J7542P580818
35089c82773N707655J37673k157120k069698k420355j605791K023028N324133
35081D556752M700139J330604j759449m265275o485168o053404j333077M052624
35073e256254M698986P73730j973593J96215M440712N348792J637191k548573
35065G317206k583877J415843M989723M543964O36068m266138q699156j0954887
$$ y = [9036000, 16448066, 17178544, 9135994, 1698728, 2563297, 7594464, 8801854, 6900593, 8528173, 13692592, 14730690, 8731505, 2886867, 3546456, 6541522, 4521899, -815078, -1786939, 2175048, 3444119, -1070059, -5097265, -4392651, -4444793, -10245613, -15163546, -9496247, 3174017, 8619624, 1378467, -7981133, -7963591, -382773, 5324882, 5462555, 3305435, 1235737, -1184618, -2790409, -767381, 4556752, 9256891, 10587495, 8828046, 4562771, -1922397, -7975801, -9308878, -5256254, -557268, 216462, -1757131, -1560916, 2879796, 8228588, 9865779, 7317206, 4733329, 6149172, 11138895, 15682859, 16318927, 12052789, 3353633, -7601254]
35057g601254p850599J152829J0075906J1409253M960023k248184m597467k273683
35049C026824J961658M825035J961942p494801j5117210j0246721M438802J3069347
35041c575124P048542l087849l227910M600077P553060J608041n120866o440991
35033f43020m709993l072912n96787K678969L488680R60134j376735j551439j904232
35024f727335l701300l981516m95161M121646N723331L459267m40928l216594
35016e258590k995559q6511K779314L629477L737333M188036K351082l304790
35008E039792p228818l010633M974263M994948m815588j1625495n337358O769173
35000a0239716J0296072L481883k286586P5379M618424L282569j857517k914469
$$ y = [-7601254, -15451853, -14299024, -4223118, 7186135, 12146158, 9897974, 5300507, 3026824, 4988482, 9813517, 11775459, 4280658, -10836552, -21083273, -16644471, -3575124, 3473418, 385569, -2842341, 1757736, 9310796, 10918837, 5797971, -643020, -5353013, -8425925, -9022712, -6343743, -2855063, -1894929, -3271664, -4823103, -6727335, -10428635, -14410151, -14905312, -10783666, -5060335, -1601068, -2041996, -5258590, -8254149, -8340660, -5561346, -1931869, 1805464, 5993500, 8344582, 5039792, -2189026, -5199659, -225396, 4769552, -46036, -11671531, -17008889, -10239716, 56356, 3538239, 1251653, 1327032, 5945456, 9228025, 7370508, 4456039]
34992D456039Q41910J529378m758204j0288610n855464M995256R648181M117528
34984D686014j796600j81473L437012J204307k684091M10644O871752N047933
34976A6995498n034847r849449k862092N539376M038308l899110p413576l768032
34968f253924J079778K452087Q27486j229202j285929J338915L589240J692581
34960B211032k588575l779366j599653j055853k337681K22928N956220N235984
34952B265036m748902j1840455n483848O951020J0827133M799961l56246R49702
34944C363401M150644M600955K674233k79579l086814l136576k33888N91720l365420
34935E278676o254184k487701L202709L566875J363752L111151N241418k35452
$$ y = [4456039, 5297949, 6827327, 2069123, -8219487, -14074951, -9079695, 568486, 4686014, 2889414, 2707941, 6144953, 7349260, 4665169, 5075813, 11947565, 16995498, 11960651, 2111202, -750890, 4788486, 8826794, 4927684, -2485892, -6253924, -5174146, -2722059, -1894573, -3123775, -4409704, -3070789, 518451, 2211032, -377543, -4156909, -5756562, -6812415, -9150096, -8927168, -2970948, 2265036, -2483866, -14324321, -19808169, -12857149, -2030016, 2769945, 2413699, 3363401, 7514045, 12115000, 14789233, 14509654, 11422840, 8286264, 8052376, 8644096, 5278676, -975508, -3463209, -260500, 3306375, 4670127, 7781278, 13022696, 12787244]
34927A2787244r456044j0801615m179463q89931l506536k042006O476341J0904687
34919g07323M954975j574878O19580N280702K409452n192819q082795m983380
34911g276486j248622J041759K356765J166047j601894j77778N757528O274073
34903F291392l506263j1755700o245021N032077N095764m787335o920529M112569
34895a2683046J2814189P383756l325587n623762o16160K178881R11225j25026
34887I14470j248627n138619p738835k444214P796301J2140152O234865k701514
34879G813979o165274l182735K111732N404152L402646l660746q944819m817584
34871h038649N676826J0004533K887233n117674k232513P357640R889526K027817
$$ y = [12787244, 3331200, -7470415, -11649878, -12539809, -16046345, -18088351, -11612010, -707323, 4247652, 2672774, 3292354, 8573056, 10982508, 5789689, -2293106, -7276486, -8525108, -7483349, -5126584, -3960537, -5562431, -5740209, 17319, 6291392, 2785129, -8970571, -15215592, -10183515, -5087751, -9875086, -16795615, -12683046, 131143, 7514899, 4189312, -1434450, -2050610, 128271, 1039496, 914470, -334157, -5472776, -13211611, -15655825, -7859524, 4280628, 10515493, 7813979, 1648705, -1534030, 577702, 5981854, 9384500, 5723754, -3221065, -8038649, -2361823, 7642710, 10529943, 5412269, 3179756, 10537396, 20426922, 22454739]
34863B2454739n897457o183440k795651j666638j528001N78581K152035k09727
34855F904441m307873o072675n464148l637303R08714P566524R968530M223370
34847A0089580l273106m036494J6453Q91504j724796j306052K237775J563763
34839D458627m438042p147647k198440K969651J035218m064132m457915j91607
34831a4034287L256275M339601N275173N848404L960634M76240j870188l068036
34823D183816m917568o750244n946639j973052K907289O071615N927513K572787
34815B075517j398062k830387j888257j403795j791170n20017K326498K850230
34807b579443k03693k646888j266765J487909K149807J204701N79681M52392J042589
$$ y = [22454739, 16557282, 10373842, 7578191, 5911553, 4383552, 4962133, 7114168, 6904441, 2596568, -3476107, -8940255, -12577558, -11668844, -4102320, 5866210, 10089580, 6816474, 2779980, 2796433, 3687937, 1963141, 657089, 2894864, 4458627, 20585, -7127062, -9325502, -6355851, -5320633, -9384765, -13842680, -14034287, -10778012, -6438411, -1163238, 4685166, 8645800, 9122040, 7251852, 4183816, -733752, -7483996, -13430635, -15403687, -12496398, -6424783, -497270, 2075517, 677455, -2152932, -4041189, -5444984, -7236154, -7756171, -5429673, -2579443, -2783136, -5430024, -6696789, -5208880, -3059073, -1854372, -1274691, -822299, 220290]
34798B20290K996807M074984J077443l205901k191448L051967L462451l182686
34790F303907p376966l561870N88630j184376j786846M707704Q107057k238262
34782C558978j5528098j2495694M220745J3090828O443748o67523K183648N235239
34774F041871j160754q589416n418804L531513N756401O70469k488551n87417
34766b244688J394566R29634K90350j2675j842383m277385m220152j433287J756321
34757i659699M297556N918389M989838J036348k677559k934864j078695m67147
34749e75833j431653j751911l05188K095857L728392K620405j367215m797939
34741a785085m436641k388989k674531l553823j17549N853858P321149L996623
$$ y = [220290, 3217097, 7292081, 8369524, 5163623, 2972175, 6024142, 9486593, 6303907, -1073059, -4634929, -4046299, -5230675, -7017521, -2309817, 5797240, 3558978, -11969120, -24464814, -20244069, -7153241, -709493, -1377016, 806632, 6041871, 4881117, -3708299, -9127103, -5595590, 160811, 831280, -1657271, -2244688, -850122, 79512, 369862, 357187, -1485196, -5762581, -9982733, -11416020, -9659699, -5362143, 556246, 5546084, 6582432, 3904873, 970009, -108686, -575833, -2007486, -3759397, -4064585, -1968728, 1759664, 4380069, 3012854, -1785085, -6221726, -8610715, -11285246, -14839069, -14956618, -9102760, -1781611, 2215012]
34733B215012K771985M255408R13081p145135p954313K983388J2072262P045180
34725A7156868m347224p641685l523016j884793k664840P55489N028597J516532
34717D395928n612713l770445O280969J0376175L755452k959101l182449l058914
34709F224902o346507o848412k318270q35768n528156o869480R34506Q853083
34701a2734102Q143304M363396N208605N718277j340503r653814q302119k8289
34693h625245L657825J169851O53056L810856L862784o18776k669918N38143L055461
34684D834037P23989k731754l215786k244075k297402k397024j238245N2470L77072
34675h136718J3274j257749l357122l324481J666047Q478222J0122907M512123
$$ y = [2215012, 4986997, 9242405, 10155486, 3010351, -4943962, -1960574, 10111688, 17156868, 12809644, 5167959, 1644943, -239850, -2904690, -2149201, 2879396, 4395928, -1216785, -4987230, 1293739, 11669914, 15425366, 12466265, 9283816, 6224902, -121605, -6970017, -9288287, -10124055, -15652211, -22521691, -21587185, -12734102, -4590798, -227402, 4981203, 10699480, 9358977, -294837, -8596956, -8625245, -4967420, -3797569, -3144513, 666343, 4529127, 3910351, 1240433, 1778576, 4834037, 5558026, 2826272, -389514, -2633589, -4930991, -7328015, -8566260, -8513790, -8136718, -8123444, -9381193, -12738315, -16062796, -14396749, -5918527, 4204380, 8716503]
34667H716503k923088n746203k244286M588736Q999485N887159l219534r317165
34659D741607o031242J650905M489508J870420k7178j80263k904208p021836o037129
34650i449416m04974J855125k16660K526916J2117605J5491826L367276j2606980
34642A2680718j3831366j81668J0990494Q726916n34764n974943n602506l479990
34634B792891j899089p57341j34109j23654n66869k063418m658656n719323k775047
34625a5904615J659043K395398r11678l058377r81976K466802L950526M114142
34617f270735M175617K596214j147940l173920l24672L641924K363848l328264
34609a467928n538802n75673M978388K998418m661228q302325l326210L924966
$$ y = [8716503, 5793415, 47212, -2197074, 2391662, 11391147, 17278306, 14058772, 4741607, -1289635, 361270, 4850778, 6721198, 6694020, 6513757, 3609549, -3412287, -9449416, -9854390, -7999265, -8215925, -5689009, 6428596, 21920422, 25287698, 12680718, -1150648, -1332316, 9658178, 18385094, 17850330, 11875387, 6272881, 2792891, 893802, 136461, 2352, -121302, -688171, -2751589, -7410245, -13129568, -15904615, -14245572, -11850174, -12761852, -15820229, -16802205, -14335403, -10384877, -6270735, -2095118, 501096, -646844, -3820764, -4145436, -503512, 1860336, -1467928, -7006730, -7582403, -2604015, 394403, -4266825, -12569150, -15895360, -11970394]
34601a1970394N052752N22032j976542J553597O471562O415515J808787j345086
34593F532223O0261K247659K68680m512737n740109r80657M184226L563285q67564
$$ y = [-11970394, -6917642, -6395610, -8372152, -6818555, -346993, 6068522, 7877309, 6532223, 6592484, 8840143, 9108823, 4596086, -1144023, -2124680, 2059546, 5622831, 4755267]
$$ [...]
##END NTUPLES=NMR SPECTRUM
##END=
