##TITLE=31Pdec_SRM-1_dec
 
 64 sc
 8.2.2024
##JCAMPDX= 6.0         $$ Bruker NMR JCAMP-DX V2.0
##DATA TYPE= NMR SPECTRUM
##DATA CLASS= NTUPLES
##ORIGIN= UXNMR, Bruker Analytische Messtechnik GmbH
##OWNER= root
$$ XWIN-NMR		Version 3.5
$$ Thu Feb  8 16:25:06 2024 Russian Standard Time (UT+4h)  she@DPX200
##.OBSERVE FREQUENCY= 81.013821
##.OBSERVE NUCLEUS= ^31P
##.ACQUISITION MODE= SIMULTANEOUS
##.ACQUISITION SCHEME= undefined
##.AVERAGES= 64
##.DIGITISER RES= 16
##SPECTROMETER/DATA SYSTEM= spect
##.PULSE SEQUENCE= zgpg30
##.SOLVENT NAME= CDCl3
##.SHIFT REFERENCE= (INTERNAL, CDCl3, 0, 248.564)
##AUDIT TRAIL= $$ (NUMBER, WHEN, WHO, WHERE, WHAT)
$$ ##TITLE= Audit trail, XWIN-NMR		Version 3.5
$$ ##JCAMPDX= 5.01
$$ ##ORIGIN= Bruker BioSpin GmbH
$$ ##OWNER= she
$$ F:/spectra/data/she/nmr/P31/1/pdata/1/auditp.txt
$$ ##AUDIT TRAIL=  $$ (NUMBER, WHEN, WHO, WHERE, WHAT)
(   1,<2024-02-08 16:24:00.78 +0400>,<she>,<DPX200>,
      <created by zg, POWCHK disabled, PULCHK disabled
       configuration hash MD5:
       00 E9 B6 7A A2 85 ED C7 34 08 36 98 17 FE 4E 26
       data hash MD5: 32K
       54 8E C2 5C 47 F3 A9 68 CD 91 FA D9 31 33 35 89>)
(   2,<2024-02-08 16:24:03.89 +0400>,<she>,<DPX200>,
      <Start of raw data processing
       efp BC_mod = 2 LB = 10 FT_mod = 6 PKNL = 1 PHC0 = -12864.33 PHC1 = 10.28285 SI = 64K 
       data hash MD5: 64K
       BE 7C 3C 37 45 F0 20 CF 87 35 1B 67 6E 0D B9 0B>)
(   3,<2024-02-08 16:24:36.96 +0400>,<she>,<DPX200>,
      <pk PHC0 = -324.4607 PHC1 = 821.0009 
       data hash MD5: 64K
       3B 46 43 3A A8 B0 87 A8 9B EC 23 84 60 C0 6D 96>)
(   4,<2024-02-08 16:24:40.18 +0400>,<she>,<DPX200>,
      <abs ABSG = 5 
       data hash MD5: 64K
       7A B0 74 39 9E 27 A2 4D 7E D5 EF A2 56 87 79 0E>)
$$ ##END=
$$ 
$$ hash MD5
$$ B8 CE A3 CE 4E C4 FF 38 80 19 B3 10 D1 70 FB 2C
##$RELAX= 
##$RELAX= 
##$RELAX= 
##$RELAX= 
##$RELAX= 
##$RELAX= 
##$RELAX= 
##$RELAX= 
##$RELAX= 
$$ Bruker specific parameters
$$ --------------------------
##$DU= <F:/spectra>
##$EXPNO= 1
##$NAME= <P31>
##$PROCNO= 1
##$TYPE= <nmr>
##$USER= <she>
##$AMP= (0..31)
100 100 100 100 100 100 100 100 100 100 100 100 100 100 100 100 100 100 
100 100 100 100 100 100 100 100 100 100 100 100 100 100 
##$AQSEQ= 0
##$AQ_mod= 1
##$AUNM= <au_zg>
##$AUTOPOS= <>
##$BF1= 81.014009
##$BF2= 200.13
##$BF3= 200.13
##$BF4= 200.13
##$BF5= 200.13
##$BF6= 200.13
##$BF7= 200.13
##$BF8= 200.13
##$BYTORDA= 1
##$CFDGTYP= 0
##$CFRGTYP= 5
##$CHEMSTR= <none>
##$CNST= (0..31)
1 1 145 1 1 1 1 1 1 1 1 1 1 1 1 1 1 1 1 1 1 1 1 1 1 1 1 1 1 1 1 1 
##$CPDPRG= <waltz16>
##$CPDPRG1= <>
##$CPDPRG2= <waltz16>
##$CPDPRG3= <>
##$CPDPRG4= <mlev>
##$CPDPRG5= <mlev>
##$CPDPRG6= <mlev>
##$CPDPRG7= <mlev>
##$CPDPRG8= <mlev>
##$CPDPRGB= <>
##$CPDPRGT= <>
##$D= (0..31)
0 1 0 0 0 0 0 0 0 0 0 0.03 2e-05 3e-06 0 0 0 0 0 0 0 0 0 0 0 0 0 0 0 0 
0 0 
##$DATE= 1707395040
##$DBL= (0..7)
120 120 120 11 120 120 24 19 
##$DBP= (0..7)
150 150 150 150 150 150 150 150 
##$DBP07= 0
##$DBPNAM0= <>
##$DBPNAM1= <>
$$ [...]
##$SUBNAM3= <"">
##$SUBNAM4= <"">
##$SUBNAM5= <"">
##$SUBNAM6= <"">
##$SUBNAM7= <"">
##$SUBNAM8= <"">
##$SUBNAM9= <"">
##$SW= 501.771253377433
##$SWIBOX= (0..15)
0 1 3 0 0 0 0 0 0 0 0 0 0 0 0 0 
##$SW_h= 40650.406504065
##$TD= 32768
##$TD0= 1
##$TE= 0
##$TE2= 300
##$TE3= 300
##$TEG= 300
##$TL= (0..7)
0 120 53 12 22 120 120 120 
##$TP= (0..7)
150 150 150 150 150 150 150 150 
##$TP07= 0
##$TPNAME0= <>
##$TPNAME1= <>
##$TPNAME2= <>
##$TPNAME3= <>
##$TPNAME4= <>
##$TPNAME5= <>
##$TPNAME6= <>
##$TPNAME7= <>
##$TPOAL= (0..7)
0.5 0.5 0.5 0.5 0.5 0.5 0.5 0.5 
##$TPOFFS= (0..7)
0 0 0 0 0 0 0 0 
##$TUNHIN= 0
##$TUNHOUT= 0
##$TUNXOUT= 0
##$USERA1= <user>
##$USERA2= <user>
##$USERA3= <user>
##$USERA4= <user>
##$USERA5= <user>
##$V9= 5
##$VALIST= <valist>
##$VCLIST= <CCCCCCCCCCCCCCC>
##$VD= 0
##$VDLIST= <DDDDDDDDDDDDDDD>
##$VPLIST= <PPPPPPPPPPPPPPP>
##$VTLIST= <TTTTTTTTTTTTTTT>
##$WBST= 1024
##$WBSW= 4
##$XGAIN= (0..3)
0 0 0 0 
##$XL= 0
##$YL= 0
##$YMAX_a= 1748
##$YMIN_a= -4720
##$ZGOPTNS= <>
##$ZL1= 120
##$ZL2= 120
##$ZL3= 120
##$ZL4= 120
##$ABSF1= 248.5645
##$ABSF2= -253.2056
##$ABSG= 5
##$ABSL= 3
##$ALPHA= 0
##$AQORDER= 0
##$ASSFAC= 0
##$ASSFACI= 0
##$ASSFACX= 0
##$ASSWID= 0
##$AUNMP= <proc_1d>
##$AZFE= 0.1
##$AZFW= 0.5
##$BCFW= 0
##$BC_mod= 2
##$BYTORDP= 0
##$COROFFS= 0
##$CY= -3
##$DATMOD= 1
##$DC= 0
##$DFILT= <>
##$DTYPP= 0
##$F1P= 0
##$F2P= 0
##$FCOR= 1
##$FTSIZE= 65536
##$FT_mod= 6
##$GAMMA= 0
##$GB= 0
##$INTBC= 1
##$INTSCL= 6.047779e-11
##$ISEN= 30
##$LB= 10
##$LEV0= 0
##$LPBIN= 0
##$MAXI= 10000
##$MC2= 0
##$MEAN= 0
##$ME_mod= 0
##$MI= 50
##$NCOEF= 0
##$NC_proc= -11
##$NLEV= 6
##$NOISF1= 182.463
##$NOISF2= 159.3651
##$NSP= 0
##$NTH_PI= 0
##$NZP= 0
##$OFFSET= 248.5645
##$PC= 4
##$PHC0= -13188.79
##$PHC1= 831.2838
##$PH_mod= 1
##$PKNL= yes
##$PPARMOD= 0
##$PSCAL= 0
##$PSIGN= 0
##$REVERSE= no
##$SF= 81.0140089999694
##$SI= 65536
##$SIGF1= 159.3651
##$SIGF2= -187.1042
##$SINO= 113.3802
##$SIOLD= 16384
##$SREGLST= <1H.CDCl3>
##$SSB= 0
##$STSI= 65536
##$STSR= 0
##$SW_p= 40650.406504065
##$SYMM= 0
##$S_DEV= 0
##$TDeff= 32768
##$TDoff= 0
##$TI= <>
##$TILT= no
##$TM1= 0
##$TM2= 0
##$TOPLEV= 0
##$USERP1= <user>
##$USERP2= <user>
##$USERP3= <user>
##$USERP4= <user>
##$USERP5= <user>
##$WDW= 1
##$XDIM= 65536
##$YMAX_p= 236477687
##$YMIN_p= -276030580
$$ End of Bruker specific parameters
$$ ---------------------------------
##NTUPLES= NMR SPECTRUM
##VAR_NAME=  FREQUENCY,     SPECTRUM/REAL,   SPECTRUM/IMAG
##SYMBOL=    X,             R,               I
##VAR_TYPE=  INDEPENDENT,   DEPENDENT,       DEPENDENT
##VAR_FORM=  AFFN,          ASDF,            ASDF
##VAR_DIM=   65536,         65536,           65536
##UNITS=     HZ,            ARBITRARY UNITS, ARBITRARY UNITS
##FACTOR=    0.620285442955139, 1,           1
##FIRST=     20137.2065510682, 0,            0
##LAST=      -20513.1999529968, 0,           0
##MIN=       -20513.1999529968, -276030580,  0
##MAX=       20137.2065510682, 236477687,    0
$$ Real data points
##PAGE= N=1
##DATA TABLE= (X++(R..R)), XYDATA
$$ [...]
##PAGE= N=2
##DATA TABLE= (X++(I..I)), XYDATA
12965B4352966j578495j838610k100781k323232k454307k448065k275910j936657
$$ 24352966 22774471 20935861 18835080 16511848 14057541 11609476 9333566 7396909
12957G396909j462342r14788l70830J01296M66018P30392R29755J096853J236412
$$ 7396909 5934567 5019779 4648949 4750245 5216263 5946655 6876410 7973263 9209675
12948I209675J320629J302178J132833P80929K46177m30771j166974j845173k332925
$$ 9209675 10530304 11832482 12965315 13746244 13992421 13561650 12394676 10549503 8216578
12939H216578k514650k329986j800945j031977j82165N78647J115589J362221
$$ 8216578 5701928 3371942 1570997 539020 356855 935502 2051091 3413312
12931C413312J327441J070962O63442J60808l89167r18787j322730j477588j297136
$$ 3413312 4740753 5811715 6475157 6635965 6246798 5328011 4005281 2527693 1230557
12922A230557p89595p3825O63187J243880J567309J633524J521670J339090J167121
$$ 1230557 440962 367137 1030324 2274204 3841513 5475037 6996707 8335797 9502918
12913I502918J030488R05901P59198N78548L78952J83893Q959j39238k56965l42516
$$ 9502918 10533406 11439307 12198505 12777053 13156005 13339898 13348857 13209619 12952654 12610138
12903A2610138m01225m49105n10491o08616p49562r06492j019712j022482q80010
$$ 12610138 12208913 11759808 11249317 10640701 9891139 8984647 7964935 6942453 6062443
12894F062443o12956k88227J3130K27922L28612L25484K54962J58128O1133k8951
$$ 6062443 5449487 5161260 5174390 5402312 5730924 6056408 6311370 6469498 6530631 6501680
12884F501680j13217j91491k67374l60110n03365p23462j012975j324042j589942
$$ 6501680 6388463 6196972 5929598 5569488 5066123 4342661 3329686 2005644 415702
12875D15702j758671j812998j766142j644817j477375j290651j105470r25412
$$ 415702 -1342969 -3155967 -4922109 -6566926 -8044301 -9334952 -10440422 -11365834
12867a1365834p27573m67570j00488L91576R78341J579018K085833K405233K491980
$$ -11365834 -12093407 -12560977 -12661465 -12269889 -11291548 -9712530 -7626697 -5221464 -2729484
12858b729484K353522K026767J551702R62694K96533l96832j050509j585752j927297
$$ -2729484 -375962 1650805 3202507 4165201 4461734 4064902 3014393 1428641 -498656
12849d98656k029185j901198j615990j283625j003256q20577p16560o30825n00769
$$ -498656 -2527841 -4429039 -6045029 -7328654 -8331910 -9152487 -9869047 -10499872 -11000641
12840a1000641k90723L464L69264P92133J254220J721610K140300K452249K618462
$$ -11000641 -11291364 -11287900 -10918636 -10126503 -8872283 -7150673 -5010373 -2558124 60338
12831F0338K627332K485398K207723J818458J351723Q41602L10942k22402p23371
$$ 60338 2687670 5173068 7380791 9199249 10550972 11392574 11703516 11481114 10757743
12822A0757743j126975j355594j358318j143840p83818l84597m4060J83069K95435
$$ 10757743 9630768 8275174 6916856 5773016 4989198 4604601 4560541 4743610 5039045
12813E039045L31025L42883L79590M75963O48667Q88692J150674J351810J395756
$$ 5039045 5370070 5712953 6092543 6568506 7217173 8105865 9256539 10608349 12004105
12804A2004105J218198Q24834K91229k73889p69140j118668j273762j217607r74140
$$ 12004105 13222303 14047137 14338366 14064477 13295337 12176669 10902907 9685300 8711160
12795H711160o03941j80427K37901O20314R59664J260926J529049J757853J924044
$$ 8711160 8107219 7926792 8164693 8785007 9744671 11005597 12534646 14292499 16216543
12786A6216543J991902J926772J708314J337427Q38464K58319l42673r11720j426296
$$ 16216543 18208445 20135217 21843531 23180958 24019422 24277741 23935068 23023348 21597052
12777B1597052j898749k354387k799031l202880l511943l674895l665916l494168
$$ 21597052 19698303 17343916 14544885 11342005 7830062 4155167 489251 -3004917
12769c004917l199987k838935k457316k071127j664028j208293o94950j52666
$$ -3004917 -6204904 -9043839 -11501155 -13572282 -15236310 -16444603 -17139553 -17292219
12761a7292219L56816P63674J020316J118999J088898R81558Q59027P85267Q07872
$$ -17292219 -16935403 -16171729 -15151413 -14032414 -12943516 -11961958 -11102931 -10317664 -9509792
12752i509792R28234J084556J176002J122690R19110O40151L98036K84092L31430
$$ -9509792 -8581558 -7497002 -6321000 -5198310 -4279200 -3639049 -3241013 -2956921 -2625491
12743b625491N11405P54700R80724J123452J148679J061097Q99660P20451N72268
$$ -2625491 -2114086 -1359386 -378662 744790 1893469 2954566 3854226 4574677 5146945
12734E146945M76872M24305L83560L19846K09924N2110j31053l00137m14458m46761
$$ 5146945 5623817 6048122 6431682 6751528 6961452 7013562 6882509 6582372 6167914 5721153
12724E721153l87589k41164k4050K27819M54344N85003N72415M24491K08429J8562
$$ 5721153 5333564 5092400 5068350 5296169 5750513 6335516 6907931 7332422 7540851 7559413
12714G559413p3730n7780J2314M8475k3511k25293n16114q13318j026839j088289
$$ 7559413 7485683 7427903 7440217 7488692 7465181 7239888 6723774 5910456 4883617 3795328
12704C795328r66659o74432k67764J63532N21531P35728P91104P32200O41092
$$ 3795328 2828669 2154237 1886473 2050005 2571536 3307264 4098368 4830568 5471660
12695E471660O02104O70052Q53514J117957J407013J670241J878910K020053K080788
$$ 5471660 6073764 6743816 7597330 8715287 10122300 11792541 13671451 15691504 17772292
12686A7772292K045708J913653J715273J511171J372364J359167J505654J805537
$$ 17772292 19818000 21731653 23446926 24958097 26330461 27689628 29195282 31000819
12678C1000819K202738K602149K905796L053256L036200K879991K614372K258957
$$ 31000819 33203557 35805706 38711502 41764758 44800958 47680949 50295321 52554278
12670E2554278J827250J333350P89138J98795m33989j085633j699205k196103
$$ 52554278 54381528 55714878 56504016 56702811 56268822 55183189 53483984 51287881
12662E1287881k506068k591925k457523k147525j745631j360274j088235r72913
$$ 51287881 48781813 46189888 43732365 41584840 39839209 38478935 37390700 36417787
12654C6417787r88927j063947j115968j077280q97769n41194J0318P40257J580264
$$ 36417787 35428860 34364913 33248945 32171665 31273896 30732702 30743020 31483277 33063541
12645C3063541K407413L066468L410905L344501K848564J990359R11154k08684
$$ 33063541 35470954 38537422 41948327 45292828 48141392 50131751 51042905 50834221
12637E0834221j200129j948194k405246k577349k505331k254236j903732j528761
$$ 50834221 49634092 47685898 45280652 42703303 40197972 37943736 36040004 34511243
12629C4511243j176920q60773n72796l11065r6570K8558K0379j40311m29742p85119
$$ 34511243 33334323 32473550 31900754 31589689 31493119 31521677 31542056 31401745 30972003 30186884
12619C0186884j131304j412365j605379j711039j737984j699821j624212j556010
$$ 30186884 29055580 27643215 26037836 24326797 22588813 20888992 19264780 17708770
12611A7708770j541034j597300j694664j760325j711936j502044j147997p27429
$$ 17708770 16167736 14570436 12875772 11115447 9403511 7901467 6753470 6026041
12603F026041l41077o6312P1445R7797O6356K9146J4471K1515L3389L8927M5455
$$ 6026041 5684964 5618652 5690097 5787894 5854250 5883396 5897867 5919382 5952771 5991698 6037153
12592F037153P1224J24868J92872K48816K76502K85595L07559L79448N29654P68223
$$ 6037153 6108377 6233245 6426117 6674933 6951435 7237030 7544589 7924037 8453691 9221914
12582I221914J074878J386493J600513J606867J337580Q05078J05752o13998j214522
$$ 9221914 10296792 11683285 13283798 14890665 16228245 17033323 17139075 16525077 15310555
12573A5310555j618872j842019j975572k132735k383146k713925l035591l224665
$$ 15310555 13691683 11849664 9874092 7741357 5358211 2644286 -391305 -3615970
12565c615970l177506k849085k262449j491592o32714K21363R97750J652132K170337
$$ -3615970 -6793476 -9642561 -11905010 -13396602 -14029316 -13807953 -12810203 -11158071 -8987734
12556h987734K562232K849932L055460L191806L258309L240653L116449K865423
$$ -8987734 -6425502 -3575570 -520110 2671696 5930005 9170658 12287107 15152530
12548A5152530K480742J977635J395699P90958K18081k86757p07198j029885j227055
$$ 15152530 17633272 19610907 21006606 21797564 22015645 21728888 21021690 19991805 18764750
12539A8764750j259178j098288p51931k69296K70833P78356J167230J367666J338421
$$ 18764750 17505572 16407284 15655353 15386057 15656890 16435246 17602476 18970142 20308563
12530B0308563J079674O40922J14188l93713q02531j092652j310713j540978j856085
$$ 20308563 21388237 22029159 22143347 21749634 20947103 19854451 18543738 17002760 15146675
12521A5146675k272598k736129l146332l407347l470615l343769l068381k692525
$$ 15146675 12874077 10137948 6991616 3584269 113654 -3230115 -6298496 -8991021
12513h991021k259389j810188j386834j026833p55385n82537n06933n22051o19656
$$ -8991021 -11250410 -13060598 -14447432 -15474265 -16229650 -16812187 -17319120 -17841171 -18460827
12504a8460827p87677j003626j228607j407656j479313j392204j121435o75951
$$ -18460827 -19248504 -20252130 -21480737 -22888393 -24367706 -25759910 -26881345 -27557296
12496b7557296r2993N73311J256920J876547K339522K568962K545400K329405
$$ -27557296 -27650289 -27076978 -25820058 -23943511 -21603989 -19035027 -16489627 -14160222
12488a4160222K039199J794667J667638J668818J768210J923782K098565K264207
$$ -14160222 -12121023 -10326356 -8658718 -6989900 -5221690 -3297908 -1199343 1064864
12480A064864K399926K494833K554158K601159K663917K746945K805642K748424
$$ 1064864 3464790 5959623 8513781 11114940 13778857 16525802 19331444 22079868
12472B2079868K474511J928137J136181K05923p16974j507012k100178k494442
$$ 22079868 24554379 26482516 27618697 27824620 27107646 25600634 23500456 21006014
12464B1006014k714546k772290k654004k341985j850283j246871o44101j58534
$$ 21006014 18291468 15519178 12865174 10523189 8672906 7426035 6781934 6623400
12456F623400J38439K48376K34575J83072J64178K12800L25413M64948N71956
$$ 6623400 6761839 7010215 7244790 7427862 7592040 7804840 8130253 8595201 9167157
12447I167157N83229M52366J63523k64496p79992j303767j740026j994522j997524
$$ 9167157 9750386 10202752 10366275 10101779 9321787 8018020 6277994 4283472 2285948
12438B285948j725992j217485n67210R6360O50249J010738J143386J049567P50802
$$ 2285948 559956 -657529 -1224739 -1128379 -478130 532608 1675994 2725561 3476363
12429C476363K90351k55024p80053j183728j405158j430473j272452r54749n18206
$$ 3476363 3766714 3511690 2731637 1547909 142751 -1287722 -2560174 -3514923 -4033129
12420d033129k9250M35602Q22757J122068J360615J584040J842846K181957K623457
$$ -4033129 -4062379 -3626777 -2804020 -1681952 -321337 1262703 3105549 5287506 7910963
12411G910963L145453L674767M107041M347999M351983M133878L749472L261848
$$ 7910963 11056416 14731183 18838224 23186223 27538206 31672084 35421556 38683404
12403C8683404K718117K146847J567857R99929M60224l9944m94518q94650j220047
$$ 38683404 41401521 43548368 45116225 46116154 46576378 46536434 46041916 45147266 43927219
12394D3927219j439245j518903j431922j158652o89837m1109P28775J515756K191107
$$ 43927219 42487974 40969071 39537149 38378497 37688660 37647551 38376326 39892082 42083189
12385D2083189K631389K743702K486514J887783J048178J15285p63608j481975
$$ 42083189 44714578 47458280 49944794 51832577 52880755 52996040 52232432 50750457
12377E0750457j987495k274269k373127k347699k285670k272627k353242k504007
$$ 50750457 48762962 46488693 44115566 41767867 39482197 37209570 34856328 32352321
12369C2352321k641908k669951k531940k242276j877463j543015j337532j324176
$$ 32352321 29710413 27040462 24508522 22266246 20388783 18845768 17508236 16184060
12361A6184060j508681j826487k151206k333634k259678j895462j291690n48968
$$ 16184060 14675379 12848892 10697686 8364052 6104374 4208912 2917222 2368254
12353B368254K25983R44467J538035J957471K180385K218102K105370J872512
$$ 2368254 2594237 3538704 5076739 7034210 9214595 11432697 13538067 15410579
12345A5410579J520052J018552L38200n10541j454097k367874l115619l590237
$$ 15410579 16930631 17949183 18287383 17776842 16322745 13954871 10839252 7249015
12337G249015l734730l542357l049521k329012j477990n95024K44499R96035J630489
$$ 7249015 3514285 -28072 -3077593 -5406605 -6884595 -7479619 -7235120 -6239085 -4608596
12328d608596K112221K394517K439395K244609J853464J338576P72008K01979
$$ -4608596 -2496375 -101858 2337537 4582146 6435610 7774186 8546194 8748173
12320H748173l53091q96234j438456j987895k545759l108525l669166m209324
$$ 8748173 8395082 7498848 6060392 4072497 1526738 -1581787 -5250953 -9460277
12312i460277m686079n030907n173322n077068m760917m289518l745710l203949
$$ -9460277 -14146356 -19177263 -24350585 -29427653 -34188570 -38478088 -42223798 -45427747
12304d5427747k713471k291492j927617j596959j270230r12753m82982N2693O93227
$$ -45427747 -48141218 -50432710 -52360327 -53957286 -55227516 -56140269 -56623251 -56570558 -55877331
12295e5877331J390835K070632K667867L153193L531213L820804M035368M175962
$$ -55877331 -54486496 -52415864 -49747997 -46594804 -43063591 -39242787 -35207419 -31031457
12287c1031457M238947M228141M157075M036051L854636L577016L158751K578193
$$ -31031457 -26792510 -22564369 -18407294 -14371243 -10516607 -6939591 -3780840 -1202647
12279a202647J864743J104399M13323j09235m20637n43607n43250m91431m39858
$$ -1202647 662096 1766495 2179818 2070583 1649946 1106339 563089 71658 -368200
12270c68200m12655m16748m58511n51569p08643r24936j167932j382099j506999
$$ -368200 -780855 -1197603 -1656114 -2207683 -2916326 -3841262 -5009194 -6391293 -7898292
12261g898292j501686j364675j135488q70291o03486l22908K1048M78508J062437
$$ -7898292 -9399978 -10764653 -11900141 -12770432 -13373918 -13696826 -13675778 -13197270 -12134833
12252a2134833J734952K421383L036575L506000L777697L831648L687293L397994
$$ -12134833 -10399881 -7978498 -4941923 -1435923 2341774 6173422 9860715 13258709
12244A3258709L025495K609301K157383J666793J152753O56876K26405j16489
$$ 13258709 16284204 18893505 21050888 22717681 23870434 24527310 24753715 24637226
12236B4637226l88144o26143q51776j040575j127055j045448p79047l82195M1063
$$ 24637226 24249082 23622939 22771163 21730588 20603533 19558085 18779038 18396843 18437906
12227A8437906L86243N92450O55746O11410N06564L85409K90338K64527L43759
$$ 18437906 18824149 19416599 20072345 20683755 21190319 21575728 21866066 22130593 22474352
12218B2474352N41351Q39125J191375J539663J832936K045863K184250K269334
$$ 22474352 23015703 23854828 25046203 26585866 28418802 30464665 32648915 34918249
12210C4918249K308738K277823K129784J828045J375587Q22295K51796k40369
$$ 34918249 37226987 39504810 41634594 43462639 44838226 45660521 45912317 45671948
12202D5671948n70686o92041o10944l85157r9275J67665L64759M75679N12257
$$ 45671948 45101262 44409221 43798277 43413120 43313845 43481510 43846269 44321948 44834205
12193D4834205M98348M48453L53825J89774n9876l84723p54411j141641j536182
$$ 44834205 45332553 45781006 46134831 46324605 46264729 45880006 45125595 43983954 42447772
12184D2447772j936321k329780k686763k974707l181669l325279l436145l528664
$$ 42447772 40511451 38181671 35494908 32520201 29338532 26013253 22577108 19048444
12176A9048444l585187l568041l448963l232258k956273k675139k433585k248975
$$ 19048444 15463257 11895216 8446253 5213995 2257722 -417417 -2851002 -5099977
12168e099977k110916j999489j909635j861080j882171j978137k110954k210902
$$ -5099977 -7210893 -9210382 -11120017 -12981097 -14863268 -16841405 -18952359 -21163261
12160b1163261k212662k086173j838204j490232j059794n63098k8809M99246R77313
$$ -21163261 -23375923 -25462096 -27300300 -28790532 -29850326 -30413424 -30442233 -29942987 -28965674
12151b8965674J380286J705783J961137K146128K247254K249101K152820J983576
$$ -28965674 -27585388 -25879605 -23918468 -21772340 -19525086 -17275985 -15123165 -13139589
12143a3139589J778170J563672J347183J124418Q94839O66177M44289K19737l4300
$$ -13139589 -11361419 -9797747 -8450564 -7326146 -6431307 -5765130 -5320841 -5101104 -5135404
12134e135404l47912p33622j175703j638951k088407k501783k865676l164372
$$ -5135404 -5483316 -6216938 -7392641 -9031592 -11119999 -13621782 -16487458 -19651830
12126a9651830l375033l473057l440974l274268k981940k581997k094330j537047
$$ -19651830 -23026863 -26499920 -29940894 -33215162 -36197102 -38779099 -40873429 -42410476
12118d2410476r30769l06552K93404Q26465J262982J590308J806552J915605J932447
$$ -42410476 -43341245 -43647797 -43354393 -42527928 -41264946 -39674638 -37868086 -35952481 -34020034
12109c4020034J892437J848145J847725J910523K023219K160456K307422K460184
$$ -34020034 -32127597 -30279452 -28431727 -26521204 -24497985 -22337529 -20030107 -17569923
12101a7569923K606082K709892K724041K613427K371404K016608J580753J100957
$$ -17569923 -14963841 -12253949 -9529908 -6916481 -4545077 -2528469 -947716 153241
12093A53241O17759J71689k03170m82428o48634o90375o11260m42436k40701o4900
$$ 153241 771000 942689 739519 257091 -391543 -1081918 -1693178 -2135614 -2376315 -2441215
12083b441215N2610J13792J35657J23913O3692o7942k82148n66860q88509j202526
$$ -2441215 -2388605 -2274813 -2139156 -2015243 -1951551 -2019493 -2301641 -2868501 -3757010 -4959536
12073d959536j465983j647847j735185j735724j675805j591520j514438j459765
$$ -4959536 -6425519 -8073366 -9808551 -11544275 -13220080 -14811600 -16326038 -17785803
12065a7785803j424621j395791j359512j308106j242550j169717j093817j008573
$$ -17785803 -19210424 -20606215 -21965727 -23273833 -24516383 -25686100 -26779917 -27788490
12057b7788490r00062p58608n84137l75276j15155K23956O54656J149603J640965
$$ -27788490 -28688552 -29447160 -30031297 -30406573 -30521728 -30297772 -29643116 -28493513 -26852548
12048b6852548K044964K293296K353000K227873J946399J547807J076467N85027
$$ -26852548 -24807584 -22514288 -20161288 -17933415 -15987016 -14439209 -13362742 -12777715
12040a2777715J36347k05635l95017m21223l12036j19212J04644L23735N23352
$$ -12777715 -12641368 -12847003 -13242020 -13663243 -13975279 -14094491 -13989847 -13666112 -13142760
12031a3142760P05042Q81711J073383J296624J547188J789057J963664K017049
$$ -13142760 -12437718 -11556007 -10482624 -9186000 -7638812 -5849755 -3886091 -1869042
12023a869042J927856J718978J446497J170812R23613O88890M11108K8098m88871
$$ -1869042 58814 1777792 3224289 4395101 5318714 6007604 6418712 6446810 5957939
12014E957939j109690j748277k291225k633551k699675k444491j851521r44611
$$ 5957939 4848249 3099972 808747 -1824804 -4524479 -6968970 -8820491 -9765102
12006i765102J95332J434355K620156L626875M381368M862193N082213N067652
$$ -9765102 -9569770 -8135415 -5515259 -1888384 2492984 7355177 12437390 17505042
11998A7505042M840868M414332L801184L035492K182656J325308N30731j76786
$$ 17505042 22345910 26760242 30561426 33596918 35779574 37104882 37635613 37458827
11990C7458827q17376j428549k028666k597301l086454l453132l688097l819630
$$ 37458827 36641451 35212902 33184236 30586935 27500481 24047349 20359252 16539622
11982A6539622l890162l921587l890796l731295l365024k753135j939579j056985
$$ 16539622 12649460 8727873 4837077 1105782 -2259242 -5012377 -6951956 -8008941
11974h008941k82194K37330M42227L72740J36322j39990l48395m23938l53380
$$ -8008941 -8291135 -8053805 -7611578 -7238838 -7102516 -7242506 -7590901 -8014839 -8368219
11965h368219j66751Q6162L60127O24729Q62213J067025J252878J455807J719860
$$ -8368219 -8534970 -8448808 -8088681 -7463952 -6601739 -5534714 -4281836 -2826029 -1106169
11956a106169K069537K489185K925856L313198L598040L753020L773907L673579
$$ -1106169 963368 3452553 6378409 9691607 13289647 17042667 20816574 24490153
11948B4490153L482118L248039L027483K858064K733479K601451K391758K056752
$$ 24490153 27972271 31220310 34247793 37105857 39839336 42440787 44832545 46889297
11940D6889297J597495J061635N20377M2191l24326n57094o61320o68008o29312
$$ 46889297 48486792 49548427 50068804 50110995 49786669 49229575 48568255 47900247 47270935
11931D7270935o06537o49589p75786r62067j157513j307392j373565j345412j245464
$$ 47270935 46664398 46014809 45239023 44276956 43119443 41812051 40438486 39093074 37847610
11922C7847610j130570j080829j172020j441338j863927k351941k777750l014728
$$ 37847610 36717040 35636211 34464191 33022853 31158926 28806985 26029235 23014507
11914B3014507k980508k662074k109927j408535o44121J13791Q14821J421216
$$ 23014507 20033999 17371925 15261998 13853463 13209342 13323133 14137954 15559170
11906A5559170J900923K226826K383483K375567K230414J993697J722436J476123
$$ 15559170 17460093 19686919 22070402 24445969 26676383 28670080 30392516 31868639
11898C1868639J302764J222591J221201J260177J296942J295857J222881J036600
$$ 31868639 33171403 34393994 35615195 36875372 38172314 39468171 40691052 41727652
11890D1727652O95903J87956m45750j113934j713865k173933k467480k596191
$$ 41727652 42423555 42611511 42165761 41051827 39337962 37164029 34696549 32100358
11882C2100358k570593k409479k152248j864552j629857j533879j647167k004145
$$ 32100358 29529765 27120286 24968038 23103486 21473629 19939750 18292583 16288438
11874A6288438k581080l286586l977534m496596m711820m541517l965345l032876
$$ 16288438 13707358 10420772 6443238 1946642 -2765178 -7306695 -11272040 -14304916
11866a4304916j869776o64155L80535J110368J465374J478572J240188Q57408
$$ -14304916 -16174692 -16838847 -16458312 -15347944 -13882570 -12403998 -11163810 -10306402
11858a0306402M29243L5871k64966m38188m69811l65868j52461J25262M08158
$$ -10306402 -9877159 -9841288 -10106254 -10544442 -11014253 -11380121 -11532582 -11407320 -10999162
11849a0999162O34725P60085P75461P12754O23604N43785M70226L68793K04941
$$ -10999162 -10364437 -9604352 -8828891 -8116137 -7492533 -6948748 -6478522 -6109729 -5904788
11840e904788k6073k87423n12051o31534o08339m52367k11884N0559K76176M14704
$$ -5904788 -5930861 -6218284 -6730335 -7361869 -7970208 -8422575 -8634459 -8583900 -8307724 -7893020
11830g893020M27636L00224N3567k59623n76561q46791j041004j146943j160770
$$ -7893020 -7465384 -7165160 -7111593 -7371216 -7947777 -8794568 -9835572 -10982515 -12143285
11821a2143285j079700r00085o25343k80419Q3562M08649O64366Q67580J067874
$$ -12143285 -13222985 -14123070 -14748413 -15028832 -14945270 -14536621 -13872255 -13004675 -11936801
11812a1936801J309584J601021J911130K190028K397233K524336K605083K707381
$$ -11936801 -10627217 -9026196 -7115066 -4925038 -2527805 -3469 2601614 5308995
11804E308995K904554L234007L665236M100694M414369M506083M338694L940725
$$ 5308995 8213549 11447556 15112792 19213486 23627855 28133938 32472632 36413357
11796C6413357L382339K744353K093165J464386Q56598K38913m27815j165312
$$ 36413357 39795696 42540049 44633214 46097600 46954198 47193111 46765296 45599984
11788D5599984j961235k769690l526078m165274m632703m885864m892550m633837
$$ 45599984 43638749 40869059 37342981 33177707 28545004 23659140 18766590 14132753
11780A4132753m114134l372811k488385j568124p22101k8527M95115Q98018J268809
$$ 14132753 10018619 6645808 4157423 2589299 1867198 1838671 2333786 3231804 4500613
11771D500613J682780K151740K609782K947359L071710K954017K637264K207437
$$ 4500613 6183393 8335133 10944915 13892274 16963984 19918001 22555265 24762702
11763B4762702J748869J306833Q75425M17899r3887o50738j210130j725168k169887
$$ 24762702 26511571 27818404 28693829 29111728 29017841 28367103 27156973 25431805 23261918
11754B3261918k541076k841233l061284l177344l162715l004153k707646k288841
$$ 23261918 20720842 17879609 14818325 11640981 8478266 5474113 2766467 477626
11746D77626j760578j134927m40609K63153Q94632J377356J668747J771684J723595
$$ 477626 -1282952 -2417879 -2858488 -2595335 -1700703 -323347 1345400 3117084 4840679
11737D840679J570802J343820J048748O79989K45873k08744n97319q10297p52951
$$ 4840679 6411481 7755301 8804049 9484038 9729911 9521167 8923848 8113551 7360600
11728G360600l86519K46500J025048J781086K352463K639901K640989K438814
$$ 7360600 6974081 7220581 8245629 10026715 12379178 15019079 17660068 20098882
11720B0098882K151148J876240J669181J549924J518057J556271J626775J673361
$$ 20098882 22250030 24126270 25795451 27345375 28863432 30419703 32046478 33719839
11712C3719839J632787J450811J098203N83144m5390p08739j323408j829714k208596
$$ 33719839 35352626 36803437 37901640 38484784 38439394 37730655 36407247 34577533 32368937
11703C2368937k475287k654246k755617k772725k699657k548516k348319k127400
$$ 32368937 29893650 27239404 24483787 21711062 19011405 16462889 14114570 11987170
11695A1987170j895967j643157j350509j012808o52896l20193p3531M0694L952
$$ 11987170 10091203 8448046 7097537 6084729 5431833 5111640 5038109 5078803 5082755
11686E082755j67600m22443o81708q61154r01763p89930n52283k32402J26940
$$ 5082755 4915155 4492712 3811004 2949850 2048087 1258157 705874 473472 600412
11677F00412M82948P85879R87502J066990J051795J011989J030904J173439J467391
$$ 600412 1083360 1869239 2856741 3923731 4975526 5987515 7018419 8191858 9659249
11668I659249J896785K402999K897695L290846L521750L571208L447071L160839
$$ 9659249 11556034 13959033 16856728 20147574 23669324 27240532 30687603 33848442
11660C3848442K720816K147555J491886Q31702K44206k26822n84992q68404j120557
$$ 33848442 36569258 38716813 40208699 41040401 41284607 41057785 40472793 39604389 38483832
11651C8483832j362920j581684j732218j758758j622807j328993r34865n37036
$$ 38483832 37120912 35539228 33807010 32048252 30425445 29096452 28161587 27624551
11643B7624551k38431j11395j72184l76864o41562q80206j040928j119069j140952
$$ 27624551 27386120 27274725 27102541 26725677 26084115 25203909 24162981 23043912 21902960
11634B1902960j137177j130105j139406j187392j289688j438993j600108j722581
$$ 21902960 20765783 19635678 18496272 17308880 16019192 14580199 12980091 11257510
11626A1257510j762593j704300j574445j442046j395291j502150j777790k178637
$$ 11257510 9494917 7790617 6216172 4774126 3378835 1876685 98895 -2079742
11618b079742k620215l000236l216305l183566k857747k254122j446526n44481
$$ -2079742 -4699957 -7700193 -10916498 -14100064 -16957811 -19211933 -20658459 -21202940
11610b1202940L35610J089992J639187J941517K007380J899429J709794J525506
$$ -21202940 -20867330 -19777338 -18138151 -16196634 -14189254 -12289825 -10580031 -9054525
11602i054525J402824J359581J379043J417213J414170J313602J088527P62921
$$ -9054525 -7651701 -6292120 -4913077 -3495864 -2081694 -768092 320435 1083356
11594A083356M15850J59210R3963K67070O56392J193231J804372K443132L091115
$$ 1083356 1499206 1658416 1752379 2019449 2675841 3869072 5673444 8116576 11207691
11585A1207691L735516M341838M842544N151544N198572M965984M509934L954578
$$ 11207691 14943207 19285045 24127589 29279133 34477705 39443689 43953623 47908201
11577D7908201L455287L137739L038584L085320L135091L049591K756561K264254
$$ 47908201 51363488 54501227 57539811 60625131 63760222 66809813 69566374 71830628
11569G1830628J633447R33209K03801n59128j392253k330544l372011m460612
$$ 71830628 73464075 74397284 74601085 74041957 72649704 70319160 66947149 62486537
11561F2486537n490733o326891o835281o922604o565628n812134m753611l491993
$$ 62486537 56995804 50668913 43833632 36911028 30345400 24533266 19779655 16287662
11553A6287662k120884p22865O25781J848978K868480L612824M037535M141120
$$ 16287662 14166778 13443913 14069694 15918672 18787152 22399976 26437511 30578631
11545C0578631L959069L537800K910501K094546J109474k094j166646k286957
$$ 30578631 34537700 38075500 40986001 43080547 44190021 44187927 43021281 40734324
11537D0734324l254775l962113m315660m260890l807939l038673k085507j096703
$$ 40734324 37479549 33517436 29201776 24940886 21132947 18094274 16008767 14912064
11529A4912064k08799M71113Q82413J024630R53153P54354N17702L19695K14521
$$ 14912064 14703265 15174378 16056791 17081421 18034574 18788928 19306630 19626325 19840846
11520A9840846K21793L18606M51741N68966O47533P00130P58970Q52645R87592
$$ 19840846 20062639 20381245 20832986 21401952 22049485 22749615 23508585 24361230 25348822
11511B5348822J137224J239454J207465R59203M59941k45221j036244j765727
$$ 25348822 26486046 27725500 28932965 29892168 30352109 30106888 29070644 27304917
11503B7304917k321397k663060k814148k821473k715555k497754k158053j704087
$$ 27304917 24983520 22320460 19506312 16684839 13969284 11471530 9313477 7609390
11495G609390j174653o26844j11359L41452P18423J015548J237001J400668J541869
$$ 7609390 6434737 5807893 5696534 6037986 6756409 7771957 9008958 10409626 11951495
11486A1951495J707486J935848K227249K525762K736190K774207K613686K293656
$$ 11951495 13658981 15594829 17822078 20347840 23084030 25858237 28471923 30765579
11478C0765579J883903J442863R99639N64697J53132j98650m36114n11993m19056
$$ 30765579 32649482 34092345 35091984 35656681 35809813 35611163 35175049 34663056 34244000
11469C4244000k04355M9325K61557L84120M07690L52511K56967J69025J37926
$$ 34244000 34039645 34088970 34350527 34734647 35142337 35494848 35751815 35920840 36058766
11460C6058766K04673L92389O96962J080776J477707J815954K049924K177996
$$ 36058766 36263439 36655828 37352790 38433566 39911273 41727227 43777151 45955147
11452D5955147K229190K227534K163497J996158J683702J218425O42499L7070
$$ 45955147 48184337 50411871 52575368 54571526 56255228 57473653 58116152 58153222
11444E8153222n06707r20394j181955j320956j401932j493659j641166j854150
$$ 58153222 57646515 56726121 55544166 54223210 52821278 51327619 49686453 47832303
11436D7832303k111534k373370k595559k747865k828933k864579k886038k905694
$$ 47832303 45720769 43347399 40751840 38003975 35175042 32310463 29424425 26518731
11428B6518731k911356k879426k789173k627097k387595k078060j724718j371135
$$ 26518731 23607375 20727949 17938776 15311679 12924084 10846024 9121306 7750171
11420G750171j069130q67014p96969q63216j038945j279433j545065j816069k087417
$$ 7750171 6681041 5814027 5017058 4153842 3114897 1835464 290399 -1525670 -3613087
11411c613087k351218k584463k752699k824664k783847k627680k357799j972830
$$ -3613087 -5964305 -8548768 -11301467 -14126131 -16909978 -19537658 -21895457 -23868287
11403b3868287j470177q52277j29894O77267J536877K397286L186638L825346
$$ -23868287 -25338464 -26190741 -26320635 -25643368 -24106491 -21709205 -18522567 -14697221
11395a4697221M248060M421617M346898M044173L534902K836853J978058J016690
$$ -14697221 -10449161 -6027544 -1680646 2363527 5898429 8735282 10713340 11730030
11387A1730030M7213q15794j467716j842880j931140j776852j461822j082072
$$ 11730030 11777243 10961449 9493733 7650853 5719713 3942861 2481039 1398967
11379A398967p31158m92205m27923n61059q56363j224718j555458j759191j795472
$$ 1398967 667809 175604 -252319 -813378 -1669741 -2894459 -4449917 -6209108 -8004580
11370h004580j672609j425749j090233o87003k26744K74836P86488J264742J665659
$$ -8004580 -9677189 -11102938 -12193171 -12880174 -13106918 -12832082 -12045594 -10780852 -9115193
11361i115193J953206K099986K086243J903157J559277J084758N30560l7119n47095
$$ -9115193 -7161987 -5062001 -2975758 -1072601 486676 1571434 2101994 2064875 1517780
11352A517780r38042j173763j250142j187744j014717p53894m25046n8811K93012
$$ 1517780 579738 -594025 -1844167 -3031911 -4046628 -4800522 -5225568 -5284379 -4991367
11343d991367N63402O90633O40281M16693O0438l65277p94103j175067j481484
$$ -4991367 -4427965 -3737332 -3097051 -2680358 -2619920 -2985197 -3779300 -4954367 -6435851
11334f435851j705174j840757j873484j781971j554185j202297p61751k73533
$$ -6435851 -8141025 -9981782 -11855266 -13637237 -15191422 -16393719 -17155470 -17429003
11326a7429003K35609P57641J288706J809295K277452K641833K865043K940510
$$ -17429003 -17193394 -16435753 -15147047 -13337752 -11060300 -8418467 -5553424 -2612914
11318b612914K891463K753088K549736K281560J928176J465656Q86379K12290
$$ -2612914 278549 3031637 5581373 7862933 9791109 11256765 12143144 12355434
11310A2355434n03058j184033j751435k143382k329934k315246k127736j804884
$$ 12355434 11852376 10668343 8916908 6773526 4443592 2128346 610 -1804274
11302a804274j381427q86993l51528J90493P05426J172286J587322J951452K248027
$$ -1804274 -3185701 -4072694 -4424222 -4233729 -3528303 -2356017 -768695 1182757 3430784
11293C430784K431554K443134K248344J873676J412198R84662O74147M78583L18906
$$ 3430784 5862338 8305472 10553816 12427492 13839690 14824352 15498499 15977082 16295988
11284A6295988R8728k30149o42287j059852j392031j565773j544689j342680j027539
$$ 16295988 16394716 16164567 15522280 14462428 13070397 11504624 9959935 8617255 7589716
11275G589716p01839m60813l46161l20086k73528o7882M04432J167460K146144
$$ 7589716 6887877 6427064 6080903 5760817 5487289 5419407 5823839 6991299 9137443
11266I137443L198124M172760M960736N509770N809852N868899N696117N296671
$$ 9137443 12335567 16508327 21469063 26978833 32788685 38657584 44353701 49650372
11258D9650372M673379L833126K798670J622491L92118p81914j791534k555511
$$ 49650372 54323751 58156877 60955547 62578038 62970156 62188242 60396708 57841197
11250E7841197l032873l228088l192637l017238k805709k636828k538001k490505
$$ 57841197 54808324 51580236 48387599 45370361 42564652 39927824 37389823 34899318
11242C4899318k461253k435626k427642k462861k548541k652902k708448k638146
$$ 34899318 32438065 30002439 27574797 25111936 22563395 19910493 17202045 14563899
11234A4563899k388401j949743j356803o73668K2176O48757J123860J373910J351839
$$ 14563899 12175498 10225755 8868952 8195284 8217460 8866217 9990077 11363987 12715826
11225A2715826J055606N32552j36027q58682j548122k120803k495568k609430
$$ 12715826 13771432 14303984 14167957 13309275 11761153 9640350 7144782 4535352
11217D535352k450073k079760j621740j207947r21480p72947p19576p03407o81386
$$ 4535352 2085279 5519 -1616221 -2824168 -3745648 -4518595 -5238171 -5941578 -6622964
11208f622964o39129n91762n72169o07384o95939q04921q90408r23729r02491
$$ -6622964 -7262093 -7853855 -8426024 -9033408 -9729347 -10534268 -11424676 -12348405 -13250896
11199a3250896q41390p53484o35164m61648j94355K01717P35943J375207K043527
$$ -13250896 -14092286 -14845770 -15480934 -15942582 -16136937 -15935220 -15199277 -13824070 -11780543
11190a1780543K642457L082768L308644L302509L076054K661728K110305J488168
$$ -11780543 -9138086 -6055318 -2746674 555835 3631889 6293617 8403922 9892090
11182I892090Q69540L28487o4446k47012j81619J18889N74941J053160J409957
$$ 9892090 10761630 11090117 11025671 10778659 10597040 10715929 11290870 12344030 13753987
11173A3753987J544320J429464J107019O53957J49226l41353p65990j087898j288697
$$ 13753987 15298307 16727771 17834790 18488747 18637973 18296620 17530630 16442732 15154035
11164A5154035j363305j302861j082278o72025p0982O65953J428850K082046K504108
$$ 15154035 13790730 12487869 11405591 10733566 10662584 11328537 12757387 14839433 17343541
11155A7343541K621462K426007J971112J346502O45190n7949p07766j261085j684178
$$ 17343541 19965003 22391010 24362122 25708624 26353814 26295865 25588099 24327014 22642836
11146B2642836j956400k070195k022898j807734j414177q40688j14621O91929
$$ 22642836 20686436 18616241 16593343 14785609 13371432 12530744 12416123 13108052
11138A3108052J464049K071435K412084K447743K210049J777370J241070O81060
$$ 13108052 14572101 16643536 19055620 21503363 23713412 25490782 26731852 27412912
11130B7412912J58021k82126o00369p61301p38269n25484j51145L15362P67571
$$ 27412912 27570933 27288807 26688438 25927137 25188868 24663384 24512239 24827601 25595172
11121B5595172J081002J147870R19831M40203j56821o89451r98923j012700p66891
$$ 25595172 26676174 27824044 28743875 29184078 29027257 28337806 27338883 26326183 25559292
11112B5559292l77121K4015L47673N77099P55216R47192J202383J530792J895099
$$ 25559292 25182171 25206186 25553859 26130958 26886174 27833366 29035749 30566541 32461640
11103C2461640K215387K387678K316489J951246J307523M59290m93959j464775
$$ 32461640 34677027 37064705 39381194 41332440 42639963 43099253 42605294 41140519
11095D1140519k397508l262350m035525m685597n175419n472857n559115n431756
$$ 41140519 38743011 35480661 31445136 26759539 21584120 16111263 10552148 5120392
11087E120392n106231m616907m014903l361803k721017k146319j667513j279777
$$ 5120392 14161 -4602746 -8617649 -11979452 -14700469 -16846788 -18514301 -19794078
11079a9794078r46861o19353k56742J58645O17990J089192J525402J877847K108489
$$ -19794078 -20740939 -21360292 -21617034 -21458389 -20840399 -19751207 -18225805 -16347958 -14239469
11070a4239469K198455K152951K002535J794586J570899J342607J083596P51832
$$ -14239469 -12041014 -9888063 -7885528 -6090942 -4520043 -3177436 -2093840 -1342008
11062a342008L24858j74444o75805j082188j303693j291994j060357o78616k45542
$$ -1342008 -1017150 -1191594 -1867399 -2949587 -4253280 -5545274 -6605631 -7284247 -7529789
11053g529789J46243M37168O13029P03478P67913Q70407J050594J302608J572672
$$ -7529789 -7383546 -6946378 -6333349 -5629871 -4861958 -3991551 -2940957 -1638349 -65677
11044f5677J778978J848807J758063J550240J316545J142985J058398J021366
$$ -65677 1713301 3562108 5320171 6870411 8186956 9329941 10388339 11409705
11036A1409705R55477Q05416N72727L09217P9046p8586j60831j87966j87399j90503
$$ 11409705 12365182 13170598 13743325 14052542 14131588 14053002 13892171 13704205 13516806 13326303
11026A3326303k34375l51470n48354p94796j037831j230082j349524j400459j402785
$$ 13326303 13091928 12740458 12192104 11397308 10359477 9129395 7779871 6379412 4976627
11017D976627j380416j353455j333566j321100j303337j256478j156084r94357
$$ 4976627 3596211 2242756 909190 -411910 -1715247 -2971725 -4127809 -5122166
11009e122166p91615n87887m16356k78420j41095M0822K95737O21305R92103J375549
$$ -5122166 -5913781 -6501668 -6918024 -7196444 -7337539 -7296717 -7000980 -6379675 -5387572 -4012023
10999d012023J737804K036878K216867K215273J979042J478773P20060k42986
$$ -4012023 -2274219 -237341 1979526 4194799 6173841 7652614 8372674 8129688
10991H129688j298482k290174l060706l505006l601313l402945l001290k484690
$$ 8129688 6831206 4541032 1480326 -2024680 -5625993 -9028938 -12030228 -14514918
10983a4514918j912716j310777o79596j2241O86817J387789K036011K569775K944501
$$ -14514918 -16427634 -17738411 -18418007 -18430248 -17743431 -16355642 -14319631 -11749856 -8805355
10974h805355L145194L180144L066315K821719K468953K042331J589641J165334
$$ -8805355 -5660161 -2480017 586298 3408017 5876970 7919301 9508942 10674276
10966A0674276Q17821N77260M50604M25882M80814N89008P21966Q50325R47774
$$ 10674276 11492097 12069357 12519961 12945843 13426657 14015665 14737631 15587956 16535730
10957A6535730R97363R96427R55298Q88057Q00478O84921N27117L19655P2302
$$ 16535730 17533093 18529520 19484818 20372875 21173353 21858274 22385391 22705046 22777348
10948B2777348j85570m09743n52340n79354m88952l19606j40048k3094j3482j03398
$$ 22777348 22591778 22182035 21629695 21050341 20561389 20241783 20101735 20078641 20065159 19961761
10938A9961761k29658l00362k41907l8926K59823N72034Q23713R72976J006977
$$ 19961761 19732103 19431741 19189834 19150908 19410731 19982765 20806478 21779454 22786431
10929B2786431R26456P37435M57074J24370k00251m54605o03971o56906o51381
$$ 22786431 23712887 24450322 24907396 25031766 24831515 24376910 23772939 23116033 22464652
10920B2464652o20540n68503m78935l47583k06245j14650j27964k68270n19942
$$ 22464652 21844112 21275609 20796674 20449091 20242846 20128196 20000232 19731962 19212020
10911A9212020q45290j203446j560822j892539k178472k396639k517739k506383
$$ 19212020 18366730 17163284 15602462 13709923 11531451 9134812 6617073 4110690
10903D110690k330239j971114j431527p36930O4542R09259J737038K512102L224884
$$ 4110690 1780451 -190663 -1622190 -2359120 -2294578 -1385319 351719 2863821 6088705
10894F088705L867178M402293M761192M871704M697599M259120L624203K877983
$$ 6088705 9955883 14358176 19119368 23991072 28688671 32947791 36571994 39449977
10886C9449977K087208J279933M55828l77054j166598j811524k192297k217218
$$ 39449977 41537185 42817118 43272946 42895892 41729294 39917770 37725473 35508255
10878C5508255j858627j167254k64293O86649J522878K127856K458206K537852
$$ 35508255 33649628 32482374 32218081 32904730 34427608 36555464 39013670 41551522
10870D1551522K423012K160892J768822J243675N87675j72595r85160j782520
$$ 41551522 43974534 46135426 47904248 49147923 49735598 49563003 48577843 46795323
10862D6795323k490206l030969l330750l331788l010459k391223j548222n91950
$$ 46795323 44305117 41274148 37943398 34611610 31601151 29209928 27661706 27069756
10854B7069756L54198J178621J800266K177878K308678K218038J946229J539904
$$ 27069756 27423954 28602575 30402841 32580719 34889397 37107435 39053664 40593568
10846D0593568J050058N30901L5170l91142p10206q92665r22666q05590n70301
$$ 40593568 41643626 42174527 42209697 41818555 41108349 40215684 39293018 38487428 37917127
10837C7917127k63848N4403L16442M55226M25774K26585r7181m72123q20191j070375
$$ 37917127 37653279 37707682 38024124 38479350 38905124 39131709 39034528 38562405 37742214 36671839
10827C6671839j158860j031814o60772o4711O79288J450704K119625K576792K742078
$$ 36671839 35512979 34481165 33820393 33755682 34434970 35885674 38005299 40582091 43324169
10818D3324169K560168K007025J113393j7597j222985k318280l135514l545920
$$ 43324169 45884337 47891362 49004755 48987158 47764173 45445893 42310379 38764459
10810C8764459l474924k918868j954937p28468N82090J803400K791623L443896
$$ 38764459 35289535 32370667 30415730 29687262 30269352 32072752 34864375 38308271
10802C8308271L707756L590661L159207K519377J784511J048353L75081j96371
$$ 38308271 42016027 45606688 48765895 51285272 53069783 54118136 54493217 54296846
10794E4296846o44830r64795j170071j296990j399313j531247j724084j968934
$$ 54296846 53652016 52687221 51517150 50220160 48820847 47289600 45565516 43596582
10786D3596582k216141k392649k429640k289361j980758j557332j097438o75368
$$ 43596582 41380441 38987792 36558152 34268791 32288033 30730701 29633263 28957895
10778B8957895l36441q7647R2455K32424L50775M53560N41667O14159O63580O74053
$$ 28957895 28621454 28533807 28626262 28858686 29209461 29663021 30204688 30818847 31482427 32156480
10768C2156480O31137N35642M06164K66519J28349k0243k14978n01821r11118
$$ 32156480 32787617 33323259 33729423 33995942 34124291 34104048 33889070 33387249 32476131
10759C2476131j433471k018015k598170l123727l571032l924801m152158m195945
$$ 32476131 31042660 29024645 26426475 23302748 19731716 15806915 11654757 7458812
10751G458812l997298l533954k848149k043649j251430n83303r7985K06948L79231
$$ 7458812 3461514 -72440 -2920589 -4964238 -6215668 -6798971 -6896956 -6690008 -6310777
10742f310777M81355N55126N93374N35331K97304j71038q38596j587206k253110
$$ -6310777 -5829422 -5274296 -4680922 -4145591 -3848287 -4019325 -4857921 -6445127 -8698237
10733h698237k686806k797109k566224k043178j326437n41882J80803P33596J059146
$$ -8698237 -11385043 -14182152 -16748376 -18791554 -20117991 -20659873 -20479070 -19745474 -18686328
10724a8686328J175335J173566J176407J273529J478064J728014J920189J950767
$$ -18686328 -17510993 -16337427 -15161020 -13887491 -12409427 -10681413 -8761224 -6810457
10716f810457J751087J316749P18800Q2718m59745q18592r67064r30777p58104
$$ -6810457 -5059370 -3742621 -3023821 -2941103 -3400848 -4219440 -5186504 -6117281 -6875385
10707f875385m92017j58489K26840O45234J067873J457891J775383J981179K040776
$$ -6875385 -7367402 -7525891 -7299051 -6653817 -5585944 -4128053 -2352670 -371491 1669285
10698A669285J930378J645169J209255O82970J57461k69610n26407n85681m59765
$$ 1669285 3599663 5244832 6454087 7137057 7294518 7024908 6498501 5912820 5453055
10689E453055j83337J98858O35718J073597J466025J786070K034283K236997K432234
$$ 5453055 5269718 5468576 6104294 7177891 8643916 10429986 12464269 14701266 17133500
10680A7133500K645876K869592L056926L145206L092474K905783K642339K384396
$$ 17133500 19779376 22648968 25705894 28851100 31943574 34849357 37491696 39876092
10672C9876092K205633K147511K211299K359664K522303K608046K528210K226944
$$ 39876092 42081725 44229236 46440535 48800199 51322502 53930548 56458758 58685702
10664E8685702J703267J009730K26816n71557j341502k070122k755646l378927
$$ 58685702 60388969 61398699 61625515 61053958 59712456 57642334 54886688 51507761
10656E1507761l885031m192063m228286l974492l479206k834350k131314j430201
$$ 51507761 47622730 43430667 39202381 35227889 31748683 28914333 26783019 25352818
10648B5352818p58320j28616M42240R30008J312993J584099J751489J826419J810499
$$ 25352818 24594498 24465882 24908122 25838130 27151123 28735222 30486711 32313130 34123629
10639C4123629J694612J468649J132977P06648K31873k28624o05355q41358r05043
$$ 34123629 35818241 37286890 38419867 39126515 39358388 39129764 38524409 37683051 36778008
10630C6778008p92773n27597j56095K63668O82819J074403J424545J713057J908386
$$ 36778008 35985235 35457638 35301543 35565211 36248030 37322433 38746978 40460035 42368421
10621D2368421J984514J942293J816055J664572J555375J545598J659131J869191
$$ 42368421 44352935 46295228 48111283 49775855 51331230 52876828 54535959 56405150
10613E6405150K101700K263208K277412K108939J766438J292353P48888K02774
$$ 56405150 58506850 60770058 63047470 65156409 66922847 68215200 68964088 69166862
10605F9166862k91649p07226j048435j340984j611389j868409k096734k265127
$$ 69166862 68875213 68167987 67119552 65778568 64167179 62298770 60202036 57936909
10597E7936909k342393k311214k173207j946115j660416j362056j117952j009410
$$ 57936909 55594516 53283302 51110095 49163980 47503564 46141508 45023556 44014146
10589D4014146j101378j397912j816876k211726k433251k392920k091753j607203
$$ 44014146 42912768 41514856 39697980 37486254 35053003 32660083 30568330 28961127
10581B8961127j053829n37950j22592J83956M11947N99291P68101R20235J045366
$$ 28961127 27907298 27369348 27246756 27430712 27842659 28441950 29210051 30130286 31175652
10572C1175652J129830J162320J138208J061916R45784Q08487O77579N92510N97658
$$ 31175652 32305482 33467802 34606010 35667926 36613710 37422197 38099776 38692286 39289944
10563C9289944P21836R56109J246552J506821J642023J574779J270107P54751
$$ 39289944 40011780 40967889 42214441 43721262 45363285 46938064 48208171 48962922
10555D8962922J20232m98194r61246j168679j090716p75514l24030J60217O14887
$$ 48962922 49083154 48584960 47623714 46455035 45364319 44588805 44264775 44424992 45039879
10546D5039879J022938J379763J663767J843531J910174J896261J861483J860875
$$ 45039879 46062817 47442580 49106347 50949878 52860052 54756313 56617796 58478671
10538E8478671J922410K045498K213703K407993K610011K795262K927099K962115
$$ 58478671 60401081 62446579 64660282 67068275 69678286 72473548 75400647 78362762
10530G8362762K864765K619820K236085J743763J186928O08484L0808n53765j169832
$$ 78362762 81227527 83847347 86083432 87827195 89014123 89622607 89653415 89099650 87929818
10521H7929818j827806k495786l094884l522749l693090l571611l191681k641285
$$ 87929818 86102012 83606226 80511342 76988593 73295503 69723892 66532211 63890926
10513F3890926k024640j416357q33464k39023M32267J245805K243836L426680
$$ 63890926 61866286 60449929 59616465 59377442 59809709 61055514 63299350 66726030
10505F6726030M748232O139039P544537Q942342J0324304J1673416J2968597J4207757
$$ 66726030 71474262 77613301 85157838 94100180 104424484 116097900 129066497 143274254
10497A43274254J5414537J6616286J7807414J8909764J9734052J9953979J9108409
$$ 143274254 158688791 175305077 193112491 212022255 231756307 251710286 270818695
10490B70818695J6646937J2057319N118552l782045j3501319k2401264k8970075
$$ 270818695 287465632 299522951 304641503 300859458 287358139 264956875 235986800
10483B35986800l2418122l2855954l1013087k7791872k3959342k0054465j6418619
$$ 235986800 203568678 170712724 139699637 111907765 87948423 67893958 51475339
10476E1475339j3252024j0655136q644782p154114o045224n152958m341592l540474
$$ 51475339 38223315 27568179 18923397 11769283 5724059 571101 -3770491 -7310965
10468g310965k746329k002539j368461q90959n90977m66152m94108o27556p94811
$$ -7310965 -10057294 -12059833 -13428294 -14319253 -14910230 -15376382 -15870490 -16498046 -17292857
10459a7292857r21190r61763r19686q36735p63647p27696p16329o88968o07721
$$ -17292857 -18214047 -19175810 -20095496 -20932231 -21695878 -22423574 -23139903 -23828871 -24436592
10450b4436592m57747k38666N6929M47421R42604J523522K143070K745283L286162
$$ -24436592 -24894339 -25133005 -25076076 -24628655 -23686051 -22162529 -20019459 -17274176 -13988014
10441a3988014L741288M097690M341065M453711M425965M265950L993546L623615
$$ -13988014 -10246726 -6149036 -1807971 2645740 7071705 11337655 15331201 18954816
10433A8954816L154175K566598J836292R54611m1650j054223j944216k583440
$$ 18954816 22108991 24675589 26511881 27466492 27424842 26370619 24426403 21842963
10425B1842963k899654k888249k598432k117490j558601j040017o51988m28118
$$ 21842963 18943309 16055060 13456628 11339138 9780537 8740520 8088532 7660414
10417G660414l40954l23992l03682k23430n4674J98823M99842P84899R83571J041312
$$ 7660414 7319460 6995468 6691786 6468356 6413682 6612505 7112347 7897246 8880817 9922129
10407I922129R31353O52172K21147l25399r27498j502134j957257k218980k261277
$$ 9922129 10853482 11505654 11726801 11401402 10473904 8971770 7014513 4795533 2534256
10398B534256k119490j874872j617038j407235j260108j144539r96977p45624
$$ 2534256 414766 -1460106 -3077144 -4484379 -5744487 -6889026 -7886003 -8631627
10390h631627l43226K04772Q34891J448342J948341K271994K403864K369387K214457
$$ -8631627 -8974853 -8770081 -7935190 -6486848 -4538507 -2266513 137351 2506738 4721195
10381D721195J982517J700037J374624J002248N77092R9769m17381r47692j450374
$$ 4721195 6703712 8403749 9778373 10780621 11357713 11457482 11040101 10092409 8642035
10372H642035j874989k172516k311480k290641k138003j895365j600367j279475
$$ 8642035 6767046 4594530 2283050 -7591 -2145594 -4040959 -5641326 -6920801
10364f920801r53058o41402l62023j20957R1487K94667N05954P32917R73875J222761
$$ -6920801 -7873859 -8515261 -8877284 -8998241 -8906754 -8612087 -8106133 -7373216 -6399341 -5176580
10354e176580J470602J700384J880395J965329J909899J690502J324107Q72843
$$ -5176580 -3705978 -2005594 -125199 1840130 3750029 5440531 6764638 7637481
10346G637481M27723P5106j37338k13631j93460j21852k8266P5196J85388L01552
$$ 7637481 8065204 8140310 8002972 7789341 7595881 7474029 7445763 7520959 7706347 8007899
10336H007899M23679N53640O97386Q64629J060545J271591J458403J565499J541007
$$ 8007899 8431578 8985218 9682604 10547233 11607778 12879369 14337772 15903271 17444278
10327A7444278J351302R86287M62532j73207q48719j484773k017362k407804k637346
$$ 17444278 18795580 19781867 20244399 20071192 19222473 17737700 15720338 13312534 10675188
10318A0675188k698758k597097k356602k019643j631149j219487p90024l33514
$$ 10675188 7976430 5379333 3022731 1003088 -628061 -1847548 -2637572 -2971086
10310b971086J63303P12015J314064J943687K535270K993766L225920L169704
$$ -2971086 -2807783 -2095768 -781704 1161983 3697253 6691019 9916939 13086643
10302A3086643K807122K167064J327678M12294m32223j071547j419027j457889
$$ 13086643 15893765 18060829 19388507 19800801 19368578 18297031 16878004 15420115
10294A5420115j244902q89570n09328j81724P3570K71205M21244N12413N26396
$$ 15420115 14175213 13285643 12776315 12594591 12668161 12939366 13360610 13873023 14399419
10285A4399419M57961L15810J08570j59026m67449p58654r38025r15176o64246
$$ 14399419 14857380 15173190 15281760 15122734 14655285 13896631 12958606 12043430 11379184
10276A1379184k62845J24720L21161K26518j33750o36315j141162j566309j908559
$$ 11379184 11116339 11241059 11562220 11788738 11654988 11018673 9877511 8311202 6402643
10267F402643k210618k510335k805857l048627l161346l072472k751211k221310
$$ 6402643 4192025 1681690 -1124167 -4172794 -7334140 -10406612 -13157823 -15379133
10259a5379133j544126p87505r261P34540J375116J834523K048761J990398J673333
$$ -15379133 -16923259 -17710764 -17720025 -16985485 -15610369 -13775846 -11727085 -9736687 -8063354
10250h063354J140551M46610l55430j217938k091940k914972l606782m082449
$$ -8063354 -6922803 -6476193 -6831623 -8049561 -10141501 -13056473 -16663255 -20745704
10242b0745704m276502m161123l749851l092474k267640j369308m82288L43976
$$ -20745704 -25022206 -29183329 -32933180 -36025654 -38293294 -39662602 -40144890 -39800914
10234c9800914J104853J825240K530380L220082L855277M359031M635216M604876
$$ -39800914 -38696061 -36870821 -34340441 -31120359 -27265082 -22906051 -18270835 -13665959
10226a3665959M245933L611121K810431J971086J201248N71581J10678j91969
$$ -13665959 -9420026 -5808905 -2998474 -1027388 173860 745441 856119 664150
10218F64150l74623m84612n62038o33158p07311p69321p75410o69202m16723l4521
$$ 664150 289527 -195085 -757123 -1390281 -2097592 -2866913 -3642323 -4311525 -4728248 -4762769
10208d762769M13176Q44840J194792J428590J538032J525797J392430J134884
$$ -4762769 -4349593 -3504753 -2309961 -881371 656661 2182458 3574888 4709772
10200D709772P56867K81554k44648p60552j205409j534014j726919j792070j756597
$$ 4709772 5466639 5748193 5503545 4742993 3537584 2003570 276651 -1515419 -3272016
10191c272016j653812j514414j365594j232256j132572j068752j022412r61501
$$ -3272016 -4925828 -6440242 -7805836 -9038092 -10170664 -11239416 -12261828 -13223329
10183a3223329q53533o71852l88990L2239O32403J430028K393805L434158M420515
$$ -13223329 -14076862 -14748714 -15137704 -15105465 -14473062 -13043034 -10649229 -7215071 -2794556
10174b794556N213119N695293N799911N527889M952492M201126L415049K703042
$$ -2794556 2418563 8113856 13913767 19441656 24394148 28595274 32010323 34713365
10166C4713365K112819J634106J226322Q49391M79511J06730k76415o82551j124771
$$ 34713365 36826184 38460290 39686612 40536003 41015514 41122244 40845829 40163278 39038507
10157C9038507j600700k078250k499797k808125k976656l019881k975974k876623
$$ 39038507 37437807 35359557 32859760 30051635 27074979 24055098 21079124 18202501
10149A8202501k727971k516021k230524j887904j535288j232858j026988r29451
$$ 18202501 15474530 12958509 10727985 8840081 7304793 6071935 5044947 4115496
10141D115496r10579r08436q53452p01217m57230j79517M0706J10369k9830l72916
$$ 4115496 3204917 2296481 1443029 741812 284582 105065 145771 256140 226310 -146606
10131a46606q33259j272880j561511j635333j517036j289872j049325q62859p53695
$$ -146606 -979865 -2252745 -3814256 -5449589 -6966625 -8256497 -9305822 -10168681 -10922376
10122a0922376p06548o82921o35072n17977l05186p148L21654N98823P48447P34432
$$ -10922376 -11628924 -12311845 -12946917 -13464894 -13770080 -13777228 -13455574 -12856751 -12108304 -11373872
10112a1373872N75075L32969Q6982r7767j85693j69859o8332P1962J76139J68085
$$ -11373872 -10798797 -10465828 -10378846 -10476613 -10662306 -10832165 -10900497 -10828535 -10652396 -10484311
10102a0484311J9296k16978m21610m71297l04079N3954N10989R57030J303609
$$ -10484311 -10465015 -10681993 -11103603 -11574900 -11878979 -11825025 -11314036 -10357006 -9053397
10093i053397J499558J529758J409682J177204Q76165N36040J63216k49206p04475
$$ -9053397 -7553839 -6024081 -4614399 -3437195 -2561030 -2024990 -1861774 -2110980 -2815455
10084b815455j192382j686195k140388k494662k694335k718505k590013k355220
$$ -2815455 -4007837 -5694032 -7834420 -10329082 -13023417 -15741922 -18331935 -20687155
10076b0687155k053831j707839j332751r48233n70692j96485K02441O61179J194686
$$ -20687155 -22740986 -24448825 -25781576 -26729809 -27300501 -27496986 -27294545 -26633366 -25438680
10067b5438680J781035K365674K880366L261335L457178L430443L161957K659588
$$ -25438680 -23657645 -21291971 -18411605 -15150270 -11693092 -8262649 -5100692 -2441104
10059b441104J964112J146232K95773m92881j136722j578316j793774j793107
$$ -2441104 -476992 669240 965013 472132 -664590 -2242906 -4036680 -5829787
10051e829787j616474j327559r99819o95406m48876k68849j53276r8498r0934
$$ -5829787 -7446261 -8773820 -9773639 -10469045 -10917921 -11186770 -11340046 -11438544 -11529478
10042a1529478r3929n1983Q1183L07659N69711P68648Q11738O60874L52941k1014
$$ -11529478 -11623407 -11675390 -11594207 -11286548 -10716837 -9948189 -9136451 -8475577 -8122636 -8143650
10032h143650l63045o11059p52830q08965q02570p39393o11613m18226j81238
$$ -8143650 -8506695 -9117754 -9870584 -10679549 -11482119 -12221512 -12833125 -13251351 -13432589
10023a3432589N7480K54206L79128M19297L73499K49712O8572j33156l06521m03410
$$ -13432589 -13375109 -13120903 -12741775 -12322478 -11948979 -11699267 -11630695 -11763851 -12070372 -12473782
10013a2473782l93400k75784q0194J44533L47105M87208N39604M89888L29551
$$ -12473782 -12867182 -13142966 -13223160 -13078627 -12731522 -12244314 -11704710 -11214822 -10885271
10004a0885271N8085l08548p33605j169375j577667j943907k270076k551358k760054
$$ -10885271 -10827186 -11135734 -11869339 -13038714 -14616381 -16560288 -18830364 -21381722 -24141776
9995b4141776k856891k823504k685647k501795k323755k161708j979551j718227
$$ -24141776 -26998667 -29822171 -32507818 -35009613 -37333368 -39495076 -41474627 -43192854
9987d3192854j326670p84325j10451O40483J396600K092767K689601L179790L581811
$$ -43192854 -44519524 -45303849 -45414300 -44773817 -43377217 -41284450 -38594849 -35415059 -31833248
9978c1833248L923626M220543M457718M591338M571469M370192L992601L464398
$$ -31833248 -27909622 -23689079 -19231361 -14640023 -10068554 -5698362 -1705761 1758637
9970A758637K811699K054008J216574L48684m72427j161272j657171j948818k074209
$$ 1758637 4570336 6624344 7840918 8189602 7717175 6555903 4898732 2949914 875705
9961H75705k097196k076169k041686j991516j901757j747045j520710j246058
$$ 875705 -1221491 -3297660 -5339346 -7330862 -9232619 -10979664 -12500374 -13746432
9953a3746432r74360p72107p04732q21013j137355j623301k198255k750339l173643
$$ -13746432 -14720792 -15492899 -16197631 -17018644 -18155999 -19779300 -21977555 -24727894 -27901537
9944b7901537l403660l430771l288071l024892k680730k270841j789636j229878
$$ -27901537 -31305197 -34735968 -38024039 -41048931 -43729661 -46000502 -47790138 -49020016
9936d9020016o06112L1941O03930J020249J211961J155752Q81329M59801j6187
$$ -49020016 -49626128 -49594187 -48990257 -47970008 -46758047 -45602295 -44720966 -44261165 -44277352
9927d4277352m51404p66935r20301r17256q05529o56395n49368n63639p66253
$$ -44277352 -44728756 -45495691 -46415992 -47333248 -48138777 -48795172 -49344540 -49908179 -50674432
9918e0674432j192351j828140k610500l446690m245377m942751n508424n930674
$$ -50674432 -51866783 -53694923 -56305423 -59752113 -63997490 -68940241 -74448665 -80379339
9910h0379339o199150o302401o236292o007076n623335n080160m332800l258316
$$ -80379339 -86578489 -92880890 -99117182 -105124258 -110747593 -115827753 -120160553 -123418869
9902a23418869j625391Q94898M656019R888169J6474550K3726605L0354184L4813814
$$ -123418869 -125044260 -124149362 -119493343 -109605174 -93130624 -69404019 -39049835 -4236021
9894d236021L5953605L3559856K8412918K1837929J5113040R108101M239105N90440
$$ -4236021 31717584 65277440 93690358 115528287 130641327 139749428 143988533 144578973
9886A44578973j945645l561741m462494m830906m826814m592883m253841l913361
$$ 144578973 142633328 139071587 134609093 129778187 124951373 120358490 116104649 112191288
9878A12191288l650427l509179l486348l531095l561461l487206l232085k756686
$$ 112191288 108540861 105031682 101545334 98014239 94452778 90965572 87733487 84976801
9870H4976801k075916j258003m03245L82133J003421J387640J493461J320344
$$ 84976801 82900885 81642882 81239637 81621770 82625191 84012831 85506292 86826636
9862H6826636R10120L36084l18525r82630j606741k155935k598324k903612l052477
$$ 86826636 87736756 88072840 87754315 86771685 85164944 83009009 80410685 77507073 74454596
9853G4454596l046021k907315k673698k380477k041825j644103j163418n97881
$$ 74454596 71408575 68501260 65827562 63447085 61405260 59761157 58597739 57999858
9845E7999858J1567N89411J057664J370919J532316J580656J561304J508625J451586
$$ 57999858 58011425 58600836 59658500 61029419 62561735 64142391 65703695 67212320 68663906
9836F8663906J420190J426181J431475J348210J086817O13797l0570p61561j492774
$$ 68663906 70084096 71510277 72941752 74289962 75376779 75990576 75960006 75198445 73705671
9827G3705671k159998k720353l139671l385396l436589l306226l053080k762560
$$ 73705671 71545673 68825320 65685649 62300253 58863664 55557438 52504358 49741798
9819D9741798k503772k295723k109769j902391j646977j340459r91147o12766
$$ 49741798 47238026 44942303 42832534 40930143 39283166 37942707 36951560 36338794
9811C6338794k35140Q7112K90385L36051K32221K5337k26031m73143o87375q61574
$$ 36338794 36103654 36190766 36481151 36817202 37049423 37074760 36848729 36375586 35688211 34826637
9801C4826637j002266j113732j186049j199988j144358j027189q69691o90694
$$ 34826637 33824371 32710639 31524590 30324602 29180244 28153055 27283364 26592670
9793B6592670m97725k94611j01836K6968J2690k11823o54590j240743j831170
$$ 26592670 26094945 25800334 25698498 25725466 25738156 25526333 24871743 23631000 21799830
9784B1799830k273722k457661k344109j963929j395687p43562j22740L56142O11354
$$ 21799830 19526108 17068447 14724338 12760409 11364722 10621160 10498420 10854562 11465916
9775A1465916O15427M05777P3883k61309m87238n29873l71608m5291L89803Q71122
$$ 11465916 12081343 12487120 12561003 12299694 11812456 11282583 10910975 10865684 11255487 12126609
9765A2126609J342003J750516K049289K200237K179888J981186J613224J102758
$$ 12126609 13468612 15219128 17268417 19468654 21648542 23629728 25242952 26345710
9757B6345710M97231j37101p27320j210813j543400j693914j638564j370703r21348
$$ 26345710 26842941 26705840 25978520 24767707 23224307 21530393 19891829 18521126 17599778
9748A7599778l68096J81864O26431R01001R95074R50262Q43622P63275P82252
$$ 17599778 17231682 17413546 18039977 18940978 19936052 20886314 21729936 22493211 23275463
9739B3275463R31969J178374J415493J495309J292570P71529J4314q03426j471996
$$ 23275463 24207432 25385806 26801299 28296608 29589178 30360707 30375021 29571595 28099599
9730B8099599j815034j745001j292509n96669J45450P50278J105233J186437J038282
$$ 28099599 26284565 24539564 23247055 22650386 22795836 23546114 24651347 25837784 26876066
9721B6876066P38326L70159R764k82012m66472n31950m93623l88145k63465j63932
$$ 26876066 27614392 27984551 27994315 27712303 27245831 26713881 26220258 25832113 25568648 25404716
9711B5404716j15109j16730j47648j77229j75683j21927j0425J45360L16357M65489
$$ 25404716 25289607 25172877 25025229 24848000 24672317 24550390 24539965 24685325 25001682 25467171
9701B5467171N53462N42744M05785J38616k29243o39162j023187j330606j548733
$$ 25467171 26020633 26563377 26969162 27107778 26878535 26239373 25216186 23885580 22336847
9692B2336847j706259j853657k028461k226978k402259k487508k423865k173914
$$ 22336847 20630588 18776931 16748470 14521492 12119233 9631725 7207860 5033946
9684E033946j723097j084183l09439N03154J224835J730782J938356J832288J467511
$$ 5033946 3310849 2226666 1917227 2420381 3645216 5375998 7314354 9146642 10614153
9675A0614153R47628L87190j21296n15409p47941p75491n72686j63211L64285
$$ 10614153 11561781 11948971 11827675 11312266 10564325 9788834 9216148 9052937 9417222
9666I417222Q76766J244760J389346J304601J049494P18959M11111K04758J50438
$$ 9417222 10293988 11538748 12928094 14232695 15282189 16001148 16412259 16617017 16767455
9657A6767455K68289N45581R35029J361569J742649K016944K166737K218672K219916
$$ 16767455 17035744 17581325 18516354 19877923 21620572 23637516 25804253 28022925 30242841
9648C0242841K204524K172286K092223J925599J653982J298565R20004N94046
$$ 30242841 32447365 34619651 36711874 38637473 40291455 41590020 42510024 43104070
9640D3104070L73796K65384K38357K62159L35121M80569P16265J024434J344686
$$ 43104070 43477866 43743250 43981607 44243766 44578887 45059456 45775721 46800155 48144841
9631D8144841J594562J707667J668854J523138J348706J211339J133052J093807
$$ 48144841 49739403 51447070 53115924 54639062 55987768 57199107 58332159 59425966
9623E9425966J055993R86449Q61371O60669L69489l826m06058p41163r09298q59841
$$ 59425966 60481959 61468408 62329779 62990448 63359937 63356111 62950053 62208890 61299592 60439751
9613F0439751o15392k48159J65353N71398R36377J234279J442653J545352J533680
$$ 60439751 59824359 59576200 59741553 60312951 61249328 62483607 63926260 65471612 67005292
9604F7005292J407231J179843Q86554N80727L17614J32234K3142n0572j56066
$$ 67005292 68412523 69592366 70478920 71059647 71377261 71509495 71532637 71482065 71325999
9595G1325999l58000o82443j091279j486925j752260j805302j634877j298631
$$ 71325999 70967999 70285556 69194277 67707352 65955092 64149790 62514913 61216282
9587F1216282q95044n34502l19402l23969n68515j002275j513399j966139k245760
$$ 61216282 60321238 59786736 59467334 59143365 58574850 57572575 56059176 54093037 51847277
9578E1847277k290831k103478j737420j270588p77735l19305N2224K86048L42923
$$ 51847277 49556446 47452968 45715548 44444960 43667225 43347920 43400144 43686192 44029115
9569D4029115K15033o6627m47888q75110j304365j692472j987050k131643k084600
$$ 44029115 44244148 44177521 43729633 42854523 41550158 39857686 37870636 35738993 33654393
9560C3654393j839030j433568r49335m90633j51671J8474L5383k6439o1530K7258
$$ 33654393 31815363 30381795 29432460 28941827 28790156 28808630 28844013 28817574 28756044 28783302
9550B8783302K91764P18572J235759J741622K137533K349918K340540K112137
$$ 28783302 29075066 29793638 31029397 32771019 34908552 37258470 39599010 41711147
9542D1711147J709984J211428O98865K25503k05574o32121j096212j606258k126939
$$ 41711147 43421131 44632559 45331424 45556927 45351353 44719232 43623020 42016762 39889823
9533C9889823k602449k988098l260084l399401l374395l147105k702877k078497
$$ 39889823 37287374 34299276 31039192 27639791 24265396 21118291 18415414 16336917
9525A6336917j363970o74449j10225K72927M71824N23235M77020L66049J89319
$$ 16336917 14972947 14298498 14188273 14461200 14933024 15456259 15933279 16299328 16488647
9516A6488647p9238m62277r53112j509021k060492k524478k817910k873404k652852
$$ 16488647 16409409 15947132 14994020 13484999 11424507 8900029 6082119 3208715 555863
9507E55863k151707j396559m45770O06572J635517K506108L101891L348071L224740
$$ 555863 -1595844 -2992403 -3438173 -2831601 -1196084 1310024 4411915 7759986 10984726
9498A0984726K770197K070962J237076L72980m39493j140369j684874k046360
$$ 10984726 13754923 15825885 17062961 17435941 16996448 15856079 14171205 12124845
9490A2124845k229388k275893k247665k190037k104072j951425j687735j296708
$$ 12124845 9895457 7619564 5371899 3181862 1077790 -873635 -2561370 -3858078
9482c858078q02109k57574K72997P34575J093408J336007J455162J437379J267843
$$ -3858078 -4660187 -4917761 -4644764 -3910189 -2816781 -1480774 -25612 1411767 2679610
9473B679610R50684N24640N8058l73745p13077r32794j033716j032632r52190
$$ 2679610 3630294 4154934 4212992 3839247 3126170 2193376 1159660 127028 -825162
9464h25162q19135o65434n22584m09746l27456k63078j99816j18956J984J84625
$$ -825162 -1644297 -2309731 -2832315 -3242061 -3569517 -3832595 -4032411 -4151367 -4149383 -3964758
9454c964758M36812P42076J061659J348086J560508J672831J672398J554014J316574
$$ -3964758 -3527946 -2785870 -1724211 -376125 1184383 2857214 4529612 6083626 7400200
9445G400200R65707N19550J3481m97794r42554j244163j344645j228756r30753
$$ 7400200 8365907 8885457 8898938 8401144 7458590 6214427 4869782 3641026 2710273
9436B710273n17946o4635L65241P22475R73234J103341J122726J062440R62444
$$ 2710273 2192327 2127692 2492933 3215408 4188642 5291983 6414709 7477149 8439593
9427H439593Q56302P60823O74914N86918M86719L77903K84346K44825K93649M36534
$$ 8439593 9295895 10056718 10731632 11318550 11805269 12183172 12467518 12712343 13005992 13442526
9417A3442526O39891Q45875J005592J106888J176782J258320J379388J533661
$$ 13442526 14082417 14928292 15933884 17040772 18217554 19475874 20855262 22388923
9409B2388923J682804J774464J763416J626234J367702J020261O35639K68619
$$ 22388923 24071727 25846191 27609607 29235841 30603543 31623804 32259443 32528062
9401C2528062l9498k66445m01942m40828l88957k77047j64079j19192j90991l83583
$$ 32528062 32488564 32222119 31820177 31379349 30990392 30713345 30549266 30430074 30239083 29855500
9391B9855500o52033r17753j096925j130928j004650p42634l88224J4756M22199
$$ 29855500 29203467 28285714 27188789 26057861 25053211 24310577 23922353 23937109 24359308
9382B4359308P77906J011799J062339R12654O13495K71948O780j06678p0563M2649
$$ 24359308 25137214 26149013 27211352 28124006 28737501 29009449 29016229 28909551 28838988 28881637
9372B8881637J31999J15833m2493l37372p38633j208261j709504k208708k672256
$$ 28881637 29013636 29129469 29086976 28749604 28010971 26802710 25093206 22884498 20212242
9363B0212242l062639l338132l457173l385472l104917k623984j984253j254138
$$ 20212242 17149603 13811471 10354298 6968826 3863909 1239925 -744328 -1998466
9355a998466n08899J91471Q13030J344526J786831K143248K416274K612819K752370
$$ -1998466 -2507365 -2315894 -1502864 -158338 1628493 3771741 6188015 8800834 11553204
9346A1553204K866110K981001L098933L187541L187650L028932K646837K001835
$$ 11553204 14419314 17400315 20499248 23686789 26874439 29903371 32550208 34552043
9338C4552043J099879L142j179528k319184l295466m014908m417944m480915m217468
$$ 34552043 35651922 35655064 34475536 32156352 28860886 24845978 20428034 15947119 11729651
9329A1729651l677091k936577k085717j214673m07251K65809P61138J079460J267892
$$ 11729651 8052560 5115983 3030266 1815593 1408342 1674151 2435289 3514749 4782641
9320D782641J397768J528415J680234J833759J953004K014867K022481J993175
$$ 4782641 6180409 7708824 9389058 11222817 13175821 15190688 17213169 19206344
9312A9206344J933710J826974J642025J356076R68155M96613l1087n85111j132969
$$ 19206344 21140054 22967028 24609053 25965129 26933284 27429897 27398810 26813699 25680730
9303B5680730j635814k046509k312699k384791k226508j826145j207281m34889
$$ 25680730 24044916 21998407 19685708 17300917 15074409 13248264 12040983 11606094
9295A1606094L89581J146862J727461K060053K132421J994914J737300J444296
$$ 11606094 11995675 13142537 14869998 16930051 19062472 21057386 22794686 24238982
9287B4238982J155344Q56019N04190O7245m55602j033659j619603k167700k647162
$$ 24238982 25394326 26250345 26754535 26821780 26366178 25332519 23712916 21545216 18898054
9278A8898054l044905l356385l570165l657181l574680l287032k792765k138256
$$ 18898054 15853149 12496764 8926599 5269418 1694738 -1592294 -4385059 -6523315
9270f523315j405623o83403m2812M67050Q13579R81444R84068Q74319P40095O80203
$$ -6523315 -7928938 -8612341 -8655153 -8188103 -7374524 -6393080 -5409012 -4534693 -3794598 -3114395
9260c114395P68732J024896J404050J813789K146124K313510K279394K072553
$$ -3114395 -2345663 -1320767 83283 1897072 4043196 6356706 8636100 10708653
9252A0708653J773146J472120J229127J059126R51215Q93056Q75206Q78077Q64783
$$ 10708653 12481799 13953919 15183046 16242172 17193387 18086443 18961649 19839726 20704509
9243B0704509P95127O53253M67390L03954K34768K94980M57057O36228P23198
$$ 20704509 21499636 22152889 22620279 22924233 23159001 23453981 23911038 24547266 25270464
9234B5270464O27851L17730j61258o91231j116665j294011j137087o43939J01441
$$ 25270464 25898315 26216045 26054787 25363556 24246891 22952880 21815793 21171854 21273295
9225B1273295R54731J757616K382920K753581K832878K610135K104694J382156
$$ 21273295 22228026 23985642 26368562 29122143 31955021 34565156 36669850 38052006
9217C8052006N56637k35539q77871j304875j506045j507428j350519j083683p61408
$$ 38052006 38608643 38373104 37495233 36190358 34684313 33176885 31826366 30742683 29981275
9208B9981275m33958j24925J80325N14669Q92338J292501J676923K014887K285228
$$ 29981275 29547317 29422392 29602717 30117386 31009724 32302225 33979148 35994035 38279263
9199C8279263K460416K501105K373415K072585J631169J106782N60674M1860m15579
$$ 38279263 40739679 43240784 45614199 47686784 49317953 50424735 50985409 51027269 50611690
9190E0611690p86798j054645j216724j289769j299475j263587j188105j080929
$$ 50611690 49824892 48770247 47553523 46263754 44964279 43700692 42512587 41431658
9182D1431658r64107q67884q12212p93626p85528p47687o40411m41199j57681
$$ 41431658 40467551 39599667 38787455 37993829 37208301 36460614 35820203 35379004 35221323
9173C5221323J72092M93547P55730R27594J004578J002643R40884Q21947O25307
$$ 35221323 35393415 35886962 36642692 37570286 38574864 39577507 40518391 41340338 41965645
9164D1965645L22237r4861n88552j075490j452283j635865j597996j376241j055497
$$ 41965645 42287882 42193021 41604469 40528979 39076696 37440831 35842835 34466594 33411097
9155C3411097p29196m60052k59835r5293Q7773L36360O68118J060144J452800
$$ 33411097 32681901 32221849 31962014 31866721 31954494 32290854 32958972 34019116 35471916
9146C5471916J769747J946621J954509J808812J562513J285833J036040Q30022
$$ 35471916 37241663 39188284 41142793 42951605 44514118 45799951 46835991 47666013
9138D7666013O38350M07115R0496l29069q38423j397444j942357k394932k682578
$$ 47666013 48304363 48711478 48801974 48472905 47634482 46237038 44294681 41899749 39217171
9129C9217171k761825k632620k337118j943000j515261j088191o55966j91877
$$ 39217171 36455346 33822726 31485608 29542608 28027347 26939156 26283190 26091313
9121B6091313L16379Q42245J323995J691003J893480J920493J802593J602326
$$ 26091313 26407692 27249937 28573932 30264935 32158415 34078908 35881501 37483827
9113C7483827J395699J246748J181422J173455J153246J037399P61860L01111
$$ 37483827 38879526 40126274 41307696 42481151 43634397 44671796 45433656 45734767
9105D5734767l30134j084353j890381k664564l324646l801131m040507m004453
$$ 45734767 45404633 44320280 42429899 39765335 36440689 32639558 28599051 24594598
9097B4594598l676979l083595k308717j489545p78863k93150p3909q1025k17861
$$ 24594598 20917619 17834024 15525307 14035762 13256899 12963749 12889840 12808815 12590954
9088A2590954l72721m55842m16284k38167O9347M74075R17398J321498J614741
$$ 12590954 12218233 11762391 11346107 11107940 11177287 11651362 12568760 13890258 15504999
9079A5504999J761574J775336J706870J620328J570254J584339J650787J715117
$$ 15504999 17266573 19041909 20748779 22369107 23939361 25523700 27174487 28889604
9071B8889604J695999J520709J162300O53253O6755n16975j033735j440356j714352
$$ 28889604 30585603 32106312 33268612 33921865 33988620 33471645 32437910 30997554 29283202
9062B9283202j857835j897667j870006j795791j670327j481875j247356j034314
$$ 29283202 27425367 25527700 23657694 21861903 20191576 18709701 17462345 16428031
9054A6428031r44889j065767j416923j936312k510362l024136l395355l579998
$$ 16428031 15483142 14417375 13000452 11064140 8553778 5529642 2134287 -1445711
9046a445711l564777l363526l017125k586492k136559j720823j375521j121570
$$ -1445711 -5010488 -8374014 -11391139 -13977631 -16114190 -17835013 -19210534 -20332104
9038b0332104r64198q84989q35662p50857n83463l39066p7931J20041J96431J28435
$$ -20332104 -21296302 -22181291 -23016953 -23767810 -24351273 -24690339 -24768270 -24648229 -24451798 -24323363
9028b4323363q3617m27399q70231j343213j743085j961742j929247j644986j178172
$$ -24323363 -24406980 -24834379 -25704610 -27047823 -28790908 -30752650 -32681897 -34326883 -35505055
9019c5505055o37723j30553K67647N19836O24034O12554N52081N30192O24148
$$ -35505055 -36142778 -36273331 -36005684 -35485848 -34861814 -34249260 -33697179 -33166987 -32542839
9010c2542839Q70173J257999J754569K332640K974696L648040M278537M755840
$$ -32542839 -31672666 -30414667 -28660098 -26327458 -23352762 -19704722 -15426185 -10670345
9002a0670345M975302M887494M518986L953167L291790K626259K029379J556620
$$ -10670345 -5695043 -807549 3711437 7664604 10956394 13582653 15612032 17168652
8994A7168652J242837J094169J086098J174020J309746J451985J566335J620460
$$ 17168652 18411489 19505658 20591756 21765776 23075522 24527507 26093842 27714302
8986B7714302J581790J419633J110065O43075L1614o82423j433440k150341k777162
$$ 27714302 29296092 30715725 31825790 32468865 32500479 31818056 30384616 28234275 25457113
8977B5457113l281484l647550l866255l935302l867712l694646l454205l174443
$$ 25457113 22175629 18528079 14661824 10726522 6858810 3164164 -290041 -3464484
8969c464484k865348k524311k145788j724413j250295p04269o2067O88719J524533
$$ -3464484 -6329832 -8854143 -10999931 -12724344 -13974639 -14678908 -14740975 -14052256 -12527723
8960a2527723K369821L105849L607545L789903L636029L192571K542890J780282
$$ -12527723 -10157902 -7052053 -3444508 345395 3981424 7173995 9716885 11497167
8952A1497167R94442K67084l34627p71349j045189j202193j316195j456700j654703
$$ 11497167 12491609 12758693 12424066 11652717 10607528 9405335 8089140 6632440 4977737
8943D977737j885379k079246k156001k060237j778195j330623p55002r5732N90458
$$ 4977737 3092358 1013112 -1142889 -3203126 -4981321 -6311944 -7066946 -7162678 -6572220
8934f572220J224058J705759J942943J891057J586651J149429P45480N23859N54080
$$ -6572220 -5348162 -3642403 -1699460 191597 1778248 2927677 3673157 4197016 4751096
8925D751096P95358J115584J351625J378408J151358P08693J46030m16339q63578
$$ 4751096 5546454 6662038 8013663 9392071 10543429 11252122 11398152 10981813 10118235
8916A0118235j113539j138959r77190p21907m97372m20375n59501r08188j386767
$$ 10118235 9004696 7865737 6888547 6166640 5669268 5248893 4689392 3781204 2394437
8907B394437j872229k236404k374832k225944j786632j117211l21183M96427J264004
$$ 2394437 522208 -1714196 -4089028 -6314972 -8101604 -9218815 -9539998 -9043571 -7779567
8898g779567J946504K521732K956484L203603L220937K999318K581170K052793
$$ -7779567 -5833063 -3311331 -354847 2848756 6069693 9069011 11650181 13702974
8890A3702974J508876J012650N84095K23920n5015k24108k67288k10709j21566
$$ 13702974 15211850 16224500 16808595 17032515 16977500 16753392 16486104 16275395 16153829
8881A6153829p3452j05567k06538l31264m33812m92326n14310n25625n51631n98932
$$ 16153829 16080377 15974810 15768272 15437008 15003196 14510870 13996560 13470935 12919304 12320372
8871A2320372o48005o64884o26218n37208m25839l18850k21458j17503J1336J62268
$$ 12320372 11672367 11007483 10381265 9844057 9418218 9099368 8877910 8760407 8771743 8934011
8861H934011L01892L81583L72838K99254K38312K85697N02598Q78266J329559
$$ 8934011 9235903 9617486 9990324 10289578 10527890 10813587 11316185 12194451 13524010
8852A3524010J737466K000667K076164J984627J782025J522439J238237R43533
$$ 13524010 15261476 17262143 19338307 21322934 23104959 24627398 25865635 26809168
8844B6809168O47081L58453Q3672j81402m48125p18582r66278j134802j166153
$$ 26809168 27456249 27814702 27898374 27716972 27268847 26550265 25583987 24449185 23283032
8835B3283032j043918q17029n80826m26955l98618m79414o14223p41026q16897
$$ 23283032 22239114 21422085 20841259 20414304 20015686 19536272 18922049 18181023 17364126
8826A7364126q33619q20103q25413q85314r93753j103488j156310j116196r78688
$$ 17364126 16530507 15710404 14884991 13999677 13005924 11902436 10746126 9629930 8651242
8817H651242p55072m51812o4811M08048R46892J497982J980506K310324K427314
$$ 8651242 7896170 7444358 7379547 7787595 8734487 10232469 12212975 14523299 16950613
8808A6950613K312060J988093J515331R80115M81162J08393q3391r5607J3076
$$ 16950613 19262673 21250766 22766097 23746212 24227374 24335767 24252376 24156769 24169845
8799B4169845J52881K44049K46723J62925K0050j41775k71407l12182k25052k1271
$$ 24169845 24322726 24566775 24813498 24976423 24996473 24854698 24583291 24271109 24046057 24024786
8789B4024786K19943L68398K94564o5469o66217j359637j954331k295719k325099
$$ 24024786 24244729 24613127 24907691 24842222 24176005 22816368 20862037 18566318 16241219
8780A6241219k093620j733316j401242j217609j222481j370834j565542j704746
$$ 16241219 14147599 12414283 11013041 9795432 8572951 7202117 5636575 3931829
8772C931829j716699j572559j284170q95057m66842o3247K62123M70388N39183
$$ 3931829 2215130 642571 -641599 -1536656 -2003498 -2066745 -1804622 -1334234 -795051
8763g95051M69185K93421P6246j07846k07295k15636j66526j07566p4713q4258
$$ -795051 -325866 -32445 43801 -64045 -271340 -486976 -653502 -761068 -835781 -920039
8753i20039j41736k54240m32779o81513r82691j291193j545133j684686j665715
$$ -920039 -1061775 -1316015 -1748794 -2430307 -3412998 -4704191 -6249324 -7934010 -9599725
8744i599725j464643j082315n51077O3272O74328J198303J572773J763242J763811
$$ -9599725 -11064368 -12146683 -12697760 -12634488 -11960160 -10761857 -9189084 -7425842 -5662031
8735e662031J600577J335720J060709Q70316Q24228R18195J086966J241198J314434
$$ -5662031 -4061454 -2725734 -1665025 -794709 29519 947714 2034680 3275878 4590312
8726D590312J289832J195020J076515R72191Q95081Q36787P90246P74171Q31440
$$ 4590312 5880144 7075164 8151679 9123870 10018951 10855738 11645984 12420155 13251595
8717A3251595R92844J233911J465489J571597J469981J158275P23289L11550P4332
$$ 13251595 14244439 15478350 16943839 18515436 19985417 21143692 21866981 22178531 22252863
8708B2252863J10191M29533R53986J546854K061587K392732K510767K462905K337306
$$ 22252863 22363054 22792587 23746573 25293427 27355014 29747746 32258513 34721418 37058724
8699C7058724K211962K120121K049878J970047J858675J713342J539252J329837
$$ 37058724 39270686 41390807 43440685 45410732 47269407 48982749 50522001 51851838
8691E1851838J060634P03678K49277k83652q53402j407544j892395k260984k482931
$$ 51851838 52912472 53616150 53865427 53581775 52728373 51320829 49428434 47167450 44684519
8682D4684519k552929k491738k339016k142872j949457j792882j686433j618897
$$ 44684519 42131590 39639852 37300836 35157964 33208507 31415625 29729192 28110295
8674B8110295j558095j459865j280011r89147n88645j18637L53561P64548J086957
$$ 28110295 26552200 25092335 23812324 22823177 22234532 22115895 22469456 23234004 24320961
8665B4320961J339478J568830J819887K114026K441095K758173K992644L056763
$$ 24320961 25660439 27229269 29049156 31163182 33604277 36362450 39355094 42411857
8657D2411857K877493K428792J744446R02040p499r00416j701209k337907k750375
$$ 42411857 45289350 47718142 49462588 50364628 50357129 49456713 47755504 45417597 42667222
8648D2667222k912773k852438k648564k410325k245141k226809k371091k628843
$$ 42667222 39754449 36902011 34253447 31843122 29597981 27371172 25000081 22371238
8640B2371238k904336l092786l118355k956541k638049k238258j854189j571541
$$ 22371238 19466902 16374116 13255761 10299220 7661171 5422913 3568724 1997183
8632A997183j433463j428312j503990j598343j665598j685455j655911j580919
$$ 1997183 563720 -864592 -2368582 -3966925 -5632523 -7317978 -8973889 -10554808
8624a0554808j463632j307896j122091r17800p02674m74110k19533P8475M36736
$$ -10554808 -12018440 -13326336 -14448427 -15366227 -16068901 -16543011 -16762544 -16684069 -16247333
8615a6247333Q64648J351517J852012K285067K556899K598540K393736J981061
$$ -16247333 -15382685 -14031168 -12179156 -9894089 -7337190 -4738650 -2344914 -363853
8607c63853J434089Q35135K55161k54809o61261r40772j076965j066388r27181
$$ -363853 1070236 1905371 2160532 1905723 1244462 303690 -773275 -1839663 -2766844
8598b766844p00444m41460k07256m7439J398p7727k72057n30641p69208q96043
$$ -2766844 -3467288 -3908748 -4116004 -4163443 -4162045 -4239772 -4511829 -5042470 -5811678 -6707721
8588f707721q50525o31829k99653N0654L21593M42187L88712J94706n7667k68435
$$ -6707721 -7558246 -8190075 -8489728 -8439074 -8117481 -7675294 -7286582 -7091876 -7149543 -7417978
8578g417978l61093l12106j53107N1847K37554L60961M10437M04524L84249L98607
$$ -7417978 -7779071 -8091177 -8244284 -8192437 -7954883 -7593922 -7183485 -6778961 -6394712 -5996105
8568e996105M84646O51403Q78592J130430J372243J577172J721023J774266J702905
$$ -5996105 -5511459 -4860056 -3981464 -2851034 -1478791 98381 1819404 3593670 5296575
8559E296575J483175J122441O69020J99084k12126n13949o84532p19325o16769
$$ 5296575 6779750 7902191 8571211 8770295 8558169 8044220 7359688 6640363 6023594
8550F023594l70055L2082N94495J296864K076737K829075L431397L787016L861315
$$ 6023594 5653539 5685621 6280116 7576980 9653717 12482792 15914189 19701205 23562520
8541B3562520L684448L317707K813268K202832J518810Q16651J68693l66939p74716
$$ 23562520 27246968 30564675 33377943 35580775 37099585 37916236 38084929 37717990 36943274
8532C6943274j084993j349451j602446j832822j989126k017374j899632j659572
$$ 36943274 35858281 34508830 32906384 31073562 29084436 27067062 25167430 23507858
8524B3507858j335088r48878n02226R282N72935J141158J630087J944075K019451
$$ 23507858 22172770 21223892 20721666 20730948 21303883 22445041 24075128 26019203 28038654
8515B8038654J859472J534285J147181P91883N23714L51857K49578J76352J03429
$$ 28038654 29898126 31432411 32579592 33371475 33895189 34247046 34496624 34672976 34776405
8506C4776405L2063l805M7589K29519N52564R86863J474679J952339K366555K679268
$$ 34776405 34808468 34804663 34852252 35081771 35634335 36621198 38095877 40048216 42414771 45094039
8496D5094039K865013K906242K789876K507966K064220J483243Q16036J36656
$$ 45094039 47959052 50865294 53655170 56163136 58227356 59710599 60526635 60663291
8488F0663291m71532r38131j228586j354360j362677j313070j256705j226957
$$ 60663291 60191759 59253628 58025042 56670682 55308005 53994935 52738230 51511273
8480E1511273j238273j289788j374338j490520j648104j860006k124893k409931
$$ 51511273 50273000 48983212 47608874 46118354 44470250 42610244 40485351 38075420
8472C8075420k640824k707044k492536j930432j055393j6405R65289J672940J968898
$$ 38075420 35434596 32727552 30235016 28304584 27249191 27232786 28198075 29871015 31839913
8463C1839913J837978J385888P93969K50183j09769k26801j12256J68626N15693
$$ 31839913 33677891 35063779 35857748 36107931 35998162 35771361 35659105 35827731 36343424
8454C6343424Q23449J020864J098542J099242J075095J041840R60704P57539L65675
$$ 36343424 37166873 38187737 39286279 40385521 41460616 42502456 43463160 44220699 44586374
8445D4586374k33308r93947j821888k604999l241505l657618l816741l719472
$$ 44586374 44353066 43359119 41537231 38932232 35690727 32033109 28216368 24496896
8437B4496896l391464k866364k179282j375795n22364K98356J007141J549746
$$ 24496896 21105432 18239068 16059786 14683991 14161627 14459983 15467124 17016870
8429A7016870J910551K115381K220563K286489K344867K378886K330293K129635
$$ 17016870 18927421 21042802 23263365 25549854 27894721 30273607 32603900 34733535
8421C4733535J732207J141608M11902l68593j100659j694619k086750k255789
$$ 34733535 36465742 37607350 38019252 37650659 36550000 34855381 32768631 30512842
8413C0512842k236867k119564k019394k030827k188014k457781k767255l044052
$$ 30512842 28275975 26156411 24137017 22106190 19918176 17460395 14693140 11649088
8405A1649088l240699l332105l299270l122152k791438k327937j789837j257729
$$ 11649088 8408389 5076284 1777014 -1345138 -4136576 -6464513 -8254350 -9512079
8397i512079q03384m57356j90534Q0078M58593J019234J758427K576084L301353
$$ -9512079 -10315463 -10772819 -10963353 -10883275 -10424682 -9405448 -7647021 -5070937 -1769584
8388a769584L754504L815122L462518K770977J868844Q89318n9843q99727j570760
$$ -1769584 1984920 5800042 9262560 12033537 13902381 14791699 14731856 13832129 12261369
8379A2261369k030351k263048k289866k161885j939626j673257j394358j116380
$$ 12261369 10231018 7967970 5678104 3516219 1576593 -96664 -1491022 -2607402
8371b607402q36331n37361j97279J97049O37403J091667J511170J842424K039657
$$ -2607402 -3443733 -3981094 -4178373 -3981324 -3343921 -2252254 -741084 1101340 3140997
8362C140997K078455J969372J763172J536503J357824J252730J195642J137507
$$ 3140997 5219452 7188824 8951996 10488499 11846323 13099053 14294695 15432202
8354A5432202J048416R40198Q52072Q14365Q20246Q22686P51884N38664J34567
$$ 15432202 16480618 17420816 18272888 19087253 19907499 20730185 21482069 22020733 22155300
8345B2155300m73788j257946k151453l063308l894245m548664m941845n007700
$$ 22155300 21681512 20423566 18272113 15208805 11314560 6765896 1824051 -3183649
8337c183649m710349m055997l098726j937760p08054M35411J342857J904289K082029
$$ -3183649 -7893998 -11949995 -15048721 -16986481 -17694535 -17259124 -15916267 -14011978 -11929949
8328a1929949J922406J536370J058101O03660K47298J8571q6844r1619k4465Q3446
$$ -11929949 -10007543 -8471173 -7413072 -6809412 -6562114 -6543543 -6630387 -6722006 -6746471 -6663025
8318f663025J95270K70109K79495K30872J73621J72145K61875M24980O06654P55404
$$ -6663025 -6467755 -6197646 -5918151 -5687279 -5513658 -5341513 -5079638 -4654658 -4048004 -3292600
8308c292600Q50614Q96537Q92870Q08782N81095J40558n46649j446693k457734
$$ -3292600 -2441986 -1545449 -652579 156203 737298 877856 331207 -1115486 -3573220
8299c573220l443951m281383m887107n221837n277548n064266m599443l898979
$$ -3573220 -7017171 -11298554 -16185661 -21407498 -26685046 -31749312 -36348755 -40247734
8291d0247734k974642j844915n55787Q04329K111204L233941M071035M572745
$$ -40247734 -43222376 -45067291 -45623078 -44818749 -42707545 -39473604 -35402569 -30829824
8283c0829824M740026M607539M226136L653043K946615K160881J341813N29676
$$ -30829824 -26089798 -21482259 -17256123 -13603080 -10656465 -8495584 -7153771 -6624095
8275f624095k33901r01106j421287j753820j886504j848326j702198j514820j322593
$$ -6624095 -6857996 -7759102 -9180389 -10934209 -12820713 -14669039 -16371237 -17886057 -19208650
8266a9208650j121152q86944o11010l17538n6526J20986J90458J70524J18105
$$ -19208650 -20329802 -21216746 -21827756 -22145294 -22201820 -22080834 -21890376 -21719852 -21601747
8257b1601747J01035J63622L07625M98715O89429Q43604R53948J048806J182227
$$ -21601747 -21500712 -21337090 -21029465 -20530750 -19841321 -18997717 -18043769 -16994963 -15812736
8248a5812736J405397J731362K114930K462185K665052K642605K370379J886997
$$ -15812736 -14407339 -12675977 -10561047 -8098862 -5433810 -2791205 -420826 1466171
8240A466171J277915O45523P9642l61597o59395q34114r37880j037142j186845
$$ 1466171 2744086 3389609 3469251 3107654 2448259 1614145 676265 -360877 -1547722
8231a547722j406631j671917j924210k094088k125855j996143j722391j358762
$$ -1547722 -2954353 -4626270 -6550480 -8644568 -10770423 -12766566 -14488957 -15847719
8223a5847719r79196o52819m21776k90353k27940j83010j03721M0807K47867M85931
$$ -15847719 -16826915 -17479734 -17901510 -18191863 -18419803 -18602813 -18706534 -18665727 -18417860 -17931929
8213a7931929P15319R09761J062018J171893J232749J232872J169685J058742
$$ -17931929 -17216610 -16306849 -15244831 -14072938 -12840189 -11607317 -10437632 -9378890
8205i378890R25455P88690O55604N32520M35407L83608L83003M20778M80696N61121
$$ -9378890 -8453435 -7664745 -7009141 -6476621 -6041214 -5657606 -5274603 -4853825 -4373129 -3812008
8195c812008O72517Q14995R61694J069879J112836J102860J082368J089610J128577
$$ -3812008 -3139491 -2324496 -1362802 -292923 819913 1922773 3005141 4094751 5223328
8186E223328J167383J160881J071946Q74917N51518R9422m47897j016720j524178
$$ 5223328 6390711 7551592 8623538 9498455 10049973 10149395 9701498 8684778 7160600
8177G160600j929289k261556k597304k995490l438340l820227l993609l841875
$$ 7160600 5231311 2969755 372451 -2623039 -6061379 -9881606 -13875215 -17717090
8169a7717090l334461k536711j577583n99375K83730J002553J526476J848491
$$ -17717090 -21051551 -23588262 -25165845 -25765220 -25481490 -24478937 -22952461 -21103970
8161b1103970J976972J936216J766116J514770J228484R44741O86148M53276K23771
$$ -21103970 -19126998 -17190782 -15424666 -13909896 -12681412 -11736671 -11050523 -10597247 -10373476
8152a0373476l3490l34488o62990r70113j186162j237562j068065o62013n8061
$$ -10373476 -10406966 -10741454 -11404444 -12374557 -13560719 -14798281 -15866346 -16528359 -16586420
8143a6586420O59754J392285K058984K614339L039648L321066L434550L351624
$$ -16586420 -15926666 -14534381 -12475397 -9861058 -6821410 -3500344 -65794 3285830
8135C285830L061490K590901K005624J391713Q27223L58884l665k71770m50985
$$ 3285830 6347320 8938221 10943845 12335558 13162781 13521665 13518000 13246230 12795245
8126A2795245n26991m79326l11575o8515J77042L55185M20675L53234J48221j83649
$$ 12795245 12268254 11788928 11477353 11408838 11585880 11941065 12361740 12714974 12863195 12679546
8116A2679546o04072j037741j384016j552223j501389j256118q85074m58427j8970
$$ 12679546 12075474 11037733 9653717 8101494 6600105 5343987 4458913 4000486 3981516
8107C981516M12544Q12511J143322J370781J491293J539731J568947J616097J677343
$$ 3981516 4394060 5206571 6349893 7720674 9211967 10751698 12320645 13936742 15614085
8098A5614085J705015J629926J397837R97863M67393j19388o61495j039584j142278
$$ 15614085 17319100 18949026 20346863 21344726 21812119 21692731 21031236 19991652 18849374
8089A8849374r15670m05727K45034Q49884J244289J330435J091014N82474q3305
$$ 18849374 17933704 17527977 17773011 18622895 19867184 21197619 22288633 22871107 22787802
8080B2787802p65859j328080j667212j737554j556851j191313p24985k30130K46773
$$ 22787802 22021943 20693863 19026651 17289097 15732246 14540933 13815948 13585818 13832591
8071A3832591O83024J071621J415353J724701K017846K319392K652853L025700
$$ 13832591 14515615 15587236 17002589 18727290 20745136 23064528 25717381 28743081
8063B8743081L414975L765674M004981M063090L890347L468871K820506K007666
$$ 28743081 32158056 35923730 39928711 43991801 47882148 51351019 54171525 56179191
8055E6179191J121556K60333m91834j077176j469982j679058j743920j720001
$$ 56179191 57300747 57561080 57069246 55992070 54522088 52843030 51099110 49379109
8047D9379109j657571j587723j523696j471618j437751j426517j435047j452048
$$ 49379109 47721538 46133815 44610119 43138501 41700750 40274233 38839186 37387138
8039C7387138j461376j444649j381313j252078j050500p96040n34560l19960j87326
$$ 37387138 35925762 34481113 33099800 31847722 30797222 30001182 29466622 29146662 28959336
8030B8959336j35812j32544j35640j23657j13996j56745l05997n87622r83540
$$ 28959336 28823524 28690980 28555340 28431683 28317687 28160942 27854945 27267323 26283783
8021B6283783j436337j864412k179569k304901k188367j806129j161160k91733
$$ 26283783 24847446 22983034 20803465 18498564 16310197 14504068 13342908 13051175
8013A3051175P10092J694607K488128K953150L037034K781061K291388J690831
$$ 13051175 13761267 15455874 17944002 20897152 23934186 26715247 29006635 30697466
8005C0697466J071603M68708j30560p45255j357257j898292k274546k407332k262614
$$ 30697466 31769069 32237777 32107217 31361962 30004705 28106413 25831867 23424535 21161921
7996B1161921j856966j244103m94629L18195J120761J835079K380661K688865
$$ 21161921 19304955 18060852 17566223 17884418 19005179 20840258 23220919 25909784
7988B5909784K722782K489144K035445J437426P86026J76929l00648n78002o19924
$$ 25909784 28632566 31121710 33157155 34594581 35380607 35557536 35256888 34678886 34058962
7979C4058962m30817n3108M38411R44640J356920J583320J581898J384029J088583
$$ 34058962 33628145 33575037 34013448 34958088 36315008 37898328 39480226 40864255 41952838
7970D1952838Q23153O90627P29581R05966J134497J317006J382847J315345J150239
$$ 41952838 42775991 43466618 44196199 45102165 46236662 47553668 48936515 50251860 51402099
7961E1402099R45543P41972N39609L02739j5024m42042r71343j562338k157852
$$ 51402099 52347642 53089614 53629223 53931962 53916938 53474896 52503553 50941215 48783363
7952D8783363k701962l146015l445035l556630l447778l104939k544835j827614
$$ 48783363 46081401 42935386 39490351 35933721 32485943 29381004 26836169 25008555
$$ [...]
##END NTUPLES=NMR SPECTRUM
##END=
