##TITLE=31Pdec_SRM-1_CHCl3
 
 64 sc
 8.2.2024
##JCAMPDX= 6.0         $$ Bruker NMR JCAMP-DX V2.0
##DATA TYPE= NMR SPECTRUM
##DATA CLASS= NTUPLES
##ORIGIN= UXNMR, Bruker Analytische Messtechnik GmbH
##OWNER= root
$$ XWIN-NMR		Version 3.5
$$ Thu Feb  8 16:30:47 2024 Russian Standard Time (UT+4h)  she@DPX200
##.OBSERVE FREQUENCY= 81.013821
##.OBSERVE NUCLEUS= ^31P
##.ACQUISITION MODE= SIMULTANEOUS
##.ACQUISITION SCHEME= undefined
##.AVERAGES= 64
##.DIGITISER RES= 16
##SPECTROMETER/DATA SYSTEM= spect
##.PULSE SEQUENCE= zgpg30
##.SOLVENT NAME= CDCl3
##.SHIFT REFERENCE= (INTERNAL, CDCl3, 0, 248.564)
##AUDIT TRAIL= $$ (NUMBER, WHEN, WHO, WHERE, WHAT)
$$ ##TITLE= Audit trail, XWIN-NMR		Version 3.5
$$ ##JCAMPDX= 5.01
$$ ##ORIGIN= Bruker BioSpin GmbH
$$ ##OWNER= she
$$ F:/spectra/data/she/nmr/P31/1/pdata/1/auditp.txt
$$ ##AUDIT TRAIL=  $$ (NUMBER, WHEN, WHO, WHERE, WHAT)
(   1,<2024-02-08 16:29:49.10 +0400>,<she>,<DPX200>,
      <created by zg, POWCHK disabled, PULCHK disabled
       configuration hash MD5:
       00 E9 B6 7A A2 85 ED C7 34 08 36 98 17 FE 4E 26
       data hash MD5: 32K
       8B 18 53 9E 6D 38 09 CD D9 A5 AD 13 C3 19 06 CA>)
(   2,<2024-02-08 16:29:51.64 +0400>,<she>,<DPX200>,
      <Start of raw data processing
       efp BC_mod = 2 LB = 10 FT_mod = 6 PKNL = 1 PHC0 = -13188.79 PHC1 = 831.2838 SI = 64K 
       data hash MD5: 64K
       34 B7 5E 3F 5F 5F 56 75 D1 0E 6B 4E 2C 54 A6 DF>)
(   3,<2024-02-08 16:30:12.87 +0400>,<she>,<DPX200>,
      <pk PHC0 = 60.75573 PHC1 = -134 
       data hash MD5: 64K
       7B A4 99 C0 E7 A2 23 07 A9 39 3F 65 A2 50 C3 E0>)
(   4,<2024-02-08 16:30:15.48 +0400>,<she>,<DPX200>,
      <abs ABSG = 5 
       data hash MD5: 64K
       C4 D7 B8 F9 56 77 49 2F 65 BE 3C D6 A6 6C A5 BA>)
$$ ##END=
$$ 
$$ hash MD5
$$ 76 43 7C 03 3F 7A 03 AC 0E 31 71 06 E8 48 C8 71
##$RELAX= 
##$RELAX= 
##$RELAX= 
##$RELAX= 
##$RELAX= 
##$RELAX= 
##$RELAX= 
##$RELAX= 
##$RELAX= 
$$ Bruker specific parameters
$$ --------------------------
##$DU= <F:/spectra>
##$EXPNO= 1
##$NAME= <P31>
##$PROCNO= 1
##$TYPE= <nmr>
##$USER= <she>
##$AMP= (0..31)
100 100 100 100 100 100 100 100 100 100 100 100 100 100 100 100 100 100 
100 100 100 100 100 100 100 100 100 100 100 100 100 100 
##$AQSEQ= 0
##$AQ_mod= 1
##$AUNM= <au_zg>
##$AUTOPOS= <>
##$BF1= 81.014009
##$BF2= 200.13
##$BF3= 200.13
##$BF4= 200.13
##$BF5= 200.13
##$BF6= 200.13
##$BF7= 200.13
##$BF8= 200.13
##$BYTORDA= 1
##$CFDGTYP= 0
##$CFRGTYP= 5
##$CHEMSTR= <none>
##$CNST= (0..31)
1 1 145 1 1 1 1 1 1 1 1 1 1 1 1 1 1 1 1 1 1 1 1 1 1 1 1 1 1 1 1 1 
##$CPDPRG= <waltz16>
##$CPDPRG1= <>
##$CPDPRG2= <waltz16>
##$CPDPRG3= <>
##$CPDPRG4= <mlev>
##$CPDPRG5= <mlev>
##$CPDPRG6= <mlev>
##$CPDPRG7= <mlev>
##$CPDPRG8= <mlev>
##$CPDPRGB= <>
##$CPDPRGT= <>
##$D= (0..31)
0 1 0 0 0 0 0 0 0 0 0 0.03 2e-05 3e-06 0 0 0 0 0 0 0 0 0 0 0 0 0 0 0 0 
0 0 
##$DATE= 1707395388
##$DBL= (0..7)
120 120 120 11 120 120 24 19 
##$DBP= (0..7)
150 150 150 150 150 150 150 150 
##$DBP07= 0
##$DBPNAM0= <>
##$DBPNAM1= <>
$$ [...]
##$SUBNAM3= <"">
##$SUBNAM4= <"">
##$SUBNAM5= <"">
##$SUBNAM6= <"">
##$SUBNAM7= <"">
##$SUBNAM8= <"">
##$SUBNAM9= <"">
##$SW= 501.771253377433
##$SWIBOX= (0..15)
0 1 3 0 0 0 0 0 0 0 0 0 0 0 0 0 
##$SW_h= 40650.406504065
##$TD= 32768
##$TD0= 1
##$TE= 0
##$TE2= 300
##$TE3= 300
##$TEG= 300
##$TL= (0..7)
0 120 53 12 22 120 120 120 
##$TP= (0..7)
150 150 150 150 150 150 150 150 
##$TP07= 0
##$TPNAME0= <>
##$TPNAME1= <>
##$TPNAME2= <>
##$TPNAME3= <>
##$TPNAME4= <>
##$TPNAME5= <>
##$TPNAME6= <>
##$TPNAME7= <>
##$TPOAL= (0..7)
0.5 0.5 0.5 0.5 0.5 0.5 0.5 0.5 
##$TPOFFS= (0..7)
0 0 0 0 0 0 0 0 
##$TUNHIN= 0
##$TUNHOUT= 0
##$TUNXOUT= 0
##$USERA1= <user>
##$USERA2= <user>
##$USERA3= <user>
##$USERA4= <user>
##$USERA5= <user>
##$V9= 5
##$VALIST= <valist>
##$VCLIST= <CCCCCCCCCCCCCCC>
##$VD= 0
##$VDLIST= <DDDDDDDDDDDDDDD>
##$VPLIST= <PPPPPPPPPPPPPPP>
##$VTLIST= <TTTTTTTTTTTTTTT>
##$WBST= 1024
##$WBSW= 4
##$XGAIN= (0..3)
0 0 0 0 
##$XL= 0
##$YL= 0
##$YMAX_a= 3662
##$YMIN_a= -5196
##$ZGOPTNS= <>
##$ZL1= 120
##$ZL2= 120
##$ZL3= 120
##$ZL4= 120
##$ABSF1= 248.5645
##$ABSF2= -253.2056
##$ABSG= 5
##$ABSL= 3
##$ALPHA= 0
##$AQORDER= 0
##$ASSFAC= 0
##$ASSFACI= 0
##$ASSFACX= 0
##$ASSWID= 0
##$AUNMP= <proc_1d>
##$AZFE= 0.1
##$AZFW= 0.5
##$BCFW= 0
##$BC_mod= 2
##$BYTORDP= 0
##$COROFFS= 0
##$CY= -3
##$DATMOD= 1
##$DC= 0
##$DFILT= <>
##$DTYPP= 0
##$F1P= 0
##$F2P= 0
##$FCOR= 1
##$FTSIZE= 65536
##$FT_mod= 6
##$GAMMA= 0
##$GB= 0
##$INTBC= 1
##$INTSCL= 6.047779e-11
##$ISEN= 30
##$LB= 10
##$LEV0= 0
##$LPBIN= 0
##$MAXI= 10000
##$MC2= 0
##$MEAN= 0
##$ME_mod= 0
##$MI= 50
##$NCOEF= 0
##$NC_proc= -10
##$NLEV= 6
##$NOISF1= 182.463
##$NOISF2= 159.3651
##$NSP= 0
##$NTH_PI= 0
##$NZP= 0
##$OFFSET= 248.5645
##$PC= 4
##$PHC0= -13128.03
##$PHC1= 697.2838
##$PH_mod= 1
##$PKNL= yes
##$PPARMOD= 0
##$PSCAL= 0
##$PSIGN= 0
##$REVERSE= no
##$SF= 81.0140089999694
##$SI= 65536
##$SIGF1= 159.3651
##$SIGF2= -187.1042
##$SINO= 113.3802
##$SIOLD= 16384
##$SREGLST= <1H.CDCl3>
##$SSB= 0
##$STSI= 65536
##$STSR= 0
##$SW_p= 40650.406504065
##$SYMM= 0
##$S_DEV= 0
##$TDeff= 32768
##$TDoff= 0
##$TI= <>
##$TILT= no
##$TM1= 0
##$TM2= 0
##$TOPLEV= 0
##$USERP1= <user>
##$USERP2= <user>
##$USERP3= <user>
##$USERP4= <user>
##$USERP5= <user>
##$WDW= 1
##$XDIM= 65536
##$YMAX_p= 391946510
##$YMIN_p= -150292534
$$ End of Bruker specific parameters
$$ ---------------------------------
##NTUPLES= NMR SPECTRUM
##VAR_NAME=  FREQUENCY,     SPECTRUM/REAL,   SPECTRUM/IMAG
##SYMBOL=    X,             R,               I
##VAR_TYPE=  INDEPENDENT,   DEPENDENT,       DEPENDENT
##VAR_FORM=  AFFN,          ASDF,            ASDF
##VAR_DIM=   65536,         65536,           65536
##UNITS=     HZ,            ARBITRARY UNITS, ARBITRARY UNITS
##FACTOR=    0.620285442955139, 1,           1
##FIRST=     20137.2065510682, 0,            0
##LAST=      -20513.1999529968, 0,           0
##MIN=       -20513.1999529968, -150292534,  0
##MAX=       20137.2065510682, 391946510,    0
$$ Real data points
##PAGE= N=1
##DATA TABLE= (X++(R..R)), XYDATA
$$ [...]
$$ plain form
42333 -5104211 -6145298 -7098012 -7846905 -8325630 -8520685 -8454351 -8161621 -7677395 -7039501
42324 -7039501 -6299944 -5531360 -4820516 -4251647 -3890548 -3778473 -3934380 -4356477 -5017795
42315 -5017795 -5860462 -6797529 -7726149 -8548479 -9193041 -9628660 -9865341 -9942488 -9912414 -9828546
42305 -9828546 -9740913 -9693841 -9720028 -9830617 -10006607 -10199005 -10342318 -10378473 -10280112 -10061541
42295 -10061541 -9774306 -9493836 -9304109 -9281263 -9475031 -9892169 -10490324 -11186644 -11876368
42286 -11876368 -12452385 -12820328 -12909540 -12681432 -12133900 -11298828 -10232682 -9004407 -7685034
42277 -7685034 -6339607 -5019749 -3757582 -2565081 -1441060 -381544 614600 1548685
42269 1548685 2429037 3272456 4096516 4908745 5702410 6461305 7165522 7788790 8288070
$$ packed form
42333e104211j041087r52714p48893m78725j95055O6334K92730M84226O37894
42324g039501P39557P68584P10844N68869L61099J12075j55907m22097o61318
42315e017795q42667r37067r28620q22330o44562m35619k36681p7147L0074Q3868
42305i828546Q7633M7072k6187j10589j75990j92398j43313l6155R8361K18571
42295a0061541K87235K80470J89727K2846j93768m17138n98155o96320o89724
42286a1876368n76017l67943q9212K28108N47532Q35072J066146J228275J319373
42277g685034J345427J319858J262167J192501J124021J059516R96144R34085
42269A548685Q80352Q43419Q24060Q12229P93665P58895P04217O23268M99280
$$ plain form
42260 8288070 8596621 8631210 8313590 7596604 6483794 5035639 3360942 1596073 -121453
42251 -121453 -1676386 -2988645 -4012846 -4728313 -5129182 -5224278 -5048264 -4673373 -4206228
42242 -4206228 -3763147 -3433147 -3246705 -3164109 -3087194 -2890423 -2462358 -1743184 -742124 472758
42232 472758 1802889 3145275 4402405 5479574 6284321 6737918 6795253 6461328 5794954
42223 5794954 4897720 3891053 2885660 1949997 1088739 243225 -682135 -1777418 -3087563
42214 -3087563 -4590875 -6199460 -7776656 -9164839 -10217913 -10831692 -10964206 -10640691 -9943399
42205 -9943399 -8989923 -7904417 -6787543 -5695388 -4639394 -3611429 -2621332 -1721395 -998008
42196 -998008 -534020 -367206 -470917 -763813 -1136528 -1479827 -1707150 -1770026 -1663097 -1414816
$$ packed form
42260H288070L08551L4589l17620p16986j112810j448155j674697j764869j717526
42251a21453j554933j312259j024201p15467m00869r5096J76014L74891M67145
42242d206228M43081L30000J86442Q2596P6915J96771M28065P19174J001060J214882
42232D72758J330131J342386J257130J077169Q04747M53597N7335l33925o66374
42223E794954q97234j006667j005393r35663q61258q45514r25360j095283j310145
42214c087563j503312j608585j577196j388183j053074o13779j32514L23515O97292
42205i943399R53476J085506J116874J092155J055994J027965R90097Q99937P23387
42196i98008M63988J66814j03711k92896l72715l43299k27323o2876J06929K48281
$$ plain form
42186 -1414816 -1066465 -650629 -180690 346343 941442 1618681 2395432 3291333 4320088
42177 4320088 5475766 6721287 7985535 9170122 10163928 10863589 11196404 11138353 10719463
42168 10719463 10014991 9127947 8169377 7238824 6406119 5699023 5103135 4575315 4064441
42159 4064441 3531409 2964306 2387293 1859772 1461705 1267534 1320467 1620363 2129122 2785780
42149 2785780 3520046 4258494 4925666 5445962 5750193 5785395 5522626 4958118 4108139 3002729
42139 3002729 1683790 208428 -1347340 -2892275 -4335455 -5609467 -6689099 -7593831
42131 -7593831 -8372803 -9081678 -9762125 -10427652 -11054879 -11582335 -11922414 -11987693 -11722594 -11125894
42121 -11125894 -10254428 -9208301 -8104997 -7051707 -6124706 -5362767 -4776777 -4369528 -4152766
$$ packed form
42186a414816L48351M15836M69939N27033N95099O77239P76751Q95901J028755
42177D320088J155678J245521J264248J184587R93806O99661L32815n8051m18890
42168A0719463p04472q87044r58570r30553q32705p07096n95888n27820n10874
42159D064441n33032n67103n77013n27521l98067j94171N2933K99896N08759O56658
42149B785780P34266P38448O67172N20296L04231L5202k62769n64508q49979j105410
42139C002729j318939j475362j555768j544935j443180j274012j079632r04732
42131g593831p78972p08875o80447o65527o27227n27456l40079o5279K65099N96700
42121a1125894Q71466J046127J103304J053290R27001P61939N85990M07249K16762
$$ plain form
42112 -4152766 -4148693 -4372213 -4803418 -5368425 -5944335 -6390949 -6595662 -6509113 -6153753 -5602959
42102 -5602959 -4944731 -4251035 -3567058 -2919344 -2329564 -1820436 -1410554 -1105143 -891540
42093 -891540 -742893 -628336 -526111 -435480 -381694 -408360 -556400 -837284 -1214552 -1606195
42083 -1606195 -1909375 -2034416 -1928340 -1576682 -989409 -186578 805956 1952658 3203952
42074 3203952 4496083 5755138 6903864 7869922 8593729 9034924 9178969 9044890 8689415
42065 8689415 8197980 7658410 7127120 6607463 6053869 5397805 4578721 3565637 2366359
42056 2366359 1027596 -372981 -1743176 -2996668 -4067777 -4915118 -5518709 -5879177 -6021312
42047 -6021312 -5995729 -5871622 -5721075 -5602829 -5554063 -5592150 -5720840 -5933503 -6210964 -6517214
$$ packed form
42112d152766M073k23520m31205n65007n75910m46614k04713Q6549L55360N50794
42102e602959O58228O93696O83977O47714N89780N09128M09882L05411K13603
42093h91540J48647J14557J02225R0631N3786k6666j48040k80884l77268l91643
42083a606195l03180j25041J06076L51658N87273Q02831R92534J146702J251294
42074C203952J292131J259055J148726R66058P23807M41195J44045j34079l55475
42065H689415m91435n39570n31290n19657n53594o56064q19084j013084j199278
42056B366359j338763j400577j370195j253492j071109q47341o03591l60468j42135
42047f021312K5583J24107J50547J18246M8766l8087j28690k12663k77461l06250
$$ plain form
42037 -6517214 -6797903 -6985015 -7009425 -6820060 -6402289 -5784810 -5030574 -4219301 -3433641 -2752915
42027 -2752915 -2248792 -1977408 -1969908 -2226933 -2719877 -3397947 -4198083 -5053436 -5896226 -6655921
42017 -6655921 -7260100 -7644324 -7767518 -7621474 -7226966 -6620393 -5841750 -4931466 -3935193
42008 -3935193 -2909681 -1922317 -1040955 -316886 231062 622681 908581 1151413 1404858
41999 1404858 1700894 2051354 2460326 2935557 3487888 4119292 4812472 5535865 6265122
41990 6265122 7007629 7813160 8763370 9946078 11427125 13231130 15336536 17684532 20196789
41981 20196789 22793648 25403645 27959543 30385337 32587041 34460077 35915160 36910245
41973 36910245 37469362 37675550 37640168 37464256 37210281 36893474 36488914 35944657 35195710
$$ packed form
42037f517214k80689j87112k4410J89365M17771O17479P54236Q11273P85660O80726
42027b752915N04123K71384P500k57025m92944o78070q00136q55353q42790p59695
42017f655921o04179l84224j23194J46044L94508O06573P78643R10284R96273
42008c935193J025512R87364Q81362P24069N47948L91619K85900K42832K53445
41999A404858K96036L50460M08972M75231N52331O31404O93180P23393P29257
41990F265122P42507Q05531R50210J182708J481047J804005K105406K347996K512257
41981B0196789K596859K609997K555898K425794K201704J873036J455083R95085
41973C6910245N59117K06188l5382j75912k53975l16807m04560n44257p48947
$$ plain form
41964 35195710 34180374 32859489 31231883 29336550 27239853 25017065 22739794 20472434
41956 20472434 18271733 16184171 14243992 12478720 10921431 9617622 8614650 7936797
41948 7936797 7564017 7430684 7444246 7510139 7550177 7510863 7364351 7105104 6743849 6299994
41938 6299994 5794312 5244881 4669154 4090577 3542068 3059294 2666585 2366977 2144287
41929 2144287 1973790 1833140 1710416 1611061 1562490 1610415 1803638 2172077 2707691 3355916
41919 3355916 4020274 4578915 4909258 4915109 4549851 3830146 2836765 1702447 589712
41910 589712 -336996 -940282 -1134841 -903004 -296646 575171 1569990 2541913 3369706 3973414
41900 3973414 4314282 4383124 4189544 3760501 3145558 2419156 1672704 996575 458572 88383
$$ packed form
41964C5195710j015336j320885j627606j895333k096697k222788k277271k267360
41956B0472434k200701k087562j940179j765272j557289j303809j002972o77853
41948G936797l72780j33333J3562O5893M0038l9314j46512k59247l61255m43855
41938F299994n05682n49431n75727n78577n48509m82774l92709k99608k22690
41929B144287j70497j40650j22724r9355m8571M7925J93223L68439N35614O48225
41919C355916O64358N58641L30343N851l65258p19705r93381j134318j112735
41910E89712r26708o03286j94559K31837O06358Q71817R94819R71923Q27793O03708
41900C973414L40868O8842j93580m29043o14943p26402p46452o76129n38003l70189
$$ plain form
41890 88383 -124401 -218994 -247599 -264322 -319524 -453212 -683717 -996582 -1342661 -1649913
41880 -1649913 -1845198 -1876294 -1723585 -1396093 -915599 -298703 454854 1365122 2466677
41871 2466677 3795558 5370542 7175654 9152181 11203446 13209318 15045768 16606003
41863 16606003 17819041 18659971 19147553 19329917 19264075 18997373 18558243 17959617 17211881
41854 17211881 16337406 15379269 14400823 13476441 12676036 12049121 11615945 11369718 11285931
41845 11285931 11330394 11461477 11629594 11779731 11858440 11821152 11635398 11281152 10754021 10073459
41835 10073459 9288054 8465324 7663265 6899119 6139554 5324878 4416305 3438489 2491662
41826 2491662 1726266 1294515 1304017 1793259 2733654 4049435 5641471 7403376 9225155
$$ packed form
41890H8383k12784r4593k8605j6723n5202j33688k30505l12865l46079l07252
41880a649913j95285l1096J52709L27492M80494O16896P53557R10268J101555
41871B466677J328881J574984J805112J976527K051265K005872J836450J560235
41863A6606003J213038Q40930M87582J82364o5842k66702m39130n98626p47736
41854A7211881q74475r58137r78446r24382q00405o26915m33176k46227q3787
41845A1285931M4463J31083J68117J50137P8709l7288j85754l54246n27131o80562
41835A0073459p85405q22730q02059p64146p59565q14676r08573r77816r46827
41826B491662p65396m31751R502M89242R40395J315781J592036J761905J821779
$$ plain form
41817 9225155 10989004 12568942 13844181 14724817 15177329 15236259 14997191 14595824 14182135
41808 14182135 13897008 13854827 14131927 14759839 15723201 16962798 18383034 19862742 21270076
41799 21270076 22483002 23412411 24017646 24303163 24294889 24009547 23437514 22551854 21337660
41790 21337660 19821378 18081237 16234989 14415603 12748262 11335000 10245981 9514020
41782 9514020 9130610 9045238 9172430 9409190 9658696 9850777 9952293 9967893 9934955 9913516
41772 9913516 9969678 10154498 10485076 10934252 11430760 11868615 12125179 12087591 11683015 10901636
41762 10901636 9800404 8485142 7082586 5718314 4506410 3543665 2900651 2612566
41754 2612566 2678907 3074275 3762507 4705213 5862885 7192066 8642065 10153075 11657184
$$ packed form
41817I225155J763849J579938J275239Q80636M52512N8930k39068m01367m13689
41808A4182135k85127m2181K77100O27912R63362J239597J420236J479708J407334
41799B1270076J212926R29409O05235K85517q274k85342n72033q85660j214194
41790B1337660j516282j740141j846248j819386j667341j413262j089019p31961
41782I514020l83410q5372J27192K36760K49506J92081J01516J5600l2938k1439
41772I913516N6162J84820L30578M49176M96508M37855K56564l7588m04576p81379
41762A0901636j101232j315262j402556j364272j211904r62745o43014k88085
41754B612566O6341L95368O88232R42706J157672J329181J449999J511010J504109
$$ plain form
41745 11657184 13082700 14360007 15426507 16230222 16732787 16911049 16755304 16265353 15450421
41736 15450421 14338251 12989217 11501665 9997244 8590249 7358965 6335007 5511982
41728 5511982 4862831 4355120 3959537 3650898 3403291 3184747 2958725 2694990 2384176
41719 2384176 2047511 1737493 1530506 1513315 1764686 2334983 3229160 4398879 5746799
41710 5746799 7142600 8447209 9539228 10336706 10809205 10978868 10912368 10706337 10467799
41701 10467799 10290402 10229458 10283204 10390161 10447898 10346965 10003490 9374753 8454912 7261851
41691 7261851 5828106 4199122 2432860 595563 -1244995 -3025431 -4692072 -6207690
41683 -6207690 -7557763 -8750656 -9808361 -10750145 -11575144 -12250401 -12710722 -12874363 -12671954
$$ packed form
41745A1657184J425516J277307J066500Q03715N02565J78262j55745m89951q14932
41736A5450421j112170j349034j487552j504421j406995j231284j023958q23025
41728E511982o49151n07711l95583l08639k47607k18544k26022k63735l10814
41719B384176l36665l10018k06987j7191K51371N70297Q94177J169719J347920
41710E746799J395801J304609J092019P97478M72499J69663o6500k06031k38538
41701A0467799j77397o0944N3746J06957N7737j00933l43475o28737r19841j193061
41691G261851j433745j628984j766262j837297j840558j780436j666641j515618
41683f207690j350073j192893j057705r41784q24999o75257m60321j63641K02409
$$ plain form
41674 -12671954 -12077554 -11127537 -9918629 -8586826 -7277057 -6115151 -5189637 -4545081 -4184713
41665 -4184713 -4079278 -4179019 -4425156 -4757856 -5120914 -5466468 -5761690 -5994072 -6168916 -6296821
41655 -6296821 -6377662 -6392452 -6310359 -6107365 -5784096 -5370793 -4916517 -4469982 -4062916 -3702811
41645 -3702811 -3375625 -3055681 -2719654 -2360838 -1997589 -1669597 -1421162 -1279813 -1243236 -1281813
41635 -1281813 -1352610 -1413296 -1426928 -1356822 -1157895 -772562 -135501 814950 2125171 3818830
41625 3818830 5892781 8313313 11013542 13896693 16848282 19754063 22515632 25055820
41617 25055820 27311319 29217941 30699725 31671633 32056785 31810077 30936924 29499251 27607196
41608 27607196 25401835 23038553 20677916 18481837 16605903 15181891 14293698 13955540
$$ packed form
41674a2671954N94400R50017J208908J331803J309769J161906R25514O44556L60368
41665d184713J05435r9741k46137l32700l63058l45554k95222k32382j74844j27905
41655f296821q0841j4790Q2093K02994L23269M13303M54276M46535M07066L60105
41645c702811L27186L19944L36027L58816L63249L27992K48435J41349L6577l8577
41635a281813p0797o0686j3632P0106J98927L85333O37061R50451J310221J693659
41625C818830K073951K420532K700229K883151K951589K905781K761569K540188
41617B5055820K255499J906622J481784R71908L85152k46708q73153j437673j892055
41608B7607196k205361k363282k360637k196079j875934j424012q88193l38158
$$ plain form
41600 13955540 14101092 14590777 15241827 15876676 16371162 16678186 16815178 16827585 16755171 16620072
41590 16620072 16433733 16205182 15939016 15628529 15256864 14809243 14286223 13707496 13105532
41581 13105532 12514413 11957856 11439623 10941871 10435054 9894646 9314986 8715517 8141602
41572 8141602 7661205 7354026 7291257 7511905 8006115 8712889 9533407 10355580 11080514 11639662
41562 11639662 11996901 12140118 12072419 11808808 11376447 10814732 10175134 9522191 8933079
41553 8933079 8489560 8260012 8278929 8536683 8986651 9565266 10214042 10895564 11600587 12344706
41543 12344706 13153502 14040675 14990797 15957227 16874952 17678600 18316944 18762237 19014641
41534 19014641 19097863 19041781 18857166 18518035 17965651 17133442 15977605 14496545 12733209
$$ packed form
41600A3955540J45552M89685O51050O34849M94486L07024J36992J2407p2414j35099
41590A6620072j86339k28551k66166l10487l71665m47621n23020n78727o01964
41581A3105532n91119n56557n18233m97752n06817n40408n79660n99469n73915
41572H141602m80397l07179o2769K20648M94210P06774Q20518Q22173P24934N59148
41562A1639662L57239J43217o7699k63611m32361n61715o39598o52943n89112
41553H933079m43519k29548J8917K57754M49968N78615O48776O81522P05023P44119
41543A2344706Q08796Q87173R50122R66430R17725Q03648O38344M45293K52404
41534A9014641Q3222n6082j84615l39131n52384q32209j155837j481060j763336
$$ plain form
41525 12733209 10766095 8698007 6646879 4737128 3088223 1799995 938530 528550
41517 528550 555911 978322 1737317 2764137 3978499 5288293 6601516 7852540 9028551
41508 9028551 10174333 11365592 12663985 14080216 15563277 17014385 18311858 19335751
41500 19335751 19989721 20220372 20029223 19468885 18621397 17570002 16382341 15114411 13827810
41491 13827810 12603829 11543093 10750689 10313689 10279497 10643336 11350541 12312380 13426616
41482 13426616 14592922 15719175 16720995 17518997 18037755 18209916 17987056 17354296 16340798
41473 16340798 15018329 13486522 11851888 10211233 8646007 7226175 6017161 5083652
41465 5083652 4487095 4276506 4475078 5068201 5999643 7180057 8507229 9892492 11283010
$$ packed form
41525A2733209j967114k068088k051128j909751j648905j288228q61465m09980
41517E28550K7361M22411P58995J026820J214362J309794J313223J251024J176011
41508I028551J145782J191259J298393J416231J483061J451108J297473J023893
41500A9335751O53970K30651j91149n60338q47488j051395j187661j267930j286601
41491A3827810j223981j060736p92404m37000l4192L63839P07205R61839J114236
41482A3426616J166306J126253J001820P98002N18758J72161k22860o32760j013498
41473A6340798j322469j531807j634634j640655j565226j419832j209014r33509
41465E083652n96557k10589J98572N93123R31442J180414J327172J385263J390518
$$ plain form
41456 11283010 12667220 14056336 15449636 16804811 18033588 19026176 19689533 19977830
41448 19977830 19901132 19512549 18885541 18095143 17209331 16287564 15381525 14537396 13800051
41439 13800051 13214113 12814369 12607352 12559254 12606068 12685968 12775739 12909081 13166085 13639228
41429 13639228 14391725 15426428 16678129 18031251 19352852 20524595 21460908 22110418
41421 22110418 22446739 22457718 22139721 21498510 20553624 19340793 17908157 16306360 14577633
41412 14577633 12751347 10851189 8911391 6990356 5167142 3516135 2073708 821843
41404 821843 -295317 -1330844 -2298723 -3166964 -3882256 -4405604 -4734188 -4898892 -4944966
41395 -4944966 -4911174 -4818608 -4671654 -4467052 -4204326 -3891777 -3546848 -3195028 -2871471 -2623017
$$ packed form
41456A1283010J384210J389116J393300J355175J228777R92588O63357K88297
41448A9977830p6698l88583o27008p90398q85812r21767r06039q44129p37345
41439A3800051n85938l99744k07017m8098M6814P9900Q9771J33342K57004M73143
41429A3639228P52497J034703J251701J353122J321601J171743R36313O49510
41421B2110418L36321J0979l17997o41211r44886j212831j432636j601797j728727
41412A4577633j826286j900158j939798j921035j823214j651007j442427j251865
41404H21843j117160j035527r67879q68241p15292n23348l28584j64704m6074
41395d944966L3792R2566J46954K04602K62726L12549L44929L51820L23557K48454
$$ plain form
41385 -2623017 -2502823 -2554280 -2792030 -3193989 -3711558 -4291809 -4897233 -5511709 -6131647 -6750591
41375 -6750591 -7348398 -7891904 -8346801 -8694139 -8941940 -9123779 -9282584 -9446784 -9611383
41366 -9611383 -9734036 -9748590 -9591226 -9229512 -8681586 -8014251 -7318872 -6677891 -6140062 -5713831
41356 -5713831 -5375246 -5081056 -4780272 -4420838 -3950321 -3313654 -2455490 -1332701 67100
41347 67100 1713270 3535818 5443754 7346865 9168699 10845862 12318925 13525935
41339 13525935 14407079 14919973 15056591 14850944 14371953 13704186 12924891 12086372 11208958
41330 11208958 10285274 9293773 8217394 7059812 5849680 4628335 3428682 2261108
41322 2261108 1116238 -20876 -1158501 -2293661 -3409094 -4465447 -5394404 -6106032
$$ packed form
41385b623017J20194n1457k37750m01959n17569n80251o05424o14476o19938o18944
41375f750591n97807n43506m54897l47338k47801j81839j58805j64200j64599
41366i611383j22653j4554J57364L61714N47926O67335O95379O40981N37829M26231
41356e713831L38585K94190L00784L59434M70517O36667Q58164J122789J399801
41347F7100J646170J822548J907936J903111J821834J677163J473063J207010
41339A3525935Q81144N12894J36618k05647m78991o67767p79295q38519q77414
41330A1208958r23684r91501j076379j157582j210132j221345j199653j167574
41322B261108j144870j137114j137625j135160j115433j056353r28957p11628
$$ plain form
41314 -6106032 -6515316 -6576035 -6301873 -5762084 -5054053 -4266077 -3446547 -2591832 -1656873 -581933
41304 -581933 678411 2136837 3769885 5525986 7338755 9140710 10873271 12489647
41296 12489647 13951252 15223855 16279748 17104754 17701538 18082495 18254180 18201242 17876652
41287 17876652 17201600 16077539 14411361 12148815 9304305 5974562 2330910 -1406226
41279 -1406226 -5002440 -8246105 -10980414 -13124219 -14674319 -15684967 -16230471 -16368876
41271 -16368876 -16126620 -15510646 -14536426 -13253392 -11755184 -10170695 -8636432 -7256757
41263 -7256757 -6068160 -5027905 -4036112 -2980506 -1780205 -408044 1115197 2746097
41255 2746097 4445225 6188411 7958992 9732903 11472288 13131908 14668566 16041971
$$ packed form
41314f106032m09284o0719K74162N39789P08031P87976Q19530Q54715R34959J074940
41304e81933J260344J458426J633048J756101J812769J801955J732561J616376
41296A2489647J461605J272603J055893Q25006N96784L80957J71685n2938l24590
41287A7876652o75052j124061j666178k262546k844510l329743l643652l737136
41279a406226l596214l243665k734309k143805j550100j010648n45504j38405
41271a6368876K42256O15974R74220J283034J498208J584489J534263J379675
41263g256757J188597J040255R91793J055606J200301J372161J523241J630900
41255B746097J699128J743186J770581J773911J739385J659620J536658J373405
$$ plain form
41247 16041971 17206643 18106051 18681122 18895012 18762088 18361206 17818133 17259816 16762953
41238 16762953 16326122 15880750 15332097 14605847 13678550 12583655 11396300 10204758 9079446
41229 9079446 8053289 7124675 6282727 5540615 4957775 4639918 4718670 5320525 6534502
41220 6534502 8384095 10807684 13652865 16690064 19645620 22246202 24261641 25536172
41212 25536172 26005168 25698769 24732437 23282767 21550440 19719839 17929015 16259041
41204 16259041 14741725 13377380 12153515 11057937 10082311 9215631 8432710 7686942 6914401
41195 6914401 6049443 5046199 3897541 2641624 1348079 86382 -1106561 -2238799
41187 -2238799 -3348831 -4476264 -5635382 -6801145 -7908398 -8863720 -9568509 -9946626 -9965513
$$ packed form
41247A6041971J164672Q99408N75071K13890j32924m00882n43073n58317m96863
41238A6762953m36831m45372n48653p26250r27297j094895j187355j191542j125312
41229I079446j026157r28614q41948p42112n82840l17857P8752O01855J213977
41220F534502J849593K423589K845181L037199K955556K600582K015439J274531
41212B5536172M68996l06399r66332j449670j732327j830601j790824j669974
41204A6259041j517316j364345j223865j095578r75626q66680p82921p45768p72541
41195F914401q64958j003244j148658j255917j293545j261697j192943j132238
41187b238799j110032j127433j159118j165763j107253r55322p04789l78117j8887
$$ plain form
41178 -9965513 -9643199 -9041649 -8251509 -7373104 -6497516 -5691152 -4985339 -4370352 -3794196
41169 -3794196 -3169734 -2393546 -1373352 -53951 1567847 3440933 5465702 7505362
41161 7505362 9405207 11020642 12245626 13027916 13364304 13281982 12818566 12010379 10893209
41152 10893209 9515143 7954009 6324647 4763801 3395836 2297085 1476272 876767
41144 876767 397707 -71391 -612182 -1252283 -1968919 -2720098 -3482467 -4271267 -5131741 -6108927
41134 -6108927 -7212310 -8392902 -9545567 -10537745 -11250489 -11610207 -11598118 -11241347 -10598163
41125 -10598163 -9744474 -8760783 -7719395 -6677027 -5676906 -4756335 -3950445 -3286698 -2772558
41116 -2772558 -2383743 -2061328 -1723154 -1287398 -697139 67024 989786 2031810 3139833
$$ packed form
41178i965513L22314O01550P90140Q78405Q75588Q06364P05813O14987N76156
41169c794196O24462P76188J020194J319401J621798J873086K024769K039660
41161G505362J899845J615435J224984P82290L36388q2322m63416q08187j117170
41152A0893209j378066j561134j629362j560846j367965j098751q20813n99505
41144H76767m79060m69098n40791o40101p16636p51179p62369p88800q60474r77186
41134f108927j103383j180592j152665r92178p12744l59718J2089L56771O43184
41125a0598163Q53689R83691J041388J042368J000121R20571Q05890O63747N14140
41116b772558L88815L22415L38174M35756N90259P64163R22762J042024J108023
$$ plain form
41107 3139833 4255028 5322505 6301491 7172473 7939279 8626403 9270602 9905801 10545585
41098 10545585 11173234 11746408 12213307 12529475 12666000 12608051 12349611 11891200 11242500
41089 11242500 10426085 9477770 8443933 7379780 6349285 5421658 4659650 4102948 3755824
41080 3755824 3585536 3531058 3518325 3478403 3364075 3158496 2872175 2531639 2167287 1805130
41070 1805130 1462258 1145078 850806 571447 297076 17130 -276792 -583577 -884734
41061 -884734 -1145101 -1326136 -1405656 -1392691 -1328815 -1274126 -1283505 -1385215 -1574252 -1823754 -2105362
41050 -2105362 -2405156 -2727921 -3090277 -3507040 -3977368 -4479501 -4979257 -5447028 -5871162
41041 -5871162 -6260706 -6640582 -7044728 -7508068 -8056601 -8698456 -9419587 -10183988 -10936837
$$ packed form
41107C139833J115195J067477R78986Q70982P66806O87124O44199O35199O39784
41098A0545585O27649N73174M66899L16168J36525n7949k58440m58411o48700
41089A1242500q16415r48315j033837j064153j030495r27627p62008n56702l47124
41080C755824j70288n4478j2733l9922j14328k05579k86321l40536l64352l62157
41070A805130l42872l17180k94272k79359k74371k79946k93922l06785l01157
41061h84734k60367j81035p9520J2965O3876N4689r379j01710j89037k49502k81608
41050b105362k99794l22765l62356m16763m70328n02133m99756m67771m24134
41041e871162l89544l79876m04146m63340n48533o41855p21131p64401p52849
$$ plain form
41032 -10936837 -11612044 -12145320 -12487377 -12608320 -12491522 -12125582 -11504405 -10637527 -9563995
41023 -9563995 -8359120 -7124799 -5962496 -4941013 -4077826 -3343899 -2684730 -2042010 -1366341
41014 -1366341 -621087 219057 1171501 2247248 3447317 4756222 6139280 7547949 8930053
41005 8930053 10237884 11430248 12470239 13323715 13962498 14372049 14559060 14554054 14408720
40996 14408720 14191763 13984926 13874749 13934831 14201714 14658069 15237518 15852602 16430616
40987 16430616 16935732 17365701 17728565 18015912 18188541 18182190 17930905 17396761 16590367 15570898
40977 15570898 14425723 13239781 12067971 10921472 9774241 8587925 7342991 6059132
40969 6059132 4795294 3632606 2650251 1902265 1400742 1111596 967813 897303 852674
$$ packed form
41032a0936837o75207n33276l42057j20943J16798L65940O21177Q66878J073532
41023i563995J204875J234321J162303J021483Q63187P33927O59169O42720O75669
41014a366341P45254Q40144R52444J075747J200069J308905J383058J408669J382104
41005H930053J307831J192364J039991Q53476O38783M09551J87011n006j45334
40996A4408720k16957k06837j10177O0082K66883M56355N79449O15084N78014
40987A6430616N05116M29969L62864K87347J72629o351k51285n34144q06394j019469
40977A5570898j145175j185942j171810j146499j147231j186316j244934j283859
40969F059132j263838j162688r82355p47986n01523k89146j43783p0510m4629
$$ plain form
40960 852674 826826 844819 936309 1106544 1327060 1554280 1763572 1975430 2257819 2705027
40950 2705027 3403933 4400188 5675037 7141213 8660464 10076035 11246880 12071977 12500333
40941 12500333 12528453 12188953 11534293 10621673 9506617 8248035 6916988 5595244 4357194
40932 4357194 3244287 2248990 1318340 374801 -653963 -1804683 -3055754 -4320909 -5463813
40923 -5463813 -6329272 -6779741 -6724651 -6133682 -5031599 -3480562 -1561774 633118 2999188
40914 2999188 5411346 7723659 9781181 11442952 12607864 13232269 13331420 12963956 12205986
40905 12205986 11126512 9776824 8200199 6455151 4634685 2865526 1284706 5413
40897 5413 -910408 -1459157 -1679462 -1622918 -1329949 -824769 -127988 727545 1691646 2704830
$$ packed form
40960H52674k5848J7993R1490J70235K20516K27220K09292K11858K82389M47208
40950B705027O98906R96255J274849J466176J519251J415571J170845Q25097M28356
40941A2500333K8120l39500o54660r12620j115056j258582j331047j321744j238050
40932D357194j112907r95297r30650r43539j028764j150720j251071j265155j142904
40923e463813q65459m50469N5090N90969J102083J551037J918788K194892K366070
40914B999188K412158K312313K057522J661771J164912O24405R9151l67464p57970
40905A2205986j079474j349688j576625j745048j820466j769159j580820j279293
40897E413r15821n48749k20305N6544K92969N05180O96781Q55533R64101J013184
$$ plain form
40887 2704830 3711554 4668696 5544418 6309890 6931518 7370599 7591388 7572565 7316886
40878 7316886 6856859 6255617 5600659 4988899 4506485 4211826 4129677 4258273 4584429 5097626
40868 5097626 5794994 6673775 7714750 8866312 10041425 11135017 12057147 12764393 13270554
40859 13270554 13632013 13921843 14212027 14570642 15064692 15755495 16682973 17845721 19186535
40850 19186535 20590480 21899992 22948338 23604916 23815740 23619524 23130171 22493828 21840102
40841 21840102 21246106 20723806 20232404 19709477 19106968 18415056 17664189 16909560 16211261
40832 16211261 15620380 15171849 14879540 14731062 14683975 14666696 14586286 14343039 13848927 13044492
40822 13044492 11909552 10466823 8780184 6948066 5090598 3331600 1781089 524127
$$ packed form
40887B704830J006724R57142Q75722P65472O21628M39081K20789j8823k55679
40878G316886m60027o01242o54958o11760m82414k94659q2149J28596L26156N13197
40868E097626O97368Q78781J040975J151562J175113J093592R22130P07246N06161
40859A3270554L61459K89830K90184L58615M94050O90803R27478J162748J340814
40850A9186535J403945J309512J048346O56578K10824j96216m89353o36343o53726
40841B1840102n93996n22300m91402n22927o02509o91912p50867p54629o98299
40832A6211261n90881m48531k92309j48478m7087j7279q0410k43247m94112q04435
40822A3044492j134940j442729j686639j832118j857468j758998j550511j256962
$$ plain form
40814 524127 -383607 -916749 -1078062 -890068 -380981 426906 1516926 2864749 4420632
40805 4420632 6098541 7780105 9335684 10657620 11692783 12458822 13036001 13539385 14084344
40796 14084344 14757854 15603581 16623636 17793382 19078331 20440435 21829652 23170447
40788 23170447 24359541 25284185 25854649 26033422 25845474 25366566 24699204 23949095 23209085
40779 23209085 22549268 22008838 21588169 21245326 20903953 20476062 19894867 19145022 18275757
40770 18275757 17387983 16597677 15990442 15589290 15352594 15202208 15064093 14898305 14704097
40761 14704097 14500697 14296006 14061014 13726036 13204074 12430137 11393543 10143713 8767268
40752 8767268 7352630 5963745 4633947 3374333 2183253 1050132 -41492 -1104348
$$ packed form
40814E24127r07734n33142j61313J87994N09087Q07887J090020J347823J555883
40805D420632J677909J681564J555579J321936J035163P66039N77179N03384N44959
40796A4084344O73510Q45727J020055J169746J284949J362104J389217J340795
40788B3170447J189094R24644N70464J78773j87948m78908o67362p50109p40010
40779B3209085o59817n40430m20669l42843l41373m27891n81195p49845q69265
40770A8275757q87774p90306o07235m01152k36696j50386j38115j65788j94208
40761A4704097k03400k04691k34992l34978n21962p73937j036594j249830j376445
40752H767268j414638j388885j329798j259614j191080j133121j091624j062856
$$ plain form
40744 -1104348 -2132618 -3092420 -3926752 -4574567 -4995092 -5186562 -5191720 -5087857 -4964885 -4899374
40734 -4899374 -4934041 -5070239 -5275362 -5499661 -5692507 -5811343 -5824788 -5715332 -5482582 -5142147
40724 -5142147 -4717577 -4230645 -3698215 -3137401 -2572334 -2035161 -1560649 -1180333 -921663
40715 -921663 -811115 -874860 -1132547 -1587391 -2220281 -2991425 -3845335 -4713846 -5518919 -6183222
40705 -6183222 -6652718 -6924064 -7060477 -7181648 -7426399 -7903196 -8652282 -9637584 -10769645
40696 -10769645 -11944144 -13074821 -14107554 -15016834 -15795463 -16446736 -16979719 -17403167 -17717231
40687 -17717231 -17908039 -17949795 -17812543 -17469673 -16901973 -16100376 -15070730 -13840245 -12460576
40678 -12460576 -11001911 -9537668 -8127473 -6809092 -5603222 -4524166 -3586133 -2801868
$$ packed form
40744a104348j028270r59802q34332o47815m20525j91470n158J03863J22972O5511
40734d899374l4667j36198k05123k24299j92846j18836j3445J09456K32750L40435
40724e142147M24570M86932N32430N60814N65067N37173M74512L80316K58670
40715i21663J10548o3745k57687m54844o32890p71144q53910q68511q05073o64303
40705f183222m69496k71346j36413j21171k44751m76797p49086r85302j132061
40696a0769645j174499j130677j032733r09280p78629o51273n32983m23448l14064
40687a7717231j90808m1756J37252L42870N67700Q01597J029646J230485J379669
40678a2460576J458665J464243J410195J318381J205870J079056R38033P84265
$$ plain form
40670 -2801868 -2178550 -1716129 -1407515 -1237417 -1179914 -1198867 -1254166 -1311317 -1347967 -1353285 -1322802
40659 -1322802 -1254942 -1151818 -1020411 -869608 -704506 -524075 -325638 -113248 96966 280009
40649 280009 413793 492229 529093 548812 573393 619789 710713 885633 1196010 1683288 2353924
40638 2353924 3168654 4053318 4925727 5724664 6426757 7044347 7608257 8145745 8663504
40629 8663504 9141766 9542142 9826870 9980394 10021212 9997888 9974090 10012862 10165883 10466020
40619 10466020 10919802 11501868 12158110 12821164 13432424 13957451 14384513 14707466 14904927
40610 14904927 14928829 14707417 14158539 13205905 11794151 9902215 7554466 4826422 1841244
40601 1841244 -1244249 -4262002 -7059279 -9522719 -11591326 -13252017 -14519828 -15414540
$$ packed form
40670b801868O23318M62421L08614J70098N7503j8953n5299n7151l6650n318L0483
40659a322802O7860J03124J31407J50803J65102J80431J98437K12390K10214J83043
40649B80009J33784P8436L6864J9719K4581M6396R0924J74920L10377M87278O70636
40638B353924Q14730Q84664Q72409P98937P02093O17590N63910N37488N17759
40629H663504M78262M00376K84728J53524M0818k3324k3798L8772J53021L00137
40619A0466020M53782N82066O56242O63054O11260N25027M27062L22953J97461
40610A4904927K3902k21412n48878r52634j411754j891936k347749k728044k985178
40601A841244l085493l017753k797277k463440k068607j660691j267811q94712
$$ plain form
40593 -15414540 -15947824 -16127279 -15971567 -15523097 -14846548 -14011678 -13070837 -12045777 -10931880
40584 -10931880 -9716497 -8400965 -7015771 -5622149 -4298983 -3120963 -2138884 -1370896
40576 -1370896 -806070 -416680 -175628 -74722 -135147 -400589 -913113 -1684892 -2681906 -3825520
40566 -3825520 -5006153 -6100536 -6988876 -7572018 -7787589 -7621143 -7107802 -6322574 -5361614
40557 -5361614 -4320022 -3273001 -2265503 -1311611 -401030 490477 1387621 2299190 3202606
40548 3202606 4037584 4714941 5137873 5225827 4931722 4249160 3211111 1882907 352110
40539 352110 -1284013 -2934705 -4535481 -6064633 -7544513 -9021205 -10530314 -12067081
40531 -12067081 -13576548 -14967841 -16145143 -17042055 -17645362 -17998034 -18179155 -18268924 -18315687
$$ packed form
40593a5414540n33284j79455J55712M48470O76549Q34870R40841J025060J113897
40584a0931880J215383J315532J385194J393622J323166J178020R82079P67988
40576a370896N64826L89390K41052J00906o0425k65442n12524p71779r97014j143614
40566c825520j180633j094383q88340n83142k15571J66446N13341P85228R60960
40557e361614J041592J047021J007498R53892R10581Q91507Q97144R11569R03416
40548C202606Q34978O77357M22932Q7954k94105o82562j038049j328204j530797
40539C52110j636123j650692j600776j529152j479880j476692j509109j536767
40531a2067081j509467j391293j177302q96912o03307l52672j81121q9769m6763
$$ plain form
40522 -18315687 -18323290 -18266402 -18122533 -17896573 -17620119 -17329508 -17042984 -16753799 -16439290 -16074451
40512 -16074451 -15640377 -15126309 -14529687 -13858328 -13133980 -12390881 -11663472 -10967358 -10288296
40503 -10288296 -9591209 -8844442 -8040792 -7200861 -6360056 -5550900 -4790877 -4079919 -3407293
40494 -3407293 -2763591 -2149269 -1571551 -1029714 -498956 73614 753518 1589011 2582547
40485 2582547 3680781 4789482 5804711 6645200 7275779 7717887 8043329 8348252 8714214
40476 8714214 9175335 9709549 10255969 10744691 11123424 11374000 11518962 11618853 11758389 12020971
40466 12020971 12457854 13066464 13792702 14559930 15309624 16030297 16759101 17557644 18477057
40457 18477057 19530600 20685664 21875192 23018253 24037730 24870281 25471786 25822734
$$ packed form
40522a8315687p603N6888J43869K25960K76454K90611K86524K89185L14509L64839
40512a6074451M34074N14068N96622O71359P24348P43099P27409O96114O79062
40503a0288296O97087P46767Q03650Q39931Q40805Q09156P60023P10958O72626
40494c407293O43702O14322N77718N41837N30758N72570O79904Q35493R93536
40485B582547J098234J108701J015229Q40489O30579M42108L25442L04923L65962
40476H714214M61121N34214N46420M88722L78733K50576J44962R9891J39536K62582
40466A2020971M36883O08610P26238P67228P49694P20673P28804P98543R19413
40457A8477057J053543J155064J189528J143061J019477Q32551O01505L50948
$$ plain form
40449 25822734 25933345 25844577 25621953 25342458 25078077 24880707 24772071 24739699 24738390 24696698
40439 24696698 24528318 24148091 23491240 22531560 21290068 19826703 18218556 16540659 14862988
40430 14862988 13259249 11809738 10588889 9646669 8998587 8627642 8490557 8522717 8643627
40421 8643627 8766346 8810304 8714169 8445885 8008300 7439130 6804007 6182041 5646496 5248022
40411 5248022 5008775 4928600 4995488 5192228 5498745 5893600 6354439 6855089 7362608 7842187
40401 7842187 8271339 8653066 9015468 9396014 9820655 10289791 10775840 11229815 11593126
40392 11593126 11812758 11856922 11723891 11437502 11032881 10545749 10014149 9486298 9020816
40383 9020816 8674619 8486017 8462272 8576015 8773653 8997859 9216903 9442975 9725284 10122322
$$ packed form
40449B5822734J10611q8768k22624k79495k64381j97370j08636l2372j309m1692
40439B4696698j68380l80227o56851r59680j241492j463365j608147j677897j677671
40430A4862988j603739j449511j220849r42220o48082l70945j37085L2160J20910
40421H643627J22719M3958r6135k68284m37585n69170o35123o21966n35545l98474
40411E248022k39247q0175O6888J96740L06517L94855M60839N00650N07519M79579
40401G842187M29152L81727L62402L80546M24641M69136M86049M53975L63311
40392A1593126K19632M4164j33031k86389m04621m87132n31600n27851m65482
40383I020816l46197j88602k3745J13743J97638K24206K19044K26072K82309L97038
$$ plain form
40373 10122322 10672001 11375451 12197083 13074527 13931964 14694580 15304772 15739042 16018517
40364 16018517 16202564 16361656 16540138 16729200 16865895 16859240 16629698 16141922 15415806 14515020
40354 14515020 13525361 12536628 11632102 10881098 10331028 10001578 9885776 9959198 10193105
40345 10193105 10563816 11051746 11630708 12256083 12860820 13360522 13663360 13684008 13364703
40336 13364703 12700739 11757454 10665348 9592492 8706221 8138851 7967415 8211689 8849184
40327 8849184 9839090 11142465 12728263 14563681 16597313 18748172 20909908 22969004
40319 22969004 24825795 26406236 27661842 28566203 29117744 29348669 29329711 29160498 28945944
40310 28945944 28768984 28670176 28638049 28610089 28486053 28155707 27536629 26608457 25427776 24115101
$$ packed form
40373A0122322N49679P03450Q21632Q77444Q57437P62616O10192M34270K79475
40364A6018517J84047J59092J78482J89062J36695o655k29542m87776p26116r00786
40354A4515020r89659r88733r04526p51004n50070l29450j15802P3422K33907
40345A0193105L70711M87930N78962O25375O04737M99702L02838K0648l19305
40336A3364703o63964r43285j092106j072856q86271n67370j71436K44274O37495
40327H849184R89906J303375J585798J835418K033632K150859K161736K059096
40319B2969004J856791J580441J255606R04361N51541K30925j8958j69213k14554
40310B8945944j76960r8808l2127k7960j24036l30346o19078r28172j180681j312675
$$ plain form
40300 24115101 22817949 21665349 20734547 20045232 19580288 19315273 19235679 19334430 19598709
40291 19598709 20000885 20501440 21061773 21658808 22292567 22981165 23744768 24587916 25491757
40282 25491757 26420834 27338243 28217815 29046446 29817802 30522590 31140068 31635023 31964211
40273 31964211 32091717 32004042 31713121 31245664 30630719 29898297 29088015 28254381 27458134
40264 27458134 26746818 26137574 25613601 25136866 24670712 24200959 23744795 23342950 23038717
40255 23038717 22852604 22762227 22695139 22538637 22165101 21465435 20379373 18911705 17128175
40246 17128175 15133236 13041037 10954662 8962241 7146036 5591950 4388622 3614358
40238 3614358 3318913 3509949 4150638 5168623 6471464 7962544 9552961 11167133 12741978
$$ packed form
40300B4115101j297152j152600r30802o89315m64944k65015p9594R8751K64279
40291A9598709M02176N00555N60333N97035O33759O88598P63603Q43148R03841
40282B5491757R29077R17409Q79572Q28631P71356P04788O17478M94955L29188
40273C1964211J27506q7675k90921m67457o14945p32422q10282q33634p96247
40264B7458134p11316o09244n23973m76735m66154m69753m56164m01845l04233
40255B3038717j86113r0377o7088j56502l73536o99666j086062j467668j783530
40246A7128175j994939k092199k086375j992421j816205j554086j203328p74264
40238C614358k95445J91036O40689J017985J302841J491080J590417J614172J574845
$$ plain form
40229 12741978 14222375 15558322 16709007 17655081 18414207 19049321 19658246 20341502 21160866
40220 21160866 22112639 23133157 24132197 25031346 25785445 26381372 26822946 27113990 27248150
40211 27248150 27209595 26983505 26568843 25983295 25256258 24416404 23485319 22482084 21431173
40202 21431173 20360390 19284436 18186277 17015792 15713488 14245602 12626381 10913550
40194 10913550 9183772 7507015 5934512 4501942 3240302 2186647 1390608 914344
40186 914344 822777 1163689 1945531 3127389 4630195 6362758 8244534 10211038 12202875
40177 12202875 14150819 15969215 17561881 18836680 19721543 20175925 20195730 19813083 19091953
40168 19091953 18118565 16986443 15780649 14568776 13402391 12324431 11373321 10578199
$$ packed form
40229A2741978J480397J335947J150685R46074P59126O35114O08925O83256Q19364
40220B1160866R51773J020518R99040Q99149P54099N95927M41574K91044J34160
40211B7248150l8555k26090m14662n85548p27037q39854r31085j003235j050911
40202B1431173j070783j075954j098159j170485j302304j467886j619221j712831
40194A0913550j729778j676757j572503j432570j261640j053655p96039m76264
40186I14344r1567L40912P81842J181858J502806J732563J881776J966504J991837
40177A2202875J947944J818396J592666J274799Q84863M54382J9805l82647p21130
40168A9091953r73388j132122j205794j211873j166385j077960r51110p95122
$$ plain form
40160 10578199 9948577 9468532 9103789 8820641 8605793 8474459 8461630 8602228 8911632
40151 8911632 9376410 9958516 10608783 11280842 11937636 12549446 13089602 13535001 13872480
40142 13872480 14105336 14254098 14351237 14434399 14542269 14713563 14987534 15404787 16007431 16836391
40132 16836391 17923916 19283150 20900606 22736366 24730974 26814217 28913382 30962638
40124 30962638 32914044 34745555 36460069 38074877 39606460 41056036 42398622 43578669
40116 43578669 44516719 45128712 45352081 45167098 44603341 43728036 42621950 41355521 39978371
40107 39978371 38525891 37033811 35547484 34120958 32810383 31666509 30725919 30000866
40099 30000866 29472325 29091277 28787783 28484419 28112717 27631121 27037575 26368444 25684221
$$ packed form
40160A0578199o29622m80045l64743k83148k14848j31334j2829J40598L09404
40151H911632M64778N82106O50267O72059O56794O11810N40156M45399L37479
40142A3872480K32856J48762R7139Q3162J07870J71294K73971M17253O02644Q28960
40132A6836391J087525J359234J617456J835760J994608K083243K099165K049256
40124C0962638J951406J831511J714514J614808J531583J449576J342586J180047
40116D3578669R38050O11993K23369j84983n63757q75305j106086j266429j377150
40107C9978371j452480j492080j486327j426526j310575j143874r40590p25053
40099C0000866n28541l81048l03494l03364l71702m81596n93546o69131o84223
$$ plain form
40090 25684221 25052610 24538757 24202478 24095474 24253647 24685653 25362875 26217205 27150482
40081 27150482 28053202 28824488 29386441 29692504 29732869 29536592 29166261 28703134 28226671
40072 28226671 27795901 27438872 27152995 26915478 26699572 26490172 26293118 26136394 26065417
40063 26065417 26135347 26400417 26897879 27628034 28540094 29537133 30504220 31348332 32030823
40054 32030823 32580088 33084781 33674106 34489028 35645164 37192590 39086756 41187491 43291942
40045 43291942 45188539 46708592 47758333 48328360 48484506 48342895 48032955 47659934 47282515
40036 47282515 46912622 46530188 46099962 45583548 44948523 44178621 43284619 42310367 41327432
40027 41327432 40417083 39646717 39052472 38635644 38370945 38217574 38125155 38033578 37873197 37573353
$$ packed form
40090B5684221o31611n13853l36279j07004J58173M32006O77222Q54330R33277
40081B7150482R02720P71286N61953L06063M0365j96277l70331m63127m76463
40072B8226671m30770l57029k85877k37517k15906k09400j97054j56724p0977
40063B6065417O9930K65070M97462P30155R12060R97039R67087Q44112O82491
40054C2030823N49265N04693N89325Q14922J156136J547426J894166K100735K104451
40045D3291942J896597J520053J049741N70027J56146j41611l09940l73021l77419
40036D7282515l69893l82434m30226n16414o35025p69902q94002r74252r82935
40027D1327432r10349p70366n94245m16828k64699j53371r2419r1577j60381k99844
$$ plain form
40017 37573353 37080865 36380725 35507165 34539033 33583163 32754596 32160471 31889254 32003249
40008 32003249 32531458 33461834 34735721 36249381 37865847 39436480 40828408 41951880
40000 41951880 42779634 43350702 43756142 44111840 44528267 45086591 45826564 46746293 47809652
39991 47809652 48956330 50112955 51206426 52177880 52991549 53634431 54109197 54425489 54591422
39982 54591422 54606101 54459431 54147420 53699988 53201982 52786983 52603258 52773900 53375573
39973 53375573 54440561 55965992 57912639 60193128 62665674 65147806 67448459 69403943
39965 69403943 70905331 71914374 72468357 72669557 72654741 72552868 72453923 72408549 72453988 72639159
39955 72639159 73024297 73655800 74538453 75625669 76831439 78054756 79205563 80224547
$$ packed form
40017C7573353m92488p00140q73560r68132r55870q28567n94125k71217J13995
40008C2003249N28209R30376J273887J513660J616466J570633J391928J123472
40000D1951880Q27754N71068M05440L55698M16427N58324P39973R19729J063359
39991D7809652J146678J156625J093471R71454Q13669O42882M74766L16292J65933
39982E4591422J4679j46670l12011m47432m98006m14999j83725J70642O01673
39973E3375573J064988J525431J946647K280489K472546K482132K300653J955484
39965F9403943J501388J009043N53983K01200j4816j01873r8945m5374M5439J85171
39955G2639159L85138O31503Q82653J087216J205770J223317J150807J018984
$$ plain form
39947 80224547 81092147 81826694 82476213 83107836 83793415 84588995 85513270 86537274 87593195
39938 87593195 88597227 89472526 90161542 90626746 90845678 90805860 90501686 89934229 89116346
39929 89116346 88083895 86906897 85688636 84545586 83575311 82829809 82308543 81973136 81775250
39920 81775250 81684545 81703470 81861377 82193033 82718496 83440576 84361238 85502174 86910933
39911 86910933 88644160 90735460 93166944 95863549 98716257 101622283 104520221 107402693
39903 107402693 110302418 113259763 116286221 119339638 122322429 125103455 127552794 129574462
39895 129574462 131126712 132226587 132939459 133357005 133570948 133652908 133648420 133585567 133490877 133402583
39885 133402583 133375335 133477746 133788208 134391706 135374008 136807915 138732825 141136643 143949362
$$ packed form
39947H0224547Q67600P34547O49519O31623O85579P95580R24275J024004J055921
39938H7593195J004032Q75299O89016M65204K18932l9818l04174n67457q17883
39929H9116346j032451j176998j218261j143050r70275p45502n21266l35407j97886
39920H1775250r0705J8925J57907L31656N25463P22080R20662J140936J408759
39911H6910933J733227K091300K431484K696605K852708K906026K897938K882472
39903A07402693K899725K957345L026458L053417K982791K781026K449339K021668
39895A29574462J552250J099875P12872M17546K13943Q1960m488o2853r4690q8294
39885A33402583k7248J02411L10462O03498R82302J433907J924910K403818K812719
$$ plain form
39876 143949362 147050471 150286120 153491634 156516817 159250441 161637404 163682083 165435946
39868 165435946 166974054 168369806 169677404 170926714 172128629 173285414 174401095 175488548
39860 175488548 176571281 177680611 178852598 180128341 181554501 183176019 185018464 187068706
39852 187068706 189266775 191514010 193691752 195681360 197380228 198713557 199643748 200177752
39844 200177752 200369710 200314722 200133344 199953566 199900137 200095246 200664263 201735208 203425332
39835 203425332 205818806 208948066 212791478 217290732 222378341 227998469 234109010 240666215
39827 240666215 247605934 254838169 262261263 269785163 277343370 284880597 292322768 299550359
39819 299550359 306392172 312639792 318070440 322467677 325640175 327444943 327816149 326789064
$$ packed form
39876A43949362L101109L235649L205514L025183K733624K386963K044679J753863
39868A65435946J538108J395752J307598J249310J201915J156785J115681J087453
39860A75488548J082733J109330J171987J275743J426160J621518J842445K050242
39852A87068706K198069K247235K177742J989608J698868J333329R30191N34004
39844B00177752J91958n4988j81378j79778n3429J95109N69017J070945J690124
39835B03425332K393474L129260L843412M499254N087609N620128O110541O557205
39827B40666215O939719P232235P423094P523900P558207P537227P442171P227591
39819B99550359O841813O247620N430648M397237L172498J804768L71206j027085
$$ plain form
39811 326789064 324503139 321175617 317052717 312357142 307251282 301826769 296119048 290135460
39803 290135460 283881975 277379594 270671885 263830143 256958582 250196434 243714600 237708038
39795 237708038 232384593 227947769 224572535 222380050 221420806 221672253 223051581 225441801
39787 225441801 228727529 232832361 237744563 243517802 250241605 257990129 266770623 276495630
39779 276495630 286990268 298025116 309351968 320724201 331899970 342639890 352711408
39772 352711408 361902000 370033292 376967723 382608285 386899805 389837607 391478923 391946510
39764 391946510 391418033 390101949 388202974 385880678 383209947 380158114 376590953 372307694
39756 372307694 367094594 360784673 353312228 344748654 335305292 325299226 315095943 305053563
$$ packed form
39811C26789064k285925l327522m122900m695575n105860n424513n707721n983588
39803B90135460o253485o502381o707709o841742o871561o762148o481834o006562
39795B37708038n323445m436824l375234k192485r59244K51447J379328K390220
39787B25441801L285728M104832M912202N773239O723803P748524Q780494R725007
39779B76495630J0494638J1034848J1326852J1372233J1175769J0739920J0071518
39772C52711408R190592Q131292O934431N640562M291520K937802J641316M67587
39764C91946510n28477j316084j898975k322296k670731l051833l567161m283259
39756C72307694n213100o309921p472445q563574r443362j0006066j0203283j0042380
$$ plain form
39748 305053563 295486969 286654068 278755564 271939775 266309038 261926811 258824165 257004024
39740 257004024 256442832 257091609 258880512 261730352 265569418 270347083 276034467 282609442
39732 282609442 290032136 298219602 307024639 316221145 325500214 334482692 342750694 349893831
39724 349893831 355560508 359502563 361603051 361881718 360479705 357630195 353622418 348763944
39716 348763944 343344765 337607590 331729753 325820682 319935080 314097508 308330485 302676904
39708 302676904 297209482 292025377 287230707 282923917 279186403 276083900 273675364 272020743
39700 272020743 271178167 271186888 272041745 273670896 275925817 278585018 281368811 283963062 286049045
39691 286049045 287332036 287560218 286533001 284107104 280208726 274850992 268147523 260312277
$$ packed form
39748C05053563r566594q832901p898504o815789n630737m382227l102646j820141
39740B57004024n61192O48777J788903K849840L839066M777665N687384O574975
39732B82609442P422694Q187466Q805037R196506R279069Q982478Q268002P143137
39724C49893831N666677L942055K100488K78667j402013k849510m007777m858474
39716C48763944n419179n737175n877837n909071n885602n837572n767023n653581
39708C02676904n467422n184105m794670m306790l737514l102503k408536j654621
39700B72020743q42576Q721Q54857J629151K254921K659201K783793K594251K085983
39691B86049045J282991K28182j027217k425897l898378n357734o703469p835246
$$ plain form
39683 260312277 251640999 242477540 233176255 224074214 215478774 207662897 200855582 195223468
39675 195223468 190851353 187732861 185777804 184836815 184738826 185331375 186510789 188233248
39667 188233248 190506646 193369722 196865978 201018436 205809587 211168694 216966042 223013067
39659 223013067 229069438 234860411 240106481 244560945 248042380 250447001 251737151 251919989
39651 251919989 251036964 249169798 246446568 243026452 239059857 234642876 229790702 224442530
39643 224442530 218494363 211846674 204451344 196344391 187656413 178599772 169437085 160438117
39635 160438117 151833214 143773180 136307123 129387478 122902984 116728544 110773285 105010612
39627 105010612 99484856 94299285 89593565 85516321 82196583 79719190 78110330 77336383
$$ packed form
39683B60312277q671278r163459r301285r102041q595440p815877o807315n632114
39675A95223468m372115l118492j955057r40989r7989N92549J179414J722459
39667A88233248K273398K863076L496256M152458M791151N359107N797348O047025
39659B23013067O056371N790973N246070M454464L481435K404621J290150J82838
39651B51919989q83025j867166k723230l420116l966595m416981m852174n348172
39643B24442530n948167o647689p395330q106953q687978r056641r162687q998968
39635A60438117q604903q060034p466057o919645o484494o174440n955259n762673
39627A05010612n525756n185571m705720m077244l319738k477393j608860p73947
$$ plain form
39619 77336383 77313109 77918191 79001966 80396491 81926710 83426242 84755345 85813796
39611 85813796 86540925 86901600 86867731 86410885 85514328 84196348 82526079 80618800 78613281
39602 78613281 76644092 74820043 73212065 71847875 70709769 69735158 68824867 67865329
39594 67865329 66762284 65470788 64003770 62415313 60772447 59133165 57537766 56009889
39586 56009889 54562365 53205364 51952718 50820091 49814229 48922723 48116201 47364182
39578 47364182 46652782 45991056 45403719 44918768 44559093 44339753 44266227 44329133 44496307 44709052
39568 44709052 44890657 44968566 44899677 44681257 44337310 43888912 43331489 42637709 41784039 40779849
39558 40779849 39676385 38549581 37470125 36480885 35593038 34797097 34075665 33406479 32754510
$$ packed form
39619G7336383k3274O05082J083775J394525J530219J499532J329103J058451
39611H5813796P27129L60675l3869m56846q96557j317980j670269j907279k005519
39602G8613281j969189j824049j607978j364190j138106r74611r10291r59538
39594F7865329j103045j291496j467018j588457j642866j639282j595399j527877
39586E6009889j447524j357001j252646j132627j005862q91506q06522p52019
39578D7364182p11400o61726n87337m84951l59675k19340p3526O2906J67174K12745
39568D4709052J81605P7909o8889k18420l43947m48398n57423o93780q53670j004190
39558D0779849j103464j126804j079456r89240q87847p95941p21432o69186o51969
$$ plain form
39549 32754510 32062875 31255416 30256363 29020162 27557420 25944791 24313499 22818239
39541 22818239 21595567 20727523 20226263 20044487 20101866 20312013 20601000 20917201 21234853
39532 21234853 21551971 21883280 22251052 22676811 23174332 23742761 24360535 24983211 25547959
39523 25547959 25983873 26224667 26221691 25958741 25469238 24848821 24249649 23847832 23792480 24159824
39513 24159824 24934659 26025072 27298668 28621139 29882654 31007636 31951946 32694230
39505 32694230 33225854 33540585 33624746 33450360 32974756 32148204 30927556 29290819 27247385
39496 27247385 24841424 22149105 19271103 16320929 13411463 10645989 8119588 5927931
39488 5927931 4171449 2944974 2315385 2299430 2852205 3868981 5198085 6661386 8077593
$$ packed form
39549C2754510o91635q07459r99053j236201j462742j612629j631292j495260
39541B2818239j222672q68044n01260j81776N7379K10147K88987L16201L17652
39532B1234853L17118L31309L67772M25759M97521N68429O17774O22676N64748
39523B5547959M35914K40794k976k62950m89503o20417n99172m01817n5352L67344
39513B4159824P74835J090413J273596J322471J261515J124982R44310P42284
39505C2694230N31624L14731Q4161j74386m75604q26552j220648j636737k043434
39496B7247385k405961k692319k878002k950174k909466k765474k526401k191657
39488E927931j756482j226475o29589j5955N52775J016776J329104J463301J416207
$$ plain form
39479 8077593 9283215 10149828 10600890 10628907 10304586 9764812 9174458 8673312 8330484
39470 8330484 8126495 7970283 7742634 7346829 6746296 5977229 5135666 4346766 3727159
39461 3727159 3352035 3237422 3342871 3590676 3891330 4166440 4366073 4479362 4533958 4579603
39451 4579603 4659769 4786014 4930221 5037417 5048212 4917304 4622672 4167845 3580092 2904313
39441 2904313 2193232 1498583 868143 346943 -24702 -220399 -238133 -100940 156241 505040
39431 505040 933863 1443467 2033375 2690688 3389786 4103485 4818641 5545586 6313721 7154758
39421 7154758 8084566 9095410 10161418 11249871 12328606 13365287 14320934 15144273 15774773
39412 15774773 16158808 16273309 16141528 15827724 15412940 14967688 14536101 14134391 13758111
$$ packed form
39479H077593J205622Q66613M51062K8017l24321n39774n90354n01146l42828
39470H330484k03989j56212k27649l95805o00533p69067q41563p88900o19607
39461C727159l75124j14613J05449K47805L00654K75110J99633J13289N4596M5645
39451D579603Q0166J26245J44207J07196J0795j30908k94632m54827n87753o75779
39441B904313p11081o94649o30440n21200l71645j95697j7734J37193K57181L48799
39431E05040M28823N09604N89908O57313O99098P13699P15156P26945P68135Q41037
39421G154758R29808J010844J066008J088453J078735J036681R55647Q23339O30500
39412A5774773L84035J14501j31781l13804m14784m45252m31587m01710l76280
$$ plain form
39403 13758111 13392786 13024646 12648273 12269167 11901877 11564974 11272351 11022349 10792128
39394 10792128 10545652 10253957 9915445 9563638 9259562 9074495 9071065 9289719 9745570 10435489
39384 10435489 11348648 12472112 13789176 15275249 16897280 18618216 20403287 22223642
39376 22223642 24055582 25878367 27675348 29439037 31174789 32898667 34632940 36406643
39368 36406643 38261598 40254435 42445734 44878868 47560551 50453865 53486158 56566065
39360 56566065 59599389 62494787 65159135 67493919 69405811 70831442 71760145 72236648
39352 72236648 72340828 72158790 71763715 71214943 70569346 69890482 69243898 68679433 68213781
39343 68213781 67827328 67477022 67113910 66692163 66166056 65481890 64575102 63379344 61847253
$$ packed form
39403A3758111l65325l68140l76373l79106l67290l36903k92623k50002k30221
39394A0792128k46476k91695l38512l51807l04076j85067l430K18654M55851O89919
39384A0435489R13159J123464J317064J486073J622031J720936J785071J820355
39376B2223642J831940J822785J796981J763689J735752J723878J734273J773703
39368C6406643J854955J992837K191299K433134K681683K893314L032293L079907
39360E6566065L033324K895398K664348K334784J911892J425631R28703M76503
39352G2236648J04180j82038l95075n48772o45597o78864o46584n64465m65652
39343F8213781l86453l50306l63112m21747n26107o84166r06788j195758j532091
$$ plain form
39334 61847253 59974839 57816578 55480950 53106255 50826670 48741666 46897906 45287379
39326 45287379 43861548 42557653 41328445 40163678 39094151 38177532 37474685 37029921
39318 37029921 36864890 36986361 37399569 38117028 39158035 40540652 42270667 44330961 46673900
39309 46673900 49220194 51867180 54504784 57032069 59366693 61445468 63220716 64658570
39301 64658570 65741541 66472489 66873825 66976271 66797324 66319425 65484106 64212921 62448680
39292 62448680 60194495 57526997 54575681 51480851 48353325 45253975 42196853 39167143
39284 39167143 36141957 33106702 30065893 27049727 24115754 21341984 18808393 16570237
39276 16570237 14635404 12960537 11471173 10095493 8792694 7563009 6440399 5478014
$$ packed form
39334F1847253j872414k158261k335628k374695k279585k085004j843760j610527
39326D5287379j425831j303895j229208j164767j069527r16619p02847m44764
39318C7029921j65031J21471M13208P17459J041007J382617J730015K060294K342939
39309D6673900K546294K646986K637604K527285K334624K078775J775248J437854
39301F4658570J082971P30948M01336J02446j78947m77899q35319j271185j764241
39292F2448680k254185k667498k951316l094830l127526l099350l057122l029710
39284C9167143l025186l035255l040809l016166k933973k773770k533591k238156
39276A6570237j934833j674867j489364j375680j302799j229685j122610r62385
$$ plain form
39268 5478014 4735001 4265963 4109554 4274158 4724835 5381417 6136290 6889312 7583048
39259 7583048 8216688 8829245 9464374 10142382 10857523 11597361 12364752 13185616 14100851
39250 14100851 15152332 16371192 17768101 19321935 20968782 22600044 24077271 25261768
39242 25261768 26046845 26379234 26264360 25759880 24964366 24003235 23009710 22100381 21350601
39233 21350601 20778571 20345879 19977070 19592655 19141485 18615471 18037370 17428458 16776656
39224 16776656 16026021 15094054 13904499 12415326 10630192 8596773 6401315 4161946
39216 4161946 2015429 94063 -1502161 -2728285 -3603450 -4200690 -4616532 -4929362 -5166332
39207 -5166332 -5297727 -5261772 -5004788 -4515452 -3838571 -3064416 -2299765 -1635623 -1129330 -809390
$$ packed form
39268E478014p43013m69038j56409J64604M50677O56582P54873P53022O93736
39259G583048O33640O12557O35129O78008P15141P39838P67391Q20864R15235
39250A4100851J051481J218860J396909J553834J646847J631262J477227J184497
39242B5261768P85077L32389j14874n04480p95514r61131r93525r09329p49780
39233B1350601n72030m32692l68809l84415m51170n26014n78101o08912o51802
39224A6776656p50635r31967j189555j489173j785134k033419k195458k239369
39216D161946k146517j921366j596224j226124q75165n97240m15842l12830k36970
39207e166332j31395L5955K56984M89336O76881P74155P64651O64142N06293L19940
$$ plain form
39197 -809390 -694363 -807692 -1177378 -1824623 -2753240 -3946045 -5364675 -6947050 -8603258
39188 -8603258 -10217243 -11659603 -12807807 -13564065 -13864963 -13685747 -13044765 -12006786 -10677486
39179 -10677486 -9185418 -7659420 -6214390 -4949756 -3952054 -3290680 -3005518 -3094864 -3511817
39170 -3511817 -4170826 -4961643 -5767516 -6483576 -7029719 -7354424 -7431845 -7258430 -6852705 -6256384
39160 -6256384 -5532699 -4759735 -4019320 -3383501 -2901712 -2592494 -2442986 -2416767 -2467186 -2551346
39150 -2551346 -2640415 -2724071 -2808350 -2906800 -3026722 -3156531 -3262476 -3298111 -3220310 -3000932
39140 -3000932 -2628231 -2100965 -1422337 -598840 355155 1410840 2523986 3645872 4743450
39131 4743450 5815918 6894838 8026197 9244125 10547444 11885683 13159185 14238142
$$ packed form
39197h09390J15027j13329l69686o47245r28617j192805j418630j582375j656208
39188h603258j613985j442360j148204p56258l00898J79216O40982J037979J329300
39179a0677486J492068J525998J445030J264634R97702O61374K85162q9346m16953
39170c511817o59009p90817q05873p16060n46143l24705p7421J73415M05725N96321
39160f256384P23685P72964P40415O35819M81789L09218J49508K6219n0419q4160
39150b551346q9069q3656q4279r8450j19922j29809j05945l5635P7801K19378
39140c000932L72701N27266O78628Q23497R53995J055685J113146J121886J097578
39131D743450J072468J078920J131359J217928J303319J338239J273502J078957
$$ plain form
39123 14238142 15000253 15374250 15367473 15061581 14579507 14043843 13548077 13148183 12867339 12702925
39113 12702925 12631658 12615034 12607234 12564236 12451783 12251145 11962419 11604706 11212540 10828927
39103 10828927 10496361 10248040 10102308 10062263 10118580 10250253 10420460 10572252 10633076 10532331
39093 10532331 10225910 9715484 9052940 8328332 7646894 7104196 6768311 6673862 6826434
39084 6826434 7210589 7794774 8531124 9353098 10175110 10897064 11415591 11642659 11528191
39075 11528191 11077187 10350102 9443373 8459859 7484346 6571308 5740209 4971650 4206454
39066 4206454 3355732 2323816 1034532 -551196 -2430320 -4560841 -6868332 -9254411
39058 -9254411 -11607579 -13816367 -15784468 -17446102 -18776626 -19792616 -20540131 -21075425
$$ packed form
39123A4238142P62111L73997o777l05892m82074n35664m95766l99894k80844j64414
39113A2702925p1267j6624p800m2998j12453k00638k88726l57713l92166l83613
39103A0828927l32566k48321j45732m0045N6317J31673J70207J51792O0824j00745
39093A0532331l06421n10426o62544p24608o81438n42698l35885r4449J52572
39084F826434L84155N84185P36350Q21974Q22012P21954N18527K27068j14468
39075A1528191m51004p27085r06729r83514r75513r13038q31099p68559p65196
39066D206454q50722j031916j289284j585728j879124k130521k307491k386079
39058i254411k353168k208788j968101j661634j330524j015990p47515n35294
$$ plain form
39050 -21075425 -21443224 -21656891 -21687534 -21471484 -20938095 -20044733 -18799081 -17259479 -15520302
39041 -15520302 -13694016 -11893732 -10213895 -8710401 -7388456 -6206681 -5098040 -3998049
39033 -3998049 -2865342 -1683494 -445753 862211 2264410 3777431 5386942 7036019
39025 7036019 8634036 10081137 11296260 12238502 12916366 13383192 13719876 14009336 14310627
39016 14310627 14641498 14975240 15252212 15401434 15364736 15115547 14666167 14061840 13365390
39007 13365390 12639280 11930433 11259193 10611914 9938243 9156153 8166999 6878723 5230353
38998 5230353 3208153 846562 -1784528 -4596102 -7489465 -10357673 -13087342 -15568140
38990 -15568140 -17707124 -19438331 -20722807 -21543720 -21903563 -21824031 -21343560 -20509945 -19371627
$$ packed form
39050b1075425l67799k13667l0643K16050N33389Q93362J245652J539602J739177
39041a5520302J826286J800284J679837J503494J321945J181775J108641J099991
39033c998049J132707J181848J237741J307964J402199J513021J609511J649077
39025G036019J598017J447101J215123R42242O77864M66826L36684K89460L01291
39016A4310627L30871L33742K76972J49222l6698k49189m49380o04327o96450
39007A3365390p26110p08847o71240o47279o73671p82090r89154j288276j648370
38998E230353k022200k361591k631090k811574k893363k868208k729669k480798
38990a5568140k138984j731207j284476q20913l59843P9532M80471Q33615J138318
$$ plain form
38981 -19371627 -17973165 -16356231 -14563315 -12641105 -10642705 -8628610 -6665702 -4823286
38973 -4823286 -3166033 -1744825 -587954 302503 944026 1356955 1547472 1503863 1210807
38964 1210807 671297 -80756 -985424 -1973112 -2980689 -3960248 -4879620 -5716182 -6447319
38955 -6447319 -7043552 -7469387 -7690509 -7681161 -7428955 -6940828 -6252241 -5432734 -4576975 -3779578
38945 -3779578 -3105419 -2571625 -2149619 -1784425 -1421913 -1033882 -634204 -283915 -85570
38936 -85570 -165689 -643274 -1589191 -2992734 -4754652 -6712420 -8683811 -10506807 -12062676
38927 -12062676 -13282324 -14141833 -14652066 -14846375 -14770645 -14477451 -14022076 -13458200 -12835256
38918 -12835256 -12200730 -11605705 -11106817 -10759745 -10606461 -10662806 -10911728 -11304717 -11771869
$$ packed form
38981a9371627J398462J616934J792916J922210J998400K014095J962908J842416
38973d823286J657253J421208J156871Q90457O41523M12929J90517m3609k93056
38964A210807n39510p52053r04668r87688j007577r79559r19372q36562p31137
38955f447319n96233m25835k21122R348K52206M88127O88587Q19507Q55759P97397
38945c779578O74159N33794M22006L65194L62512L88031L99678L50289J98345
38936h5570q0119m77585r45917j403543j761918j957768j971391j822996j555869
38927a2062676j219648q59509n10233j94309P5730K93194M55375N63876O22944
38918a2835256O34526N95025M98888L47072J53284n6345k48922l92989m67152
$$ plain form
38909 -11771869 -12237560 -12633770 -12902336 -12985129 -12811995 -12299942 -11369930 -9976088 -8134301
38900 -8134301 -5935883 -3536667 -1121568 1142560 3144629 4840699 6238324 7369509
38892 7369509 8271085 8980110 9537793 9990884 10385991 10761093 11140664 11536282 11949516
38883 11949516 12373656 12794416 13192167 13546500 13840366 14060341 14193173 14222448 14128519 13891094
38873 13891094 13492143 12918836 12167426 11246363 10174870 8976739 7675131 6294189 4865854
38864 4865854 3434429 2053959 779936 -340766 -1279084 -2028965 -2604008 -3024494 -3301730
38855 -3301730 -3429641 -3387146 -3147023 -2686637 -1999800 -1107557 -60013 1077719 2250473
38846 2250473 3432576 4628198 5853517 7114333 8392722 9646968 10820868 11856975
$$ packed form
38909a1771869m65691l96210k68566q2793J73134N12053R30012J393842J841787
38900h134301K198418K399216K415099K264128K002069J696070J397625J131185
38892G369509R01576P09025N57683M53091L95107L75102L79571L95618M13234
38883A1949516M24140M20760L97751L54333K93866K19975J32832K9275r3929k37425
38873A3891094l98951n73307p51410r21063j071493j198131j301608j380942j428335
38864D865854j431425j380470j274023j120702r38318p49881n75043m20486k77236
38855c301730j27911M2495K40123M60386O86837Q92243J047544J137732J172754
38846B250473J182103J195622J225319J260816J278389J254246J173900J036107
$$ plain form
38838 11856975 12710133 13357949 13804237 14074182 14205809 14244790 14244200 14262972 14356542 14561415
38828 14561415 14882212 15287643 15715236 16082189 16301588 16302232 16045246 15528726 14778003 13828624
38818 13828624 12712940 11456427 10082093 8617238 7098429 5574329 4106683 2766022
38810 2766022 1617018 695243 -11987 -565998 -1055725 -1567175 -2157527 -2839180 -3573444
38801 -3573444 -4276957 -4846017 -5195512 -5296466 -5194052 -4998495 -4853943 -4896565 -5214706 -5824573
38791 -5824573 -6671413 -7654926 -8664715 -9608270 -10422470 -11070723 -11532494 -11791290 -11826795
38782 -11826795 -11616397 -11146713 -10427972 -9501553 -8436877 -7322023 -6254284 -5333064 -4654050
38773 -4654050 -4303154 -4348230 -4825951 -5723883 -6964656 -8403603 -9847652 -11093488 -11974188
$$ packed form
38838A1856975Q53158O47816M46288K69945J31627L8981n90J8772R3570K04873
38828A4561415L20797M05431M27593L66953K19399O44k56986n16520p50723r49379
38818A3828624j115684j256513j374334j464855j518809j524100j467646j340661
38810B766022j149004r21775p07230n54011m89727n11450n90352o81653p34264
38801c573444p03513n69060l49495j00954J02414J95557J44552m2622l18141o09867
38791e824573q46840r83513j009789r43555q14200o48253m61771k58796l5505
38782a1826795K10398M69684P18741R26419J064676J114854J067739R21220O79014
38773d654050L50896m5076m77721q97932j240773j438947j444049j245836q80700
$$ plain form
38764 -11974188 -12399495 -12375816 -11997711 -11413118 -10775667 -10202551 -9752330 -9427141 -9193739
38755 -9193739 -9010988 -8849841 -8697095 -8545293 -8381031 -8184106 -7939621 -7653142 -7356232
38746 -7356232 -7097627 -6925715 -6871972 -6941295 -7109671 -7327544 -7528411 -7643066 -7617643 -7429615
38736 -7429615 -7094554 -6660559 -6194387 -5766875 -5442077 -5269514 -5278039 -5472578 -5835286 -6329343
38726 -6329343 -6902138 -7488280 -8016378 -8420748 -8653096 -8687836 -8519700 -8157449 -7617687 -6919858
38716 -6919858 -6082108 -5119046 -4044481 -2881768 -1679281 -520673 482874 1221958 1627085
38707 1627085 1694599 1487512 1114560 699657 350892 132653 45171 19261 -68040 -360715
38697 -360715 -986431 -2027347 -3504217 -5371676 -7521512 -9794574 -12003800 -13966586
$$ packed form
38764a1974188m25307K3679L78105N84593O37451N73116M50221L25189K33402
38755i193739J82751J61147J52746J51802J64262J96925K44485K86479K96910
38746g356232K58605J71912N3743o9323j68376k17873k00867j14655K5423J88028
38736g429615L35061M33995M66172M27512L24798J72563q525j94539l62708m94057
38726f329343n72795n86142n28098m04370k32348l4740J68136L62251N39762O97829
38716f919858Q37750R63062J074565J162713J202487J158608J003547P39084M05127
38707A627085O7514k07087l72952m14903l48765k18239q7482k5910q7301k92675
38697c60715o25716j040916j476870j867459k149836k273062k209226j962786
$$ plain form
38689 -13966586 -15537547 -16629959 -17220201 -17339202 -17059162 -16478830 -15704213 -14823530 -13885113
38680 -13885113 -12892541 -11823393 -10661844 -9425197 -8168445 -6965277 -5878309 -4937082
38672 -4937082 -4135864 -3448690 -2847768 -2312721 -1829104 -1383015 -957682 -533080 -88256
38663 -88256 392632 910739 1442964 1937600 2318822 2500894 2409446 2002833 1284234 298758
38653 298758 -882497 -2183476 -3540611 -4910369 -6264840 -7579373 -8822282 -9956304
38645 -9956304 -10953016 -11810432 -12560197 -13257819 -13961556 -14712904 -15527864 -16397348 -17289346
38636 -17289346 -18151358 -18921233 -19552420 -20043839 -20451981 -20870803 -21389099 -22052647 -22853388
38627 -22853388 -23746209 -24675425 -25591209 -26448340 -27194121 -27759064 -28060751 -28021963 -27595121
$$ packed form
38689a3966586j570961j092412n90242j19001K80040N80332P74617Q80683R38417
38680a3885113R92572J069148J161549J236647J256752J203168J086968R41227
38672d937082Q01218O87174O00922N35047M83617M46089M25333M24602M44824
38663h8256M80888N18107N32225M94636L81222J82072r1448m06613p18599r85476
38653B98758j181255j300979j357135j369758j354471j314533j242909j134022
38645i956304r96712q57416p49765o97622p03737p51348q14960q69484q91998
38636a7289346q62012p69875o31187m91419m08142m18822n18296o63548q00741
38627b2853388q92821r29216r15784q57131p45781n64943l01687L8788M26842
$$ plain form
38618 -27595121 -26781009 -25632283 -24239312 -22704302 -21115436 -19532529 -17988088 -16496641
38610 -16496641 -15060251 -13665079 -12276558 -10845260 -9325802 -7697981 -5977044 -4209640
38602 -4209640 -2461279 -801831 708434 2031037 3156943 4106404 4919678 5640263 6296051
38593 6296051 6886855 7385061 7747991 7932362 7901386 7623130 7066175 6199507 4999431
38584 4999431 3461266 1609893 -497144 -2775557 -5124744 -7437427 -9608352 -11545191
38576 -11545191 -13180453 -14477853 -15429046 -16045388 -16353498 -16397327 -16240257 -15958394 -15623267
38567 -15623267 -15282295 -14949988 -14616338 -14264925 -13884675 -13466539 -12993917 -12443928 -11805041
38558 -11805041 -11097392 -10376933 -9718511 -9190352 -8836797 -8677077 -8715965 -8955924 -9401468
$$ packed form
38618b7595121Q14112J148726J392971J535010J588866J582907J544441J491447
38610a6496641J436390J395172J388521J431298J519458J627821J720937J767404
38602d209640J748361J659448J510265J322603J125906R49461Q13274P20585O55788
38593F296051N90804M98206L62930J84371l0976k78256n56955q66668j200076
38584D999431j538165j851373k107037k278413k349187k312683k170925j936839
38576a1545191j635262j297400r51193o16342l08110m3829J57070K81863L35127
38567a5623267L40972L32307L33650L51413L80250M18136M72622N49989O38887
38558a1805041P07649P20459O58422N28159L53555J59720l8888k39959m45544
$$ plain form
38549 -9401468 -10053117 -10896639 -11897196 -13003771 -14160644 -15317785 -16434646 -17477803
38541 -17477803 -18416397 -19218896 -19853223 -20291461 -20518787 -20542713 -20395870 -20127315 -19784492
38532 -19784492 -19394979 -18957741 -18447348 -17827006 -17063150 -16136320 -15047028 -13818337 -12497391
38523 -12497391 -11156305 -9890018 -8807494 -8014101 -7586696 -7547464 -7846745 -8365815 -8944468
38514 -8944468 -9425702 -9699038 -9724041 -9527230 -9180049 -8772224 -8391139 -8109562 -7979112 -8027812
38504 -8027812 -8262551 -8676377 -9256436 -9986347 -10840371 -11773360 -12714400 -13570521 -14241082
38495 -14241082 -14637230 -14698138 -14398697 -13749346 -12792398 -11597506 -10255059 -8865265 -7523563
38486 -7523563 -6306531 -5263703 -4417992 -3771642 -3309969 -2997606 -2771385 -2541083 -2204904
$$ packed form
38549i401468o51649q43522j000557j106575j156873j157141j116861j043157
38541a7477803r38594q02499o34327m38238k27326k3926J46843K68555L42823
38532a9784492L89513M37238N10393O20342P63856R26830J089292J228691J320946
38523a2497391J341086J266287J082524P93393M27405L9232k99281n19070n78653
38514h944468m81234k73336k5003J96811L47181M07825L81085K81577J30450m8700
38504h027812k34739m13826n80059p29911q54024r32989r41040q56121o70561
38495a4241082l96148o0908K99441O49351R56948J194892J342447J389794J341702
38486g523563J217032J042828Q45711O46350M61673L12363K26221K30302L36179
$$ plain form
38477 -2204904 -1674360 -895490 142763 1412246 2854126 4385790 5905188 7297079
38469 7297079 8445968 9254219 9657466 9630731 9187305 8377685 7290444 6047494 4784817
38460 4784817 3619392 2614888 1762977 991438 198098 -702679 -1740826 -2875202 -4006747
38451 -4006747 -5011117 -5774117 -6215902 -6300002 -6032372 -5457031 -4649722 -3707270 -2732741
38442 -2732741 -1821163 -1050424 -476871 -131153 -12132 -82754 -275280 -509012 -714398 -850890
38432 -850890 -909060 -898039 -828514 -702276 -512890 -254486 68479 436756 818884 1178169
38422 1178169 1480359 1699932 1823327 1846779 1768974 1584190 1283008 861476 332356 -267716
38412 -267716 -876730 -1412248 -1786367 -1931617 -1829022 -1523181 -1114989 -736125 -518231 -568652
$$ packed form
38477b204904N30544P78870J038253J269483J441880J531664J519398J391891
38469G297079J148889Q08251M03247k6735m43426q09620j087241j242950j262677
38460D784817j165425j004504q51911p71539p93340r00777j038147j134376j131545
38451d006747j004370p63000m41785q4100K67630N75341Q07309R42452R74529
38442b732741R11578P70739N73553L45718J19021p0622j92526k33732k05386j36492
38432h50890n8170J1021O9525J26238J89386K58404L22965L68277L82128L59285
38422A178169L02190K19573J23395K3452p7805j84784l01182m21532n29120o00072
38412b67716o09014n35518l74119j45250J02595L05841M08192L78864K17894n0421
$$ plain form
38402 -568652 -957426 -1713695 -2827569 -4255496 -5930062 -7774181 -9714600 -11686008 -13621305
38393 -13621305 -15434823 -17013719 -18229967 -18971534 -19177371 -18857675 -18090305 -16998044 -15719777
38384 -15719777 -14387581 -13114074 -11986249 -11059741 -10352781 -9846313 -9496553 -9256574 -9094282
38375 -9094282 -8995692 -8953851 -8953832 -8965375 -8948067 -8865104 -8696308 -8442529 -8120694 -7754464 -7364671
38364 -7364671 -6960536 -6533861 -6061257 -5515850 -4880527 -4151623 -3330375 -2410046 -1368532
38355 -1368532 -171197 1216388 2809905 4590247 6498948 8447666 10336196 12072132
38347 12072132 13588682 14857349 15889324 16721914 17395660 17934387 18337480 18585523 18654214
38338 18654214 18528530 18209085 17707950 17040296 16222301 15279187 14256442 13223719 12266300
$$ packed form
38402e68652l88774p56269j113874j427927j674566j844119j940419j971408j935297
38393a3621305j813518j578896j216248p41567k05837L19696P67370J092261J278267
38384a5719777J332196J273507J127825R26508P06960N06468L49760K39979J62292
38375i094282R8590M1841J9j1543J7308Q2963J68796K53779L21835L66230L89793
38364g364671M04135M26675M72604N45407O35323P28904Q21248R20329J041514
38355a368532J197335J387585J593517J780342J908701J948718J888530J735936
38347A2072132J516550J268667J031975Q32590O73746N38727M03093K48043O8691
38338A8654214j25684l19445n01135o67654q17995r43114j022745j032723r57419
$$ plain form
38329 12266300 11465841 10876663 10507514 10320522 10252259 10246787 10279128 10353153 10478105 10645212
38319 10645212 10824499 10982828 11104981 11198156 11277479 11348838 11406599 11447569 11486621 11559196
38309 11559196 11708664 11967941 12346337 12827494 13378020 13961053 14546151 15110068 15631423
38300 15631423 16088812 16468680 16778288 17050460 17329376 17640090 17959068 18206149 18265310
38291 18265310 18021756 17393689 16346230 14891473 13085650 11027681 8854253 6725456
38283 6725456 4801338 3215945 2056746 1354360 1082737 1167506 1501010 1963432 2445791
38274 2445791 2865434 3166568 3309365 3260241 2992252 2492181 1764999 832311 -270152
38265 -270152 -1491584 -2764542 -4009237 -5145662 -6108904 -6861158 -7396380 -7736608 -7921756
$$ packed form
38329A2266300q00459n89178l69149j86992o8263n472L2341P4025J24952J67107
38319A0645212J79287J58329J22153R3175P9323P1359N7761M0970L9052P2575
38309A1559196J49468K59277L78396M81157N50526N83033N85098N63917N21355
38300A5631423M57389L79868L09608K72172K78916L10714L18978K47081N9161
38291A8265310k43554o28067j047459j454757j805823k057969k173428k128797
38283F725456j924118j585393j159199p02386k71623Q4769L33504M62422M82359
38274B445791M19643L01134J42797m9124k67989n00071p27182r32688j102463
38265b70152j221432j272958j244695j136425r63242p52254n35222l40228j85148
$$ plain form
38256 -7921756 -7997742 -8008617 -7993725 -7984808 -7998150 -8025123 -8030707 -7965296 -7784466 -7465900 -7015707
38245 -7015707 -6462029 -5838037 -5161808 -4425974 -3607561 -2694906 -1714488 -739473 125965
38236 125965 778564 1149462 1225427 1050004 706230 291167 -106546 -421541 -619958 -700615
38226 -700615 -685635 -601596 -462484 -267706 -15545 283442 608971 948061 1309013 1717119
38216 1717119 2193483 2730983 3280580 3753653 4040323 4039183 3688145 2983332 1978504 768006
38206 768006 -537027 -1830237 -3025287 -4065472 -4930379 -5640240 -6254191 -6857641 -7539127
38197 -7539127 -8364429 -9358090 -10498950 -11730522 -12981338 -14185672 -15295694 -16282920 -17133905
38188 -17133905 -17844608 -18413125 -18830592 -19075005 -19112948 -18907362 -18424713 -17639200 -16537944
$$ packed form
38256g921756p5986j0875J4892Q917j3342k6973n584O5411J80830L18566M50193
38245g015707N53678O23992O76229P35834Q18413R12655R80418R75015Q65438
38236A25965O52599L70898P5965j75423l43774m15063l97713l14995j98417q0657
38226g00615J4980Q4039J39112J94778K52161K98987L25529L39090L60952M08106
38216A717119M76364N37500N49597M73073K86670j140l51038p04813j004828j210498
38206G68006j305033j293210j195050j040185q64907p09861o13951o03450o81486
38197g539127q25302r93661j140860j231572j250816j204334j110022r87226q50985
38188a7133905p10703n68517m17467k44413l7943K05586M82649P85513J101256
$$ plain form
38179 -16537944 -15130049 -13455557 -11586563 -9616170 -7638547 -5730048 -3942561 -2312750
38171 -2312750 -878443 313375 1216157 1806320 2104309 2180340 2138916 2086822 2097343 2184973
38161 2184973 2299412 2340423 2190592 1758819 1020986 40397 -1043296 -2053234 -2825648
38152 -2825648 -3250475 -3287848 -2958656 -2320598 -1446939 -418787 671936 1720477 2617417
38143 2617417 3267052 3608175 3627066 3355267 2851332 2173746 1357879 409341 -681952
38134 -681952 -1915183 -3256754 -4637845 -5972596 -7184822 -8228273 -9091714 -9787570 -10328985
38125 -10328985 -10706661 -10880619 -10795203 -10409939 -9727161 -8799883 -7716764 -6573967 -5449184
38116 -5449184 -4389650 -3416035 -2534498 -1747505 -1060288 -484835 -41670 243245 346794
$$ packed form
38179a6537944J407895J674492J868994J970393J977623J908499J787487J629811
38171b312750J434307J191818R02782N90163K97989P6031m1424n2094J0521Q7630
38161B184973J14439M1011j49831m31773p37833r80589j083693j009938p72414
38152b825648m24827l7373L29192O38058Q73659J028152J090723J048541Q96940
38143B617417O49635L41123J8891k71799n03935o77586q15867r48538j091293
38134f81952j233231j341571j381091j334751j212226j043451q63441o95856n41415
38125a0328985l77676j73958Q5416L85264O82778R27278J083119J142797J124783
38116e449184J059534R73615Q81537P86993O87217N75453M43165K84915J03549
$$ plain form
38107 346794 258108 -15093 -444486 -984797 -1585698 -2210072 -2848021 -3514149 -4226372 -4979240
38097 -4979240 -5729857 -6405892 -6930883 -7252521 -7360649 -7289771 -7108597 -6901537 -6746660 -6695288
38087 -6695288 -6759750 -6913835 -7105083 -7273445 -7369241 -7363159 -7243232 -7000516 -6614417 -6051143
38077 -6051143 -5279750 -4296215 -3139118 -1885855 -630971 540597 1569700 2420398 3064226
38068 3064226 3466439 3586816 3394923 2888507 2102685 1105457 -16642 -1175987 -2298971
38059 -2298971 -3335746 -4263243 -5082038 -5809283 -6469871 -7086811 -7671742 -8218713 -8705332
38050 -8705332 -9101963 -9384059 -9540603 -9575313 -9502979 -9346199 -9135691 -8912063 -8723021 -8612202
38040 -8612202 -8603864 -8693754 -8852806 -9040125 -9216018 -9350136 -9426351 -9446286 -9429072 -9403806 -9395740
$$ packed form
38107C46794q8686k73201m29393n40311o00901o24374o37949o66128p12223p52868
38097d979240p50617o76035n24991l21638j08128P0878J81174K07060J54877N1372
38087f695288o4462j54085j91248j68362r5796O082J19927K42716L86099N63274
38077f051143P71393R83535J157097J253263J254884J171568J029103Q50698O43828
38068C064226M02213J20377j91893n06416p85822r97228j122099j159345j122984
38059b298971j036775r27497q18795p27245o60588o16940n84931n46971m86619
38050h705332l96631k82096j56544l4710P2334J56780K10508K23628J89042J10819
38040h612202Q338q9890j59052j87319j75893j34118p6215j9935J7214K5266Q066
$$ plain form
38029 -9395740 -9412337 -9436949 -9435216 -9372460 -9231526 -9017110 -8741910 -8405907 -7987256 -7452917
38019 -7452917 -6779956 -5971501 -5058865 -4092588 -3129502 -2220773 -1403213 -695815 -102719
38010 -102719 378433 746279 988117 1078681 987284 691333 189382 -494524 -1318029 -2233003
38000 -2233003 -3193373 -4153337 -5060802 -5855613 -6478440 -6887566 -7074450 -7069162 -6933264 -6744318
37990 -6744318 -6578017 -6491347 -6508891 -6616695 -6768462 -6902678 -6961631 -6903443 -6706313 -6370244
37980 -6370244 -5918778 -5396646 -4857845 -4345129 -3870822 -3412726 -2933269 -2415839 -1898533
37971 -1898533 -1483731 -1314683 -1528455 -2205654 -3337629 -4824134 -6502513 -8196207 -9762591
37962 -9762591 -11122980 -12268681 -13247053 -14135811 -15013965 -15937514 -16926752 -17968216 -19028578
$$ packed form
38029i395740j6597k4612J733O2756J40934K14416K75200L36003M18651N34339
38019g452917O72961Q08455R12636R66277R63086R08729Q17560P07398N93096
38010a02719M81152L67846K41838R0564r1397k95951n01951o83906q23505r14974
38000b233003r60370r59964r07465p94811o22827m09126j86884N288J35898J88946
37990f744318J66301Q6670j7544j07804j51767j34216n8953N8188J97130L36069
37980f370244M51466N22132N38801N12716M74307M58096M79457N17430N17306
37971a898533M14802J69048k13772o77199j131975j486505j678379j693694j566384
37962i762591j360389j145701r78372q88758q78154r23549r89238j041464j060362
$$ plain form
37953 -19028578 -20072589 -21075263 -22022127 -22899812 -23686307 -24349420 -24854246 -25174047 -25298960
37944 -25298960 -25240141 -25028581 -24708134 -24324236 -23912231 -23488860 -23048446 -22564583 -21998098
37935 -21998098 -21309042 -20466008 -19446617 -18231261 -16800356 -15144136 -13283076 -11286114
37927 -11286114 -9272032 -7388053 -5772891 -4521300 -3667125 -3190653 -3040489 -3151839 -3448794
37918 -3448794 -3833584 -4177792 -4330170 -4144081 -3514100 -2405496 -865278 985415 2969955
37909 2969955 4879171 6498046 7637470 8166672 8035886 7280929 6010104 4379943 2565770
37900 2565770 730908 -1000333 -2558672 -3930175 -5142167 -6240538 -7265067 -8229566
37892 -8229566 -9113635 -9869982 -10444391 -10798977 -10928271 -10862196 -10656452 -10375826 -10078020 -9804088
$$ packed form
37953a9028578j044011j002674r46864q77685p86495o63113n04826l19801j24913
37944b5298960N8819K11560L20447L83898M12005M23371M40414M83863N66485
37935b1998098O89056Q43034J019391J215356J430905J656220J861060J996962
37927a1286114K014082J883979J615162J251591Q54175M76472J50164j11350k96955
37918c448794l84790l44208j52378J86089O29981J108604J540218J850693J984540
37909B969955J909216J618875J139424N29202j30786p54957j270825j630161j814173
37900B565770j834862j731241j558339j371503j211992j098371j024529r64499
37892h229566q84069p56347n74409l54586j29294O6075K05744K80626K97806K73932
$$ plain form
37882 -9804088 -9577001 -9405155 -9285945 -9206537 -9142114 -9054374 -8893912 -8609325 -8162511 -7544871
37872 -7544871 -6785844 -5946958 -5101534 -4308869 -3596860 -2963973 -2400491 -1916165 -1556382
37863 -1556382 -1396569 -1519299 -1988431 -2832540 -4040151 -5562434 -7319857 -9212701 -11134844
37854 -11134844 -12986372 -14680352 -16144657 -17324501 -18188548 -18734275 -18986073 -18985337 -18777952
37845 -18777952 -18403760 -17887889 -17233292 -16418563 -15407485 -14171383 -12715634 -11096271 -9415500
37836 -9415500 -7794428 -6332667 -5072346 -3984048 -2982490 -1965493 -858597 353776
37828 353776 1621756 2847430 3916843 4734305 5248581 5463755 5431743 5229123 4927170
37819 4927170 4567008 4149048 3639331 2988803 2158073 1139668 -29071 -1266980 -2464318
$$ packed form
37882i804088K27087J71846J19210P9408O4423Q7740J60462K84587M46814O17640
37872g544871P59027Q38886Q45424P92665P12009O32887N63482M84326L59783
37863a556382J59813j22730m69132q44109j207611j522283j757423j892844j922143
37854a1134844j851528j693980j464305j179844q64047n45727k51798P36K07385
37845a8777952L74192N15871O54597Q14729J011078J236102J455749J619363J680771
37836i415500J621072J461761J260321J088298J001558J016997J106896J212373
37828C53776J267980J225674J069413Q17462N14276K15174l2012k02620l01953
37819D927170l60162m17960n09717o50528q30730j018405j168739j237909j197338
$$ plain form
37810 -2464318 -3506262 -4293709 -4753191 -4837740 -4528230 -3840186 -2829145 -1583924 -207630
37801 -207630 1202080 2563972 3818069 4932505 5911852 6795566 7637490 8472951 9293865
37792 9293865 10049636 10673339 11114452 11357739 11422862 11354302 11211791 11061477 10962802 10951772
37782 10951772 11028751 11157741 11275940 11306408 11168665 10788330 10110097 9113622 7823546
37773 7823546 6303298 4632529 2881409 1097370 -690900 -2459614 -4177289 -5800543
37765 -5800543 -7279457 -8567564 -9628058 -10431769 -10952532 -11170244 -11084041 -10726005 -10163864
37756 -10163864 -9490277 -8805593 -8202854 -7759765 -7535840 -7567688 -7857343 -8359662 -8984202
37747 -8984202 -9620565 -10176121 -10602220 -10892509 -11057209 -11091994 -10962013 -10612855 -10004885 -9150950
$$ packed form
37810b464318j041944p87447m59482q4549L09510O88044J011041J245221J376294
37801b07630J409710J361892J254097J114436R79347Q83714Q41924Q35461Q20914
37792I293865P55771O23703M41113K43287O5123o8560j42511j50314r8675j1030
37782A0951772P6979J28990J18199L0468j37743l80335o78233r96475j290076
37773G823546j520248j670769j751120j784039j788270j768714j717675j623254
37765e800543j478914j288107j060494q03711n20763k17712Q6203L58036N62141
37756a0163864O73587O84684O02739M43089K23925l1848k89655n02319o24540
37747h984202o36363n55556m26099k90289j64700l4785J29981L49158O07970Q53935
$$ plain form
37737 -9150950 -8131543 -7074072 -6106668 -5313121 -4712038 -4265283 -3903054 -3547603 -3125979
37728 -3125979 -2574843 -1846021 -916312 202259 1456681 2752751 3960658 4929670 5515159
37719 5515159 5613691 5193083 4303008 3060158 1614110 108239 -1350697 -2708335 -3965019
37710 -3965019 -5166319 -6380458 -7664047 -9027448 -10417047 -11724137 -12814556 -13564671
37702 -13564671 -13893344 -13786679 -13312313 -12615405 -11889877 -11329254 -11073967 -11175383 -11588760
37693 -11588760 -12194018 -12833384 -13352512 -13634661 -13621304 -13315283 -12766700 -12048134 -11231442
37684 -11231442 -10376875 -9536049 -8759789 -8099043 -7594199 -7259236 -7073080 -6986339 -6940531 -6888017
37674 -6888017 -6801659 -6672372 -6501471 -6295699 -6066959 -5832922 -5613464 -5421703 -5254373 -5090190
$$ packed form
37737i150950J019407J057471R67404P93547O01083M46755L62229L55451M21624
37728c125979N51136P28822R29709J118571J254422J296070J207907R69012N85489
37719E515159R8532m20608q90075j242850j446048j505871j458936j357638j256684
37710c965019j201300j214139j283589j363401j389599j307090j090419p50115
37702a3564671l28673J06665M74366O96908P25528N60623K55287j01416m13377
37693a1588760o05258o39366n19128k82149J3357L06021N48583P18566Q16692
37684a1231442Q54567Q40826P76260O60746N04844L34963J86156Q6741M5808N2514
37674f888017Q6358J29287J70901K05772K28740K34037K19458J91761J67330J64183
$$ plain form
37664 -5090190 -4901840 -4676624 -4430833 -4204578 -4038771 -3950802 -3926211 -3930404 -3930060 -3910650 -3883404
37653 -3883404 -3883543 -3964113 -4186895 -4609494 -5270482 -6179602 -7319715 -8658384 -10158055 -11775834
37643 -11775834 -13455767 -15124345 -16695357 -18080621 -19201543 -20002264 -20466409 -20631885
37635 -20631885 -20592085 -20476996 -20419936 -20523294 -20835483 -21346061 -22000128 -22726210 -23465615 -24190361
37625 -24190361 -24902967 -25620063 -26348812 -27068498 -27727718 -28258542 -28597950 -28703867 -28561206
37616 -28561206 -28182050 -27603248 -26878714 -26063803 -25196925 -24288995 -23327730 -22295581 -21193233
37607 -21193233 -20056631 -18955867 -17973039 -17170813 -16571399 -16157418 -15888740 -15719556 -15604936
37598 -15604936 -15497001 -15337217 -15051257 -14551215 -13748523 -12577568 -11023544 -9141427 -7052750
$$ packed form
37664e090190J88350K25216K45791K26255J65807Q7969K4591m193L44J9410K7246
37653c883404j39q0570k22782m22599o60988r09120j140113j338669j499671j617779
37643a1775834j679933j668578j571012j385264j120922q00721m64145j65476
37635b0631885L9800J15089N7060j03358l12189n10578o54067p26082p39405p24746
37625b4190361p12606p17096p28749p19686o59220n30824l39408j05917J42661
37616b8561206L79156N78802P24534Q14911Q66878R07930R61265J032149J102348
37607b1193233J136602J100764R82828Q02226N99414M13981K68678J69184J14620
37598a5604936J07935J59784K85960N00042Q02692J170955J554024J882117K088677
$$ plain form
37589 -7052750 -4916686 -2887415 -1078718 449505 1683977 2642450 3360628 3884437 4266134
37580 4266134 4562737 4834395 5138107 5514853 5976071 6499733 7039728 7540857 7948296
37571 7948296 8208468 8267669 8075767 7595814 6815293 5754417 4468439 3041831 1574597
37562 1574597 165594 -1100095 -2156561 -2958533 -3483710 -3735797 -3743529 -3553376 -3220236
37553 -3220236 -2802625 -2362909 -1965710 -1668482 -1507915 -1493420 -1614930 -1859415 -2222459 -2706435
37543 -2706435 -3309854 -4019962 -4815930 -5678731 -6597235 -7563663 -8561261 -9553214 -10479648
37534 -10479648 -11263047 -11818853 -12069212 -11958710 -11468676 -10624539 -9493290 -8172625 -6774803
37525 -6774803 -5407101 -4152206 -3055657 -2126802 -1351496 -706481 -166519 295253 705989
$$ packed form
37589g052750K136064K029271J808697J528223J234472R58473P18178N23809L81697
37580D266134K96603K71658L03712L76746M61218N23662N39995N01129M07439
37571G948296K60172N9201j91902m79953p80521j060876j285978j426608j467234
37562A574597j409003j265689j056466q01972n25177k52087p732J90153L33140
37553c220236M17611M39716L97199K97228J60567J4495j21510k44485l63044m83976
37543b706435o03419p10108p95968q62801r18504r66428r97598r91953r26434
37534a0479648p83399n55806k50359J10502M90034Q44137J131249J320665J397822
37525f774803J367702J254895J096549R28855P75306O45015N39962M61772M10736
$$ plain form
37516 705989 1085575 1436169 1737428 1953058 2046559 1998272 1815951 1535323 1211606 905272
37506 905272 666563 524057 482217 529307 651117 841428 1102247 1435039 1831543 2271582
37496 2271582 2726862 3163985 3544079 3824391 3967786 3957191 3804389 3545404 3224833 2878727
37486 2878727 2525117 2165395 1793683 1408441 1021934 666275 394510 272209 356537 669822
37476 669822 1183891 1826925 2507992 3142402 3664627 4027830 4196706 4140161 3827860 3232877
37466 3232877 2339644 1152920 -296887 -1953898 -3741933 -5573741 -7362902 -9035976
37458 -9035976 -10542893 -11865160 -13020848 -14062895 -15067901 -16117623 -17279590 -18591597
37450 -18591597 -20050643 -21606310 -23161652 -24585237 -25733781 -26479224 -26732435 -26458193
$$ packed form
37516G05989L79586L50594L01259K15630R3501m8287j82321k80628l23717l06334
37506I05272k38709j42506m1840M7090J21810J90311K60819L32792L96504M40039
37496B271582M55280M37123L80094K80312J43395j0595j52802k58985l20571l46106
37486B878727l53610l59722l71712l85242l86507l55659k71765j22301Q4328L13285
37476F69822N14069O43034O81067O34410N22225L63203J68876n6545l12301n94983
37466C232877q93233j186724j449807j657011j788035j831808j789161j673074
37458i035976j506917j322267j155688j042047j005006j049722j161967j312007
37450a8591597j459046j555667j555342j423585j148544p45443k53211K74242
$$ plain form
37442 -26458193 -25680308 -24478137 -22975520 -21322104 -19668273 -18138933 -16814063 -15721632
37434 -15721632 -14843072 -14127927 -13513573 -12945035 -12388824 -11836372 -11298151 -10794145 -10346236
37425 -10346236 -9974496 -9696340 -9525581 -9467725 -9510227 -9612883 -9708385 -9719001 -9583188 -9276589
37415 -9276589 -8814935 -8239031 -7592755 -6905882 -6187247 -5427830 -4610651 -3722450 -2759932
37406 -2759932 -1725588 -617408 574708 1856587 3207745 4567698 5843207 6932418
37398 6932418 7751360 8251507 8425481 8301977 7932057 7372013 6671134 5869488 5002581
37389 5002581 4104691 3205455 2321360 1448443 562143 -373748 -1391961 -2506158 -3700764
37380 -3700764 -4930880 -6134788 -7256411 -8267258 -9174506 -10010641 -10814587 -11619366 -12451392
$$ packed form
37442b6458193P77885J202171J502617J653416J653831J529340J324870J092431
37434a5721632Q78560P15145O14354N68538N56211N52452N38221N04006M47909
37425a0346236L71740K78156J70759N7856m2502j02656r5502j0616J35813L06599
37415i276589M61654N75904O46276O86873P18635P59417Q17179Q88201R62518
37406b759932J034344J108180J192116J281879J351158J359953J275509J089211
37398F932418Q18942N00147J73974j23504l69920n60044p00879q01646q66907
37389E002581q97890q99236q84095q72917q86300r35891j018213j114197j194606
37380c700764j230116j203908j121623j010847r07248q36135q03946q04779q32026
$$ plain form
37371 -12451392 -13333678 -14284120 -15308897 -16397107 -17520077 -18634170 -19685543 -20616976
37363 -20616976 -21376178 -21922912 -22232603 -22296715 -22121866 -21729076 -21152989 -20439703 -19641867
37354 -19641867 -18811222 -17990901 -17210886 -16489244 -15840043 -15285851 -14868375 -14648291 -14689221
37345 -14689221 -15030642 -15662609 -16514923 -17466172 -18369141 -19082401 -19495781 -19542206 -19197639
37336 -19197639 -18475957 -17421818 -16098966 -14573702 -12901058 -11122760 -9277172 -7411496
37328 -7411496 -5585278 -3861558 -2291370 -903375 291485 1281964 2039977 2521129 2682917
37319 2682917 2505698 2001363 1207149 171983 -1056634 -2440238 -3948735 -5552586 -7214504
37310 -7214504 -8888734 -10529979 -12106470 -13609205 -15051566 -16457269 -17839931 -19183800
$$ packed form
37371a2451392q82286r50442j024777j088210j122970j114093j051373r31433
37363b0616976p59202n46734l09691o4112J74849L92790N76087P13286P97836
37354a9641867Q30645Q20321P80015P21642O49201N54192M17476K20084m0930
37345a4689221l41421o31967q52314r51249r02969p13260m13380m6425L44567
37336a9197639P21682J054139J322852J525264J672644J778298J845588J865676
37328g411496J826218J723720J570188J387995J194860R90479P58013M81152J61788
37319B682917j77219n04335p94214j035166j228617j383604j508497j603851j661918
37310g214504j674230j641245j576491j502735j442361j405703j382662j343869
$$ plain form
37302 -19183800 -20437042 -21522465 -22360641 -22895600 -23114929 -23058736 -22813089 -22487597 -22184943
37293 -22184943 -21975835 -21888511 -21911131 -21998920 -22081422 -22072639 -21888379 -21468971 -20798542 -19911241
37283 -19911241 -18880259 -17793490 -16725889 -15719936 -14780711 -13883464 -12986451 -12044241 -11022107
37274 -11022107 -9912330 -8747556 -7602337 -6577742 -5772439 -5250476 -5017887 -5017745 -5146252
37265 -5146252 -5282417 -5316387 -5163906 -4766247 -4086385 -3111820 -1862888 -394563 1217554
37256 1217554 2902147 4611765 6324520 8029113 9704546 11305334 12757720 13968985
37248 13968985 14849065 15337823 15425651 15156499 14611461 13881078 13038932 12126870 11155552
37239 11155552 10116624 8998700 7800426 6537655 5244065 3965285 2748293 1630072
$$ packed form
37302a9183800j253242j085423q38176n34959k19329N6193K45647L25492L02654
37293b2184943K09108Q7324k2620q7789q2502Q783J84260M19408O70429Q87301
37283a9911241J030982J086769J067601J005953R39225Q97247Q97013R42210J022134
37274a1022107J109777J164774J145219J024595Q05303N21963K32589J42j28507
37265e146252j36165l3970J52481L97659O79862R74565J248932J468325J612117
37256A217554J684593J709618J712755J704593J675433J600788J452386J211265
37248A3968985Q80080M88758Q7828k69152n45038p30383q42146r12062r71318
37239A1155552j038928j117924j198274j262771j293590j278780j216992j118221
$$ plain form
37231 1630072 629881 -252660 -1033258 -1732966 -2365630 -2929272 -3406866 -3774610 -4009290
37222 -4009290 -4088934 -3990585 -3694262 -3196145 -2523245 -1737828 -926451 -178656 434666 875372
37212 875372 1141965 1265126 1298495 1307338 1354792 1484589 1703632 1973512 2218977 2351069
37202 2351069 2292703 1994633 1438408 630349 -407854 -1647311 -3054480 -4585748 -6177394
37193 -6177394 -7739531 -9162101 -10334529 -11172755 -11642402 -11767657 -11622464 -11309588 -10937352
$$ packed form
37231A630072j000191q82541p80598o99708o32664n63642m77594l67744k34680
37222d009290p9644R8349K96323M98117O72900P85417Q11377P47795O13322M40706
37212H75372K66593J23161L3369Q843M7454J29797K19043K69880K45465J32092
37202B351069n8366k98070n56225q08059j038203j239457j407169j531268j591646
37193f177394j562137j422570j172428q38226m69647j25255J45193L12876L72236
$$ [...]
##END NTUPLES=NMR SPECTRUM
##END=
