##TITLE=31Pdec_SRM-164.K.TFA
 CDCl3, 128 sc
 11.5.2023
##JCAMPDX= 6.0         $$ Bruker NMR JCAMP-DX V2.0
##DATA TYPE= NMR SPECTRUM
##DATA CLASS= NTUPLES
##ORIGIN= UXNMR, Bruker Analytische Messtechnik GmbH
##OWNER= root
$$ XWIN-NMR		Version 3.5
$$ Thu May 11 14:42:33 2023 Russian Standard Time (UT+4h)  she@DPX200
##.OBSERVE FREQUENCY= 81.013821
##.OBSERVE NUCLEUS= ^31P
##.ACQUISITION MODE= SIMULTANEOUS
##.ACQUISITION SCHEME= undefined
##.AVERAGES= 128
##.DIGITISER RES= 16
##SPECTROMETER/DATA SYSTEM= spect
##.PULSE SEQUENCE= zgpg30
##.SOLVENT NAME= CDCl3
##.SHIFT REFERENCE= (INTERNAL, CDCl3, 0, 248.564)
##AUDIT TRAIL= $$ (NUMBER, WHEN, WHO, WHERE, WHAT)
$$ ##TITLE= Audit trail, XWIN-NMR		Version 3.5
$$ ##JCAMPDX= 5.01
$$ ##ORIGIN= Bruker BioSpin GmbH
$$ ##OWNER= she
$$ F:/spectra/data/she/nmr/P31/1/pdata/1/auditp.txt
$$ ##AUDIT TRAIL=  $$ (NUMBER, WHEN, WHO, WHERE, WHAT)
(   1,<2023-05-11 14:34:56.54 +0400>,<she>,<DPX200>,
      <continue with go, POWCHK disabled, PULCHK disabled
       configuration hash MD5:
       00 E9 B6 7A A2 85 ED C7 34 08 36 98 17 FE 4E 26
       data hash MD5: 32K
       2F 88 BF 58 4D 1F 0D 20 B7 CA C3 95 8E 29 97 3D>)
(   2,<2023-05-11 14:35:43.64 +0400>,<she>,<DPX200>,
      <Start of raw data processing
       efp BC_mod = 2 LB = 1 FT_mod = 6 PKNL = 1 PHC0 = -11117.47 PHC1 = 431.2849 SI = 64K 
       data hash MD5: 64K
       C0 6A D8 AD 4C 6A 06 65 73 02 43 8F 46 2A E0 82>)
(   3,<2023-05-11 14:36:06.03 +0400>,<she>,<DPX200>,
      <pk PHC0 = 33.64986 PHC1 = -58.6 
       data hash MD5: 64K
       FD C4 C8 BC 63 EF CF EC AB FC 1C 5E E5 F6 61 C6>)
(   4,<2023-05-11 14:36:09.42 +0400>,<she>,<DPX200>,
      <abs ABSG = 5 
       data hash MD5: 64K
       89 E4 1F 09 FF E8 E7 DA F8 4E 42 72 BA D8 3E 67>)
$$ ##END=
$$ 
$$ hash MD5
$$ B2 B8 84 BE EA 06 BA 25 0B E6 B6 C7 1F AC C5 74
##$RELAX= 
##$RELAX= 
##$RELAX= 
##$RELAX= 
##$RELAX= 
##$RELAX= 
##$RELAX= 
##$RELAX= 
##$RELAX= 
$$ Bruker specific parameters
$$ --------------------------
##$DU= <F:/spectra>
##$EXPNO= 1
##$NAME= <P31>
##$PROCNO= 1
##$TYPE= <nmr>
##$USER= <she>
##$AMP= (0..31)
100 100 100 100 100 100 100 100 100 100 100 100 100 100 100 100 100 100 
100 100 100 100 100 100 100 100 100 100 100 100 100 100 
##$AQSEQ= 0
##$AQ_mod= 1
##$AUNM= <au_zg>
##$AUTOPOS= <>
##$BF1= 81.014009
##$BF2= 200.13
##$BF3= 200.13
##$BF4= 200.13
##$BF5= 200.13
##$BF6= 200.13
##$BF7= 200.13
##$BF8= 200.13
##$BYTORDA= 1
##$CFDGTYP= 0
##$CFRGTYP= 5
##$CHEMSTR= <none>
##$CNST= (0..31)
1 1 145 1 1 1 1 1 1 1 1 1 1 1 1 1 1 1 1 1 1 1 1 1 1 1 1 1 1 1 1 1 
##$CPDPRG= <waltz16>
##$CPDPRG1= <>
##$CPDPRG2= <waltz16>
##$CPDPRG3= <>
##$CPDPRG4= <mlev>
##$CPDPRG5= <mlev>
##$CPDPRG6= <mlev>
##$CPDPRG7= <mlev>
##$CPDPRG8= <mlev>
##$CPDPRGB= <>
##$CPDPRGT= <>
##$D= (0..31)
0 1 0 0 0 0 0 0 0 0 0 0.03 2e-05 3e-06 0 0 0 0 0 0 0 0 0 0 0 0 0 0 0 0 
0 0 
##$DATE= 1683801119
##$DBL= (0..7)
120 120 120 11 120 120 24 19 
##$DBP= (0..7)
150 150 150 150 150 150 150 150 
##$DBP07= 0
##$DBPNAM0= <>
$$ [...]
##$SUBNAM3= <"">
##$SUBNAM4= <"">
##$SUBNAM5= <"">
##$SUBNAM6= <"">
##$SUBNAM7= <"">
##$SUBNAM8= <"">
##$SUBNAM9= <"">
##$SW= 501.771253377433
##$SWIBOX= (0..15)
0 1 3 0 0 0 0 0 0 0 0 0 0 0 0 0 
##$SW_h= 40650.406504065
##$TD= 32768
##$TD0= 1
##$TE= 0
##$TE2= 300
##$TE3= 300
##$TEG= 300
##$TL= (0..7)
0 120 53 12 22 120 120 120 
##$TP= (0..7)
150 150 150 150 150 150 150 150 
##$TP07= 0
##$TPNAME0= <>
##$TPNAME1= <>
##$TPNAME2= <>
##$TPNAME3= <>
##$TPNAME4= <>
##$TPNAME5= <>
##$TPNAME6= <>
##$TPNAME7= <>
##$TPOAL= (0..7)
0.5 0.5 0.5 0.5 0.5 0.5 0.5 0.5 
##$TPOFFS= (0..7)
0 0 0 0 0 0 0 0 
##$TUNHIN= 0
##$TUNHOUT= 0
##$TUNXOUT= 0
##$USERA1= <user>
##$USERA2= <user>
##$USERA3= <user>
##$USERA4= <user>
##$USERA5= <user>
##$V9= 5
##$VALIST= <valist>
##$VCLIST= <CCCCCCCCCCCCCCC>
##$VD= 0
##$VDLIST= <DDDDDDDDDDDDDDD>
##$VPLIST= <PPPPPPPPPPPPPPP>
##$VTLIST= <TTTTTTTTTTTTTTT>
##$WBST= 1024
##$WBSW= 4
##$XGAIN= (0..3)
0 0 0 0 
##$XL= 0
##$YL= 0
##$YMAX_a= 4905
##$YMIN_a= -8223
##$ZGOPTNS= <>
##$ZL1= 120
##$ZL2= 120
##$ZL3= 120
##$ZL4= 120
##$ABSF1= 248.5645
##$ABSF2= -253.2056
##$ABSG= 5
##$ABSL= 3
##$ALPHA= 0
##$AQORDER= 0
##$ASSFAC= 0
##$ASSFACI= 0
##$ASSFACX= 0
##$ASSWID= 0
##$AUNMP= <proc_1d>
##$AZFE= 0.1
##$AZFW= 0.5
##$BCFW= 0
##$BC_mod= 2
##$BYTORDP= 0
##$COROFFS= 0
##$CY= -3
##$DATMOD= 1
##$DC= 0
##$DFILT= <>
##$DTYPP= 0
##$F1P= 0
##$F2P= 0
##$FCOR= 1
##$FTSIZE= 65536
##$FT_mod= 6
##$GAMMA= 0
##$GB= 0
##$INTBC= 1
##$INTSCL= 6.047779e-11
##$ISEN= 30
##$LB= 1
##$LEV0= 0
##$LPBIN= 0
##$MAXI= 10000
##$MC2= 0
##$MEAN= 0
##$ME_mod= 0
##$MI= 50
##$NCOEF= 0
##$NC_proc= -9
##$NLEV= 6
##$NOISF1= 182.463
##$NOISF2= 159.3651
##$NSP= 0
##$NTH_PI= 0
##$NZP= 0
##$OFFSET= 248.5645
##$PC= 4
##$PHC0= -11083.82
##$PHC1= 372.6849
##$PH_mod= 1
##$PKNL= yes
##$PPARMOD= 0
##$PSCAL= 0
##$PSIGN= 0
##$REVERSE= no
##$SF= 81.0140089999694
##$SI= 65536
##$SIGF1= 159.3651
##$SIGF2= -187.1042
##$SINO= 113.3802
##$SIOLD= 16384
##$SREGLST= <1H.CDCl3>
##$SSB= 0
##$STSI= 65536
##$STSR= 0
##$SW_p= 40650.406504065
##$SYMM= 0
##$S_DEV= 0
##$TDeff= 32768
##$TDoff= 0
##$TI= <>
##$TILT= no
##$TM1= 0
##$TM2= 0
##$TOPLEV= 0
##$USERP1= <user>
##$USERP2= <user>
##$USERP3= <user>
##$USERP4= <user>
##$USERP5= <user>
##$WDW= 1
##$XDIM= 65536
##$YMAX_p= 357292408
##$YMIN_p= -151053882
$$ End of Bruker specific parameters
$$ ---------------------------------
##NTUPLES= NMR SPECTRUM
##VAR_NAME=  FREQUENCY,     SPECTRUM/REAL,   SPECTRUM/IMAG
##SYMBOL=    X,             R,               I
##VAR_TYPE=  INDEPENDENT,   DEPENDENT,       DEPENDENT
##VAR_FORM=  AFFN,          ASDF,            ASDF
##VAR_DIM=   65536,         65536,           65536
##UNITS=     HZ,            ARBITRARY UNITS, ARBITRARY UNITS
##FACTOR=    0.620285442955139, 1,           1
##FIRST=     20137.2065510682, 0,            0
##LAST=      -20513.1999529968, 0,           0
##MIN=       -20513.1999529968, -151053882,  0
##MAX=       20137.2065510682, 357292408,    0
$$ Real data points
##PAGE= N=1
##DATA TABLE= (X++(R..R)), XYDATA
$$ [...]
12800i651399Q171098J3034663J5286312m628480k7621014k0022124J1975795
12793a3455149K8762275J5878122L21381J892506L239100j3862110l1561335k2703334
12785c1488544L599155J3747952p74549j5182795j2437401m384628m402860l238853
12777e4562523J2692921L4112517L6989896J2812436k0190854l4612508j8881969
12770c1640084J1157746K4998727R356272j3406093j1094978J3922568K5180299
12763B8474457M018109k1061962j4719421J3364612K3279186L198396j6619911
12756A9933466j0702656P968892J2916751J981602p212891o864577m689418m758981
12748H572188j093232P043350Q245376m562087j9707711j9156200k065965J3994072
$$ plain form
12800 -9651399 -1480301 11554362 26840674 22212194 -5408820 -25430944 -13455149
12793 -13455149 15307126 31185248 31506629 33399135 36638235 22776125 -8785210 -31488544
12785 -31488544 -27889389 -14141437 -14915986 -30098781 -42536182 -46920810 -51323670 -54562523
12777 -54562523 -41869602 -7757085 29232811 42045247 21854393 -12758115 -31640084
12770 -31640084 -20482338 4516389 13872661 466568 -10628410 3294158 28474457
12763 28474457 32492566 11430604 -3288817 10075795 33354981 36553377 19933466
12756 19933466 9230810 17199702 30116453 32098055 24885164 18020587 13331169 8572188
12748 8572188 7478956 14522306 22767682 18205595 -1502116 -20658316 -22724281 -8730209
12740h730209J5850762Q911825M399784K176458m115976j1196176q733168L177076
12732A740376J2057137J0609782M228084j733761q469959j2431990l367084J6151029
12724A8783614K4240787P644426j6006539k1279357j0010574k666023k802916
12717b096582L922352J6869002J5161728o837516k4081272j5404646N597332J1519923
12709D650321o86679j0939074p359177J358647K670648m270058j0478809p090145
12701c2144326N277478J3554867N000705j2821168j5747064M578739K4131403
12694h169366J6690853r018141k0870308p238108J0677422J1054556k883996j4620963
12686b4378051j6040351r318312J571741J2726552K0021703K1831441J7498328
$$ plain form
12740 -8730209 7120553 16032378 20432162 22608620 18492644 7296468 -1436700 1740376
12732 1740376 13797513 24407295 28635379 26901618 18431659 5999669 2632585 18783614
12724 18783614 43024401 50668827 34662288 13382931 3372357 706334 -2096582
12717 -2096582 1825770 18694772 33856500 27018984 2937712 -12466934 -6869602 4650321
12709 4650321 3963642 -6975432 -14334609 -12975962 -10305314 -14575372 -25054181 -32144326
12701 -32144326 -26866848 -13311981 -8311276 -21132444 -36879508 -32300769 -8169366
12694 -8169366 8521487 -496654 -21366962 -28605070 -17927648 -6873092 -9757088 -24378051
12686 -24378051 -40418402 -49736714 -48164973 -35438421 -15416718 6414723 23913051
12679B3913051M089443j6065886k6886270j3306849J3179904K2087768M664026
12672A1675187j1835670l876119J2696524P868909j4603196k1917510k110538
12665b2102413J8434877J4312292n040947j3978735o538270K660310L540738j60116
12657h872264l030261m747671m264469J273574R275471J1869706O172755k210417
12649E466424q049943j1611109j1702970k245579J6297892K8260650J7814869
12642C4230234p312224j9732686n857774J4953648J5080620m862126j8885701
12635G613991j2834641j249672j779015r204105p211757N497322J6043451J7364418
12627A4239992J2105878J766135j1293375j5014057j106359J3469920K820994
$$ plain form
12679 23913051 28002494 11936608 -14949662 -28256511 -15076607 7011161 11675187
12672 11675187 -160483 -4036602 8659922 16528831 1925635 -19991875 -22102413
12665 -22102413 -3667536 10644756 5603809 -8374926 -14913196 -12252886 -8712148 -8872264
12657 -8872264 -11902525 -16650196 -20914665 -19641091 -10365620 1504086 7676841 5466424
12649 5466424 -2583519 -14194628 -25897598 -28143177 -11845285 16415365 34230234
12642 34230234 26918010 7185324 1327550 16281198 31361818 26499692 7613991
12635 7613991 -5220650 -6470322 -8249337 -17453442 -24665199 -19167877 -3124426 14239992
12627 14239992 26345870 28112005 16818630 1804573 698214 14168134 16989128
12620A6989128k5032474k9340365M676171L5543157K0199756k1521516l2423121
12613c0909264J052470L2534921K4333062n169407j8037989r083473J963162P200267
12605C883749J1529675J1710851K776033l623366M850924J3008957l846050l5000594
12597E290179m0881706j1246360J6826866J4067737k40630L343587J4414050O089914
12589G663637j1780212o271763J8297088K0021985j2331726l4298869j1171355
12582b9871215K6841102K7788582o508545k6255115o462394K3169627K5929536
12575C4631578N555875q253675l232845L982101n326810k5271070k9465315k738608
12567c0118769L3998686M1770654J1913260j8374423j3359733J2588618J7386680
$$ plain form
12620 16989128 -8043346 -37383711 -32707540 2835617 23035373 1513857 -30909264
12613 -30909264 -29856794 2678127 27011189 21841782 3803793 -5279680 -3316518 3883749
12605 3883749 15413424 27124275 29900308 26276942 31127866 44136823 40290773 5290179
12597 5290179 -35591527 -46837887 -30011021 -15943284 -16183914 -12840327 1573723 7663637
12589 7663637 -4116575 -10388338 7908750 27930735 15599009 -18699860 -29871215
12582 -29871215 -3030113 24758469 18249924 -8005191 -14467585 8702042 34631578
12575 34631578 40187453 31933778 28700933 32683034 27356224 2085154 -27380161 -30118769
12567 -30118769 3879917 45650571 57563831 39189408 25829675 38418293 55804973
12560E5804973o820051k5278534j5130661M485785P796036j508698p116638q454606
12552C777606j0691829o514728Q136026J6491497N018101q448134N84902K0422475
12544B8775916J7882272p835090k1522462p274038P644455j493492j8566556j6572891
12536a8961886j271620M009953R38653R962609K7007248K1761810j2755521l9546439
12528h855193k5572657J0966580K6077480J0120468o522263m858732j704619j2145794
12520a2494730j7978177J693452K8623479K6727215k743693k1252122r990058
12513g414634O559144M522747l669402K499277J3704657Q354866q617835j3721659
12505B217161l308167L462750k603137r716405q065883k346454K052856O968274
$$ plain form
12560 55804973 48984922 23706388 8575727 13061512 20857548 19348850 12232212 3777606
12552 3777606 -6914223 -13428951 -5292925 11198572 16216673 7768539 8353441 28775916
12544 28775916 46658188 38823098 17300636 10026598 17671053 16177561 -2388995 -18961886
12536 -18961886 -20233506 -16223553 -15284900 -5322291 21684957 43446767 30691246 -8855193
12528 -8855193 -34427850 -23461270 2616210 12736678 6214415 1355683 -348936 -12494730
12520 -12494730 -30472907 -28779455 -155976 26571239 23827546 2575424 -7414634
12513 -7414634 -855490 3667257 -2145 2497132 16201789 24556655 15938820 2217161
12505 2217161 -1091006 2371744 -231393 -9947798 -18013681 -20360135 -18307279 -11339005
12497a1339005J1121082P830589j476774m478710N504940J9172629K1253441N399670
12489E2987862j9775364l4130232k1553250R322155K8246313J8616877o02739
12482C3111622l058923P425720Q897449k94026l319037N71048m974728j9013071
12474A9346054j9962590l197453Q429153K156747n013695K201678J2483022J0773502
12466B7216418K822142n98329l484130j0871195j3707716m896759O015122R525417
12458A2020970J0042236Q980954m277317k6692823l0720442l645279K3698243
12451a0593458J7146118r078203j4249529P135558K1970281J2733141j415328
12444B3648580k156326J842507k442653r053728p053762o38849r64423p875869
$$ plain form
12497 -11339005 -217923 7612666 6135892 1657182 7162122 26334751 47588192 52987862
12489 52987862 33212498 -917734 -22470984 -13148829 15097484 33714361 33111622
12482 33111622 30052699 37478419 46375868 46081842 42762805 43333853 38359125 19346054
12474 19346054 -616536 -3813989 4615164 6771911 1758216 3959894 16442916 27216418
12466 27216418 30038560 29440231 25956101 15084906 1377190 -3519569 2495553 12020970
12458 12020970 22063206 31044160 26766843 74020 -30646422 -34291701 -10593458
12451 -10593458 6552660 -2525543 -16775072 -9639514 12330767 25063908 23648580
12444 23648580 21492254 23334761 20892108 11838380 4784618 4145769 3181346 -4694523
12436d694523j0751048k795365J1002026J7468441P239461j2606972k2194367
12429a7332347j2308563J929450J581510q038836m805079J6775667L5494491L0369820
12421D3666113O100782j3813854j3499409o13370K991186j2663692l0668419k6128325
12413d4628988P6496K0198577J6930896N146160N931774J5328225J4593345j044929
12405C2531556k0211766l1389489k6612025k186150K8014742L5024769J0798421
12398B5970058j3085158o347111J5353494J5791607m610874j2769867J141727
12391B1443876J0160281k965388k0758572k2600924j1901026M4409J1592772J9570154
12383D585582J3539916m940484j6358046r392436L133224N170653j132891m867726
$$ plain form
12436 -4694523 -15445571 -18240936 -7238910 10229531 17468992 4862020 -17332347
12429 -17332347 -29640910 -27711460 -26129950 -34168786 -38973865 -22198198 13296293 43666113
12421 43666113 49766895 35953041 22453632 21840262 24831448 12167756 -18500663 -44628988
12413 -44628988 -44552492 -24353915 -7423019 -2276859 3654915 18983140 33576485 32531556
12405 32531556 12319790 -19069699 -45681724 -47867874 -19853132 15171637 25970058
12398 25970058 12884900 6537789 21891283 37682890 33072016 20302149 21443876
12391 21443876 31604157 28638769 7880197 -14720727 -26621753 -26577344 -14984572 4585582
12383 4585582 18125498 13185014 -3173032 -12565468 -9432244 -4261591 -5394482 -10262208
12375a0262208k893996K126466P657900Q799800K236919m068638N22605J0121119
12367A4239967R716190J956920L336035J1121497K559914k3619903l4677504j0459502
12359b5826386K2850775K8056045O536819j1660692j2757183q344105p285829
12352h430556l940989M544231Q517631J10902j2543310j2391418O010980K6162958
12344H040429K5452304L991138j1968663m612832R340350M068714j5178119k2204331
12336c071010j2815840o939012r389497k717626J5636283K3739315J3447544N064542
12328B2954699R838306J0520817l670391j5134782j1148394p136875j3414200
12321g190820j0713169J2769709L0062137J4635912j4384366k1796977r916675
$$ plain form
12375 -10262208 -13156204 -11029738 -3371838 5427962 7664881 3596243 4118848 14239967
12367 14239967 23956157 25913077 29249112 40370609 42930523 19310620 -15366884 -25826386
12359 -25826386 -2975611 25080434 31617253 19956561 7199378 -1144727 -8430556
12352 -8430556 -12371545 -7827314 690317 801219 -11742091 -24133509 -18122529 8040429
12344 8040429 33492733 37483871 25515208 20902376 30242726 34311440 19133321 -3071010
12336 -3071010 -15886850 -22825862 -32215359 -34932985 -19296702 4442613 17890157 22954699
12328 22954699 32793005 43313822 39643431 24508649 13360255 6223380 -7190820
12321 -7190820 -17903989 -5134280 24927857 39563769 25179403 3382426 -6534249
12314f534249n991664j3666893j4590883n707075M89108K730141O485368N127674
12306c1658473l800836l98653K4667107L8428171R570978l2827483l4742151l56793
12298c1118133J6017960k097235j3774308L206490J7531358N728766p369690J314070
12290a0560722J1130942P13336q871396N974062K2480446O873191k5559471l0849311
12282b8668923k489638K4697081K8734377J9379104O323810j2916250k9297681
12275E761880k1746586P529902K4921968Q747633j9460850k4793574n868429Q487121
12267a6420935L116856m933982L373310J8587870J7621807j22958j1772636o609064
12259B840268p84349o753460r394828P689292K8230999K2435152p770002l0593202
$$ plain form
12314 -6534249 -12525913 -26192806 -40783689 -46490764 -46001656 -43271515 -36786147 -31658473
12306 -31658473 -35459309 -35857962 -11190855 27237316 36808294 3980811 -30761340 -31118133
12298 -31118133 -15100173 -17197408 -30971716 -27765226 -10233868 -4505102 -11874792 -10560722
12290 -10560722 570220 1283556 -7587840 -1613778 20866668 27739859 2180388 -28668923
12282 -28668923 -31158561 -6461480 22272897 41652001 47975811 35059561 5761880
12275 5761880 -15984706 -8454804 16467164 25214797 5753947 -19039627 -24908056 -16420935
12267 -16420935 -13304079 -18238061 -14864751 3723119 21344926 21221968 9449332 2840268
12259 2840268 2055919 -4697541 -14092369 -6403077 21827922 44263074 36493072 5899870
12251E899870k9168194j6585148n536590O921274J8223252J4363175k723625r195727
12243a7801713M335930J5796326P706871m890200l104744L009865m227283j5679538
12235a4854486j1037430M902732J0515270K671435l625403l729019m165745n14914
12227a9837560J6443845L3951297K6475609l978890k4277678j5556884K018822
12220A5238561J818784j2821131k0114958j2146383J377489J2025949J8736743
12213D115054J9221160J0044467l592519r001069j767157N515508k738383k2651840
12205h54779l0307067j0448774J9342449K6099529L927977j6845377j0632625
12198a9718667R474556J3701492j408130j2891033p828595K880248P268999P470011
$$ plain form
12251 5899870 -23268324 -39853472 -45390062 -38468788 -20245536 -5882361 -8605986 -17801713
12243 -17801713 -13465783 2330543 10037414 5147214 2042470 5052335 825052 -14854486
12235 -14854486 -25891916 -20989184 -10473914 -7802479 -11427882 -15156901 -19322646 -19837560
12227 -19837560 -3393715 30557582 57033191 53054301 28776623 13219739 15238561
12220 15238561 17057345 4236214 -15878744 -28025127 -26647638 -14621689 4115054
12213 4115054 23336214 33380681 29788162 20787093 19019936 24535444 21797061 -854779
12205 -854779 -31161846 -41610620 -22268171 3831358 7759335 -9086042 -19718667
12198 -19718667 -10244111 3457381 2049251 -10841782 -18670377 -15790129 -8521130 -1051119
12190a051119P672195N604145K594743N419666J0617563L517664j7142723k9589357
12182a2357223j7585159M631938J2138312L727269k238454J68466j382436j0434921
12174b3332208j0794736P583232K7743098K5568160K425794j6919426j6518538
12167d244624n295690J082993J209613L226434Q219446R241892L683623l337627
12159A3786060p899166j1372371j4371294j3545719o307595O290965K1167120
12152a2252000L1679886K7037352M054407k0808665k5179994j0056674p4156p731183
12144a3331027j4768802k174699J8201432K2234619J1422357P108408J2790742
12137D1483030J0026297o517201j7754194j2703721o912109j3395031j6966374
$$ plain form
12190 -1051119 6621076 12225221 14819964 20239630 30857193 34374857 17232134 -12357223
12182 -12357223 -29942382 -25310444 -13172132 -9444863 -11683317 -11514851 -12897287 -23332208
12174 -23332208 -34126944 -26543712 1199386 26767546 29193340 12273914 -4244624
12167 -4244624 -9540314 -8457321 -7247708 -4021274 4198172 13440064 17123687 13786060
12159 13786060 5886894 -5485477 -19856771 -33402490 -39710085 -33419120 -12252000
12152 -12252000 19427886 46465238 50519645 29710980 4530986 -5525688 -5599844 -13331027
12144 -13331027 -28099829 -30274528 -12073096 10161523 21583880 28692288 41483030
12137 41483030 51509327 44992126 27237932 14534211 7622102 -5772929 -22739303
12130b2739303J096734K7669149L2168502J0556993r217467p511494K569096n17722
12122C4074488j4059835j6969733j731106J3970803J0330595q659403j9883956
12115b928147j0143236P199217R317489o712937j9815463j1047227J3338566K9348111
12107H556373K2239761J665972j0186969m114021M729049m156901k5911544l0307989
12099c7486269k386973K8819596K3212775j3398206l3010556j1696147J8137446
12092b7808334J8843237J839780Q72615J2905377P148734j4979016j5554099J5696716
12084a034990L6665806J4840427k1747828k7635081p323639q0853j3265591j5975207
12076c5556956K530908J3779489K126074n153159J4963375L6371718K1104028
$$ plain form
12130 -22739303 -21642569 6026580 38195082 48752075 39534608 32023114 34592210 34074488
12122 34074488 20014653 3044920 1313814 15284617 25615212 16955809 -2928147
12115 -2928147 -13071383 -5872166 3445323 -3267614 -23083077 -34130304 -20791738 8556373
12107 8556373 30796134 32462106 22275137 18161116 22890165 18733264 -7178280 -37486269
12099 -37486269 -39873242 -11053646 12159129 -1239077 -34249633 -45945780 -27808334
12092 -27808334 -8965097 -7125317 -6252702 6652675 13801409 -1177607 -16731706 -1034990
12084 -1034990 35630816 50471243 28723415 1088334 -6235305 -6316158 -19581749 -35556956
12076 -35556956 -33026048 -19246559 -17120485 -22273644 -7310269 29061449 50165477
12069E0165477j8898186l6984869k0566292l655966p395945q810849J4122829
12062c2023801M0485159L7252926R711210r551914q842939m269610n699593o271001
12054B0790437m696907r145482j5953750j1515922M4024j158655j4350190j3872086
12046d9858531P000337K0014008P994828n174393L633767J5776374N760225r980334
12038d833719k055254J4788868M269151k3056889k0872617J2621112K5286018
12031F146670l439233k6268318o203479K2237457J2234124j7645432j7483989
12024c0422200J0431756J9112273m320360k2305893j1008546P033673N869092
12017b5610205n982305o790406N791226J8330971K0090881Q913556o975617j0541939
$$ plain form
12069 50165477 31267291 -5717578 -26283870 -29939836 -37335781 -46146630 -32023801
12062 -32023801 8461358 45714284 55425494 45873580 37030641 32761031 27061438 20790437
12054 20790437 16093530 6948048 -9005702 -20521624 -20477600 -21636255 -35986445 -49858531
12046 -49858531 -42858194 -22844186 -14849358 -20023751 -16389984 -613610 5146615 -4833719
12038 -4833719 -6888973 7899895 12169046 -10887843 -31760460 -19139348 6146670
12031 6146670 2707437 -23560881 -29764360 -7526903 4707221 -12938211 -30422200
12024 -30422200 -19990444 -878171 -5198531 -27504424 -38512970 -31479297 -25610205
12017 -25610205 -31592510 -38382916 -32591690 -14260719 5830162 14743718 7768101 -2773838
12009b773838M844811J9488329J0533690j2109879j8282752m830501P5182j5382658
12001a8437616k6931093j4427941P527109J6282532J3359958J0676854O226603
11994e723594m978955j2761496o325808N562607Q195101L623249K108558K116193
11986h184145k650091n769149L334286J9619665K7823385K2477571Q961099q259876
11978E7352745k4505455k9871082k0430521p825717l824646l395429K212201N799484
11970b4488420l015088j3428212n167075J7641018K7701987J3271305m945818
11963G569697l857267J0793393J4730600j574081k0613513j8459647O926990L1095037
11955B6611209K9338889M929029j6797354k1171337j7045659j4203468p142871
$$ plain form
12009 -2773838 2070973 21559302 32092992 19983113 1700361 -3130140 -3054958 -18437616
12001 -18437616 -45368709 -59796650 -52269541 -35987009 -22627051 -11950197 -5723594
11994 -5723594 -10702549 -23464045 -29789853 -24227246 -16032145 -12408896 -10300338 -8184145
11986 -8184145 -10834236 -16603385 -13269099 6350566 34173951 56651522 65612621 57352745
11978 57352745 32847290 2976208 -17454313 -25280030 -29104676 -32500105 -30287904 -24488420
11970 -24488420 -27503508 -40931720 -46098795 -28457777 -755790 12515515 7569697
11963 7569697 3712430 14505823 29236423 27662342 7048829 -11410818 -4483828 26611209
11955 26611209 55950098 60879127 44081773 22910436 5864777 -8338691 -15481562
11948a5481562P561664J6565514J0158442J749340N699150R494741n644953k6276603
11940C825733k0618940J0245466K7249721P427384k4252416l0753669r790682
11933c6667403J1353289J3704335L005956m841854j910017O844830J0706214N502597
11925G697947j629370k665249L26894R94040l68493r39212l425898q012282m693144
11916a2714767J0183809J8464535K906144k0945335k1736158J119221J7197570
11909e524981J3479659J0038887J8139305J7464706n263170k5622467j7146568
11902E565371N188408Q512455o382224j0633833L020324J0290851k824121j8212350
11894e475119j5124373J301959J3326197J5679966J3739065Q175183l722224j6203974
$$ plain form
11948 -15481562 -7919898 8645616 18804058 20553398 26252548 35747289 30102336 3825733
11940 3825733 -16793207 -6547741 20701980 28129364 3876948 -26876721 -36667403
11933 -36667403 -25314114 -11609779 -8603823 -13445677 -15355694 -8510864 2195350 7697947
11925 7697947 6068577 3403328 3730222 4724262 4355769 3416557 -9341 -8021623 -12714767
11916 -12714767 -2530958 15933577 18839721 -2105614 -23841772 -22722551 -5524981
11909 -5524981 7954678 17993565 36132870 53597576 48334406 22711939 5565371
11902 5565371 10753779 19266234 12884010 2250177 5270501 15561352 12737231 -5475119
11894 -5475119 -20599492 -19297533 -5971336 9708630 23447695 31622878 27900654 11696680
11886A1696680j7652880o186258N591341M786858o998088j6540451j4429336l193278
11878d2925412R681230K0338532K6083450K0787951K419298j6718965j8599165
11871A066919j422427J6194276J7511487N917594m766337r691116j3072281j4019880
11863b281765m839116J3999314K6188538J4790315j5588641l8138451l0468592
11856c6338398l64791K1784165J8215023L288603J197829J2131809J3817151m898255
11848B8833136k6706487k7868155p751090J1968273J3214019n94774j1742934
11841b0648012q240068N289768J5017180J3045895L169943n605445o187214L810949
11833c47004J8174164K1702802M978635j8865060k5717758j2696329k316471p304630
$$ plain form
11886 11696680 -5956200 -12142458 -6551117 -1764259 -8762347 -25302798 -39732134 -42925412
11878 -42925412 -33244182 -12905650 13177800 33965751 36385049 19666084 1066919
11871 1066919 -355508 15838768 33350255 39267849 34501512 24810396 11738115 -2281765
11863 -2281765 -7120881 6878433 33066971 47857286 32268645 -5869806 -36338398
11856 -36338398 -36703189 -14919024 3295999 6584602 7782431 19914240 33731391 28833136
11848 28833136 2126649 -25741506 -33492596 -21524323 -8310304 -8905078 -20648012
11841 -20648012 -28888080 -23598312 -8581132 4464763 7634706 2029261 -4157953 -347004
11833 -347004 17827160 39529962 44508597 25643537 -74221 -12770550 -15087021 -22391651
11825b2391651j1146231K443678K0546082K1817164R470499j13057o749391j7053696
11817c176603j8867399K196763K8596566K8514537M958405q545911j730716J227243
11809C3172885j0087067j3281513L596136J7210289P963095p966323r082983l822620
11801A7701899r612610j8764602j2253525P470558K1060316J9020692O266949
11794C0889677q812185j6050338p779913O789068P680356m985480p235872R303065
11786I798378J9438199L857427j8552309k0408693n437899N779357Q815313R033112
11778A2322885K455748j0470264j1617068O418329J8302189K533421j9628467
11771C16773j5699606N698678J1928823P77631l425717K442801j51619r591090
$$ plain form
11825 -22391651 -33537882 -31094204 -10548122 11269042 20739541 20626484 13877093 -3176603
11817 -3176603 -22044002 -19847239 8749327 37263864 42222269 33676358 31945642 33172885
11809 33172885 23085818 9804305 13400441 30610730 38573825 30607502 21524519 17701899
11801 17701899 8089289 -10675313 -22928838 -15458280 5602036 24622728 30889677
11794 30889677 22077492 6027154 -1752759 5036309 12716665 7731185 495313 9798378
11786 9798378 29236577 33094004 14541695 -5866998 -11304897 -5525540 3289773 12322885
11778 12322885 14778633 4308369 -7308699 -890370 17411819 19945240 316773
11771 316773 -15382833 -9684155 2244668 3022299 -403418 2039383 1887764 -7703326
11763g703326n845548O943608L802493j1980660q090484J9610110L3800067J5479804
11755D6016064m965926Q66977J4279212N014612j7389863k1440840m397386P715940
11747B5698790K129463p135572o429495p62557q44797o269196p967910j583879
11739c165153O368023O458139p96005n170875k295131k16257l349103j465127
11731c631489J1451892J8606387J648730k5854730l0897529o986586J6651040
11724a9012285J6525790L004353j897267M224742P578826R80788p990222p121398
11716c706673O246932J8952950J4365695l863554j1361729K636186J5429204M196278
11708D2895289j6276580j6485740n99929K181079j1510622j5187700m34875J0120442
$$ plain form
11763 -7703326 -13548874 -6605266 -2802773 -14783433 -22873917 -3263807 30536260 46016064
11755 46016064 41050138 41917115 56196327 61210939 43821076 22380236 17982850 25698790
11747 25698790 27828253 20692681 14263186 13500629 12655832 6386636 -1581274 -3165153
11739 -3165153 3202870 9661009 8865004 3694129 1398998 1182741 -2166362 -3631489
11731 -3631489 7820403 26426790 28075520 2220790 -28676739 -35663325 -19012285
11724 -19012285 -2486495 517858 -1379409 2845333 10424159 11404947 3414725 -3706673
11716 -3706673 2540259 21493209 35858904 31995350 20633621 23269807 38699011 42895289
11708 42895289 26618709 10132969 9533040 11714119 203497 -14984203 -15419078 -5298636
11700e298636N153999K023198R601298J0383040l575104j1550062j692016M661313
11692I707030r253846k2830787j1505276J1435032J7143370O469427J879700P719519
11684A0764169Q747623K88776o896654p379358n109167j324184L510423K159119
11676D760747p883612j3187936k236074J3433826J4065322P33381q428005n308893
11668d051244J990004N368315L767156j408758m920558J510465J4693605J6103765
11660C3052750k798751k2336020j9450347p26706R442657M994069j88457j022316
11652I66879o591130j6686894j6445774L9413J8469397K2878236J2599093k817808
11644A2411412j3783974j3218532l79889J4534782J8296724Q857928m846938j5018325
$$ plain form
11700 -5298636 -144637 1878561 11479859 21862899 18287795 6737733 5045717 9707030
11692 9707030 453184 -22377603 -33882879 -22447847 -5304477 1164950 3044650 10764169
11684 10764169 19511792 19800568 12903914 5524556 415389 -908795 2601628 4760747
11676 4760747 -3122865 -16310801 -18546875 -5113049 8952273 9685654 1257649 -4051244
11668 -4051244 -2061240 3307075 7074231 5665473 744915 2255380 16948985 33052750
11660 33052750 30253999 7917979 -11532368 -12259074 -2816417 2177652 1989195 966879
11652 966879 -5624251 -22311145 -38756919 -38717506 -20248109 2630127 15229220 12411412
11644 12411412 -1372562 -14591094 -14970983 -436201 17860523 26718451 21871513 6853188
11636F853188j8580379j2713691J455192J2574152Q790833n543145j3152805n006851
11628b5323506R916783J6363455P791635q989268j8502147r590925J0418661K0646925
11620B731613J2557378J493716J950707L469767j0595987k9298548k4222450O643513
11612c5270291L0654017K4205465K668838o722048l301097m797416j2709504j0240780
11604a5512816O088788J5845208M683798j2283083j2123433J795126O471019m024993
11596i060386j0675916k567138M733717l280322j3760580p572221Q072429J2180605
11588b1929812N089516L697019P521599N66887j2928006q280090J6237192K8571704
11580A8546009J0388613j3901976j5185394j177949L365016l045249m320530J614476
$$ plain form
11636 6853188 -11727191 -24440882 -22985690 -10411538 -1620705 -7163850 -20316655 -25323506
11628 -25323506 -15406723 956732 8748367 -240901 -18743048 -28333973 -17915312 2731613
11620 2731613 15288991 16782707 18733414 22203181 11607194 -17691354 -41913804 -35270291
11612 -35270291 -4616274 19589191 22258029 15535981 12234884 7437468 -5272036 -15512816
11604 -15512816 -9424028 6421180 11104978 -1178105 -13301538 -11506412 -5035393 -9060386
11596 -9060386 -19736302 -22303440 -17569723 -20850045 -34610625 -42182846 -34110417 -21929812
11588 -21929812 -16840296 -13143277 -5621678 -5054791 -17982797 -26262887 -10025695 18546009
11580 18546009 28934622 15032646 -152748 -1330697 2034319 -1010930 -5331460 -3716984
11572c716984K360856n990936j5479859j8921065j1586882Q622301K9253481K7224634
11564A1765546J090525j8167821q455000R799977N628438j4487199k0164407n329604
11556c8319545R172027J2694022J2480514R362463k420102j3135795o315312R986435
11548f495293J0600297o129559j4858128m328780P926985R038093R577297J7503356
11540B2834268J9943937O519989j0092209j3346837p221905o362174j2597529
11533c22460j4103542k208634J8184781L1244333K3163252j285889j9422924j7291633
11525A7957284p755849q228948j1541933r63572J5067101J2559150o462047j3968459
11517c337273j319887P151210m330653j7418708j0612376Q373873J7857227J1423861
$$ plain form
11572 -3716984 -1356128 -7347064 -22826923 -41747988 -53334870 -44712569 -15459088 11765546
11564 11765546 12856071 -5311750 -13766750 -3966773 1661665 -12825534 -32989941 -38319545
11556 -38319545 -29147518 -16453496 -3972982 5389481 2969379 -10166416 -16481728 -6495293
11548 -6495293 4105004 -2024555 -16882683 -21211463 -13284478 -4246385 5330912 22834268
11540 22834268 42778205 49298194 39205985 25859148 18637243 12275069 -322460
11533 -322460 -14426002 -16634636 1550145 32794478 55957730 54671841 35248917 17957284
11525 17957284 10201435 1972487 -9569446 -10533018 4534083 17093233 10631186 -3337273
11517 -3337273 -4657160 2494050 -1836603 -19255311 -29867687 -21493814 -3636587 7787274
11509G787274k239275j2964103j1680362M502738K0824211J5896519p691975k2915958
11501h480931j6233216l992662j449000j04744R928961J8918021J6334435R218531
11493B4139395L880576q720993k8760091l1122065L8785L7365001M0394792R653443
11485D6868843j6858108j5439992O06164Q166766J745347q322945r311254L285556
11477A0740377J8290246J5849241q217489l1897908l1728030j0428150J0696116
11470b6695597J7461929R863262n223730j5533473q841111J0225847K0547625
11463A804752J2998187K852846J646611j699421j3952149j7039206l14084J1801166
11455a901298j832844j6554723j19235K6132427J6723503j7962314k1639488J4942233
$$ plain form
11509 7787274 5547999 -7416104 -19096466 -14593728 6230483 22127002 14435027 -8480931
11501 -8480931 -24714147 -28706809 -30155809 -30260553 -20331592 -1413571 14920864 24139395
11493 24139395 28019971 19298978 -9461113 -40583178 -40544393 -3179392 37215400 46868843
11485 46868843 30010735 14570743 15176907 23343673 25089020 16766075 7454821 10740377
11477 10740377 29030623 44879864 36662375 4764467 -26963563 -37391713 -26695597
11470 -26695597 -9233668 629594 -4594136 -20127609 -28968720 -18742873 1804752
11463 1804752 14802939 17655785 19302396 17602975 3650826 -13388380 -13702464 -1901298
11455 -1901298 -3734142 -20288865 -20408100 5724327 22447830 4485516 -17153972 -2211739
11447b211739L4538261N132719k9711758k4257650m7674J596243q798184J885738
11439b1874044K1531170J3692643j2725766j5102466Q616918J6530431l082463
11432G586423j2395165O657278J8899150j256991k1626744n180115K5662111K3504290
11424D1850237q314147k3027317m202306J4674874P474119r314364j1559202m176488
11416C405406l667632q324397p067201j708999j79726J378864J0763393K1174271
11408A5773979J8446673L372586q988024j1070311r608526j0088500q030412k274
11400a0194809P251405N559622k311041n566871M51445P617586N172823m724756
11392C255404p428031L770818J4146219N904942j3399040j8201236l327626O052137
$$ plain form
11447 -2211739 32326522 37459241 7747483 -16510167 -16557841 -14961598 -23759782 -21874044
11439 -21874044 -342874 13349769 624003 -14478463 -5861545 10668886 7586423
11432 7586423 -4808742 1848536 20747686 19490695 -2136049 -7316164 18345947 41850237
11424 41850237 33536090 10508773 6306467 20981341 28455460 19141096 7581894 3405406
11416 3405406 -262226 -8586623 -15653824 -17362823 -17542549 -16163685 -5400292 15773979
11408 15773979 34220652 37593238 28605214 17534903 7926377 -2162123 -10192535 -10194809
11400 -10194809 -2943404 2616218 305177 -5261694 -4810249 2807337 7980160 3255404
11392 3255404 -4172627 -401809 13744410 19649352 6250312 -11950924 -15278550 -9226413
11384i226413o027870j8201259m100257K3361194K8243611N075830j4036423p499512
11376b411099Q817747J1167787J57996r500511j2097540q920884J820793J7477410
11368F511699K4252447J2962985n732778j4067978q613847J236332Q279388R624734
11360C4452982J685975j3411097k1858625j2597898N338226J3207842Q009001
11353A4826406L183229M261373N65426j3236439k3060356j5340533o16690j64552
11345b9582136j2147427j0770982J4124214L4979754K1388480j3894298k8017909
11338b3920304o326679J8736012J6191519j273256k775855J2844634K0674020
11331C4150091J0170147n267621j4457765j8344485j5277339j529305J2492282
$$ plain form
11384 -9226413 -15254283 -33455542 -37555799 -14194605 14049006 19124836 5088413 -2411099
11376 -2411099 6406648 17574435 17732431 8231920 -3865620 -12786504 -10965711 6511699
11368 6511699 30764146 43727131 37994353 23926375 15312528 16548860 24828248 34452982
11360 34452982 36138957 22727860 869235 -11728663 -6390437 6817405 14826406
11353 14826406 18009635 22271008 22836434 9599995 -13460361 -28800894 -29417584 -29582136
11345 -29582136 -41729563 -52500545 -38376331 -3396577 17991903 4097605 -23920304
11338 -23920304 -30246983 -11510971 4680548 3407292 631437 13476071 34150091
11331 34150091 44320238 39052617 24594852 6250367 -9026972 -10556277 1936005
11324A936005J0724494j879378n106162K712904L663794m171154j759830J2086657
11316A8207330J1421385j1377609k4578313n410170K0104199J5562742j0643628
11309A3285936k1630211p323537R977369J5135050J3001912O901483n830065j7687098
11301E830839j5776255l156634N388178O834447R156308J1164212M944305m705825
11293A9679575n543473k81198j562140p064666l468892N883157L021319j2612707
11285a949025j9464822o925344R836272J5217196J2430990R437271M796095l330057
11277B0048576r847503j1968971j2227775q478585L739077J6515683J5484760
11270A3265262L729180k51685O820902O593046q503813j9198691r083698Q919550
$$ plain form
11324 1936005 12660499 10781121 5674959 8387863 12051657 7880503 6120673 18207330
11316 18207330 29628715 18251106 -6327207 -11737377 8366822 23929564 13285936
11309 13285936 -8344275 -15667812 -5690443 9444607 22446519 29348002 23517937 5830839
11301 5830839 -9945416 -13102050 -7713872 -879425 8276883 19441095 24385400 19679575
11293 19679575 14136102 13854904 12292764 5228098 1759206 7642363 10663682 -1949025
11285 -1949025 -21413847 -28339191 -18502919 -3285723 9145267 18582538 23378633 20048576
11277 20048576 10201073 -1767898 -13995673 -22474258 -18735181 -2219498 13265262
11270 13265262 16994442 16742757 23563659 30156705 21652892 2454201 -6629497 2290053
11262B290053J1847173j624217j3873048j2553948n1936J2936533J5012742L994817
11254A7978169o369619j366660J1012124Q518016r994313j9818651q742795M299251
11246d484478J782639n926464m477624k077061q971240j1443847N579653K5737445
11238d280977K1679128j662466j4900907r623346n100098j0391482j0365406M349949
11230c0295605J9355099J8740460O673927k622322k465006N288690J4596734J6037006
11222D5308983M380621j2095624k0125056j8404965j4259144p624095M754139
11215a8065141J3149386N193937q043817k272367J9140397K2920553l860692k9457090
11207a294834k2733950J653211R003178l130799q595304K306655J3181302J3955720
$$ plain form
11262 2290053 14137226 12513009 -1360039 -13913987 -13965923 -1029390 13983352 17978169
11254 17978169 11608550 10241890 21254014 29772030 19777717 -40934 -8783729 -4484478
11246 -4484478 -2701839 -8628303 -13105927 -15182988 -24154228 -35598075 -30018422 -4280977
11238 -4280977 17398151 15735685 834778 -8788568 -13888666 -24280148 -34645554 -30295605
11230 -30295605 -10940506 7799954 14473881 11851559 9386553 14675243 29271977 45308983
11222 45308983 49689604 37593980 17468924 -936041 -15195185 -22819280 -18065141
11215 -18065141 -4915755 278182 -7765635 -10038002 9102395 32022948 28162256 -1294834
11207 -1294834 -24028784 -22375573 -13372395 -16503194 -25098498 -22791843 -9610541 4345179
11199D345179J2618849J1678911J317791j5711443j8323872K77480J6129478P835107
11191B0167480j1412162j5297758m136007N44229o591059q616021K082464J0583242
11183a2675592M977201m715480l967402N127515J1804798J3200965J0935515K634948
11175B7322468r517963j2298747M53307J2067530L946012j4513535j8482725o347558
11167a7371211l91526p371534o884117J1036582K4462259J4066776m162489n108415
11159H276325M241527j005911j8717884k1393144j433696J6552844J5082037P287988
11151H890086Q870282J1142152N16932j3242383j0673554N010002J1178896p90773
11143B0901640j4351177j2968695j223871O043539M668521J304680j624128q718182
$$ plain form
11199 4345179 16964028 28642939 29960730 14249287 -4074585 -3797105 12332373 20167480
11191 20167480 8755318 -6542440 -10678447 -10134218 -16725277 -25341298 -23258834 -12675592
11183 -12675592 -7698391 -12413871 -16381273 -11253758 551040 13752005 24687520 27322468
11175 27322468 17804505 5505758 5959065 18026595 21972607 7459072 -11023653 -17371211
11167 -17371211 -17762737 -25134271 -32018388 -20981806 3480453 17547229 13384740 8276325
11159 8276325 12517852 11511941 -7205943 -28599087 -30032783 -13479939 1602098 8890086
11151 8890086 17760368 28902520 29419452 16177069 5503515 10513517 21692413 20901640
11143 20901640 6550463 -6418232 -7642103 -1598564 3069957 4374637 2750509 -5967673
11135e967673j7482812j3268975J0907947L5478598L1720076M75295k4218218
11128A7644238j9575390l781515m076145j3133325n559409J3542107J3701992
11121a237447p462033j6493412o00170R251337o562117j8144146K935617K9073896
11113i238475J8619573j2509677j5081679J0995762J8317663l877843j0629745
11106c404421J7004616L2667278J483736l6149943k5822491J4035783K3154112
11099B2968670n132485j9667127K665914K4727882J3544569j1713103j7451690
11092I942630m767963M318525L532705o3947o603884j7161919j9323260j898472
11084c2025585K2440619K8908476J2657638o288147r428831J109918J0334677
$$ plain form
11135 -5967673 -23450485 -36719460 -25811513 9667085 41387161 41862456 17644238
11128 17644238 -1931152 -5712667 -9788812 -22922137 -28481546 -14939439 -1237447
11121 -1237447 -8699480 -25192892 -25793062 -16541725 -23103842 -41247988 -38312371 -9238475
11113 -9238475 9381098 -3128579 -18210258 -7214496 11103167 7225324 -3404421
11106 -3404421 13600195 46267473 47751209 11601266 -14221225 -185442 22968670
11099 22968670 17836185 -1830942 834972 25562854 39107423 27394320 9942630
11092 9942630 5174667 9493192 13025897 12961950 6358066 -10803853 -30127113 -32025585
11084 -32025585 -9584966 19323510 31981148 25693001 16264170 17374088 27708765
11077B7708765Q093349k333994q601766k924660O982802N754889q317449j8487398
11069G874538j2234484M67292J865936p433504j0143402K330940J9163428K6260023
11061B8150767K2051993J2897686J574689j2265322k4109108k4835062j0936000
11054g470357Q803275K0104004J6968177O445245j502949n629296j0732997j5733355
11046A1251747j2162600K641513J6967105J5624180j781196j8473961j8428574
11039d361786m586187M547192j800984j1259772l886710J7980677K8068978J0662513
11031C5363921j5739298k2137953p120880N946002M437128j346771j520615l63095
11023b481561q18465M292563J4939758J5608283j430359j8927529j7279572l775148
$$ plain form
11077 27708765 35802114 33468120 24866354 21941694 28924496 34679385 26361936 7874538
11069 7874538 -4359946 -3892654 -2026718 -9460222 -19603624 -17272684 1890744 28150767
11061 28150767 50202760 63100446 64675135 52409813 28300705 3465643 -7470357
11054 -7470357 1332918 21436922 38405099 44850344 43347395 37718099 26985102 11251747
11046 11251747 -910853 1730660 18697765 34321945 32540749 14066788 -4361786
11039 -4361786 -8947973 -4400781 -6201765 -17461537 -21348247 -3367570 24701408 35363921
11031 35363921 19624623 -2513330 -9634210 -3688208 748920 -597851 -2118466 -2481561
11023 -2481561 -3300026 992537 15932295 31540578 30110219 11182690 -6096882 -9872030
11015i872030j050852j2227606j6319573R21288K6494174L5409679J8422261r415531
11007C2361810k4284112j6176484K668128J2068878N199056p790761j4259185
11000a0212670r616760L630589J6335816J4537827m726568k0847378j1452799
10993b2351943J2431740J6214365q020776k7837318j8710616J991367P992330
10986c8290851M174103Q124236J4888242J0706544L663868P869938J1947065j847787
10978B1235358j9384908j3595428P050806J0158792m652539n775414J2278449
10971G315116J7468627k211208j5195212L20833K0322637J7275666K916057k02092
10963D8010424N61409j1746515k6508228k2743040o651118K70198k034135J746005
$$ plain form
11015 -9872030 -10922882 -23150488 -39470061 -38548773 -12054599 23355080 41777341 32361810
11007 32361810 8077698 -8098786 -5430658 6638220 11837276 4046515 -10212670
11000 -10212670 -19829430 -16198841 136975 14674802 9948234 -10899144 -22351943
10993 -22351943 -9920203 6294162 -1726614 -29563932 -48274548 -46283181 -38290851
10986 -38290851 -34116748 -25992512 -11104270 -397726 3266142 11136080 23083145 21235358
10978 21235358 1850450 -11744978 -4694172 5464620 812081 -4963333 7315116
10971 7315116 24783743 22572535 7377323 7698156 28020793 45296459 48212516 48010424
10963 48010424 48571833 36825318 10317090 -12425950 -19077068 -18806870 -20841005 -19095000
10955a9095000Q859720K134867j6424620k3379954p004703J7660689K8729575
10948h519426J8505249l421148j7082178q236997J2713424J8883671M053865o091294
10940A0805166M620494J2918242o169710l2101653k5736840P982088K4813919
10933b868294P434402j2845276q116787Q072574R441641m295166j4834479j1938741
10925b9950126J652617J7028907K1172278O686541j4057044j9779117q977241
10918b6223185K03945N95059L079041Q986998L701752j2028302j3776607P245905
10910b8215394K4337013J5781256m93053J657390J3054500P454351j3304120k4483022
10902d211079j8022507o225836N734932J9701145K2937338N14597l0791012l4297228
$$ plain form
10955 -19095000 -10235280 -8100413 -24525033 -47904987 -54909690 -37249001 -8519426
10948 -8519426 9985823 6564675 -10517503 -18754500 -6041076 12842595 16896460 10805166
10940 10805166 15425660 28343902 22174192 -9927461 -35664301 -27682213 -2868294
10933 -2868294 4566108 -8279168 -16395955 -8323381 1118260 -3176906 -18011385 -29950126
10925 -29950126 -28297509 -11268602 9903676 16590217 2533173 -17245944 -26223185
10918 -26223185 -26019240 -25424181 -22345140 -13358142 -9656390 -21684692 -35461299 -28215394
10910 -28215394 -3878381 11902875 11409822 13067212 26121712 33576063 20271943 -4211079
10902 -4211079 -22233586 -28459422 -22724490 -3023345 19913993 20428590 -10362422 -44659650
10894d4659650m878621K1398531J7982856N37329l315680P418570J4455829Q245815
10886A7184979n866055j6770228j3736042L503014J5863784L495140k2047250
10879a8372658k6309708l88572K4493935K3327008J0851443R899277J3475772
10872C6976497N200796n350350j93780J0655661M868070j1385247j3942329m548727
10864B2280591o352441j8045729j3027798J0616426K0030250R98051j6041855
10857D57495m168887J7791988J7211563l149446j6424037j4110781q355649l623980
10849a4371734N684405J4916253J1738184j669162r225221m609381J986598J801749
10841F251691j658987j829134J127254J932321l760303j4059493j9392418j2109547
$$ plain form
10894 -44659650 -49538271 -28139740 -10156884 -9619555 -12935235 -5516665 8939164 17184979
10886 17184979 11318924 -5451304 -19187346 -15684332 179452 3674592 -18372658
10879 -18372658 -44682366 -45070938 -20577003 2750005 13601448 23500725 36976497
10872 36976497 42177293 36826943 36633163 47288824 52156894 40771647 26829318 22280591
10864 22280591 15928150 -2117579 -15145377 -4528951 15501299 16499350 457495
10857 457495 -3711392 14080596 31292159 28142713 11718676 -2392105 -10747754 -14371734
10849 -14371734 -8687329 6228924 17967108 16297946 7072725 2463344 4449942 6251691
10841 6251691 4592704 2763570 3890824 5823145 2062842 -11996651 -31389069 -43498616
10833d3498616O64038M026516j862221m56910J3614547K3371145J6580476N526279
10825A7965254M597363O117215k360743j2748915j0322586M92808O437432Q436894
10817A8614722J1201119M542713j7245294l1121654j3380042J7610806K2678305
10810A2900675O43765j2005725L33321J3316249P434100n772356j1968089j3981866
10802i099926j2453958O13169J7447162J6273780q48009o101476N929716O696076
10794A8456534j2917769k0107352L232306K3468058R852605j1850549l581029
10787F552804J8776230J3631117j3974572k2513256n231618L209827r411624j4390077
10779b3351169L308496J7981528P649346j1605276j5600678o982120k50586M120301
$$ plain form
10833 -43498616 -42834578 -38808062 -40670283 -41127193 -27512646 -4141501 12438975 17965254
10825 17965254 22562617 28679832 26319089 13570174 3247588 3740396 10177828 18614722
10817 18614722 29815841 34358554 17113260 -14008394 -27388436 -9777630 12900675
10810 12900675 13544440 1538715 1872036 15188285 22622385 16850029 4881940 -9099926
10802 -9099926 -21553884 -20940715 -3493553 12780227 11932218 5830742 11760458 18456534
10794 18456534 5538765 -14568587 -11336281 12131777 21984382 10133833 6552804
10787 6552804 25329034 38960151 24985579 2472323 -2759295 450532 -8961092 -23351169
10779 -23351169 -20042673 -2061145 5588201 -6017075 -21617753 -28599873 -28850459 -24730158
10771b4730158J0399617J1344599J345001p629763j838983J1195740J2038508
10764A2124561k296865j2872502k850664K0435728L1333627J4367061j5539126
10757D4701820k8445792j6174518j358511l237545j0954842o172711L904830L87074
10749a7350195j0945558o764714J2798636K0743233N754497r829905n001006J0678620
10741H3608J6264677R118052J178827n44404K768954P353803O454403n408251
10733C7269669k0804879k3388187r868911M105301O179231K224196K084566M182379
10725A983365L304354J542558K049957K097731K04577J28828J428274k514687
10717A0224957j0830037j2294108l028562O410118Q765901R639916J0895718K482995
$$ plain form
10771 -24730158 -14330541 -2985942 -1640941 -9270704 -11109687 86053 12124561
10764 12124561 9827696 -3044806 -5895470 14540258 45873885 60240946 44701820
10757 44701820 16256028 81510 -1277001 -4514546 -15469388 -21642099 -17737269 -17350195
10749 -17350195 -28295753 -35060467 -22261831 -1518598 4235899 -5594006 -10595012 83608
10741 83608 16348285 25466337 26645164 26100760 28869714 36223517 42677920 37269669
10733 37269669 16464790 -6923397 -16792308 -12687007 -6507776 -4283580 -2199014 1983365
10725 1983365 5287719 6830277 8880234 10977965 11182542 11311370 12739644 10224957
10717 10224957 -605080 -12899188 -15927750 -9517632 -751731 8888185 19783903 22266898
10709B2266898j6179818k4533907q774085J3003947J4523796m14431n973984O081398
10701a86J8277881J6933810P093327l850680j6035403k5126993k0039197k037003
10693b4784444R906181M200480o026786l537190O420563O506349l144315n733292
10685a6192454K565904N133651n767955j2241982J396060J9848412J8023872J362480
10677A4127988k407135J0247269J1852263q634134k3897449j2258279N539709
10670e429768J020152j4175775r824378R860049J4513155J105498k952871R134457
10662C250519J1636811n661661j7437245o442362Q771991R258402N793933J0644789
10654A9815177J0162510o513979j8184751l134260K0573443J9705558l858893
$$ plain form
10709 22266898 6087080 -18446827 -27220912 -14216965 306831 -107600 -6081584 -186
10701 -186 18277695 35211505 42304832 38454152 22418749 -2708244 -22747441 -24784444
10693 -24784444 -14878263 -10677783 -16704569 -20241759 -13821196 -7314847 -10459162 -16192454
10685 -16192454 -13626550 -8492899 -14260854 -26502836 -25106776 -5258364 12765508 14127988
10677 14127988 11720853 21968122 33820385 25186251 1288802 -10969477 -5429768
10670 -5429768 -4409616 -18585391 -28409769 -18549720 -4036565 -2931067 -5883938 3250519
10662 3250519 14887330 9225669 -8211576 -14653938 -5881947 3376455 9170388 19815177
10654 19815177 29977687 23463708 5278957 2144697 22718140 42423698 38564805
10647C8564805j9652298j4504244j046064J0792035J9795122J7068529n129551
10640D5888334k9971025l0438828q024571Q661730M915858n006498n447994J778893
10632a7644101R173519J3121579R274595k784540j0769027m700159L451901k119606
10624b995839r794926K576860K3434657J7696066j4370262k8812587l124917K8038138
10616A2647190K4800729k865617j9811889j8384637j4213787r397719M961054
10609b2264676K0130095J6968609j121860j0208971j066139J0671184J0790775
10602B3899017K732965m842312r501306j0870403q389811n161999l888051o45069
10594a6666969P193721J1778012O150041j150636J569213P563239J012336j4962511
$$ plain form
10647 38564805 18912507 4408263 3362199 14154234 33949356 51017885 45888334
10640 45888334 15917309 -14521519 -22546090 -13884360 -8968502 -13975000 -19422994 -17644101
10632 -17644101 -8470582 4650997 13925592 11141052 372025 -4328134 -876233 -2995839
10624 -2995839 -12790765 -10213905 13220752 30916818 16546556 -12266031 -15390948 12647190
10616 12647190 37447919 34582302 14770413 -3614224 -17828011 -27225730 -22264676
10609 -22264676 -2134581 14834028 13712168 3503197 2437058 13108242 23899017
10602 23899017 26631982 21789670 12288364 1417961 -6971850 -12133849 -16021900 -16666969
10594 -16666969 -9473248 2304764 8454805 7304169 8873382 16436621 17448957 2486446
10586B486446k0401821r538285J093692J4274l658439J08741M910309J388796
10578b3596287n505485m640505M842169J4533825J7169327R871717m840393j6128292
10570h293924j2394695K776143J2223353Q029705J205771K345700O117942M486517
10562A6496512J935237M667007O198846j196077r846782p789862M09993J139267
10554A2014141m673669l627521O187430J1651546O823106J521147K938862L830296
10546C6665338l466232j2914178j3388480m069229N935960Q811513M131368k982742
10538A8723318p142687q041542r675196j2135671r483947j311846J369001p773267
10530c5471837j5818823o810701J2665437K1362198J3864815M258869O72078k410894
$$ plain form
10586 2486446 -17915375 -27453660 -26359968 -26345694 -30004133 -29895392 -24985083 -23596287
10578 -23596287 -29101772 -33742277 -28900108 -14366283 2803044 12674761 7834368 -8293924
10570 -8293924 -20688619 -17912476 -5689123 2340582 3546353 5892053 12009995 16496512
10562 16496512 18431749 23098756 29297602 28101525 18254743 10464881 10874874 12014141
10554 12014141 7340472 3712951 9900381 21551927 28375033 29896180 32835042 36665338
10546 36665338 33199106 20284928 6896448 2827219 8763179 17574692 21706060 18723318
10538 18723318 11580631 3539089 -6136107 -18271778 -27755725 -29067571 -27698570 -35471837
10530 -35471837 -51290660 -58101361 -45435924 -24073726 -10208911 -5950042 -5277964 -7688858
10522g688858m973514J816840J4145375J4444170O35479o616713K751812J0632745
10514B5147336R89171j4178919j6160835p132927J059497O537076Q135885k718391
10506A677893k0796643j9576195J0887132L9224668L2846495L740570j4038427
10499C3965493j3393067r933282p930568l846139m862730j0107252K451782L1948651
10491A8292888L1531032j5138763l1856999N1629038J60586570J42248642j6675155
10484C40617253j50392827j33689801l7143815L917119j9137550k3981156M870125
10477a4940652J0247679j6571181k1327957Q647826K2689124K087996p787740
10470a6954905J7458008L8351382K2759533l238470q216201n113323j3961609
$$ plain form
10522 -7688858 -12662372 -10845532 3299843 17744013 18379492 11762779 14514591 25147336
10514 25147336 26136507 11957588 -4203247 -11336174 -10276677 -3739601 4396284 1677893
10506 1677893 -19118750 -38694945 -27807813 11416855 44263350 48003920 33965493
10499 33965493 20572426 10639144 2708576 -1137563 -6000293 -16107545 -13655763 18292888
10491 18292888 49823920 34685157 2828158 54457196 215043766 357292408 340617253
10484 340617253 190224426 56534625 19390810 23307929 4170379 -19810777 -14940652
10477 -14940652 -4692973 -21264154 -42592111 -33944285 -11255161 -9167165 -16954905
10470 -16954905 503103 38854485 61614018 58375548 50159347 45046024 31084415
10463C1084415k1383397j2376795l159843q273625r739177P759805K3139772J4636972
10455B1688127J46930N557118J7500619O393647k1165604l1515240j5291125M626226
10447a2059302J0785404O875258p65719j0610967j5851433r356444J257518J795032
10439b7930653o493036r336871j845383P017313J0748122J1764252J1984174R034767
10431D942685K653633l027426l550234K652152J1144637J1271071j641672j3851741
10423A0593105p678122R878257J2732353m502472j5911025m870159R672664N457309
10415A5371910p895994r364963k350339k872820p490861k350180O592900K341050
10407h019297j0609002j1545013J631206J0236198O797205L297135O015255O353439
$$ plain form
10463 31084415 9701018 -2675777 -5835620 -14109245 -23848422 -16088617 7051155 21688127
10455 21688127 21835057 27392175 44892794 51286441 30120837 -1394403 -16685528 -12059302
10447 -12059302 -1273898 5601360 4835641 -5775326 -21626759 -30983203 -29725685 -27930653
10439 -27930653 -34423689 -43760560 -45605943 -38588630 -27840508 -16076256 -4092082 4942685
10431 4942685 7596318 4568892 1018658 3670810 14815447 26086518 24444846 10593105
10423 10593105 2914983 12793240 25525593 21023121 5112096 241937 9914601 15371910
10415 15371910 7475916 -1889047 -4239386 -7112206 -14603067 -16953247 -10360347 -8019297
10407 -8019297 -18628299 -30173312 -28542106 -18305908 -11508703 -8211568 -2196313 4157126
10399D157126L09612m276992m076561n259764q713017p064291P27964O431163
10391a7764760N140502j668466j2247620k0230195j2001205J3668714L2551297
10384a2551733K4022368M326167L969071J9774322K1844575M252966q221668o145592
10376E1270476r161443k4397918k9395636j2493082M449800L439195j022794O910739
10368a0400663J3718742K927231j2443331j1562831r3046M007686J664822L455208
10360h726182N007888j804141o749821L445327J9375883K3200090J6640861J0670690
10352F1060595J378103j6578923k6621600j2403664P423127J610103k2676891
10345f809150k7726664l106652K0757414K0770052Q230513j63472n696100j0368971
$$ plain form
10399 4157126 4466738 189746 -3886815 -9146579 -17859596 -24923887 -24195923 -17764760
10391 -17764760 -12624258 -14292724 -26540344 -46770539 -58771744 -45103030 -12551733
10384 -12551733 11470635 15796802 19765873 39540195 61384770 65637736 57416068 51270476
10376 51270476 42109033 17711115 -11684521 -24177603 -19727803 -16288608 -17311402 -10400663
10368 -10400663 3318079 6245310 -6198021 -17760852 -17853898 -13846212 -12181390 -8726182
10360 -8726182 -3718294 -5522435 -12272256 -8826929 10548954 33749044 50389905 61060595
10352 61060595 62438698 45859775 19238175 6834511 14257638 15867741 -6809150
10345 -6809150 -34535814 -37642466 -16885052 3885000 12115513 11952041 6255941 -4113030
10337d113030n621958P470522J1631398O56200r318332p771812n286844q139226
10329b0493082k980960J5557914K6126431J1677696j0514142j3947566k315760
10322C110531J351644o777169j0014038k360683L799685O23091m911577n323312
10314b0501828j579135L528908Q199868P700103r91811j1090779j2701317o260461
10306c3696452J75798M586090J1503036K0228979K2487154J2696912n210667k0335871
10298A2434979k1748867q704370L446189k116340j8321156j8055764O951544K8060107
10290a8053678J7445974j0969961k1009713m532611J3479358J5185507Q184073
10283b71051K767077l099277r906087r610286q21471O097024N458714K369277
$$ plain form
10337 -4113030 -9734988 -2264466 9366932 10023132 704800 -7067012 -12353856 -20493082
10329 -20493082 -23474042 -7916128 18210303 29887999 19373857 5426291 3110531
10322 3110531 4462175 -2314994 -12329032 -14689715 -10890030 -10266939 -15178516 -20501828
10314 -20501828 -22080963 -18552055 -10352187 -2652084 -3643895 -14734674 -27435991 -33696452
10306 -33696452 -33520654 -28934564 -17431528 2797451 25284605 37981517 32770850 12434979
10298 12434979 -9313888 -18018258 -14572069 -16688409 -35009565 -53065329 -46113785 -18053678
10290 -18053678 -607704 -11577665 -32587378 -37119989 -23640631 -8455124 -271051
10283 -271051 2496026 -603251 -10509338 -20119624 -20941095 -14844071 -9385357 -7016080
10275g016080q68047o715590p975838P147510K9651300L2469664Q677691j5338846
10267D0031764j7565840q907946p922772r235142N50614J3036308J0189351m290288
10259A5886049j0698190m197737K680600M015038N294162O744246K559747l778257
10251A8505658k418563M458405M846289k448864o950559o363755q751131j3526317
10243a2648837r733261K757296R301306M008756l94093N793737J3790330J1835255
10235B4710489K081256p689338j6354498k3079083k0293918m825851J2311934
10228c3139009J7823573J1700775L286085j172132l38968M761077Q307827L040313
10220A4269541p607276j0327012j516278N516100J573100l023902L617920J3386264
$$ plain form
10275 -7016080 -7884127 -14599717 -22575555 -15428045 14223255 46692919 55370610 40031764
10267 40031764 22465924 13557978 5635206 -3599936 -3049322 9986986 20176337 15886049
10259 15886049 5187859 990122 3670722 7685760 12979922 19724168 22283915 18505658
10251 18505658 16087095 20545500 25391789 22942925 15992366 9628611 877480 -12648837
10243 -12648837 -22382098 -19624802 -10323496 -6314740 -6708833 -915096 12875234 24710489
10235 24710489 26791745 19102407 2747909 -20331174 -40625092 -45450943 -33139009
10228 -33139009 -15315436 -3614661 -328576 -1500708 -1839676 2921401 11229228 14269541
10220 14269541 6662265 -3664747 -5181025 335075 1908175 -1115727 2502193 15888457
10212A5888457J0438750l084559j0503176n309987L155897O289021M466230K69611
10204B1610244m184929m737170o17720R87382l953872o985341j457348K393294
10196C054540o170775j5194802n803522J3855277J7194982J672640o618995L467092
10188E456437J0690389K48542r897998j678670J0135384L489430j2764179j5042086
10180i362751m326025R09688j08548N696351J3497284O821385p028810l971739
10172B126835J1704918P784556j9879108l1564174m835873K5103670J7611179
10165H052003j0115903j1737479J4819527K7468199Q193381j3120011j0267538
10158A3292179K930979M254083p36074K995480Q352879j028621j9308162k4532974
$$ plain form
10212 15888457 26327207 23242648 12739472 7429485 10585382 16874403 21340633 21610244
10204 21610244 17425315 12688145 12070425 13057807 9103935 2118594 661246 3054540
10196 3054540 -3116235 -18311037 -24114559 -10259282 6935700 8608340 1989345 5456437
10188 5456437 16146826 16395368 6497370 4818700 14954084 18443514 5679335 -9362751
10180 -9362751 -13688776 -12779088 -12887636 -7191285 6305999 13127384 6098574 2126835
10172 2126835 13831753 21616309 1737201 -29826973 -34662846 -9559176 8052003
10165 8052003 -2063900 -13801379 1018148 28486347 36679728 23559717 13292179
10158 13292179 16223158 20477241 19741167 22736647 31089526 30060905 10752743 -13780231
10150a3780231j0859119N593242J1248987Q718982N799225M672534M008566K176330
10142A7578516k530844q219650q289028p82208N976594N409576L635572P310693
10134B0089221Q525612k256579j4773063j1148636L259525N208828q284674j3773894
10126a3153660j272500P975572q00821q267904M614466J8944775P540854j5531620
10118D9162j5043246M793340N453394j7563848k0539731J6108585M6841439K5927748
10110D6026843k1169062l4198314m664757K0655527J4078237k269997l975121
10103A4483356Q55817j341174l585028R22143R28768q658281r898935P117393
10095H24059J9120363L836781j9173955j4927220J1377378K1264631K346209j5730139
$$ plain form
10150 -13780231 -24639350 -19046108 -7797121 921861 6721086 11393620 15402186 17578516
10142 17578516 15047672 6828022 -1461006 -2243214 3733380 9142956 12778528 20089221
10134 20089221 28614833 26358254 11585191 436555 3696080 8904908 620234 -13153660
10126 -13153660 -14426160 -6450588 -7251409 -15519313 -10904847 8039928 15580782 49162
10118 49162 -14994084 -10200744 -4747350 -22311198 -42850929 -26742344 20099095 46026843
10110 46026843 24857781 -9340533 -14005290 6650237 20728474 18458477 14483356
10103 14483356 15339173 13997999 10412971 11335114 12263882 3605601 -6293334 824059
10095 824059 19944422 23781203 4607248 -10319972 1057406 22322037 24668246 8938107
10087H938107j0505548J984187q14677j2757371j5398297q896625m614445p54536
10079d2819205J2068461K7891691K8587095R201510j4611044k4846893j6868477
10072b1396862R51739J3751614R632078p250008j6461085m919335J3307000J4289462
10064A904603j200047p278959R946772L1435391L0175725M946517k1774817l1199172
10056A6956013k1886046k145486J7285646K4195164J2538940o683968j3201658
10049B7058605k580682O055835l274916j8013174j3771502P562109J6980768Q41275
10041B0858318j6745492r002838J2863389J7054033m05657j2731946p269077l140081
10033A480649j4339622k3170530r828134J2535351J6695826K151957q046943l585270
$$ plain form
10087 8938107 -1567441 416746 -397931 -13155302 -28553599 -37450224 -42064669 -42819205
10079 -42819205 -30750744 -2859053 25728042 34929552 20318508 -4528385 -21396862
10072 -21396862 -20445123 -6693509 2938569 -4311439 -20772524 -25691859 -12384859 1904603
10064 1904603 704556 -6574403 3372369 34807760 64983485 69930002 48155185 16956013
10056 16956013 -4930033 -7075519 10210127 34405291 46944231 40260263 27058605
10049 27058605 24477923 30533758 27258842 9245668 -4525834 3036275 20017043 20858318
10041 20858318 4112826 -4890012 7973377 25027410 24621753 11889807 4620730 1480649
10033 1480649 -12858973 -36029503 -45857637 -33322286 -16626460 -14474503 -22521446 -26106716
10025b6106716M986690J0754103J7610516K1914219J2105665p270326j4397837
10018A9596314l185181L834847r758870k5078074j4106478J6071273K9044499
10011A6418330Q373811j9727239k0919318L748460K1724583J1837847j0575729
10004A0880745j7012931m416031L758488n758751j6294638q638306P160392P219438
9996b3101594o864551q830503J0769105K8400368K2147530J715776j0084003q979708
9988E172420n192768p09174Q881447J6399678P981331j3260685k5427031j4551142
9980b0705924Q134641K0561030J3831099k191178j1934211r017571m35126K347901
9972E90661l396509q957923n315393O469844J7455179J9374383R765477o065216
$$ plain form
10025 -26106716 -21120026 -10365923 7244593 29158812 41264477 33994151 19596314
10018 19596314 16411133 20245980 10487110 -14590964 -28697442 -12626169 16418330
10011 16418330 24792141 5064902 -15854416 -12105956 9618627 21456474 10880745
10004 10880745 -6132186 -10548217 -6789729 -12548480 -28843118 -37481424 -30321032 -23101594
9996 -23101594 -29966145 -38796648 -28027543 372825 22520355 24236131 14152128 5172420
9988 5172420 -20348 -729522 8151925 24551603 32532934 19272249 -6154782 -20705924
9980 -20705924 -12571283 7989747 21820846 19629668 7695457 -1322114 -1757240 590661
9972 590661 -2805848 -11763771 -17079164 -10609320 6845859 26220242 35985719 29920503
9964B9920503j6763989j5244492q767820j0360227j8675914j8220385l776952
9957f1889276R634201R638843M942106Q254939J3833261Q658278l493661p503004
9949a7924313p12494O281595Q573983R598985Q323277J540054l477079K737705
9941A4941713J1922273O205732j2620275k2385995j3364988j790271l144119j0463325
9933c0699255r827675k111298L094621M173015O102072R376801R845574N702170
9925d343975n30272l802159j71593O116018L263981j0754364j8100240m113697
9917c2436301J5571941J3084779q747346j7993395j523919J6711540J4376467
9910i56234R09356m076545J185599P717300R294835j206151k3858770l2905493
$$ plain form
9964 29920503 13156514 -2087978 -10855798 -21216025 -39891939 -58112324 -61889276
9957 -61889276 -52255075 -42616232 -37674126 -29419187 -15585926 -6927648 -10421309 -17924313
9949 -17924313 -18636807 -12355212 -3781229 5817756 14141033 15681087 12204008 14941713
9941 14941713 26863986 33069718 20449443 -1936552 -15301540 -17091811 -20235930 -30699255
9933 -30699255 -40526930 -42638228 -39543607 -35370592 -29268520 -19891719 -10046145 -4343975
9925 -4343975 -4874247 -8676406 -8847999 -2731981 532000 -10222364 -28322604 -32436301
9917 -32436301 -16864360 -3779581 -12526927 -30520322 -32044241 -15332701 -956234
9910 -956234 -46878 -4123423 -2937824 4779476 14074311 12868160 -10990610 -43896103
9902d3896103j638709M1537976K9220686m4635351r1050191m0592190N1462833
9895i9591049P7905872K7369491j5091500j841060K3709577J5894625o560361
9888B1795595r758887L88870N711181J0446046J6811615P767249j6403537k4350939
9880A2407193m972798Q721273l029284j0069217J0481225K6053391M353862k4032676
9872A9912969j4480726J3581806R471264k1610652l0096096p553177O078599k096739
9864b6792752q26247J9446624K4953612j59261k3781784j8422592L55461Q979658
9856a6247281R923300J0546344M295229p196839o930973M646816L325244j5481659
9848a3119819k2854566m837974J2279775P463674j548680L516391O532332p965827
$$ plain form
9902 -43896103 -45534812 -3996836 25223850 -19411501 -110461692 -151053882 -99591049
9895 -99591049 -21685177 5684314 -9407186 -11248246 12461331 28355956 21795595
9888 21795595 12036708 12425578 18136759 28582805 45394420 53161669 36758132 12407193
9880 12407193 7434395 16155668 13126384 3057167 13538392 39591783 43945645 19912969
9872 19912969 5432243 19014049 28485313 6874661 -23221435 -30774612 -24696013 -26792752
9864 -26792752 -27618999 -8172375 16781237 16621976 -7159808 -25582400 -25226939 -16247281
9856 -16247281 -6323981 4222363 8517592 1320753 -5610220 -963404 2361840 -13119819
9848 -13119819 -35974385 -40812359 -28532584 -21068910 -22617590 -19101199 -12568867 -20534694
9840b0534694j8278979o29322K6292573K8834500Q655226q804852j5199074j5145183
9832a4809805l040853K0084007K7286748J889903k5577667j7365268J1082926
9825d50009J4803986r288332k2225508q308102P269128P449251N143481R416283
9817C810178R665319K445759o06883P50269o431604j7846377j3227767N492563
9809a5948543J1702590j777269j0271359M88302J2945090J1079096L540028J0910
9801A1768845n040729j1052320m075150J3981483J8440513O75156j4993662j0543566
9793h39430j424251n048168j0652182l397238P073105O527758K317952N502538
9785F0084O851918n206350j9938343k0123956p468152O458863J7969447K3315956
$$ plain form
9840 -20534694 -38813673 -39442995 -13150422 15684078 24339304 15534452 335378 -14809805
9832 -14809805 -17850658 2233349 29520097 31410000 5832333 -11532935 -450009
9825 -450009 14353977 5065645 -17159863 -25467965 -18198837 -10749586 -5606105 3810178
9817 3810178 13475497 15921256 15314373 16064642 9633038 -8213339 -21441106 -15948543
9809 -15948543 -4245953 -6023222 -16294581 -15806279 -2861189 8217907 11757935 11768845
9801 11768845 6728116 -4324204 -8399354 5582129 24022642 24697798 9704136 -839430
9793 -839430 -2263681 -7311849 -17964031 -21361269 -14288164 -7760406 -5442454 60084
9785 60084 6912002 1705652 -18232691 -38356647 -45824799 -39365936 -21396489 1919467
9777A919467J3212533o925976j3492665m02677O597783p174690j6543339J352879
9769b1456685K4184663J8882634m858772j4717084r745758j1598980j6722013
9762c6031995l778986J8373461J7247719p581127j9055804Q4559K3598871K5678162
9754A8534860J3852706N121246k96398o251531o780409m06452R51553r231057
9746A5494518j9333785j5910723j048720J2829107J5769774O493555m823128l694600
9738E775998Q421087J1060141l484857j1346297O318170K5167120J0539799k3871773
9730B8579388l2527750q946107O577019m818370j2845291N488848K6368764K1255343
9722B9131844J960457n393695k685098o227180j3262699j1207321m098514l823192
$$ plain form
9777 1919467 15132000 8206024 -5286641 -5689318 908465 -6266225 -22809564 -21456685
9769 -21456685 2727978 21610612 16751840 2034756 -7711002 -19309982 -36031995
9762 -36031995 -39810981 -21437520 -4189801 -11770928 -30826732 -30742173 -7143302 18534860
9754 18534860 32387566 37508812 37212414 30960883 24180474 23774022 24725575 15494518
9746 15494518 -3839267 -19749990 -20798710 -7969603 7800171 14293726 9470598 5775998
9738 5775998 14197085 25257226 21772369 10426072 16744242 41911362 52451161 28579388
9730 28579388 -3948362 -12894469 -6317450 -11135820 -23981111 -18492263 7876501 29131844
9722 29131844 31092301 25698606 23013508 16786328 3523629 -7683692 -11782206 -15605398
9714a5605398p545825n796184j276691n43155P92322O846020Q417202j237369
9706a5949078j0363172o083897M217958O150363J475782R92034M746321N829453
9698h984236M845948N966584P107121O116469P076579J0297669P705443k742534
9690C7389043j1686155j4879241j7785413j7041214r07382K1747689K1612086
9683A8449413n407241k3000051p617732J3970870R753693m932386J968539K0733184
9675B3918289J7065680p629547j9665855r481326j24659j729669m49996N388358
9667G291275l44267j4881159j2877345J1108146L0803563K8437352J4918863J950327
9659F6406755j2792675k3556543j4325028Q729046J6109081J90116j2060932o475549
$$ plain form
9714 -15605398 -23151223 -28947407 -30224098 -30767253 -29974931 -23128911 -14711709 -15949078
9706 -15949078 -26312250 -32396147 -28178189 -22027826 -20552044 -19560010 -14813689 -8984236
9698 -8984236 -4138288 1828296 8935417 15051886 22128465 32426134 40131577 37389043
9690 37389043 25702888 10823647 -6961766 -24002980 -24910362 -3162673 18449413
9683 18449413 13042172 -9957879 -17575611 -3604741 6148952 1216566 3185105 23918289
9675 23918289 40983969 33354422 13688567 4207241 4082582 2352913 1902917 7291275
9667 7291275 6947008 -7934151 -20811496 -9703350 21100213 49537565 64456428 66406755
9659 66406755 53614080 30057537 15732509 24461555 40570636 40760752 28699820 22224271
9651B2224271n009006k1112476k9589568j0183848J2369602P465260r488068l902420
9643c7226253J9599926K7585363J3815412K762404L087597j284509j3186512j4403800
9635G49628k161162K218985q427283j2879564L20490J0954974K388678q332086
9627a5167340j72123J3780465P629695j1594668j2633521Q984989K1571766O316144
9619A8715407j3229460p915990J2043921J3694476p193175j9234015k918317J9885702
9611A3848549J7872909m996797j6939209l733181J4692933J5322119P24338j2446774
9603B4344887j8647530k2308885k0272506l971378K0463934L1183699J7454203
9596B8246424m026219j0369001k432461J53298r044524j3152296N30044J7982645
$$ plain form
9651 22224271 17215265 -3897211 -33486779 -43670627 -31301025 -23835765 -33323833 -37226253
9643 -37226253 -17626327 9959036 23774448 26536852 29624449 28339940 15153428 749628
9635 749628 -1411534 807451 -7619832 -20499396 -20178906 -9223932 -6835254 -15167340
9627 -15167340 -15339463 -1558998 6070697 -5523971 -18157492 -9172503 12399263 18715407
9619 18715407 5485947 -2430043 9613878 23308354 16115179 -3118836 -6037153 13848549
9611 13848549 31721458 26724661 9785452 6052271 20745204 36067323 36791661 24344887
9603 24344887 5697357 -16611528 -36884034 -40855412 -20391478 10792221 28246424
9596 28246424 24220205 13851204 11418743 11572041 2527517 -10624779 -10094735 7887910
9588G887910J6898274r47296j2749275q185666j897543p486312j5369888q429791
9580c0279587J0494115K1053182J1927580o989618j8805590j6704357n360765
9573c4665040P225811J5394207J6383628R153084m732431j7990870j9590293o367535
9565c5189439Q997064J0062445l279188j5625353j6215325o837771Q821908K6611185
9557b2654474L1518391Q978231k4910639k9697945N878513L9794020K9740368
9550C8646465r191993k8437989j2780352R413039J4313803O849963j570028p777103
9542I465805p046460L551271J0596132J51028j3071166l550412J8840191J7878640
9534C6815029r532961k4843149j0626328K202380q931395j7803275K522626K8779968
$$ plain form
9588 7887910 24786184 23838888 11089613 2903947 1006404 -6479908 -21849796 -30279587
9580 -30279587 -19785472 1267710 13195290 6205672 -12599918 -29304275 -34665040
9573 -34665040 -27439229 -12045022 4338606 13491690 8759259 -9231611 -28821904 -35189439
9565 -35189439 -26192375 -16129930 -19409118 -35034471 -51249796 -58087567 -49265659 -22654474
9557 -22654474 8863917 17842148 -7068491 -36766436 -30887923 8906097 38646465
9550 38646465 29454472 1016483 -11763869 -2350830 11962973 18812936 17242908 9465805
9542 9465805 2419345 5970616 16566748 16717776 3646610 96198 18936389 36815029
9534 36815029 27282068 2438919 -8187409 -5985029 -14916424 -32719699 -30197073 -1417105
9526a417105K4794376J192998n806631N046194O026461n870786p563197K420309
9518A8822619K98977j5362632j5140654J0343834K8153610J0635851k2736374
9511A5015231l3080681j3389941Q948728J1278757k94709m458628P711038K1832374
9503A3562169J7726286l127395j7045282j0546237M31690l152928j2494301p296277
9495b1942275Q489927J4011220P979049P934326J4823376J0442956n811916j0572894
9487B5353769L073783J0441321l898361j9108807j2169018O228877J3182058R365523
9479C2469145P401315K843761j3587355k7663659j7449788Q417380J9285082Q561663
9471B0277544P36130P780106R221251j0557037l0863381k2561912P674395K4875120
$$ plain form
9526 -1417105 23377271 24570269 18763638 23809832 29836293 23965507 16402310 18822619
9518 18822619 19121596 3758964 -11381690 -1037856 27115754 37751605 15015231
9511 15015231 -18065450 -31455391 -22506663 -11227906 -11522615 -15981243 -8270205 13562169
9503 13562169 31288455 28161060 11115778 569541 1001231 -2151697 -14645998 -21942275
9495 -21942275 -13452348 558872 8537921 16472247 31295623 41738579 35926663 25353769
9487 25353769 28427552 38868873 34970512 15861705 3692687 9921564 23103622 32469145
9479 32469145 39870460 42714221 29126866 1463207 -15986581 -7569201 11715881 20277544
9471 20277544 21013674 28793780 38015031 27457994 -3405387 -25967299 -18292904 6582216
9463F582216J2764666p922521j0695059M132085J6383443J4264362L981278m388341
9455C5102129q678261j0607405r306088m244484P77737K098390J135872J97762
9447F475652k478762p671280r504359k704444P581050J2087845J1167403J1819917
9439B6773022J2333457K898718j5806659k7626929k1370384o392444N40341l055210
9431c1706088n576247P61525J0381982J2453087M076942n643039n218110M337009
9423a6132939Q325166k122912j4445603r916238Q166611J7118524P683732l112284
9415d435943P01716J0493675R328229j625224q775823q981437r617135j0932767
9407b3844709n813779L525352M761114n208185j3105333p375014N703115J1085062
$$ plain form
9463 6582216 19346882 11424361 729302 4861387 21244830 35509192 39490470 35102129
9455 35102129 26423868 15816463 6510375 2265891 3043628 5142018 6277890 6475652
9447 6475652 3996890 -3674390 -13178749 -15883193 -8302143 3785702 14953105 26773022
9439 26773022 39106479 42005197 26198538 -1428391 -22798775 -29191219 -28650878 -31706088
9431 -31706088 -37282335 -36520810 -26138828 -13685741 -9608799 -15251838 -20469948 -16132939
9423 -16132939 -7807773 -9930685 -24376288 -34292526 -26125915 -9007391 -1323659 -4435943
9415 -4435943 -3734227 6759448 16087677 14462453 5686630 -3294807 -12911942 -23844709
9407 -23844709 -29658488 -26133136 -21372022 -26580207 -39685540 -47060554 -41357439 -30272377
9399c0272377M958118j685628J141329R101809J0398765L799231J534464R823323
9391H799034J5569562M320959j4429682j7387886k479939O717777k684897j3283015
9383a4858087o073747J0624895J7698401J4215165J0076779L637026j0469088
9376B4851344k1543778j5424802J38180P277264Q699410J8786624K8436791J2455621
9368F3676654k4107610m1773543k1855185M993425M676355j2274115j3523486
9361d0187505L642424J2945866K378069j0255407n634049J2172872K2635160J0572606
9353H270036j8601035l9366696k7815568R703718L8172040L3258251Q793219o408197
9345F005768o524395o232871j0507554r362063L19282Q841392J0731942J0006924
$$ plain form
9399 -30272377 -25314259 -26999887 -25858558 -16756749 -6357984 -2558753 -1024289 8799034
9391 8799034 24368596 28689555 14259873 -3128013 -5607952 1109825 -1575072 -14858087
9383 -14858087 -20931834 -10306939 7391462 21606627 31683406 35320432 24851344
9376 24851344 3307566 -12117236 -11979056 -4701792 3997618 22784242 51221033 63676654
9368 63676654 39569044 -2204499 -24059684 -19066259 -14389904 -26664019 -40187505
9361 -40187505 -36545081 -23599215 -21221146 -31476553 -37110602 -24937730 -2302570 8270036
9353 8270036 -10330999 -49697695 -77513263 -67809545 -29637505 3620746 12413965 6005768
9345 6005768 -518627 -6751498 -17259052 -26621115 -26301833 -17460441 -6728499 3278425
9337C278425P342124p33039q460770m939213N288401M615078r134973j5893895
9329a8637862m028366J0650000R469575j209810k478439Q269819J7209475J4795942
9321C4040334J934773j6804776l0954532k3437388Q479074L6231898K6621882
9314C6111265j2599005l5844879j6337221J9977655L0317507Q897581j3706791
9307A6816112j5792265p131891n618798j1009601j1628572n183953J98555J511261
9299c7839152N027213J3283768J8054831J2508856L637927L177737Q769848N710450
9291C2331478r996090k2196250j6342577j033007M773028k39506o97592Q227369
9283e173147J3226081O798154L1693J383092J34377j2990301k2820489q940095
$$ plain form
9337 3278425 10620549 9887510 1426740 -3512473 1775928 6391006 -2743967 -18637862
9329 -18637862 -22666228 -12016228 -2546653 -3756463 -6234902 2034917 19244392 34040334
9321 34040334 35975107 19170331 -11784201 -35221589 -26742515 9489383 36111265
9314 36111265 23512260 -12332619 -28669840 -8692185 21625322 30522903 16816112
9307 16816112 1023847 -6108044 -11726842 -22736443 -34365015 -39548968 -39350413 -37839152
9299 -37839152 -32811939 -19528171 -1473340 11035516 14673443 17851180 26621028 32331478
9291 32331478 22335388 139138 -16203439 -17236446 -12463418 -12702924 -13400516 -5173147
9283 -5173147 8052934 14851088 14882781 16265873 16400250 3409949 -19410540 -28350635
9275b8350635J9452806L1154855J4859952p872908j4610122p272229L86771K277603
9267A0026093j261274q437319j1306340q80536J5234316J6609429L52584j0944833
9259I392120l911456L449804p545198k2947464j8049019K321794J3168358Q951360
9251a5169701M953455N633033J594770n209266l767198o5623q855102j9575393
9243d0461025p119048J9148196J8895041j3508969l0335622j676777L5128727
9236a9929477L1272867k138568j9617632j2270558o802051j0028754l725755J0454159
9228c2785769Q556264r221398j2528779Q595320K4807655J3175777j0385787k0288606
9220c0075323j5084714n501671O534766J8749666J9017300L441755j1790500j1932096
$$ plain form
9275 -28350635 -8897829 22257026 37116978 29244070 14633948 7361719 7748490 10026093
9267 10026093 8764819 327500 -10978840 -11859376 3374940 19984369 20336953 9392120
9259 9392120 5480664 8930468 1385270 -21562194 -39611213 -37289419 -24121061 -15169701
9251 -15169701 -10216246 -4583213 -2988443 -8197709 -11964907 -12030530 -20885632 -40461025
9243 -40461025 -47580073 -28431877 -9536836 -23045805 -53381427 -55058204 -19929477
9236 -19929477 11343390 9204822 -10412810 -22683368 -29485419 -39514173 -43239928 -32785769
9228 -32785769 -24229505 -33450903 -45979682 -37384362 -12576707 599070 -9786717 -30075323
9220 -30075323 -45160037 -50661708 -44126942 -25377276 -6359976 -2918221 -14708721 -26640817
9212b6640817k848871L635772P930358J3536720J5076125Q473823m47733p740330
9204A0975047j6226954k0152661n684123K0870898K8454360L246728k5739288
9197d255993k4833419r78862J4915940J2933878N771161m53942p632814p416958
9189a1951009Q757309K6530924K3168177J882711j4057845j7107882j8085948
9182h63563j7357597m581626J2648816J2377977m377382j0985818K079462J2671067
9174A611336O537341N74494R497166J7554412O013105j3717279j9151304j1766817
9166b847546q059698q724746k224039R362915J2749547P507267N255240O589139
9158A9608079K45155j3461645j8542544p855235N111230O612605J556346K616247
$$ plain form
9212 -26640817 -29489688 -25853916 -17923558 -4386838 10689287 19163110 18715377 10975047
9204 10975047 -5251907 -25404568 -31088691 -10217793 18236567 21483295 -4255993
9197 -4255993 -29089412 -30068274 -15152334 -2218456 3552705 3098763 -4534051 -11951009
9189 -11951009 -3193700 23337224 46505401 48388112 34330267 17222385 -863563
9182 -863563 -18221160 -22802786 -10153970 2224007 -2153375 -13139193 -11059731 1611336
9174 1611336 8148677 8723171 18220337 35774749 41787854 28070575 8919271 -2847546
9166 -2847546 -10907244 -19631990 -21856029 -12493114 256433 7763700 13018940 19608079
9158 19608079 19853234 6391589 -12150955 -20006190 -14894960 -8282355 -6726009 -4109762
9150d109762R761184J1462419K519782q709748j1498941n103776K421481M124182
9142H66821l60565o840586r434561k826616J1155180J8619512N720820j9136081
9134b236076k7137631m236658K5805426K9199991N506405j5437954j5202988l767744
9126g507229M096257N926780J888286q352132j3079202K780665K7650288K8037731
9118D1441444l013178k8262759j6339806J4348670K5360455J0745144p668048
9111C6611922j9364543k7308830k3648103J041496K8463332K6973009k198649
9104B0569634k3052269j4276001O428521J4158574P476259k075911q494450q166471
9096g432114K915660J7724332J9812936N848444q005276r916015p188096r224947
$$ plain form
9150 -4109762 5651422 17113841 19633623 10923875 -575066 -5678842 -3257361 866821
9142 866821 506256 -6334330 -15768891 -18595507 -7440327 11179185 16900005 -2236076
9134 -2236076 -29373707 -33610365 -7804939 21395052 26901457 11463503 -3739485 -7507229
9126 -7507229 -3410972 2515808 4404094 -3948038 -17027240 -14246575 13403713 41441444
9118 41441444 38428266 10165507 -6174299 8174371 33534826 44279970 36611922
9111 36611922 17247379 -10061451 -33709554 -32668058 -4204726 22768283 20569634
9104 20569634 -2482635 -16758636 -10330115 3828459 11304718 9228807 734357 -7432114
9096 -7432114 -4516454 13207878 33020814 38869258 30863982 20947967 13759871 4534924
9088D534924j1547241o763422K014139P983270R152858L874373q334773j6470491
9080a5556363o031408J5579058K1519147L689818j2789577p420206N586793M643225
9072I220487l407833j382619K124219j1692898k9814487j8622717K1208469M6871082
9064A4503703L1546994o7303j1241800k536638J265771n347242o423522K353896
9056B4053859O443005j42280m102079K661930P210757l146302j7822333j7122308
9048a965751j318882J1236765J1587949Q298657P156022J102792j2191235j8951790
9040D954527q523111P354433R888463Q35410j920599O468431J0596697l25513
9032B9328738j5345691j6952300l928987R132809J0938863N568897M745578J0188027
$$ plain form
9088 4534924 -7012317 -13775739 -11761600 -3778330 5374528 9248901 914128 -15556363
9080 -15556363 -21587771 -6008713 15510434 19200252 6410675 -1009531 4577262 9220487
9072 9220487 5812654 4430035 6554254 -5138644 -34953131 -53575848 -32367379 14503703
9064 14503703 46050697 45983394 34741594 32204956 33470727 28123485 21699963 24053859
9056 24053859 30496864 30354584 26252505 28914435 36125192 32978890 15156557 -1965751
9048 -1965751 -3284633 7952132 19540081 27838738 34994760 36097552 23906317 4954527
9040 4954527 -3568584 3785849 13674312 14509722 12589123 19057554 29654251 29328738
9032 29328738 13983047 -2969253 -6898240 2234569 13173432 18742329 23487907 33675934
9024C3675934Q495624r440970k7065323j6964292J6865818L2673304N137098l2649539
9016A0727654l0152672Q969119L2252040J4270300j2319634j2377530K620428
9009A3989705L362369r134423j3112023m645803K294163L004173L795085M362286
9001C915532Q41523j51305Q463751J6250454Q251529q747034j3966152l978989
8993A0879309M104318J59356p454978r090336n259550J079854Q356859J0577121
8985A3351953J865851j1159781j4666597p282913k233696p296106j3504368p342736
8977d8268393J2785325L3541045L6527562J5620895j1282423j7296842o43785
8970B0983384R702208n400032k5443280k1059622N69796R045506j58637l164593
$$ plain form
9024 33675934 42171558 32730588 5665265 -11299027 5566791 38240095 43377193 10727654
9016 10727654 -19425018 -10455899 21796141 36066441 23746807 11369277 13989705
9009 13989705 17352074 8217651 -4894372 -9540175 -7246012 -4241839 -446754 3915532
9001 3915532 4757055 4605750 13069501 29319955 37571484 28824450 14858298 10879309
8993 10879309 14983627 15142983 7688005 -1402331 -6661881 -5582027 2774832 13351953
8985 13351953 15217804 4058023 -10608574 -17891487 -20125183 -27421289 -40925657 -48268393
8977 -48268393 -35483068 -1942023 34585539 50206434 38924011 21627169 20983384
8970 20983384 30685592 25285560 -157720 -21217342 -20647546 -11602040 -11760677 -14925270
8962a4925270P448356J0399263m205092j5107814n381690Q797731M246264j3461481
8954b2189733k0355808q088039R729356J7708614J2207771L56952n498295J792560
8946a4336622J3647605J3078777l274494j9378673j9692581n233502J2636719
8939b2552771K3290757J9654455K802844j3375221j4612083m828397J090755J540053
8931f989608O731196J3922271Q358308p025072r397541P021482J7990430O949966
8923C7561432r131312r000027L69781Q89516o065515p778340l824352j585557
8915A435626j212858k050548r444602j9408152j4638113O483714J7838193M062154
8907a6934586j1242808k405661J5482248J3372672j949016l660429M595868k152181
$$ plain form
8962 -14925270 -7476914 2922349 -1282743 -16390557 -21772247 -12974516 -8728252 -22189733
8954 -22189733 -42545541 -50633580 -40904224 -23195610 -10987839 -10630887 -16129182 -14336622
8946 -14336622 -689017 12389760 9115266 -10263407 -29955988 -35189490 -22552771
8939 -22552771 737986 20392441 23195285 9820064 -4792019 -9620416 -8529661 -6989608
8931 -6989608 -258412 13663859 22022167 14997095 5599554 12621036 30611466 37561432
8923 37561432 28430120 19430093 19799874 20689390 14623875 6845535 3021183 1435626
8915 1435626 222768 -1827780 -11272382 -30680534 -45318647 -38834933 -20996740 -16934586
8907 -16934586 -28177394 -30583055 -15100807 -1728135 -3677151 -7337580 -2741712 -4893893
8899d893893j8731283j4345329J1200024K2389477O623312o905631m44227L834606
8891a272944j0323266j8990766R09311K7971540K7275594K862005j3668223j1455923
8883C307328n637148m588287k234982J729142R04702l54144P399326J6234359
8875A6760296P791687j4859082k5433526j1439700P588348R599364J47663j995095
8867a1840045L860911K972488o305792p665799N808094J7536010J1173163m849128
8859A0689902j1028010n878794l260524n514948j107706R722115J0889836n0719
8851D461152k565758J2172653K0636568K806681k1371772j9772709J929251J0611418
8843H907484j647312j0053368j638302P366480M829379J329002M602746L915810
$$ plain form
8899 -4893893 -23625176 -37970505 -26770481 -4381004 2242308 -4663323 -5107550 -1272944
8891 -1272944 -11596210 -30586976 -29677665 -1706125 25569469 28431474 14763251 3307328
8883 3307328 -2329820 -6918107 -9153089 -7423947 -6519245 -6873389 525937 16760296
8875 16760296 24551983 9692901 -15740625 -27180325 -19591977 -9992613 -9844950 -11840045
8867 -11840045 -7979134 -5006646 -11312438 -18978237 -13170143 4365867 15539030 10689902
8859 10689902 -338108 -6216902 -9477426 -14992374 -16100080 -6377965 4511871 4461152
8851 4461152 1895394 14068047 34704615 37511296 16139524 -3633185 -1703934 8907484
8843 8907484 7260172 -2793196 -4431498 2934982 7764361 9093363 13696109 17611919
8835A7611919o384257j2725078o496971j7315l383273o475379K79805P196613
8827a0393936L988505j311775J236056N722438N346600O934704J3417017J1119425
8819C6059034n838009j7793935q753147N126958J845649q807095l593786J1748959
8811I994628J1399245o736083j8780738j3855105m758791K16728O923448J4367837
8803a228831J1539029k82904o626542m997315o749308j0820616k351839J6509182
8795e009144K2046133N601632j0673896p634982M400944P580687L685076K724744
8787B2721194K489052k906303q370517p737727n628644n615022o06731J0540022
8779D885324J2355587l405277j7238798o344722K0147389L1976201J8003331m182047
$$ plain form
8835 17611919 11227662 -1497416 -7994387 -8011702 -11394975 -17870354 -17590549 -10393936
8827 -10393936 -6405431 -7717206 -6481150 -758712 4587888 11522592 24939609 36059034
8819 36059034 30221025 12427090 3673943 8800901 10646550 1839455 -1754331 9994628
8811 9994628 21393873 14657790 -4122948 -17978053 -22736844 -22520116 -15596668 -1228831
8803 -1228831 10310198 10027294 3400752 -1596563 -8345871 -19166487 -21518326 -5009144
8795 -5009144 17036989 22638621 11964725 4329743 8730687 16311374 19996450 22721194
8787 22721194 25210246 22303943 13933426 6195699 567055 -5047967 -5654698 4885324
8779 4885324 17240911 13835634 -3403164 -9747886 10399503 42375704 60379035 56196988
8771E6196988j5039629j1090024Q31123R794068L745861j6703824l0252732j8718003
8763b1236172L964910P885138p889839j1796015J1543707L4341564K4058442r677996
8755C1193739k8650681j7379432J773540M381411n235431o732517N743438J7639710
8747B733777J4605720q51114j4658845j6695309p548728N727895J4830526J3119739
8739A1263661R20598j0426007p236327R287562K0835903J3309192m936776j3963901
8731A9053905p122393M326490Q822340O039103Q67591l680267n549094m443690
8723A8313985n235779j1861235j7123477r708280O574595J3919480O087364j226568
8715b59915N794970J8625413K1542400J4290331M673672q935052k7589108l4070533
$$ plain form
8771 56196988 41157359 30067335 30898458 40692526 44438387 27734563 -2518169 -21236172
8763 -21236172 -17271262 -9386124 -17275963 -29071978 -17528271 16813293 40871735 31193739
8755 31193739 2543058 -14836374 -13062834 -8681423 -13916854 -20649371 -14905933 2733777
8747 2733777 17339497 16488383 1829538 -14865771 -22414499 -16686604 -1856078 11263661
8739 11263661 12184259 1758252 -5478075 3809487 24645390 37954582 33017806 19053905
8731 19053905 11931512 16258002 25080342 31119445 31987036 28306769 22757675 18313985
8723 18313985 13078206 1216971 -15906506 -25614786 -19040191 -5120711 966653 -259915
8715 -259915 5535055 24160468 45702868 59993199 64666871 55731819 28142711 -5927822
8707e927822j1159364K4924859L6769231J5598454p688788r721469m889451j2309219
8699B5596431j9744425p098729J3546094J4207776k279514o405742P846081J1921606
8691C7589578q772155k7046629j4213804J5171345K4201953O282897r449411k205400
8683B1558374J4639851J6928512J275657j6712612k5051260k4159657j6936038
8676b8457173k741363J4244500J9805458M443084j7961760k0115459L585468K4660719
8668b536526J5934540j0912146k1285246m964371J4996883J9734265J5451343
8661B6418742J1254495K686415r797486j0635641M198352J2153760k352837j9369944
8653A4555856j4348640J131825J513164n905903L872202K0812005R605403k5092795
$$ plain form
8707 -5927822 -17087186 7837673 44606904 60205358 52516570 42795101 37905650 25596431
8699 25596431 5852006 -1246723 12299371 26507147 24227633 17821891 25667972 37589578
8691 37589578 28817423 1770794 -12443010 2728335 26930288 33213185 23763774 21558374
8683 21558374 36198225 53126737 54402394 37689782 12638522 -11521135 -28457173
8676 -28457173 -31198536 -16954036 2851422 7294506 -10667254 -30782713 -27197245 -2536526
8668 -2536526 13398014 2485868 -18799378 -23763749 -8766866 10967399 26418742
8661 26418742 37673237 40359652 30562166 19926525 24124877 36278637 33925800 14555856
8653 14555856 207216 1339041 2852205 -3053698 818504 21630509 31235912 6143117
8645F143117l3227104M086466L9169971K7462000p607029j7374734l263565k350354
8637A3038768j8060225j7927661M561443J7170446N557056l506896P433106J3720393
8629B1986430p427412l2414578k4187786J0456745L0633790J8464482m795320
8622A2716351j6006013j4742431q730784j47890O792947M769654k115709P20925
8614a6742950J5028912K2657238J0842592r177035j8943709j5812335q053110
8607b0200397J332599J1788189J4880803L003408j4896252k0400885q228764Q611022
8599b4110277J5478884R318279k575459q657133j544944J1193724J0825163o940948
8591B987289j8749876l353437K2542545K2583586n720522k4301898r928126J2113645
$$ plain form
8645 6143117 -27083987 -22997521 16172450 43634450 36027421 18652687 15389122 13038768
8637 13038768 -5021457 -22949118 -18387675 -1217229 4339827 832931 8266037 21986430
8629 21986430 14559018 -17855560 -42043346 -31586601 -952811 17511671 12716351
8622 12716351 -3289662 -18032093 -26762877 -26910767 -20117820 -15348166 -17463875 -16742950
8614 -16742950 -1714038 20943200 31785792 22608757 3665048 -12147287 -20200397
8607 -20200397 -18867798 -7079609 7801194 10804602 -4091650 -24492535 -32721299 -24110277
8599 -24110277 -8631393 686886 -1888573 -10545706 -12090650 -896926 9928237 2987289
8591 2987289 -15762587 -19116024 3426521 26010107 20289585 -4012313 -13940439 -1826794
8583a826794Q248612j2806373j6273785N463551K4843038K0971068L763614p158349
8575B5224582p260259l764430j921040k087995k045208J616487Q096885R192012
8567B7051034J10939r151331n516650N595128N797388p150113j2821289J602449
8559E517555J9488517J5909553q470509k8413615k5581568p063698P981459J0384292
8551a0248014N130319q96384p453093j5192163j7520257o856911J1094285J9752304
8543b2189914J3141931M461863M707992M296483r025173k3113489j4119633J5025867
8535b6814073L2027905J7935378p322256j3484851J453831J5106714J2324303
8528C1226951j551273j3222093j4972642q347419k347386m912734j1568325r122757
$$ plain form
8583 -1826794 6421818 -6384555 -22658340 -17194789 7648249 28619317 32382931 25224582
8575 25224582 17964323 14199893 12278853 10190858 8145650 9762137 17859022 27051034
8567 27051034 27161973 18010642 12493992 18089120 23886508 16736395 3915106 5517555
8559 5517555 25006072 40915625 32445116 4031501 -21550067 -28613765 -20632306 -10248014
8551 -10248014 -5117695 -6014079 -13467172 -28659335 -46179592 -53036503 -41942218 -22189914
8543 -22189914 -9047983 -4586120 121872 4418355 -4606818 -27720307 -41839940 -26814073
8535 -26814073 5213832 23149210 15826954 2342103 3795934 18902648 31226951
8528 31226951 29675678 16453585 1480943 -6866476 -9213862 -14126596 -25694921 -34817678
8520c4817678M357903J2917921M219778j2035676j8025560j1444416k504621M719546
8512e2612803J2132969J4217114L438283j1519058j1915837K741086J0993495
8505c2524751K395676l700379J2249642L4987872L1459394o09695k5169268j6344031
8497B744460O274204P620203j1752255j9038508r7763K0393018J8154145L995263
8489B8292767J177954P053148K634546j0551223j2496609j275049K169973r045724
8481G959783j4492710j807073J0474041K844166j3839904j7816347r949041m671765
8473d1298850j317190R343057J8891767R821949j2048863k0523335o855993R423571
8465c4563887J2105046P425378M219126j828042j1590227j0849557P155901K2794944
$$ plain form
8520 -34817678 -30459775 -17541854 -13322076 -25357752 -43383312 -54827728 -57332349 -52612803
8512 -52612803 -40479834 -26262720 -22824437 -34343495 -46259332 -43518246 -32524751
8505 -32524751 -30129075 -33829454 -21579812 13408060 44867454 44257759 19088491 2744460
8497 2744460 9018664 16638867 4886612 -14151896 -14249659 6143359 24297504 28292767
8489 28292767 29470721 36523869 39158415 28607192 16110583 14835534 17005507 7959783
8481 7959783 -6532927 -8340000 2134041 4978207 -8861697 -26678044 -36627085 -41298850
8473 -41298850 -42616040 -33272983 -14381216 -4559267 -16608130 -37131465 -43987458 -34563887
8465 -34563887 -22458841 -15033463 -10814337 -12642379 -24232606 -35082163 -27926262 -5131318
8457e131318J4032303r545919j7435659j64115J8787701J6007590k836981j4861611
8449a148009j0519082j783823k652288j0475300j0796790J795173J3620455P476167
8441a4483497j3691952k6727230j5624034P931542J9024315J0385313j431564
8434c4617107n88202Q822694J3423253J0648885P850933O425814j36688j1386333
8426D43249j5501847o000514O345288P274993j273662n563917p94866M262242
8418a0809034L620542L168645Q713474J4378585J0835701K63133n008093J463617
8410B6626570J0889855Q504605q660483k5750661k5400388r011976L850067Q60342
8402a8092069o843101k511885J0327620J4148800N154765k764482k127291j523060
$$ plain form
8457 -5131318 8900985 -644934 -18080593 -18244708 542993 16550583 13713602 -1148009
8449 -1148009 -11667091 -13450914 -16103202 -26578502 -37375292 -35580119 -21959664 -14483497
8441 -14483497 -28175449 -54902679 -70526713 -62595171 -43570856 -33185543 -34617107
8434 -34617107 -35205309 -26382615 -12959362 -2310477 5540456 11966270 11829582 443249
8426 443249 -15058598 -21059112 -14713824 -7438831 -8712493 -14276410 -15071276 -10809034
8418 -10809034 -7188492 -4019847 4693627 19072212 29907913 30171046 25162953 26626570
8410 26626570 37516425 46021030 37360547 11609886 -13790502 -22802478 -18952411 -18092069
8402 -18092069 -24935170 -27447055 -17119435 -2970635 2184130 -580352 -2707643 -4230703
8394d230703o337550p416850K048481J2770969J2790576L384641o976573j3311179
8386g278188j1552046J106876J4798973J1201527r848800k3544580j2902027P509487
8378c0508778J5459605J1688136Q426858M545033n030003j0114903j217136Q188870
8370A437682K691180m684772N229689J7340172L191351k4743005k5076023M409589
8362b0204137J9518832K357140r057329J1572188K9234781M639360l6227240l8390680
8354c6557085k017381K0778908N993948j3778528o632647J4053016J8329111L993388
8346D162730p272825j851825J3160950K0937938J0442605j2266298k5891903j6143785
8338a4722413L784351P365531r576800k2193282j0419031J4765509K7552111J9197124
$$ plain form
8394 -4230703 -10568253 -17985103 -15936622 -3165653 9624923 13009564 6032991 -7278188
8386 -7278188 -18830234 -17723358 -2924385 8277142 -1571658 -25116238 -38018265 -30508778
8378 -30508778 -15049173 -3361037 5065821 9610854 4580851 -5534052 -6751188 1437682
8370 1437682 4128862 -555910 4673779 22013951 25205302 462297 -24613726 -20204137
8362 -20204137 -685305 1671835 -7385494 4186694 33421475 38060835 1833595 -36557085
8354 -36557085 -38574466 -17795558 -11801610 -25580138 -32212785 -18159769 169342 4162730
8346 4162730 -3110095 -4961920 8199030 29136968 39579573 27313275 1421372 -14722413
8338 -14722413 -10938062 -3572531 -13149331 -35342613 -45761644 -30996135 -3444024 15753100
8330A5753100L468277l581746M57121O705373O188281k168840j1609715j4542494
8322F69357r710707k740834q40065o591438j3947193j1059510O803377K6671121
8314a0745892K9083381J2677268l117263m727257m47166j444114k602763K843746
8306B1519940M580217p728149k0050456j2358901N576118O043680j0664035j4635882
8298b7717468L748843J5986189K231579j4917533o495563J6959596K3553933Q552704
8290B1902280l887805L68924J0809270J3793373P124621n625395j7363315j6536650
8282A0585303j080675J0647071J520936j5823592j3640293R361690K4647152J4642917
8274D0860509o243243j7463738j7350773j3206477o011022L450898Q817541Q824044
$$ plain form
8330 15753100 19221377 15639631 16096752 22802125 28990406 26821566 15211851 669357
8322 669357 -9041350 -11782184 -12622249 -19213687 -33160880 -44220390 -37417013 -10745892
8314 -10745892 18337489 31014757 27897494 23170237 22723071 21278957 18676194 21519940
8306 21519940 26100157 18372008 -1678448 -14037349 -8461231 -2417551 -13081586 -27717468
8298 -27717468 -23968625 -7982436 -5750857 -20668390 -27163953 -10204357 13349576 21902280
8290 21902280 18014475 18383399 29192669 42986042 50110663 44485268 27121953 10585303
8282 10585303 9504628 20151699 21672635 5849043 -7791250 1570440 26217592 40860509
8274 40860509 34617266 17153528 -197245 -13403722 -19414744 -15963846 -7146305 1677739
8266A677739R866551J0542599O66727j5723578j6576031N453525K5818942K0816681
8258D2543155J43707j2670513j5666009k0512394k2793808q479519J6251853K8895918
8250G712390K3052694J3291833Q208332J696631p882035j2166893r250790n719639
8242A8942523q97578J0216278J7898728N943637j7790993k5158799q978210N803470
8234E979056K184039m757177J382800R542330L742672p011848m965745N766267
8226A1862394P740374j890649j2135749j6819505j4850653l312597J2310475J4423823
8218b672087j063437j0629998K594993J6788776L166215k3646955k3562863N980709
8210c3044647K4573080J0739124q919015n738176R380257J0733838j647165r940117
$$ plain form
8266 1677739 11544290 22086889 22753616 7030038 -9545993 -4092468 21726474 42543155
8258 42543155 42686862 30016349 14350340 -6162054 -28955862 -37435381 -21183528 7712390
8250 7712390 30765084 44056917 52265249 53961880 46079845 33912952 24662162 18942523
8242 18942523 18044945 28261223 46159951 52103588 34312595 9153796 175586 5979056
8234 5979056 8163095 3405918 4788718 14331048 18073720 11061872 6096127 11862394
8226 11862394 19602768 17712119 5576370 -11243135 -26093788 -29406385 -17095910 -2672087
8218 -2672087 -3735524 -14365522 -11770529 5018247 8184462 -15462493 -39025356 -33044647
8210 -33044647 -8471567 2267557 -6651458 -12389634 -3009377 7724461 6077296 -3862821
8202c862821r251011o845574k103280J0285720K2514321J8828450j386351j9867264
8194H312190k0947642p993938K996993Q19920j0298117j4980907l288858J6272317
8186b9108042K4920388J5903619J984032k328419J318818R09550p297438j3635429
8178g332921q568171L729243Q940608J40645j1795845j0693881L277423J3518095
8170h784804J0582433M089627M749511P598062M491987R60569M980142R224807
8162C7892334L041197o079497l902668L965518N06374j1110890j0437795M817795
8154A8692368J3014622L532902q209044r168298p705468j2888738j7006269j1831331
8146c1569256k865842M946731J6122720K6733402J9074000r382471l1868910k6704881
$$ plain form
8202 -3862821 -13113832 -19959406 -22062686 -11776966 10737355 29565805 28179454 8312190
8194 8312190 -12635452 -20629390 -17632397 -16812477 -27110594 -42091501 -45380359 -29108042
8186 -29108042 -4187654 11715965 13699997 11371578 12690396 13599946 6302508 -7332921
8178 -7332921 -15901092 -12171849 -3231241 -3090596 -14886441 -25580322 -22302899 -8784804
8170 -8784804 1797629 5887256 10636767 18234829 22726816 23687385 28667527 37892334
8162 37892334 40933531 34854034 30951366 34916884 35423258 24312368 13874573 18692368
8154 18692368 31706990 35239892 27030848 17862550 10157082 -2731656 -19737925 -31569256
8146 -31569256 -34435098 -29488367 -13365647 13367755 32441755 23059284 -8809626 -35514507
8138c5514507q458918l773983j1411643r892952O175405K1550189K5955363K2721679
8130G350633J5368109M098815o540687j1514685j3496183j4916798r024720O805911
8122b1869605J7373961P264210j3519248k0099874o018630J1189400J5922182
$$ plain form
8138 -35514507 -43973425 -47747408 -59159051 -69052003 -62876598 -41326409 -15371046 7350633
8130 7350633 22718742 26817557 20276870 8762185 -4733998 -19650796 -28675516 -21869605
8122 -21869605 -4495644 2768566 -10750682 -30850556 -36869186 -25679786 -9757604
$$ [...]
##END NTUPLES=NMR SPECTRUM
##END=
