##TITLE=31Pdec_SRM-146.oil
 CDCl3, 64 sc
 11.5.2023
##JCAMPDX= 6.0         $$ Bruker NMR JCAMP-DX V2.0
##DATA TYPE= NMR SPECTRUM
##DATA CLASS= NTUPLES
##ORIGIN= UXNMR, Bruker Analytische Messtechnik GmbH
##OWNER= root
$$ XWIN-NMR		Version 3.5
$$ Thu May 11 14:05:33 2023 Russian Standard Time (UT+4h)  she@DPX200
##.OBSERVE FREQUENCY= 81.013821
##.OBSERVE NUCLEUS= ^31P
##.ACQUISITION MODE= SIMULTANEOUS
##.ACQUISITION SCHEME= undefined
##.AVERAGES= 64
##.DIGITISER RES= 16
##SPECTROMETER/DATA SYSTEM= spect
##.PULSE SEQUENCE= zgpg30
##.SOLVENT NAME= CDCl3
##.SHIFT REFERENCE= (INTERNAL, CDCl3, 0, 248.564)
##AUDIT TRAIL= $$ (NUMBER, WHEN, WHO, WHERE, WHAT)
$$ ##TITLE= Audit trail, XWIN-NMR		Version 3.5
$$ ##JCAMPDX= 5.01
$$ ##ORIGIN= Bruker BioSpin GmbH
$$ ##OWNER= she
$$ F:/spectra/data/she/nmr/P31/1/pdata/1/auditp.txt
$$ ##AUDIT TRAIL=  $$ (NUMBER, WHEN, WHO, WHERE, WHAT)
(   1,<2023-05-11 14:04:33.35 +0400>,<she>,<DPX200>,
      <continue with go, POWCHK disabled, PULCHK disabled
       configuration hash MD5:
       00 E9 B6 7A A2 85 ED C7 34 08 36 98 17 FE 4E 26
       data hash MD5: 32K
       F6 36 68 A3 C0 8C B5 FD EA B8 9B 38 38 1C 44 72>)
(   2,<2023-05-11 14:04:36.64 +0400>,<she>,<DPX200>,
      <Start of raw data processing
       efp BC_mod = 2 LB = 1 FT_mod = 6 PKNL = 1 PHC0 = -11082.54 PHC1 = 353.8849 SI = 64K 
       data hash MD5: 64K
       C6 4B C2 1A AA 36 ED AB 83 F8 8C 8C 7F 56 11 7F>)
(   3,<2023-05-11 14:04:56.73 +0400>,<she>,<DPX200>,
      <pk PHC0 = -34.92905 PHC1 = 77.40001 
       data hash MD5: 64K
       D7 0B A0 30 27 CB 83 53 BD B9 6F 13 29 89 EF EB>)
(   4,<2023-05-11 14:05:04.35 +0400>,<she>,<DPX200>,
      <abs ABSG = 5 
       data hash MD5: 64K
       54 38 C0 CA 63 93 B0 EE 3F AE 79 F2 07 32 5E 96>)
$$ ##END=
$$ 
$$ hash MD5
$$ DF B8 E5 F6 3F 27 AC ED F3 81 18 93 C7 11 B7 69
##$RELAX= 
##$RELAX= 
##$RELAX= 
##$RELAX= 
##$RELAX= 
##$RELAX= 
##$RELAX= 
##$RELAX= 
##$RELAX= 
$$ Bruker specific parameters
$$ --------------------------
##$DU= <F:/spectra>
##$EXPNO= 1
##$NAME= <P31>
##$PROCNO= 1
##$TYPE= <nmr>
##$USER= <she>
##$AMP= (0..31)
100 100 100 100 100 100 100 100 100 100 100 100 100 100 100 100 100 100 
100 100 100 100 100 100 100 100 100 100 100 100 100 100 
##$AQSEQ= 0
##$AQ_mod= 1
##$AUNM= <au_zg>
##$AUTOPOS= <>
##$BF1= 81.014009
##$BF2= 200.13
##$BF3= 200.13
##$BF4= 200.13
##$BF5= 200.13
##$BF6= 200.13
##$BF7= 200.13
##$BF8= 200.13
##$BYTORDA= 1
##$CFDGTYP= 0
##$CFRGTYP= 5
##$CHEMSTR= <none>
##$CNST= (0..31)
1 1 145 1 1 1 1 1 1 1 1 1 1 1 1 1 1 1 1 1 1 1 1 1 1 1 1 1 1 1 1 1 
##$CPDPRG= <waltz16>
##$CPDPRG1= <>
##$CPDPRG2= <waltz16>
##$CPDPRG3= <>
##$CPDPRG4= <mlev>
##$CPDPRG5= <mlev>
##$CPDPRG6= <mlev>
##$CPDPRG7= <mlev>
##$CPDPRG8= <mlev>
##$CPDPRGB= <>
##$CPDPRGT= <>
##$D= (0..31)
0 1 0 0 0 0 0 0 0 0 0 0.03 2e-05 3e-06 0 0 0 0 0 0 0 0 0 0 0 0 0 0 0 0 
0 0 
##$DATE= 1683799395
##$DBL= (0..7)
120 120 120 11 120 120 24 19 
##$DBP= (0..7)
150 150 150 150 150 150 150 150 
##$DBP07= 0
##$DBPNAM0= <>
$$ [...]
##$SUBNAM3= <"">
##$SUBNAM4= <"">
##$SUBNAM5= <"">
##$SUBNAM6= <"">
##$SUBNAM7= <"">
##$SUBNAM8= <"">
##$SUBNAM9= <"">
##$SW= 501.771253377433
##$SWIBOX= (0..15)
0 1 3 0 0 0 0 0 0 0 0 0 0 0 0 0 
##$SW_h= 40650.406504065
##$TD= 32768
##$TD0= 1
##$TE= 0
##$TE2= 300
##$TE3= 300
##$TEG= 300
##$TL= (0..7)
0 120 53 12 22 120 120 120 
##$TP= (0..7)
150 150 150 150 150 150 150 150 
##$TP07= 0
##$TPNAME0= <>
##$TPNAME1= <>
##$TPNAME2= <>
##$TPNAME3= <>
##$TPNAME4= <>
##$TPNAME5= <>
##$TPNAME6= <>
##$TPNAME7= <>
##$TPOAL= (0..7)
0.5 0.5 0.5 0.5 0.5 0.5 0.5 0.5 
##$TPOFFS= (0..7)
0 0 0 0 0 0 0 0 
##$TUNHIN= 0
##$TUNHOUT= 0
##$TUNXOUT= 0
##$USERA1= <user>
##$USERA2= <user>
##$USERA3= <user>
##$USERA4= <user>
##$USERA5= <user>
##$V9= 5
##$VALIST= <valist>
##$VCLIST= <CCCCCCCCCCCCCCC>
##$VD= 0
##$VDLIST= <DDDDDDDDDDDDDDD>
##$VPLIST= <PPPPPPPPPPPPPPP>
##$VTLIST= <TTTTTTTTTTTTTTT>
##$WBST= 1024
##$WBSW= 4
##$XGAIN= (0..3)
0 0 0 0 
##$XL= 0
##$YL= 0
##$YMAX_a= 3677
##$YMIN_a= -7828
##$ZGOPTNS= <>
##$ZL1= 120
##$ZL2= 120
##$ZL3= 120
##$ZL4= 120
##$ABSF1= 248.5645
##$ABSF2= -253.2056
##$ABSG= 5
##$ABSL= 3
##$ALPHA= 0
##$AQORDER= 0
##$ASSFAC= 0
##$ASSFACI= 0
##$ASSFACX= 0
##$ASSWID= 0
##$AUNMP= <proc_1d>
##$AZFE= 0.1
##$AZFW= 0.5
##$BCFW= 0
##$BC_mod= 2
##$BYTORDP= 0
##$COROFFS= 0
##$CY= -3
##$DATMOD= 1
##$DC= 0
##$DFILT= <>
##$DTYPP= 0
##$F1P= 0
##$F2P= 0
##$FCOR= 1
##$FTSIZE= 65536
##$FT_mod= 6
##$GAMMA= 0
##$GB= 0
##$INTBC= 1
##$INTSCL= 6.047779e-11
##$ISEN= 30
##$LB= 1
##$LEV0= 0
##$LPBIN= 0
##$MAXI= 10000
##$MC2= 0
##$MEAN= 0
##$ME_mod= 0
##$MI= 50
##$NCOEF= 0
##$NC_proc= -8
##$NLEV= 6
##$NOISF1= 182.463
##$NOISF2= 159.3651
##$NSP= 0
##$NTH_PI= 0
##$NZP= 0
##$OFFSET= 248.5645
##$PC= 4
##$PHC0= -11117.47
##$PHC1= 431.2849
##$PH_mod= 1
##$PKNL= yes
##$PPARMOD= 0
##$PSCAL= 0
##$PSIGN= 0
##$REVERSE= no
##$SF= 81.0140089999694
##$SI= 65536
##$SIGF1= 159.3651
##$SIGF2= -187.1042
##$SINO= 113.3802
##$SIOLD= 16384
##$SREGLST= <1H.CDCl3>
##$SSB= 0
##$STSI= 65536
##$STSR= 0
##$SW_p= 40650.406504065
##$SYMM= 0
##$S_DEV= 0
##$TDeff= 32768
##$TDoff= 0
##$TI= <>
##$TILT= no
##$TM1= 0
##$TM2= 0
##$TOPLEV= 0
##$USERP1= <user>
##$USERP2= <user>
##$USERP3= <user>
##$USERP4= <user>
##$USERP5= <user>
##$WDW= 1
##$XDIM= 65536
##$YMAX_p= 448059524
##$YMIN_p= -55546786
$$ End of Bruker specific parameters
$$ ---------------------------------
##NTUPLES= NMR SPECTRUM
##VAR_NAME=  FREQUENCY,     SPECTRUM/REAL,   SPECTRUM/IMAG
##SYMBOL=    X,             R,               I
##VAR_TYPE=  INDEPENDENT,   DEPENDENT,       DEPENDENT
##VAR_FORM=  AFFN,          ASDF,            ASDF
##VAR_DIM=   65536,         65536,           65536
##UNITS=     HZ,            ARBITRARY UNITS, ARBITRARY UNITS
##FACTOR=    0.620285442955139, 1,           1
##FIRST=     20137.2065510682, 0,            0
##LAST=      -20513.1999529968, 0,           0
##MIN=       -20513.1999529968, -55546786,   0
##MAX=       20137.2065510682, 448059524,    0
$$ Real data points
##PAGE= N=1
##DATA TABLE= (X++(R..R)), XYDATA
$$ [...]
39606C5166869L045612m862883j0729103j0093598l820349K206198L024993j154200
$$ 35166869 38212481 33349598 22620495 12526897 8706548 10912746 13937739 12783539
39598A2783539n874985o110706p31252M841776L214861m911106r101788k613357
$$ 12783539 6908554 797848 66596 4908372 8123233 3212127 -5889661 -8503018
39590h503018O422409N167268m490990o933512M760750J7598957J5961731K369623
$$ -8503018 -2080609 3086659 -1404331 -8337843 -3577093 14021864 29983595 32353218
39582C2353218p519567o231490j355391j914971o681602q800534n898133j191054
$$ 32353218 24833651 18602161 17246770 15331799 8650197 -150337 -6048470 -7239524
39574g239524K384075M818728O426185N890582K223118k522332m133043o12094
$$ -7239524 -4855449 -36721 6389464 12280046 14503164 11980832 7847789 7235695
39566G235695M955891P402253N575926L508489M196361M521213j85650p322560
$$ 7235695 12191586 19593839 25169765 28678254 32874615 37395828 37210178 29887618
39558B9887618p806957J776536J1934207J0584061p34046p676599k081996O555368
$$ 29887618 22080661 23857197 35791404 46375465 45641419 37964820 35882824 42438192
39550D2438192M274738p451590j3733313p168742K894444M904616K46458k111586
$$ 42438192 46712930 39261340 25528027 18359285 21253729 26158345 26404803 24293217
39542B4293217M48480L295123L439560J323081l622006j0876827j3890517o476498
$$ 24293217 24741697 28036820 31476380 32799461 29177455 18300628 4410111 -2066387
39534b066387N409405P705599l134058j3879498j1207291K214863J3252760J4138116
$$ -2066387 3343018 11048617 7914559 -5964939 -17172230 -14957367 -1704607 12433509
39526A2433509P458767J66548j796293L279179R642285P559075m571912j5035942
$$ 12433509 19892276 20058824 18262531 21541710 31183995 38743070 34171158 19135216
39518A9135216j2010405O61692P911805K555489p119073r588637l663569K693015
$$ 19135216 7124811 7786503 15698308 18253797 11134724 1546087 -2117482 575533
39510E75533L077925q41691k414492J664299O643938N135206k529106p353371
$$ 575533 3653458 2811767 397275 2061574 8705512 13840718 11311612 3958241
39502C958241l420767M065629O750230M565667L066658L176466J503119j347388
$$ 3958241 537474 4603103 11353333 15919000 18985658 22162124 23665243 22317855
39494B2317855j626307j108620n656963j3782431j5741637p327310L393928P311900
$$ 22317855 20691548 19582928 13925965 143534 -15598103 -22925413 -19531485 -12219585
39486a2219585N263287L161930K686224K454384L022347M520937L556177j361506
$$ -12219585 -6956298 -3794368 -1108144 1346240 4368587 8889524 12445701 11084195
39478A1084195m791016j118808O182389Q319121K642925n388741j0448834j1657390
$$ 11084195 6293179 5174371 11356760 19675881 22318806 16930065 6481231 -5176159
39470e176159r164982k609542N469657R282461N527000k386199p353779n313711
$$ -5176159 -14341141 -16950683 -11481026 -2198565 3328435 942236 -6411543 -11725254
39462a1725254J002348M814327K732661r74784j07700M130943M572545l26619
$$ -11725254 -10722906 -5908579 -3175918 -4150702 -4258402 -127459 4445086 4118467
39454D118467l264940N094K953995j008545o480633l829459N072629R186003M854878
$$ 4118467 853527 858621 3812616 2804071 -3676562 -7506021 -2433392 6752611 11607489
39445A1607489k69602l52428J364846O24409j282719k310790l517828m531438
$$ 11607489 11337887 10985459 12350305 12974714 11691995 9381205 5863377 1331939
39437A331939j935393L880875O414530J937349m516202o268098l516624p76207
$$ 1331939 -603454 3277421 9691951 11629300 7113098 845000 -2671624 -3447831
39429c447831p7603o60175j792521k458611j391476L89125P98814J405513N269889
$$ -3447831 -3525434 -4185609 -5978130 -8436741 -9828217 -9439092 -8640278 -7234765 -1964876
39420a964876R069060N411839m174600p971108j086085N834708K627689m805770
$$ -1964876 7104184 12516023 8341423 370315 -715770 5118938 7746627 2940857
39412B940857n077821M54365K345716j427J99326K522757Q20315k468266J099771
$$ 2940857 -2136964 -1682599 663117 661690 861016 3383773 4204088 1735822 2835593
39403B835593Q619917P188099m175367j0210586l345443L838948k10693o811908
$$ 2835593 11455510 18643609 14468242 4257656 912213 4751161 4540468 -2271440
39395b271440k526393P454389P792892j787607o919856k073779K704049K39684
$$ -2271440 -4797833 2656556 10449448 8661841 1741985 -331794 2372255 2611939
39387B611939l105061k24302M731499M042119j587116n395252m170864l14507
$$ 2611939 -493122 -717424 4014075 8056194 6469078 1073826 -3097038 -3411545
39379c411545K506133K447387R41516K170002P201460R194091J421334r718145
$$ -3411545 -905412 1541975 2483491 4653493 11854953 21049044 22470378 12752233
39371A2752233r791146K388308J0382584M390707k275753O169271K0505988J7715736
$$ 12752233 2961087 5349395 15731979 20122686 17846933 24016204 44522192 62237928
39363F2237928l965014k0970491j8013027p020448m884133r006329p281335K39465
$$ 62237928 58272914 37302423 19289396 12268948 7384815 -1621514 -8902849 -8663384
39355h663384M415961L669146L101527K390497j571883m144944Q14648P316538
$$ -8663384 -4247423 -578277 2523250 4913747 3341864 -803080 11568 7328106
39347G328106M715882l269596l244552M791575P264957J867645K189870J1117021
$$ 7328106 12043988 8774392 5529840 10321415 17586372 19454017 21643887 32760908
39339C2760908J0970986p198298k3687125j7323842K134557R314097O01622n813203
$$ 32760908 43731894 36533596 12846471 -4477371 -2342814 6971283 7572905 1759702
39331A759702j266922M628816N136774M807973M756812q19808r294528q891563
$$ 1759702 492780 5121596 10258370 15066343 19823155 19003347 9708819 817256
39323H17256J072597O115313n02529p029781l574558K535777K024385j94305L499901
$$ 817256 1889853 8005166 7502637 472856 -3101702 -565925 1458460 1264155 4764056
39314D764056Q080828N417427q33140l159857m000447p950831q813530J65562
$$ 4764056 12844884 18262311 17429171 14269314 10268867 2318036 -6495494 -6329932
39306f329932J0084733P321474l734648o394385J806591O217359j79533o651681
$$ -6329932 3754801 11076275 7341627 947242 2753833 8971192 8791659 2139978
39298B139978l831444K640531M401773L235536L724027L908197J847282K589599
$$ 2139978 -1691466 949065 5350838 8586374 12310401 16218598 18065880 20655479
39290B0655479R552676J5652920J1822027k66443j1384730j6479661j6386568
$$ 20655479 30208155 45861075 57683102 57416659 46031929 29552268 13165700
39283A3165700j1971940m150352K692845M235993K075204Q65640J351797J218703
$$ 13165700 1193760 -2956592 -263747 3972246 6047450 6913090 8264887 9483590
39275I483590P01392J606588K303524j25508l309153j574638M663010P718911
$$ 9483590 10184982 11791570 14095094 13969586 10660433 9085795 13748805 21467716
39267B1467716L532301j302838K094399J1931485J6141021O586483j0313390j9792548
$$ 21467716 25000017 23697179 25791578 37723063 53864084 60450567 50137177 30344629
39259C0344629j4852393l317225K377985m26258m037083k763724j82398k035037
$$ 30344629 15492236 12175011 14552996 14126738 10089655 7325931 7143533 5108496
39251E108496o696485p349264j651761N335200P782077N120010P38344k623906
$$ 5108496 -1587989 -8937253 -10589014 -5253814 2528263 7648273 8386617 5762711
39243E762711m665905n946790o042658l827722L63301L772252M010041K528655
$$ 5762711 1096806 -4849984 -10892642 -14720364 -14357063 -10584811 -6574770 -4046115
39235d046115K799889M491785K789219m304049j1036261j0004711j634790O321523
$$ -4046115 -1246226 3245559 6034778 1730729 -9305532 -19310243 -20945033 -14623510
39227a4623510Q224137N711825L254650K365350J746367M50371j147602k250658
$$ -14623510 -6399373 -687548 2567102 4932452 6678819 7129190 5981588 3730930
39219C730930k244796j225914l81861q08002j838834j881576q07869J94194R72100
$$ 3730930 1486134 260220 -121641 -929643 -2768477 -4650053 -5457922 -5263728 -4291628
39210d291628K312283L348878J879054j820547m265945l383861j381313j127380
$$ -4291628 -1979345 1369533 3248587 1428040 -2837905 -6221766 -7603079 -8730459
39202h730459j922562j149403J633115M577326O194117O154107M857045L837283
$$ -8730459 -10653021 -11802424 -10169309 -5591983 602134 6756241 11613286 15450569
39194A5450569M598408N325203J731998o077617j1092485q024790j338408R17430
$$ 15450569 20048977 25374180 27106178 21028561 9936076 1911286 572878 1490308
39186A490308j241761j238239K275724L433519k19158l474358k553370p91290
$$ 1490308 248547 -989692 1286032 4719551 4500393 1026035 -1527335 -2318625
39178b318625j391805j586286J128977L302541J640990q08171m14516M61611j096222
$$ -2318625 -3710430 -5296716 -4167739 -865198 775792 -32379 -446895 14716 -1081506
39169a081506k010184O02169J881150l390012r938542q301341N15366O577539
$$ -1081506 -3091690 -2489521 -608371 -3998383 -13936925 -22238266 -21722900 -15145361
39161a5145361N895859L814091L852637L226653O16904q61861k99328m18010r88862
$$ -15145361 -9249502 -5435411 -1582774 1643879 2260783 1398922 1099594 681584 -307278
39152c07278J083792M166850L147933p01513o91493L000439K609036l098346n351480
$$ -307278 776514 4943364 8091297 7389784 6698291 9698730 12307766 9209420 3857940
39143C857940k77985M041790J226917l374074l118394n13618K25712J430890M632299
$$ 3857940 3579955 7621745 8848662 5474588 2356194 1842576 2068288 3499178 8131477
39134H131477M229447k543853p984682n605790j058481j588001l204160N49018
$$ 8131477 12360924 9817071 1832389 -3773401 -4831882 -6419883 -9624043 -9075025
39126i075025N328620M069266J004197L883475Q268768M375999m770523p236772
$$ -9075025 -3746405 322861 1327058 5210533 13479301 17855300 13084777 5848005
39118E848005j631406K248453P53477m31699n7988l429789r471561r612092k103834
$$ 5848005 4216599 6465052 7218529 6786830 6728842 3299053 -6172508 -15784600 -17888434
39109a7888434M737251N715882L806372R40907m181368p954288m229798L525662
$$ -17888434 -13151183 -7435301 -3628929 -2688022 -6869390 -14823678 -19053476 -15527814
39101a5527814N203892O91295q9375M590354N290893k35616k152452K745243M162898
$$ -15527814 -10323922 -9632627 -9722002 -5131648 159245 -76371 -2228823 516420 4679318
39092D679318k440704o297302n76764M782928J134362l053326J766774P960336
$$ 4679318 2238614 -4058688 -4635452 147476 1281838 -1771488 -4714 7955622
39084G955622M363762l263610k833716K055926p22371q815582q743293M80413
$$ 7955622 12319384 9055774 6222058 8277984 7555613 -1259969 -10003262 -9522849
39076i522849N689128J826551j382780K197398N636358K883037r62747J4110K181806
$$ -9522849 -3833721 -2007170 -3389950 -1192552 4443806 7326843 6364096 6378206 8560012
39067H560012l61900n377540o271204j811153L413973N432284L891974O43505
$$ 8560012 8198112 2820572 -3450632 -5261785 -1847812 3584472 7476446 8119951
39059H119951j863276j919739N4000J816812J155956k519801o958515p471944
$$ 8119951 6256675 4336936 4390936 6207748 7363704 4843903 -2114612 -9586556
39051i586556j768542N038915M966570j662919n493025j586338L415265K752198
$$ -9586556 -11355098 -6316183 -1349613 -3012532 -8505557 -10091895 -6676630 -3924432
39043c924432Q01354M736043J0680215Q459381k346863j1047514j0437926m386916
$$ -3924432 -3123078 1612965 12293180 20752561 18405698 7358184 -3079742 -7466658
39035g466658J59884J780279L122623N440535O613420L329664l963091q376018
$$ -7466658 -7306774 -5526495 -2403872 3036663 9650083 12979747 9016656 640638
39027F40638l529684N731911P181646r09448n565073N78685N906979j816944j3709101
$$ 640638 -2889046 2842865 10024511 9115063 3549990 4128675 10035654 8218710 -5490391
39018e490391j2280962O25001O770273N00530m108387K363857J0766648J0073486
$$ -5490391 -17771353 -17146352 -10376079 -9875549 -13983936 -11620079 -853431 9220055
39010I220055L259507j445666l219327m187738k243125L055609N290323J00714
$$ 9220055 12479562 11033896 7814569 3626831 1383706 4439315 9729638 9830352
39002I830352o904797q246990m963737k443958j268169J206825M381919N464864
$$ 9830352 2925555 -5321435 -10285172 -12729130 -13997299 -12790474 -8408555 -2943691
38994b943691L814175J45613m837958p990237m975741K697163P465430N952039
$$ -2943691 870484 1016097 -3821861 -11812098 -16787839 -14090676 -6625246 -673207
38986f73207L236967L309404K666773j451170m107531r74951K929460Q38523m516862
$$ -673207 2563760 5873164 8539937 7088767 2981236 2006285 4935745 5774268 1257406
38977A257406n443640j174090K668516L324336K173124k96257l514523l741150
$$ 1257406 -4186234 -5360324 -2691808 632528 2805652 2509395 -1005128 -4746278
38969d746278O77455L948334O01855m422916k493291M329303O045564J076898
$$ -4746278 -4068823 -120489 481366 -3941550 -6434841 -2105538 3940026 5016924
38961E016924j498185K358278N129077J174726l635195k248026J934033J594451
$$ 5016924 3518739 5877017 11006094 12180820 8545625 6297599 8231632 9826083
38953I826083k505811m487081l870189m263656m288694O50751P910561Q427678
$$ 9826083 7320272 2833191 -1036998 -5300654 -9589348 -8938597 -1028036 7399642
38945G399642K77199o937573n418038J83389J227928j611532j303088K731183
$$ 7399642 7676841 739268 -4678770 -4495381 -3267453 -4878985 -6182073 -3450890
38937c450890L866911J31392k103362J079682M396588K236349j800834o71637
$$ -3450890 416021 547413 -1555949 -476267 3920321 6156670 4355836 3684199
38929C684199M687671O801087K902779j937304k919262r01912J125608J805204
$$ 3684199 8371870 15172957 18075736 16138432 13219170 12317258 13442866 15248070
38921A5248070L88607l280670o144507l967571J737466L456587k226855q310583
$$ 15248070 15636677 12356007 6211500 2243929 3981395 7437982 5211127 -3099456
38913c099456n895695L506790R659780O969351O99892j598433r5992m82204m438317
$$ -3099456 -8995151 -5488361 4171419 11140770 11840662 10242229 10146237 9664033 5225716
38904E225716p081781m140990K146901O048892M809292L30748l486875l254565
$$ 5225716 -1856065 -5997055 -3850154 2198738 7008030 7338778 3851903 597338
38896E97338J500924N899301K770873p806260j5111666r849809K564307Q282488
$$ 597338 2098262 7997563 10768436 2962176 -12149490 -21999299 -19434992 -11152504
38888a1152504L653225j468374J6174L269371K559709J221994L629456N761861
$$ -11152504 -7499279 -8967653 -8951479 -5682108 -3122399 -1900405 1729051 7490912
38880G490912K377000k931141l651783r25977M33352J096100L121682K212018
$$ 7490912 9867912 6936771 3284988 2359011 2792363 3888463 7010145 9222163
38872I222163n082119j1051211o094066M691762P332278N9108n043855j848087
$$ 9222163 4140044 -6911167 -13005233 -8313471 -981193 -922085 -5965940 -7814027
38864g814027K298843J371076n03829M10356K98560k811084l126089K526723P152798
$$ -7814027 -5515184 -4144108 -4647937 -4237581 -3939021 -6750105 -9876194 -7349471 -196673
38855a96673L513080n085254r852437o782943K236577J2322323J6179922R006791
$$ -196673 3316407 -1768847 -11621284 -18404227 -16167650 -3845327 12334595 21341386
38847B1341386l427681q913590m564229m54411l743758q286359n579013K414967
$$ 21341386 17913705 9000115 4435886 3981475 237717 -8048642 -13627655 -11212688
38839a1212688P868083P511945K734483l999895p876708m125054L724833N883089
$$ -11212688 -3344605 4167340 6901823 2901928 -4974780 -9099834 -5375001 508088
38831E08088P02941k449966Q46991K895633j045972l545608K10944J935436l616694
$$ 508088 1211029 -1238937 -391946 2503687 1457715 -2087893 -1876949 58487 -3558207
38822c558207n436721N373288J5888163Q960670p986665j2794995k512955M453843
$$ -3558207 -8994928 -3621640 12266523 21227193 13240528 445533 -2067422 2386421
38814B386421n61512n405452j135853L369044p01070o194390k834474N975731
$$ 2386421 1824909 -3580543 -4716396 -1347352 -2048422 -8242812 -11077286 -5101555
38806e101555R861929O594461J245407l160771n793072l993157K977144R237105
$$ -5101555 4760374 11354835 12600242 9439471 3646399 -346758 2630386 11867491
38798A1867491P732717j057569r737577j1785558o594374J053000N100856L973815
$$ 11867491 19600208 18542639 8805062 -2980496 -9574870 -8521870 -3421014 552801
38790E52801K283677M094999O117258K502769n039947q565120n153617R2181K868677
$$ 552801 2836478 6931477 13048735 15551504 10511557 1946437 -3207180 -3114999 -246322
38781b46322M255297N173491L625921k02220k711237l060601m120791n274357
$$ -246322 4008975 9182466 12808387 12606167 9894930 6834329 2713538 -2560819
38773b560819j683191O217441J0187222N685690j035190k773569j998591m955614
$$ -2560819 -4244010 1973431 12160653 17846343 16811153 14037584 12038993 7083379
38765G083379j0071874j0030364l221558L858273N453204K585309k42607n73746
$$ 7083379 -2988495 -13018859 -16240417 -12382144 -6928940 -4343631 -4586238 -5159984
38757e159984P03680J299836p0528k383172l341479j837270J219950M166600N444170
$$ -5159984 -4456304 -3156468 -3226996 -5610168 -8951647 -10788917 -9568967 -5402367 41803
38748D1803L879041J10828k665882j593423K314571N233098M548983M95131m568965
$$ 41803 3920844 4031672 1365790 -227633 2086938 7320036 11869019 12364150 7795185
38739G795185o872935l946863J079481J607523k800897m035542K071257O861153
$$ 7795185 922250 -3024613 -1945132 -337609 -3138506 -7174048 -5102791 1758362
38731A758362J116731q572784p479237M692341J1672267L366921j0658844j5034664
$$ 1758362 2875093 -5697691 -13176928 -8484587 3187680 6554601 -4104243 -19138907
38723a9138907o859373M916547J1106149Q632242J199095k955225O14942N254082
$$ -19138907 -25998280 -21081733 -9975584 -1343342 -144247 -3099472 -2484530 2769552
38715B769552J416604p597027q625587O96842P086782K503078l614945j501980
$$ 2769552 4186156 -3410871 -12036458 -11339616 -4252834 -1749756 -5364701 -6866681
38707f866681K541642j014676o592369k913637O600653Q715759J772595l110713
$$ -6866681 -4325039 -5339715 -11932084 -14845721 -8245068 470691 2243286 -867427
38699h67427o90683K982106L845361M737064N560300J717097m792013n123092
$$ -867427 -1558110 1423996 5269357 10006421 15566721 17283818 12491805 7368713
38691G368713J631280N215554P04509l312923L58827N245052K512397m352521
$$ 7368713 8999993 14215547 14920056 11607133 11965960 17211012 19723409 15370888
38683A5370888o153038k667268l85522j92236K264034O451716O988897K864894
$$ 15370888 9217850 6550582 6165060 5972824 8236858 14688574 21677471 24542365
38675B4542365j712225m803923p145827o344590K90522P448337O270141j620178
$$ 24542365 22830140 18026217 10880390 4535800 4826322 12274659 18544800 16924622
38667A6924622m724415R69451N884756K818886j906527o75181K308640L59919
$$ 16924622 12200207 13169658 19054414 21873300 19966773 19291592 21600232 21960151
38659B1960151k002921K385261P478837J838278j0753682j4612585o349280N02955
$$ 21960151 19957230 22342491 29821328 31659606 20905924 6293339 -55941 447014
38651D47014j842027m571032n76713K289042l380077r477096n711086K652125
$$ 447014 -1395013 -5966045 -6542758 -4253716 -7633793 -17110889 -22821975 -20169850
38643b0169850M496338J780308L576586P732664M956231k609293l797114J811400
$$ -20169850 -15673512 -13893204 -10316618 -2583954 2372277 -237016 -4034130 -2222730
38635b222730L206118k044662l649888K210679N440406l37092o825939n250180
$$ -2222730 983388 -1061274 -4711162 -2500483 2939923 2602831 -4223108 -9473288
38627i473288N26026L036522K861113L216389K462220N6883J010967O329514P983489
$$ -9473288 -8947262 -5910740 -3049627 166762 2628982 2685865 3696832 10026346 18009835
38618A8009835J999524k688518J506390O704200J797129q649360j1494205n852086
$$ 18009835 20009359 17320841 18827231 25531431 27328560 18679200 7184995 1332909
38610A332909k212726l506514k247971L159141M167683k183878o235807o38475
$$ 1332909 -879817 -4386331 -6634302 -3475161 692522 -1491356 -7727163 -8365638
38602h365638P704644Q072767J269113l130471o54686L945098M760504J521879
$$ -8365638 -660994 7411773 8680886 5550415 4895729 8840827 13601331 15123210
38594A5123210j603454p79239M121539R224693R825932M670734l138492r381952
$$ 15123210 13519756 12740517 16862056 26086749 35912681 40583415 37444923 28062971
38586B8062971j1908813j0761427o695008o69617N152581O808763J337004p928303
$$ 28062971 16154158 5392731 -1302277 -1971894 3180687 9989450 11326454 3398151
38578C398151j1458504l732768P676822R652549P93604o648013m668061p8251
$$ 3398151 -8060353 -11793121 -4116299 5536250 6329854 -318159 -4986220 -5064471
38570e064471j223460l634900O89494O830752L537119o683836q978457R54397
$$ -5064471 -6287931 -9922831 -9233337 -2402585 1134534 -5549302 -14527759 -13573362
38562a3573362R681784O756858l11605j49564M069316J777889o061699q101088
$$ -13573362 -3891578 2865280 2553675 2404111 6473427 8251316 2189617 -5911471
38554e911471p90757O434265N760573R79536q30435L00465M81647j89614N86726
$$ -5911471 -6702228 -267963 5492610 6472146 5641711 5942176 6423823 6234209 6820935
38545F820935J240236j259693m627114l661880O91297J571624k893370n725443
$$ 6820935 8061171 6801478 2174364 -1487516 -796219 775405 -2117965 -7843408
38537g843408j759414L973500M043290j08355j728097j85513m71885k531317k50101
$$ -7843408 -9602822 -5629322 -1586032 -1694387 -3422484 -3607997 -4079882 -6611199 -6861300
38528f861300P238832J1472592N782689n420272j2560765j1654341n647793R02251
$$ -6861300 377532 11850124 17632813 12212541 -348224 -12002565 -17650358 -16748107
38520a6748107M845152N260777M260432M512072M685370J123667m995996p446857
$$ -16748107 -11902955 -6642178 -2381746 2130326 6815696 7939363 2943367 -4503490
38512d503490l679924K077389O631348J1611520J5768484J1601632l395258j8269199
$$ -4503490 -8183414 -6106025 525323 12136843 27905327 39506959 36111701 17842502
38504A7842502j9713748q288164L605232P152847L760578j250633m384088m195952
$$ 17842502 -1871246 -10159410 -6554178 598669 4359247 3108614 -1275474 -5471426
38496e471426j609697J01839p15016j615275m18831J065393R83777J038520K299134
$$ -5471426 -7081123 -6979284 -7694300 -9309575 -9728406 -8663013 -7679236 -6640716 -4341582
38487d341582K183401l3482k97628K553883K772440k288544n478941j372426L083670
$$ -4341582 -2158181 -2191663 -2489291 64592 2837032 548488 -4930453 -6302879 -3219209
38478c219209k36537n943820m136483K010358K226604j740995N61492P945702
$$ -3219209 -3455746 -9399566 -13536049 -11525691 -9299087 -11040082 -10478590 -2532888
38470b532888Q266830L47489k822558L392592P251962J709549l420380J17153
$$ -2532888 5733942 6081431 3258873 6651465 13903427 15612976 12192596 12309749
38462A2309749L756887k313278j0684396q087331L290140R997879P452718K787870
$$ 12309749 16066636 13753358 3068962 -5018369 -1728229 8269650 15722368 18510238
38454A8510238Q51528n23454k379334k167461O4567P94032j107557l196603l640871
$$ 18510238 19361766 18838312 16458978 14291517 14356084 15150116 14042559 10845956 7205085
38445G205085k142141J492284N446214N437435P40011k928314j630968P8262k873766
$$ 7205085 5062944 6555228 12001442 17438877 18178888 15250574 13619606 13697868 10824102
38436A0824102n975903j653150O975961Q734854O73257p491139p139851j176721
$$ 10824102 4848199 3195049 10171010 18905864 19579121 12087982 4948131 3771410
38428C771410K457409J388311j189833k717440k937275j518790J934568N586418
$$ 3771410 6228819 7617130 6427297 3709857 772582 -746208 1188360 6774778
38420F774778N783006J131334m690469o073666k190935J434989K23325k812897
$$ 6774778 12557784 13689118 8998649 2924983 734048 2169037 2392362 -420535
38412d20535j770502K449385L222412r43360l653106p85844L442263L931209J794798
$$ -420535 -2191037 258348 3480760 2537400 -1115706 -1901550 1540713 5471922 7266720
38403G266720m7469k103617m426170l713997L21581J885022j609597l651569Q67333
$$ 7266720 7219251 5115634 689464 -3024533 -2702952 -817930 -2427527 -6079096 -5211763
38394e211763N898881L681843k188742l389946j375813l472330q083360o669915
$$ -5211763 687118 4368961 2180219 -1209727 -2585540 -6057870 -14141230 -20811145
38386b0811145R60476O147829O057769O157451P285356L665006l722907n474950
$$ -20811145 -19850669 -13702840 -7645071 -1487620 5797736 9462742 5739835 264885
38378B64885O5609K272806l910815q461124k921693N175910M760729j727770m841677
$$ 264885 330494 2603300 -1307515 -9768639 -12690332 -7514422 -2753693 -4481463 -9323140
38369i323140l444106j899810Q87977P015574R878854K572394p676941p454471
$$ -9323140 -12767246 -14667056 -13779079 -6763505 3115349 5687743 -1989198 -9443669
38361i443669K163748O872257J216986m563785k166340L494203N047254L137196
$$ -9443669 -7279921 -407664 809322 -3754463 -5920803 -2426600 2620654 5757850
38353E757850O87790l152074p388498o510695M33130O066598N507564K763778
$$ 5757850 6445640 3293566 -4094932 -10605627 -10172497 -4105899 1401665 4165443
38345D165443J151365k813815r130117q869212J132277Q504814K892697n790437
$$ 4165443 5316808 2502993 -6627124 -15496336 -14364059 -5859245 -2966548 -8756985
38337h756985k015774R466228J0625315l62523o598037m90081N693937K520347
$$ -8756985 -10772759 -1306531 9318784 8956261 2358224 1868143 7562080 10082427
38329A0082427k354924j462312j605224q338798j1403897j144716J1940697J1225618
$$ 10082427 7727503 6265191 4659967 -3678831 -15082728 -16227444 -4286747 6938871
38321F938871k06294n433350p10170J664216l632550p170992l021751J271631
$$ 6938871 6732577 1299227 589057 2253273 -1379277 -8550269 -11572020 -10300389
38313a0300389j008205m470560j993227L739288O563133O609459O465943M336441
$$ -10300389 -11308594 -15779154 -17772381 -14033093 -7469960 -860501 5605442 9941883
38305I941883j488018o458472n332891m43387J907770O46745k12223R69464J453551
$$ 9941883 8453865 1995393 -3337498 -3780885 -1873115 -1226370 -1438593 -469129 984422
38296I84422q85461m332012n246447j662748M148635O429205J891702m634768
$$ 984422 98961 -4233051 -9479498 -11142246 -6993611 -564406 1327296 -3307472
38288c307472m517876L283570R649283O792754j860116o959563n137158j338539
$$ -3307472 -7825348 -4541778 5107505 11900259 10040143 3080580 -2056578 -3395117
38280c395117r67371l698050n212017k827739J466102L660298L082680K910673
$$ -3395117 -4362488 -8060538 -13272555 -16100294 -14634192 -10973894 -7891214 -4980541
38272d980541M099007K643020l288958p731260m908053P10582J025962j557439
$$ -4980541 -881534 1761486 -1527472 -9258732 -14166785 -13456203 -12430241 -13987680
38264a3987680K250807J1190105J2589380K160003p986948o980196N81019N250683
$$ -13987680 -11736873 -546768 12042612 14202615 6215667 -764529 -183510 5067173
38256E067173O693960Q101833O616996M2386m890402k087540K642382P72269m760164
$$ 5067173 11761133 19862966 26479962 26522348 21631946 19544406 22186788 22959057 18198893
38247A8198893n880414l785174m556387n755754j138738N263413M335400j444182
$$ 18198893 12318479 8533305 3976918 -1778836 -2917574 2345839 6681239 5237057
38239E237057j622255L287040K521684m753441o827317k31504L477230k241893
$$ 5237057 3614802 6901842 9423526 4670085 -2157232 -2388736 1088494 -1153399
38231a153399p560136l474141L195183K401733k525876k264230K711961M928426
$$ -1153399 -8713535 -12187676 -8992493 -6590760 -9116636 -11380866 -8668905 -3740479
38223c740479K749473L46915q10693j655857o18193K968986M314718k73779n795943
$$ -3740479 -991006 -644091 -1454784 -3110641 -3728834 -759848 3554870 3281091 -2514852
38214b514852n071381L73146L403623K297674J012790Q58041k87732j910794j437147
$$ -2514852 -7586233 -7213087 -3809464 -1511790 -499000 359041 71309 -1839485 -3276632
38205c276632l9883j005321k915979j240846L330393M750417O53722m250139n156052
$$ -3276632 -3316515 -4321836 -7237815 -8478661 -5148268 -397851 255871 -3994268 -9150320
38196i150320k709690j07803J372764K330510L393245M453365M336209J833071
$$ -9150320 -11860010 -11967813 -10595049 -8264539 -4871294 -417929 3918280 5751351
38188E751351j575447k192198M28060J524029j830822n066414k529389L196249
$$ 5751351 4175904 1983706 2411766 3935795 2104973 -2961441 -5490830 -2294581
38180b294581M612593M92699k841411j294561K160943L228875J454950j436216
$$ -2294581 2318012 2810711 -30700 -1325261 835682 4064557 5519507 4083291
38172D083291l631925k777028K031192P048107P172276K982482k14753o84169
$$ 4083291 451366 -2325662 -294470 6753637 13925913 16908395 16693642 16009473
38164A6009473j998529n457909o976130l994064J03256J609848J554768J822218
$$ 16009473 14010944 8553035 1576905 -2417159 -2313903 -704055 850713 2672931
38156B672931J191691o38743K67064O054462J1057489P731380k772908j1105440
$$ 2672931 3864622 3225879 3492943 9547405 20604894 28336274 25563366 14457926
38148A4457926j0548190l398885L425512N761003M601500L333664L307769K032887
$$ 14457926 3909736 510851 3936363 9697366 14298866 17632530 20940299 22973186
38140B2973186k927465q420515p814887m76935N243653K498585m280498n657378
$$ 22973186 20045721 11625206 3810319 3333384 8577037 11075622 6795124 1137746
38132A137746p47811K401830m72130m155746l086537L02814O38065j414341n56284
$$ 1137746 389935 2791765 2319635 -1836111 -4922648 -4619834 -3981769 -5396110 -5952394
38123e952394M533684Q851500P625344J945468l207365m615351l226376j753257
$$ -5952394 -1418710 7432790 15058134 17003602 13796237 9180886 5954510 4201253
38115D201253j350878j456278k256811n143626r341117j0101493l568145O866847
$$ 4201253 2850375 1394097 -862714 -6006340 -15347457 -25448950 -29017095 -22150248
38107b2150248J2669006R716149K716626j417563j505869r87706j667009k199631
$$ -22150248 -9481242 234907 2951533 1533970 28101 -959605 -2626614 -4826245
38099d826245j527334k59315J178540K918408M087389L260888O31842k239326
$$ -4826245 -6353579 -6612894 -5434354 -2515946 1571443 4832331 5464173 3224847
38091C224847m596524o270610n864930k161436K575380M038410J579624o30857
$$ 3224847 -1371677 -7642287 -13507217 -15668653 -13093273 -9054863 -7475239 -8106096
38083h106096M28725K576189K438761N92497m21753r82615l142939n228024k323992
$$ -8106096 -7677371 -5101182 -2662421 -2069924 -2491677 -3474292 -6617231 -11845255 -14169247
38074a4169247O152731J2785471R564870j740437r972367o931473K690658O682080
$$ -14169247 -8016516 4768955 14333825 12593388 2621021 -4310452 -1619794 5062286
38066E062286J64635q848987j0384231m713779O20543K542208M284262O577630
$$ 5062286 5226921 -3622066 -14006297 -18720076 -18099533 -15557325 -11273063 -4695433
38058d695433N393312N13108j840762P60311J802259k878612o110935n95060P064807
$$ -4695433 697879 1210987 -629775 130536 1932795 -945817 -7056752 -7651812 -587005
38049e87005N185826l631428n448919K787975Q170864K689101m317737j878175
$$ -587005 4598821 967393 -4481526 -1693551 6477313 9166414 4848677 2970502
38041B970502N675334P115661J395046l883261n097935l875322n15406M216375
$$ 2970502 8645836 15761497 17156543 13273282 8175347 4300025 3784619 8000994
38033H000994M888296j307622o948362m211152J649919L10756n542574m108251
$$ 8000994 12889290 11581668 4633306 422154 2072073 2382829 -3159745 -7267996
38025g267996M686559P741694M19025n747414k195378M036349M166518J240888
$$ -7267996 -2581437 5160257 5579282 -168132 -2363510 1672839 5839357 7080245
38017G080245Q53892j15498n072924p991705l390041K466278J833601r11679J846971
$$ 7080245 7934137 7818639 2745715 -5245990 -8636031 -6169753 -4336152 -5247831 -3400860
38008c400860O005327L464597j476577J199229Q422248P951149j193764q236718
$$ -3400860 2604467 6069064 4592487 5791716 14213964 22165113 20971349 12734631
38000A2734631r323007r981266r186873M27326J3803828J4382133J90517r476413
$$ 12734631 3411624 -6569642 -15756515 -15329189 -1525361 12856772 13047289 3570876
37992C570876k619706P632212N508488l240226m513329K80767N92035l001631
$$ 3570876 951170 8583382 14091870 10851644 6338315 6619082 7211117 4209486
37984D209486k555372J35202k371041o614959k970702N656646O584406j851414
$$ 4209486 1654114 1789316 -581725 -7196684 -10167386 -4510740 2073666 222252
37976B22252q054177o266373k673196q65653L506927J0139836J0760415L762652
$$ 222252 -7831925 -14098298 -16771494 -17637147 -14130220 -3990384 6770031 10532683
37968A0532683q52594K606897O448317L301196k036644k405416l13020j275408
$$ 10532683 9680089 12286986 18735303 22036499 19999855 17594439 17281419 16006011
37960A6006011k991089n63523L214815J947597l624183o822492m667493j76664
$$ 16006011 13014922 12451399 15666214 17613811 13989628 7167136 2499643 2322979
37952B322979K965807L275387J061178j387292j703217j481972m222890p745365
$$ 2322979 5288786 8564173 9625351 8238059 6534842 5052870 829980 -6915385
37944f915385n206411L400506Q573332N130597Q67263M393462J1349023J1435664
$$ -6915385 -12121796 -8721290 -147958 4982639 5849902 10243364 21592387 33028051
37936C3028051L871767l467379o511971p222463o115720k242666O33733k684115
$$ 33028051 36899818 33432439 26920468 19698005 13582285 11339619 11973352 9289237
37928I289237r127877r571668j932561N700343O799144M018070K438259J764032
$$ 9289237 161360 -9410308 -11342869 -5642526 1156618 5174688 7612947 9376979
37920I376979o35068l456375k896348J425720N279201M548541j2269l195231j267026
$$ 9376979 8741911 5285536 2389188 3814908 9094109 13642650 13630381 10435150 9168124
37911I168124K804111K723661j823863l530907K150540R622122J0843028O381915
$$ 9168124 11972235 14695896 12872033 9341126 11491666 21113788 31956816 38338731
37903C8338731K586565Q24000k823250q318965j0217857o548466k188164j131131
$$ 38338731 40925296 41749296 38926046 30607081 20389224 13840758 11652594 10521463
37895A0521463j222415N00221K102004K06038l851032n128022j563462K996233
$$ 10521463 9299048 9799269 11901273 12107311 8256279 3128257 1564795 4561028
37887D561028K793239l011999q134729n632088L103506Q938886O122863j043746
$$ 4561028 7354267 4342268 -3792461 -9424549 -6321043 2617843 8740706 7696960
37879G696960n320496n617005m466802j276749M931265R341165O189134j410271
$$ 7696960 2376464 -3240541 -7707343 -8984092 -4052827 5288338 11477472 10067201
37871A0067201m562982j381054J384025J95006l15645L171634O136863L673320
$$ 10067201 5504219 4123165 5507190 5702196 5386551 8558185 14695048 18368368
37863A8368368j418939l061557p25189O84522k016746o196109n983735J219593
$$ 18368368 16949429 13887872 13162683 13847205 11830459 5634350 -349385 870208
37855H70208R760736R706667o89461r921031o973140L046213O315926J624718
$$ 870208 10630944 20337611 19648150 9727119 2753979 5800192 12116118 13740836
37847A3740836J953742J2769115K2088671J8536120P386848m88328n352770j2693134
$$ 13740836 15694578 28463693 50552364 69088484 76475332 75987004 70634234 57941100
37839E7941100j8765098j5975678q086843n645507q014551m529818N524981Q987430
$$ 57941100 39176002 23200324 15113481 9467974 1453423 -3076395 2448586 11436016
37831A1436016m25056j0762644r166378p761L883897K03999l269017k794801j291367
$$ 11436016 11010960 248316 -8918062 -8925823 -5041926 -4837927 -8106944 -10901745 -12193112
37822a2193112L66193L949546O766799M192771n65803M21416N750002M975697
$$ -12193112 -11826919 -7877373 -1110574 3082197 2516394 2937810 8687812 13663509
37814A3663509l748014q299361j406526O518262L253794n955181p486045q22794
$$ 13663509 9915495 1616134 209608 6727870 9981664 4026483 -3459562 -4282356
37806d282356L326847K241234K890713N504707J803596p732762j0419588q86414
$$ -4282356 -955509 1285725 4176438 9681145 11484741 3751979 -6667609 -7554023
37798g554023R472444R494097K676622k561905n136437n681228p18053P796612
$$ -7554023 1918421 11412518 14089140 11527235 6390798 709570 -8483 7788129
37790G788129Q691238j408838q467392j291388R390392P154516m430082r445076
$$ 7788129 16479367 15070529 6603137 5311749 14702141 21856657 17426575 7981499
37782G981499n109921j041797Q36645N591860Q636691J158671r675473q088468
$$ 7981499 2871578 1829781 2666426 8258286 16894977 18053648 8378175 289707
37774B89707K868641M911857k471693Q71755J8743976K6523724J0016198r148993
$$ 289707 3158348 8070205 5598512 6470267 25214243 51737967 61754165 52605172
37766E2605172o772676O331552M088773j2774217k0935324j2378089k100428l05688
$$ 52605172 45832496 52164048 56252821 43478604 22543280 10165191 8064763 7759075
37758G759075m34704K812797L521431j951359o863353n562192j722781j62273
$$ 7759075 7324371 10137168 13658599 11707240 4843887 -718305 -2441086 -2603359
37750b603359K67086J551365K227050J548402J207372P32073k296216n917856
$$ -2603359 -2336273 -784908 1442142 2990544 4197916 4929989 2633773 -3284083
37742c284083m586525J730408N795484L100188j879897k408189J625595M505626
$$ -3284083 -7870608 -6140200 -344716 2755472 875575 -1532614 92981 4598607
37734D598607K246909k607497l636244J496238O466531L442185m979818p494054
$$ 4598607 6845516 4238019 601775 2098013 8564544 12006729 7026911 -467143
37726d67143k63572O697711M605047j284599k228801j066362n118169j0355827
$$ -467143 -730715 5966996 10572043 9287444 7058643 5992281 874112 -9481715
37718i481715o866792K881224O259744J018212j386424M059814P065378r6209
$$ -9481715 -16348507 -13467283 -7207539 -6189327 -7575751 -3515937 3549441 3453232
37710C453232q300171m931633O631983J1519312L796868o695663p967754k36792
$$ 3453232 -4846939 -9778572 -3146589 8372723 12169591 5473928 -2493826 -2730618
37702b730618N566266J683701o437947o470700M145627J2994757Q593371l454804
$$ -2730618 2835648 4519349 -1918598 -8389298 -4243671 8751086 17344457 13889653
37694A3889653q182284k015175M387235L491386k29698j267784j901827m690675
$$ 13889653 5707369 3692194 8079429 11570815 11341117 10073333 8171506 3480831
37686C480831n502225j175134L058690J519171k096310q57799L537236L566844
$$ 3480831 -2021394 -3196528 -137838 1381333 -714977 -1572776 1964460 5531304
37678E531304j566585m584620j438532L312304M170864J964964N79974N90222
$$ 5531304 3964719 -619901 -2058433 1253871 5424735 7389699 7969673 8559895
37670H559895j51665j716899j743308K41597J417634J01363q88154J656558N041013
$$ 8559895 8408230 6691331 4948023 5189620 6607254 6708617 5820463 7477021 12518034
37661A2518034K952686m928230j0329071o795667R87092L237777j668457n708640
$$ 12518034 15470720 10542490 213419 -6582248 -5595156 -2357379 -4025836 -9734476
37653i734476k781417L697498O374738L080469k022232m112228k365859L76446
$$ -9734476 -12515893 -8818395 -2443657 636812 -1385420 -5497648 -7863507 -7487061
37645g487061J508920J686207K936467M120644J402006n338094j0197449q442200
$$ -7487061 -5978141 -4291934 -1355467 2765177 4167183 -1170911 -11368360 -19810560
37637a9810560k946025K84291K71909L93422J825530K624139K086279J429876
$$ -19810560 -22756585 -22472294 -22200385 -21806963 -19981433 -17357294 -15271015 -13841139
37629a3841139Q98285J15808K84079K285315L897187K595007l03402j723874j194619
$$ -13841139 -12942854 -12827046 -12542967 -10257652 -6360465 -3765458 -4068860 -5792734 -6987353
37620f987353Q4629J868279L243662J911040j315766j888824M81298n53063o647090
$$ -6987353 -6902724 -5034445 -1790783 120257 -1195509 -3084333 -2603035 -3156098 -9803188
37611i803188q746037j019196P047918M362067k801013o75103P590928N618006
$$ -9803188 -18549225 -19568421 -12520503 -8158436 -10959449 -11634552 -4043624 1574382
37603A574382q037517j4522430k950474J2793184J4530152L932855m112778k639568
$$ 1574382 -6463135 -20985565 -23936039 -11142855 3387297 7320152 3207374 567806
37595E67806L020758N465740J560978o577494j1355342n939350N337851J0028827
$$ 567806 3588564 9054304 10615282 4037788 -7317554 -13256904 -7919053 2109774
37587B109774M744741o97K762621N045200j635869j0337910q758666J371237P039440
$$ 2109774 6854515 6853818 9616439 14661639 13025770 2687860 -6070806 -4699569 2339871
37578B339871K811544l840907m919356p83780L323786L176785j824860p409974
$$ 2339871 5151415 1310508 -3608848 -4392628 -1068842 2107943 283083 -7126891
37570g126891p119551J27498P535552Q653878M576624j20974l705917n529727
$$ -7126891 -14246442 -14118944 -6583392 2070486 6647110 6526136 2820219 -2709508
37562b709508l446981J726828M070116M21715m050719l460461K47335J818438
$$ -2709508 -6156489 -4429661 -359545 62170 -3988549 -7449010 -7201675 -5383237
37554e383237J037150P39822Q67188J65057l38644m78553k623640n590567l380137
$$ -5383237 -4346087 -3606265 -2739077 -2574020 -2912664 -3391217 -6014857 -11605424 -14985561
37545a4985561M335852P916823J384758o936619o313263N20990L413975R87776
$$ -14985561 -10649709 -2732886 -1348128 -8284747 -14598010 -14077020 -10663045 -9675269
37537i675269j38165K034660L905906M460008M182548k87535r549876j3688123
$$ -9675269 -9813434 -7778774 -3872868 587140 4769688 4482153 -5067723 -18755846
37529a8755846l760321J1799313J5778920N991098l149642k803684P03148L46851
$$ -18755846 -22516167 -10716854 5062066 11053164 7903522 5099838 5802986 6149837
37521F149837j578172k128238l859218o777530m952981K793341Q119064N105677
$$ 6149837 4571665 2443427 -1415791 -8193321 -13146302 -10352961 -2233897 2871780
37513B871780j165936l626013l014804k788859j602206K367779N453803L659485
$$ 2871780 1705844 -1920169 -4934973 -7723832 -9326038 -6958259 -1504456 2155029
37505B155029m47601j874793p13680l03898r41340l73504J458927K316659J173194
$$ 2155029 1707428 -167365 -881045 -1184943 -2126283 -2499787 -1040860 1275799 2448993
37496B448993r04370k469369k769233j996449q49451Q83657L910154O356823M541331
$$ 2448993 1544623 -924746 -3693979 -5690428 -6539879 -5656222 -1746068 4610755 9152086
37487I152086l53823j393010L243647M668438l167828j0626964n352690O312468
$$ 9152086 8798263 7405253 10648900 15317338 12149510 1522546 -3830144 2482324
37479B482324O675691n250307j0890221j323434Q645991M647640n013655m460801
$$ 2482324 9158015 3907708 -6982513 -8305947 340044 4987684 -25971 -4486772
37471d486772M494969P592857J135699n489476o421965m472863j257634M892597
$$ -4486772 8197 7601054 8736753 3247277 -3174688 -7647551 -8905185 -4012588
37463d012588J0544186Q078642k361021j0583708r072426j478554M005057M118625
$$ -4012588 6531598 14610240 12249219 1665511 -7406915 -8885469 -4880412 -761787
37455g61787J032850j787981j585110K281903O487290N770536r83733q031897
$$ -761787 271063 -1516918 -3102028 -820125 5667165 11437701 10453968 2422071
37447B422071q044759k48459P666031P205323r25175o895793l972214K560108
$$ 2422071 -5622688 -5871147 1794884 9000207 8075032 1179239 -2792975 -232867
37439b32867L280988j741477m623877l038360k019176k112594K433260J0068810
$$ -232867 3048121 1306644 -3317233 -6355593 -8374769 -10487363 -8054103 2014707
37431B014707R108099m040016j5071449j0519338K801917Q837314N314967K354284
$$ 2014707 11122806 7082790 -7988659 -18507997 -15706080 -6868766 -1553799 800485
37423H00485L357717K187483k316522l389262P89891L471841R10070k771128m334824
$$ 800485 4158202 6345685 4029163 639901 1429792 4901633 5811703 3040575 -1294249
37414a294249n271512m917588K61463P733488Q998349K322117l564351k430072
$$ -1294249 -6565761 -11483349 -11221886 -3488398 5509951 7832068 4267717 1837645
37406A837645J398145K170740J225501J105307o26367n202848p132471j913084
$$ 1837645 3235790 5406530 6632031 7737338 7110971 1908123 -5224348 -7137432
37398g137432N792067Q126948M196185j092231m312108m744774k437077K49695
$$ -7137432 -1345365 6781583 10977768 9885537 5573429 828655 -1608422 -1358727
37390a358727p24375m588948m729442J261315O087278L142391l054753l906801
$$ -1358727 -2083102 -6672050 -11401492 -10140177 -4052899 -910508 -3965261 -7872062
37382g872062M06269L066349K156219J619833K592030J881759j356662m189085
$$ -7872062 -7465793 -4399444 -2243225 -623392 1968638 3850397 2493735 -1695350
37374a695350m838903l561793P0427N127667O600819J190029o020376p437966
$$ -1695350 -6534253 -10096046 -10025619 -4897952 1702867 2892896 -3127480 -10565446
37366a0565446l565087m91299P70211L618548O437886M272235m46830p4248M351873
$$ -10565446 -14130533 -14621832 -13851621 -10233073 -3795187 477048 30218 -44030 4307843
37357D307843L453446l612683n735948J318334N941447p27875r268407o821198
$$ 4307843 7761289 4148606 -1587342 -269008 5672439 4944564 -4323843 -11145041
37349a1145041K135260L916610j919594l690088J631299M388489P6400l233182
$$ -11145041 -9009781 -5093171 -7012765 -10702853 -9071554 -4683065 -4606665 -7839847
37341g839847L14650M260298J275297m399604l910482K554199O732774M085308
$$ -7839847 -7525197 -3264899 -1989602 -6389206 -10299688 -7745489 -1012715 3072593
37333C072593j598451m413694k802661K22646J058542l60523k81397L791667Q692139
$$ 3072593 1474142 -2939552 -5742213 -5519567 -4461025 -4821548 -5102945 -1311278 7380861
37324G380861R271102N686150K679809J780002k36292l977350m744988l39921
$$ 7380861 16651963 22338113 25017922 26797924 26561632 22584282 17839294 17499373
37316A7499373L858199K077224l558471o659284n533160l638543l031512k323401
$$ 17499373 21357572 23434796 19876325 13217041 7683881 4045338 1013826 -1309575
37308a309575o92045K21492r18596k950195l391622q35764L437233N856169L978928
$$ -1309575 -2001620 -1780128 -2698724 -5648919 -9040541 -9876305 -6439072 -582903 3396025
37299C396025j55585k243600j496456r74654j609920m91970K919621M043928M18053
$$ 3396025 3240440 996840 -499616 -1474270 -3084190 -3576160 -656539 3387389 3805442
37290C805442l016325j080622K978996K361468k281179m004646j063267M29401
$$ 3805442 789117 -291505 2687491 5048959 2767780 -1236866 -2300133 -1870732
37282a870732k933891n512959j015303P283752J0042871M089903l659426n508372
$$ -1870732 -4804623 -10317582 -11332885 -4049133 5993738 10083641 6424215 915843
37274I15843k646043k214148n883561o435352J238615R982994Q174824l199477
$$ 915843 -1730200 -3944348 -9827909 -16263261 -15024646 -5041652 3133172 -66305
37266f6305r804735l177400P575127R285074K832295j036540Q55262J708703j636091
$$ -66305 -9871040 -13048440 -5473313 3811761 6644056 5607516 6462778 8171481 6535390
37257F535390l806224j594493R9373k859980o556588n483089o52118L381984N012779
$$ 6535390 2729166 1134673 1234046 -1625934 -8182522 -13665611 -14317729 -10935745 -5922966
37248e922966M878604K932176L77632N03607L365162L690161j278995o016089
$$ -5922966 -1044362 1887814 2265446 2769053 6134215 9824376 8545381 2529292
37240B529292m440647L05265P18705l019211l923038m70366O34225m037620q171850
$$ 2529292 -1911355 -1606090 -887385 -3906596 -7829634 -8300000 -7665775 -11703395 -19875245
37231a9875245n076239K302955O168729M854056L134027L523452L293788M81585
$$ -19875245 -24951484 -22648529 -16479800 -11625744 -8491717 -4968265 -1674477 -1192892
37223a192892k143083j128053K661926N272975M344847R68848k171244l231732
$$ -1192892 -3335975 -4464028 -1802102 3470873 7815720 8784568 6613324 3381592
37215C381592k236008n80486L95980M14053j13543p01192n99897P51480K016470
$$ 3381592 1145584 565098 961078 1375131 1261588 560396 -39501 711979 2728449
37206B728449M40449l856686n946894j962654M374602N782945J704306j135905
$$ 2728449 3168898 -687788 -6634682 -8597336 -4222734 1560211 3264517 2128612
37198B128612L85688Q84908l992639r109072o660971K440149J0072066J1284474
$$ 2128612 2514300 3399208 -593431 -9702503 -16363474 -13923325 -3851259 7433215
37190G433215P530402J703542m033801o694612m514214k52432J911552J604475
$$ 7433215 14963617 16667159 12633358 5938746 1424532 1172100 3083652 4688127
37182D688127M94311j789732m782703l917735K790944Q171818M617394l298068
$$ 4688127 5182438 3392706 -1389997 -5307732 -2516788 5655030 10272424 6974356
37174F974356m847209P0666J596672l032031n705627k491004L53262q53141q37573
$$ 6974356 2127147 2197813 3794485 762454 -4943173 -7434177 -7080915 -7934056 -8771629
37165h771629K936845L983611j164461n311874k300174L238047M904137L906105
$$ -8771629 -5834784 -1851173 -3015634 -8327508 -10627682 -7389635 -2485498 1420607
37157A420607K505808j781345p644273o182857M893406J3084176P765437l434158
$$ 1420607 3926415 2145070 -5499203 -11682060 -6788654 6295522 14060959 10626801
37149A0626801n977840R52237O076223K852873m666789q487208l079736R143151
$$ 10626801 4648961 5601198 11677421 14530294 9863505 1376297 -1703439 7439712
37141G439712J5974650Q723510j727142K182708J4596459J2334023m035834o249113
$$ 7439712 23414362 32137872 30410730 32593438 47189897 59523920 55488086 49238973
37133D9238973J2437876K2558889J6769935L7731725J02462626J39030531O7828969
$$ 49238973 61676849 84235738 101005673 138737398 241200024 380230555 448059524
37126D48059524p1267366j49317811j11014624l4350095q229490k2450700j9780104
$$ 448059524 376792158 227474347 116459723 82109628 73880138 51429438 31649334
37119C1649334L798151J0170089o396989j6144900q923269k230405k254489J085138
$$ 31649334 35447485 45617574 39220585 23075685 14152416 11922011 9667522 10752660
37111A0752660N112237k532309j4697850j1819433L644844J0281060L585710m75040
$$ 10752660 15864897 13332588 -1365262 -13184695 -9539851 741209 4326919 3851879
37103C851879L120624K391272n093776p118052j293398O95446l225715j687940
$$ 3851879 6972503 9363775 4269999 -2848053 -4141451 -3446005 -6671720 -8359660
37095h359660O398278P788912m50703m659154J211876O242764L633206Q46337
$$ -8359660 -1961382 5827530 5376827 717673 1929549 8172313 11805519 12651856
37087A2651856K020958K2125o446942o852335J518211N762813j408776q942862
$$ 12651856 14672814 14694939 8247997 1395662 2913873 8676686 7267910 -1674952
37079a674952n746103K688141N511949J927261k797525n409595k820431O098295
$$ -1674952 -7421055 -4732914 779035 2706296 -91229 -5500824 -8321255 -2222960
37071b222960J2839718O902604n737032p849061J791714N315649m357550j1731820
$$ -2222960 10616758 17519362 11782330 3933269 5724983 11040632 6683082 -5048738
37063e048738o194781N18866k344114m727876L557453J1148058M567368o039937
$$ -5048738 -11243519 -10724653 -13068767 -17796643 -14239190 -3091132 1476236 -4563701
37055d563701k993054Q715072J0355031O49943m757917m65931L504024J668287
$$ -4563701 -7556755 1158317 11513348 12163291 7405374 6939443 10443467 12111754
37047A2111754j136265l003648o334991o998921N39609Q256844K901766j0598090
$$ 12111754 10975489 7971841 1636850 -5362071 -4822462 3434382 6336148 -4261942
37039d261942j3149963j082069P939362L563463k334657J818494P913819M003731
$$ -4261942 -17411905 -18493974 -10554612 -6991149 -9325806 -7507312 406507 4410238
37031D410238m693389n385750J361653M848720K227455j82155K34360M11156K53639
$$ 4410238 -283151 -5668901 -4307248 541472 2768927 2586772 2821132 3232288 3485927
37022C485927K108185K992660j771221p713786n405172L315050N276686l767980
$$ 3485927 5594112 8586772 6815551 -898235 -6303407 -2988357 2288329 -1479651
37014a479651j0560379l766467P909798Q313377j911648p274768j543542M637880
$$ -1479651 -12040030 -15806497 -7896699 416678 -1494970 -8769738 -10313280 -5675400
37006e675400K812224o13237K018736N121707R8066p950434o888138K901314Q757962
$$ -5675400 -2863176 -3476413 -1457677 3664030 3762096 -4188338 -11076476 -8175162 582800
36997E82800M815025j598161l917705m563284n633691k932590M492512Q448188
$$ 582800 5397825 3799664 -118041 -4681325 -10315016 -13247606 -8755094 -306906
36989c06906L052941n131981o483616k023079O83242O50198K971470P465115P565906
$$ -306906 2746035 -2385946 -8869562 -10892641 -10209399 -9559201 -6587731 877384 8443290
36980H443290J422321l977455k714458J712914J886948k902187n857500k187848
$$ 8443290 9865611 5888156 3173698 4886612 6773560 3871373 -1986127 -4173975
36972d173975M059095N062699j02054l748871j52040O042120O086038q67414p469082
$$ -4173975 -114880 4947819 4845765 1096894 944854 6986974 13073012 12205598 4736516
36963D736516q455532n263442r95284K773008L973092J439359j040611J237807
$$ 4736516 -3719016 -8982458 -9977742 -7204734 -3231642 -1792283 -2832894 -1595087
36955a595087N318534L659071l395101p007757l508180R98383K399308M097584
$$ -1595087 3723447 7382518 3987417 -3020340 -6528520 -5530137 -3130829 966755
36947I66755O414166K569586p413246j0707611k9032J2237659J0766418j03768
$$ 966755 7380921 9950507 2537261 -8170350 -8199382 4038277 14804695 14700927
36939A4700927m508464L69245L334380m16666l819853k975127k839795n326283
$$ 14700927 10192463 10561708 13896088 13479422 9659569 6684442 3844647 -1481636
36931a481636m816699L27500L151319o788k876937j19012L692055K211138k380961
$$ -1481636 -6298335 -5970835 -2819516 -2826304 -5703241 -5822253 -2130198 80940 -2300021
36922b300021l733740j030788J609536J927963P47434r24206k049555j120975
$$ -2300021 -6033761 -7064549 -5455013 -3527050 -2779616 -3703822 -5753377 -6874352
36914f874352J372386K374840O16171j088540j83993J783462K063803P04752p90630
$$ -6874352 -5501966 -3127126 -2510955 -3599495 -3783488 -2000026 63777 768529 -22101
36905b2101k085155k650418n66945L968205O204448K121120m718025n989447Q32169
$$ -22101 -2107256 -4757674 -5324619 -1356414 4848034 6969154 2251129 -3738318 -2906149
36896b906149Q428622Q422383J569296m291423n091849m417438n495786m900148
$$ -2906149 5522473 13944856 15514152 11222729 6130880 1713442 -3782344 -8682492
36888h682492J148912Q071086P453163o23181o810140n104360K76612K776485
$$ -8682492 -7533580 537506 7990669 7367488 557348 -4547012 -4270400 -1493915
36880a493915K075764J500374K125223L136829L818554K274157l269298r399643
$$ -1493915 581849 2082223 4207446 7344275 11162829 13436986 10167688 768045
36872G68045r277557k362529L719461M228043L133115L957750L213914j116819
$$ 768045 -8509512 -10872041 -7152580 -2924537 208578 4166328 7380242 6263423
36864F263423l170195R39403M926958K948296L43042L203593N224203j807235
$$ 6263423 3093228 4032631 8959589 11907885 12250927 15454520 20678723 18871488
36856A8871488j0896782q796685J660937M809933l008534q527066l631156L473985
$$ 18871488 7974706 -821979 838958 5648891 2640357 -5886709 -9517865 -6043880
36848f043880L912987Q84527K37844J20465k552808m526845k098702K435493N365390
$$ -6043880 -2130893 -1246366 -1008522 -888057 -3440865 -7967710 -10066412 -7630919 -2265529
36839b265529O105532L907622k292735p924116n585294K863774O641442K325114
$$ -2265529 3840003 7747625 5454890 -2469226 -8054520 -5190746 1450696 3775810
36831C775810r27350K303539L841187l410451j1532462r184078N41436N401759
$$ 3775810 2848460 5151999 8993186 5582735 -5949727 -15133805 -14592369 -9190610
36823i190610K325948o42386J591523M984245M200634m81074m821891n046663
$$ -9190610 -6864662 -7507048 -5915525 -931280 3269354 2788280 -2033611 -7080274
36815g080274r57434L163590K722146r74117k431827n50458M30341k71401J894582
$$ -7080274 -8037708 -4874118 -2151972 -3126089 -5557916 -6108374 -5678033 -5949434 -4054852
36806d054852P146736Q567433L264687k449455m042707n381522q236876n937468
$$ -4054852 3091884 11659317 14924004 12474549 8431842 3050320 -5186556 -11124024
36798a1124024L637793R237598K162690p672513n226537O472377J1264339M206983
$$ -11124024 -7486231 1751367 3914057 -3758456 -8984993 -2512616 8751723 12958706
36790A2958706l879119n065019l316107l484890l683802j704311M71464J291902
$$ 12958706 9079587 4014568 698461 -2786429 -6470231 -8174542 -7703078 -6411176
36782f411176J410947p6614m019238o172388j745549N449230O842178J872471
$$ -6411176 -5000229 -5076843 -9096081 -15268469 -17014018 -11564788 -4722610 -2850139
36774b850139j717199k12864K372290L042139L114139K369186q73881l396406
$$ -2850139 -4567338 -4780202 -2407912 634227 3748366 6117552 5243671 1847265
36766A847265l65695M557247K754707m802544p840586l462890l63996k950973
$$ 1847265 1481570 6038817 8793524 3990980 -3849606 -7312496 -7676492 -10627465
36758a0627465l974561J295898N750712L165732m34883K519409P788388O689375
$$ -10627465 -14602026 -13306128 -7555416 -4389684 -4824567 -2305158 5483230 12172605
36750A2172605K49120l762097l024393r98542P71691K327515R23241m863700r536974
$$ 12172605 12421725 8659628 5635235 4636693 5408384 7735899 8659140 3795440 -5741534
36741e741534o841914P26570N380324M716158K514926J273364M51240K06612P80711
$$ -5741534 -12583448 -11856878 -6476554 -1760396 754530 2027894 2479134 2685746 3466457
36732C466457J3124k986247m167001m08799L755767K090178k930019l174974K627885
$$ 3466457 3479581 493334 -3673667 -4082466 -326699 1763479 -1166540 -4341514 -1713629
36723a713629O862791L957683k934795p221967n929105p06290M290805N261995
$$ -1713629 5149162 9106845 6172050 -1049917 -6979022 -7685312 -3394507 1867488
36715A867488K478676K67909Q37752R09524k045180m256292j671992K406370K455396
$$ 1867488 4346164 4614073 5451825 6361349 4316169 59877 -1612115 794255 3249651
36706C249651J35379P57159L061684J527519k536946j982048L702512O435505
$$ 3249651 3385030 4142189 7203873 8731392 6194446 4212398 7914910 14350415
36698A4350415K007067m106840o019834m675939k797386K8273L517878M312617
$$ 14350415 16357482 12250642 6230808 1554869 -1242517 -1214244 2303634 6616251
36690F616251J298683j763176j925469p52502l83966q02176k182231m428892l973511
$$ 6616251 7914934 6151758 4226289 3473787 3089821 2287645 105414 -4323478 -8296989
36681h296989K037896Q058745N349709l891084p675195k140589K844155N45560
$$ -8296989 -6259093 1799652 7149361 3258277 -4416918 -6557507 -3713352 -3167792
36673c167792k096227J837315O280763K911443m263777n982488k224842J044457
$$ -3167792 -5264019 -3426704 2854059 5765502 1501725 -4480763 -6705605 -5661148
36665e661148L079338N403861M048497l343405q295250k345368P397519P297089
$$ -5661148 -2581810 2822051 6870548 3527143 -4768107 -7113475 284044 7581133
36657G581133j530129n568340p95526L067959P07225j460785J081913L578348
$$ 7581133 6051004 482664 -312862 2755097 3462322 2001537 3083450 6661798
36649F661798K233515Q7363r97227l299696n333848k261837L207059K495028l474460
$$ 6661798 8895313 8982676 7985449 4685753 -648095 -2909932 297127 2792155 -682305
36640f82305l963551K905588N964142Q11900k141622K700155M962563k179790
$$ -682305 -4645856 -1740268 4223874 5035774 2894152 5594307 10556870 8377080
36632H377080p330247k94220P908975K092832j0899610j2447319j451569O312619
$$ 8377080 1046833 752613 8661588 10754420 -145190 -12592509 -14044078 -7731459
36624g731459M269984J261585K678661L420749J179437Q07325K831452J555714
$$ -7731459 -3461475 -2199890 478771 3899520 5078957 5886282 8717734 10273448
36616A0273448k946101m053168j920195m213700j0774132j1121789j547603P965286
$$ 10273448 7327347 3274179 1353984 -2859716 -13633848 -24755637 -26303240 -18337954
36608a8337954Q988299N249928K827030R18118j879165k485391l64249k7031j565494
$$ -18337954 -9349655 -4099727 -1272697 -354579 -2233744 -4719135 -5083384 -5110415 -6675909
36599f675909R24826O514170N091506n234011j0915348k735763Q664925Q714619
$$ -6675909 -5751083 763087 5854593 620582 -10294766 -13030529 -4365604 4349015
36591D349015O45020k017060K645472M872594Q79560l120277k989179j028788
$$ 4349015 4994035 2976975 5622447 10495041 11374601 8254324 5265145 4236357
36583D236357J101543L745065M219520k77342n591910n403462j939862k550029
$$ 4236357 5337900 9082965 13302485 13025143 7433233 2029771 89909 -2460120
36575b460120o540444n713477J523164O928859N352874J433990L81966O03436
$$ -2460120 -9000564 -14714041 -13190877 -6262018 -909144 524846 906812 1510248
36567A510248o74276j812105j002717n1282j38160O82394K333971P39377n048575
$$ 1510248 835972 -976133 -1978850 -2030132 -2168292 -1485898 848073 1587450 -3461125
36558c461125r046103o332454m87269J845302L12011l08328J895987M262195M627295
$$ -3461125 -12507228 -18839682 -19326951 -17481649 -17169638 -17477966 -15581979 -11319784 -6692489
36549f692489L561822J848934m21397j949403p23509K527698L897786J088269
$$ -6692489 -3130667 -1281733 -1703130 -3652533 -4376042 -1848344 2049442 3137711
36541C137711k792926k545819J989855M651286O89119o057983p273712j127706
$$ 3137711 344785 -2201034 -211179 4440107 5129226 -928757 -8202469 -9330175
36533i330175N213111N284028R84898k029733k016110k91371K799697N765281
$$ -9330175 -4117064 1166964 2151862 122129 -1893981 -2185352 614345 6379626
36525F379626L989293l225199p197965m01212R561072P555343o470684j4653517
$$ 6379626 10368919 7143720 -54245 -455457 9105615 16660958 10190274 -4463243
36517d463243o243716N944698L955070q593497j1582930K242388J6781689J5044812
$$ -4463243 -10706959 -4762261 -807191 -9400688 -20983618 -18741230 -1959541 13085271
36509A3085271J249718p159099l141466L709209K998634l380589o776205l985124
$$ 13085271 14334989 7175890 4034424 7743633 10742267 7361678 585473 -3399651
36501c399651J147687M790697O005193L923782j995312q306092r533018n398449
$$ -3399651 -2251964 2538733 8543926 12467708 10472396 2166304 -7366714 -12765163
36493a2765163j243471M86653L416122Q850920J0686921M310079m704717p786647
$$ -12765163 -14008634 -13521981 -10105859 -1254939 9431982 13742061 9037344 1250697
36485A250697n242418l320928k958468n79084K106550l30870n602091m694099
$$ 1250697 -3991721 -7312649 -10271117 -10850201 -8743651 -9074521 -14676612 -19370711
36477a9370711L411040Q442850M337344j757458j664453J552869Q79958k467018
$$ -19370711 -15959671 -7516821 -3179477 -4936935 -6601388 -5048519 -4168561 -6635579
36469f635579k728564j62986Q69627Q47003L575020P739119P838203K898820k252170
$$ -6635579 -9364143 -9527129 -8657502 -7810499 -4235479 3503640 11341843 14240663 11988493
36460A1988493m096405l489585k301789j665872k472673l561898j632847K870754
$$ 11988493 7892088 4402503 2100714 434842 -2037831 -5599729 -7232576 -4361822
36452d361822L516241k729520q143486m227752M473663O372891O63517k187129
$$ -4361822 -845581 -3575101 -11718587 -15946339 -11472676 -5099785 -4436268 -6623397
36444f623397J928919M780842P50904l768487j931964K314989K130038p29042
$$ -6623397 -4694478 86364 837268 -2931219 -4863183 -2548194 -418156 -1147198
36436a147198m87494K427531L888881M013619M504904K370508m798533j0609656
$$ -1147198 -1634692 792839 4681720 8695339 13200243 15570751 10772218 162562
36428A62562o892402K508203N299459j312684o583587k992307K913942K209113
$$ 162562 -6729840 -4221637 1077822 -234862 -6818449 -9810756 -6896814 -4687701
36420d687701k107854j025515N075810O703127K86441o031244m520936J039935
$$ -4687701 -6795555 -7821070 -2745260 3957867 4244308 -1786936 -6307872 -5267937
36412e267937J742984k966517m947809N1416O093774N840170M69174l520621l761122
$$ -5267937 -3524953 -6491470 -11439279 -11387863 -5294089 546081 1015255 -2505366 -6266488
36403f266488k677557q81642L363582Q088733P782836J537358m565985n496973
$$ -6266488 -8944045 -9825687 -6462105 1626628 9409464 10946822 6380837 883864
36395H83864k660139O79005L498363M112653o9061o194676o494958Q9661M428819
$$ 883864 -1776275 -1097270 2401093 6513746 6444685 250009 -6244949 -6155288 -1726469
36386a726469J289560j760980K130394N857036M87407p268922m795977M605630
$$ -1726469 -436909 -2197889 -67495 5789541 6276948 -991974 -5787951 -1182321
36378a182321O820318J161690M93027O529460N549966o114204j2535875l640905
$$ -1182321 5637997 6799687 7292714 13822174 19372140 13257936 722061 -2918844
36370b918844P850150P179386n49100l170579j910285l144057k231437O360358
$$ -2918844 4931306 12110692 11561592 8391013 6480728 3336671 1105234 7465592
36362G465592J2694386M662939r250562j0465377P73261O992208J872822l204472
$$ 7465592 20159978 24822917 15572355 5106978 5880239 12872447 14745269 11540797
36354A1540797j478759J26803k569569l740634j484064k536622p747989q226383
$$ 11540797 10062038 10188841 7619272 3878638 2394574 -142048 -7890037 -16116420
36346a6116420j449801L668865L190314M231679Q736442P646109r20628m560929
$$ -16116420 -17566221 -13897356 -10707042 -6475363 2261079 9907188 8986560 4425631
36338D425631K136996N750822l719021j4132781j0249382J552027M849659p19634
$$ 4425631 6562627 12313449 8594428 -5538353 -15787735 -14235708 -9386049 -10105683
36330a0105683k914546J014152L505903K797996K946469J884777m034970p404352
$$ -10105683 -13020229 -12006077 -8500174 -5702178 -2755709 -870932 -4905902 -12310254
36322a2310254P87864J1633554P362400r658780j6600087l140086J3519229J4268075
$$ -12310254 -11522390 111164 7473564 -2185216 -18785303 -21925389 -8406160 5861915
36314E861915K919202m717921l810745m70339K397885O308051Q379815K929703
$$ 5861915 8781117 4063196 252451 -217888 2179997 8488048 16867863 19797566
36306A9797566p974302j3815260p937300L784340R280829L941064m469473n722161
$$ 19797566 11823264 -1991996 -9929296 -6144956 3135873 7076937 2607464 -3114697
36298c114697L5477L648301R53485j675411Q87395L162111j265811p359780n784700
$$ -3114697 -3079220 569081 1522566 -152845 734550 3896661 2630850 -4728930 -10513630
36289a0513630J886303N811235L057583o78613k508872l932201k330095O066990
$$ -10513630 -8627327 -2816092 241491 -437122 -2945994 -6878195 -9208290 -3141300
36281c141300J4253530R566996o093517j4897431p465512M070776M825850k454622
$$ -3141300 11112230 20679226 14585709 -311722 -7777234 -3706458 1119392 -1335230
36273a335230n268225o49987M035667L975496R18321k376628m013340j913067
$$ -1335230 -6603455 -7253442 -3217775 757721 1676042 -700586 -4713926 -6626993
36265f626993K970136N092153J160279m449943n747585l219856j294701j178034
$$ -6626993 -3656857 1435296 2595575 -1854368 -7601953 -10821809 -12116510 -13294544
36257a3294544r66304M0802J413357L294455M638916K941178j244796l312758
$$ -13294544 -14260848 -14220046 -12806689 -9512234 -4873318 -1932140 -3176936 -6489694
36249f489694j188415J327554R37145k01065N57131J511189Q66087O65275J946589
$$ -6489694 -7678109 -6350555 -5413410 -5614475 -5057344 -3546155 -2680068 -2014793 -68204
36240f8204J336008k220204k787010L794080J0984231R194122k51587o506441
$$ -68204 1267804 -952400 -3739410 54670 11038901 20233023 19981436 13474995
36232A3474995l751552K470934M116497M12201l168183k780550q99163k726776
$$ 13474995 9723443 12194377 16310874 16723075 13554892 10774342 9875179 7148403
36224G148403q007576r114572j022228R155352R465675l85805q204631o488471
$$ 7148403 -859173 -9973745 -10995973 -1840621 7625054 7239249 -965382 -7453853
36216g453853j077136Q74438J452941M194275N103864K39855m951680l436049
$$ -7453853 -8530989 -7656551 -6203610 -2009335 3094529 3334384 -1617296 -5053345
36208e053345J647302K400785j039319k505093j102975j117507k897532k549583
$$ -5053345 -3406043 -1005258 -2044577 -4549670 -5652645 -6770152 -9667684 -12217267
36200a2217267P25250M281786O951799P781193L456501n514160j0350098m774919
$$ -12217267 -11492017 -7210231 -258432 7522761 10979262 5465102 -4884996 -9659915
36192i659915L721537L678513k745869l869226J904830L991564k073109p475067
$$ -9659915 -5938378 -2259865 -5005734 -8874960 -6970130 -2978566 -5051675 -12526742
36184a2526742m865846J155372L325171K103760J369621J358569J155021K123610
$$ -12526742 -17392588 -16237216 -12912045 -10808285 -9438664 -8080095 -6925074 -4801464
36176d801464M332865M638954J754185j487441l095326l940350l461714K87412
$$ -4801464 -468599 4170355 5924540 4437099 1341773 -2598577 -6060291 -5772879
36168e772879M765377M306043n01458k441087O59240K268650r92268k724517K119417
$$ -5772879 -1007502 3298541 2797083 355996 1015236 3283886 2291618 -432899 1686518
36159A686518P540378N546325j335182m786604l370768k211924l051715k672551
$$ 1686518 9226896 14773221 13438039 8651435 5280667 3068743 17028 -2655523
36151b655523N2568K384960K630459J627423M6091j451621q24918K154531L179729
$$ -2655523 -2602955 -217995 2412464 4039887 4085978 2634357 1809439 3963970 7143699
36142G143699j218982p251403q062092l073148K179976M372225M734322L878558
$$ 7143699 5924717 -1326686 -9388778 -12461926 -10281950 -5909725 -1175403 2703155
36134B703155Q92598k050096j032308K178870J070582m512411n653192K107328
$$ 2703155 3595753 1545657 513349 2692219 3762801 -749610 -6402802 -4295474
36126d295474R317160M720285p495552j2418264n380662K274710J023626l287152
$$ -4295474 5021686 9741971 2246419 -10171845 -15552507 -13277797 -12254171 -15541323
36118a5541323m19235P272651Q694538J618098m047265j368359M529377O048337
$$ -15541323 -15960558 -8687907 6631 1624729 -2422536 -3790895 738482 6786819
36110F786819M104244L715228L995405L1855p226712j0259772n362768J656071
$$ 6786819 10891063 14606291 18601696 18633551 11406839 1147067 -4215701 -2559630
36102b559630L124902m36098j923329J618430M554541J352769m019016l169098
$$ -2559630 565272 129174 -1794155 -175725 4378816 5731585 1712569 -1456529
36094a456529L078202M006078m774106j2496414q073718K652694N233937j486451
$$ -1456529 1621673 5627751 853645 -11642769 -19716487 -17063793 -11829856 -13316307
36086a3316307m823330N94093N307937K535854m74319L763341R247226O576022
$$ -13316307 -18139637 -17545544 -12237607 -9701753 -10176072 -6412731 2834495 9410517
36078I410517j612259n784377m110620j953576j390416o60191m11161j856289
$$ 9410517 7798258 2013881 -2096739 -4050315 -5440731 -6100922 -6512083 -8368372
36070h368372j966886J638605M577391K009104k993416m828136m191756l581548
$$ -8368372 -10335258 -8696653 -4119262 -2110158 -5103574 -9931710 -14123466 -17705014
36062a7705014q2274P600581J1177358L834173n813862m256014N926855R866296
$$ -17705014 -17787288 -10186707 990651 4824824 -989038 -5245052 681803 10548099
36054A0548099L313837l039769k200979P03673M66529j108565k691954n744632
$$ 10548099 13861936 10822167 8621188 9324861 9791390 8682825 5990871 246239
36046B46239p084838j322990P080455O883609k018420o736124j073012O007049
$$ 246239 -6838599 -8161589 -1081134 5802475 3784055 -2952069 -4025081 1981968
36038A981968O153296K886226J459530p3207l106712l223965O05530K087587j102234
$$ 1981968 8135264 11021490 12481020 12407813 9301101 6077136 6682666 8770253 7668019
36029G668019k779939o03582j199626o649463q398545k311048K835445P84778
$$ 7668019 4888080 4284498 3084872 -3564591 -11963136 -14274184 -11438739 -10653961
36021a0653961r40157M323568Q747936L487254m801663m508004K219311M673263
$$ -10653961 -11594118 -7270550 1477386 4964640 162977 -4345027 -2125716 2547547
36013B547547P37717l638937n925891o236060j506136P716763J1268686K642844
$$ 2547547 3285264 -353673 -6279564 -12515624 -14021760 -6304997 4963689 7606533
36005G606533q018825p319414J026525L474389q94472j103707N168455P947626
$$ 7606533 -412292 -7731706 -6705181 -3230792 -4125264 -5228971 -60516 7887110
35997G887110K428948m147541n321048l349509j867198m54152J139971J263603
$$ 7887110 10316058 6168517 847469 -2502040 -4369238 -4823390 -3683419 -2419816
35989b419816L05143K03585M68408J51012J157688L716695K999711k735086o341091
$$ -2419816 -2114673 -1911088 -1442680 -1291668 -133980 3582715 6582426 3847340 -2493751
35980b493751k452058K676768J738693q54184J386044K947899l199262q794351
$$ -2493751 -4945809 -2269041 -530348 -1384532 1512 2949411 -249851 -9044202
35972i044202k062899R431486Q235850l762597p783521J98834L800686l824389
$$ -9044202 -11107101 -1675615 6560235 2797638 -4985883 -4787049 -986363 -4810752
35964d810752p991950J043774J1038589Q946746J098027q70032R01257j137117
$$ -4810752 -12802702 -11758928 -720339 8226407 9324434 8454402 9355659 8218542
35956H218542n123359o114598o233836o973742k490986P951873J2479580M205875
$$ 8218542 3095183 -3019415 -9253251 -16226993 -18717979 -10766106 1713474 5919349
35948E919349n005751k428630M725702K503489n195167l828797N889580Q823398
$$ 5919349 913598 -1515032 3210670 5714159 518992 -3309805 2579775 11403173
35940A1403173M60706p054833n373184m56711O68547m094Q43956J282477J6478
$$ 11403173 11863879 4809046 -564138 -1020849 -352302 -356396 487560 1770037 1786515
35931A786515j49232J242566K64131l627536n248403k308811P42794O74739K60260
$$ 1786515 1637283 2879849 3143980 -483556 -5731959 -8040770 -7297976 -6623237 -6362977
35922f362977J521484J096521k893762n252857q15820O717544Q838485L237621
$$ -6362977 -4841493 -3744972 -6638734 -11891591 -12707411 -5989867 2848618 6086239
35914F086239l981122o297808l203237J310736L614281K855284L75548j648936
$$ 6086239 2105117 -4192691 -7395928 -6085192 -2470911 384373 759921 -889015
35906h89015j232106K124308N940061N743174r824o401083o792998j615439J695069
$$ -889015 -2121121 3187 5943248 11686422 11676598 5275515 -1517483 -3132922 -1437853
35897a437853q14145l973213j811389L079198L960324N32283j539614l98433l62965
$$ -1437853 -2251998 -6225211 -8036600 -4957402 -997078 -464795 -2004409 -2402842 -2765807
35888b765807l754519o570311m716363J45961L912853N592332O207669M789304
$$ -2765807 -6520326 -13090637 -17807000 -17661039 -13748186 -8155854 -1948185 2841119
35880B841119l42096o793017q489823k696227N327617P479583K624140j786347
$$ 2841119 2499023 -4293994 -12783817 -15480044 -10152427 -2672844 -48704 -1835051
35872a835051K19939M413951K191263o064931r746061k277755R044018J2080243
$$ -1835051 -1615112 2798839 4990102 -1074829 -10820890 -13098645 -4054627 8025616
35864H025616M972399l330342n656301l590938j750914q93250P43731K948675
$$ 8025616 12998015 9667673 4011372 420434 -1330480 -2223730 -1479999 1468676
35856A468676L709750K472910P50573j44586l32979m37290p83864j755785l557133
$$ 1468676 5178426 7651336 8401909 8257323 7924344 7487054 6703190 4947405 1390272
35847A390272m793154k818236K423852O036077L237103l039106m309792J731226
$$ 1390272 -3402882 -6221118 -3797266 2238811 5475914 2436808 -1872984 -141758
35839a41758O960731M381819j472015k274365O27940k65235m389351l851276J394632
$$ -141758 6818973 11200792 9728777 7454412 8082352 7817117 3427766 -423510 971122
35830I71122J605768n782795r463893j688831Q197571P509865n78586l175884
$$ 971122 2576890 -3205905 -12669798 -14358629 -6161058 1348807 770221 -2405663
35822b405663K121227N542661J906827k684621k217756Q34544J535413j76002
$$ -2405663 -284436 5258225 7165052 4480431 2262675 3097219 4632632 4456630
35814D456630j539520j503393m41629J263920K508320J816940o18170k977738
$$ 4456630 2917110 1413717 972088 2236008 4744328 6561268 5943098 2965360
35806B965360l694180k037477J404732L287737j49944o698968q440172k431226
$$ 2965360 -728820 -2766297 -1361565 1926172 1776228 -4922740 -13362912 -15794138
35798a5794138L653937K189082k924990k817310K507963N831704N227817M813355
$$ -15794138 -12140201 -9951119 -12876109 -15693419 -13185456 -7353752 -2125935 2687420
35790B687420M537978J82039o108715o394323k12624L248813m24095m381544k783179
$$ 2687420 7225398 7407437 1298722 -5095601 -5308225 -2059412 -2483507 -6865051 -9648230
35781i648230L45526L03438M39055M245140O624937J751027o042129p870018k892842
$$ -9648230 -9302704 -8999266 -8560211 -4315071 2309866 4060893 -1981236 -9851254 -12744096
35772a2744096K442751M470055M291516K570547m11631j649511Q19208K946066
$$ -12744096 -10301345 -5831290 -1539774 1030773 619142 -1030369 -211161 2734905
35764B734905J07324m391741l448421K259488M343840j159999q398698r906144
$$ 2734905 2842229 -1549512 -4997933 -2738445 1605395 445396 -7953302 -17859446
35756a7859446m919158J990183O309631O371164M090449L423767N376306N580493
$$ -17859446 -22778604 -20788421 -14478790 -8107626 -4017177 -593410 4782896 10363389
35748A0363389M29051o100206o786328j281090L688589L789504R58490k063154
$$ 10363389 10792440 4692234 -2094094 -3375184 313405 4102909 5061399 2998245
35740B998245m688399n248721j418784M285646N564695J227956k676746k043954
$$ 2998245 -1690154 -6938875 -8357659 -4072013 1492682 2720638 43892 -2000062
35732b000062j33718q50817k541893k300883r94901J32622K564673N790383N058218
$$ -2000062 -2133780 -2984597 -5526490 -7827373 -8822274 -8689652 -6124979 -334596 4723622
35723D723622p76806m634914j005393M546682L359216k863623n349652k316629
$$ 4723622 3946816 -688098 -1693491 2853191 6212407 3348784 -2000868 -4317497
35715d317497j03544j233199j390279O22972k83122n520160q275597l626182L575789
$$ -4317497 -4421041 -5654240 -7044519 -6421547 -6704669 -12224829 -20500426 -24126608 -20550819
35706b0550819N992461L547914Q56033m57503j528887j819862q5417K428275L774356
$$ -20550819 -14558358 -11010444 -10154411 -10611914 -12140801 -13960663 -14046080 -11617805 -7843449
35697g843449M117107L603641O09291m143639n321202Q8548O377732N559732j287201
$$ -7843449 -3726342 -122701 486590 -3657049 -8978251 -8889703 -2511971 3047761 1760560
35688A760560n216552j806553L565125M221432Q59472j169495N3048J319052j12669
$$ 1760560 -3455992 -5262545 -1697420 2524012 3383484 2213989 2267037 3586089 3473420
35679C473420k280560j384149K188096L393232l90515m302695j855941N251374
$$ 3473420 1192860 -191289 1996807 5390039 4999524 696829 -1159112 4092262
35671D092262Q391463L708844l078920n607342m727248m009133l168778r05368
$$ 4092262 12483725 16192569 13113649 7506307 2779059 -1230074 -4398852 -5304220
35663e304220P24821M94014K012151P072654R317308K510899p913541j0479543
$$ -5304220 -4579399 -4085385 -2073234 4999420 14316728 16827627 8914086 -1565457
35655a565457l572114L082306K865982l64953o67977K090808N008326O204785
$$ -1565457 -5137571 -2055265 810717 445764 -222213 1868595 6876921 13081706
35647A3081706L902672k582625q954963q841008k590650K315489J399073j849709
$$ 13081706 16984378 14401753 5446790 -3394218 -5984868 -3669379 -2270306 -4120015
35639d120015k737760j131535J517804M894164P198656N547580J341150l53178
$$ -4120015 -6857775 -7989310 -6471506 -1577342 5621314 11168894 12510044 12156866
35631A2156866J222392J241508k004498m048497k672398k069729m651887n704238
$$ 12156866 13379258 14620766 12616268 8567771 5895373 3825644 -826243 -6530481
35623f530481j191129N016608O755380L551910j067364m333641m128816Q3947
$$ -6530481 -7721610 -2705002 4050378 7602288 6534924 2201283 -1927533 -1843586
35615a843586L365077o36936q606829r060303P82335R190855O991259L88843j134001
$$ -1843586 1521491 884555 -7722274 -16782577 -16000242 -6809387 181872 570715 -563286
35606e63286M28342q96936k148421J753673N784061K507716l904062m517937j135104
$$ -563286 -134944 -1031880 -3180301 -1426628 4357433 6865149 2961087 -1556850 -2691954
35597b691954j166053k176792K948873R330752N792187m421810o608530J177783
$$ -2691954 -3858007 -6034799 -3085926 6244826 12037013 7615203 1006673 2184456
35589B184456N291614N05024k196970K662645M573163k718843q088337k164881
$$ 2184456 7476070 7981094 5784124 8446769 13019932 10301089 2212752 47871
35581D7871N596263K965870m521361m331583J790886L341381L64509R10839M263566
$$ 47871 5644134 8610004 4088643 -242940 1547946 4889327 5253836 6164675 10428241
35572A0428241K941578j500628o89275L660236J105023q047750j0494526j341243
$$ 10428241 13369819 11869191 11179916 14840152 15945175 7897425 -2597101 -3938344
35564c938344O840611L294488n047240o124253j397046q90222n629165o734124
$$ -3938344 2902267 6196755 1149515 -4974738 -6371784 -7262006 -12891171 -19625295
35556a9625295m63627O039711N898935J953066J163833L963562M231170q52604
$$ -19625295 -20088922 -14049211 -8150276 -6197210 -5033377 -1069815 3161355 2308751
35548B308751n594841l236233L850448O416334J279258l832645j880030K739574
$$ 2308751 -3286090 -6522323 -2671875 3744459 5023717 1191072 -688958 2050616
35540B050616J686933l295461l175256L036729O460662L401062J099036L884471
$$ 2050616 3737549 442088 -2733168 303561 6764223 10165285 11264321 15148792
35532A5148792M517090k752164r998659p262241Q13640K565856j511171j590216
$$ 15148792 19665882 16913718 6915059 -347182 466458 3032314 1521143 -69073
35524f9073K156706k59839p967439o909564N520223J1427563l17293j3605349
$$ -69073 2087633 1827794 -6139645 -13049209 -7528986 3898577 3581284 -10024065
35516a0024065q590119O520837Q177683m914514j0800933o13574Q614956M208860
$$ -10024065 -18614184 -12093347 -3915664 -8830178 -19631111 -20244685 -11629729 -7420869
35508g420869j785561M389744J3457662R247806l368913o814585J96358K454981
$$ -7420869 -9206430 -4816686 8640976 17888782 14519869 7705284 7901642 10356623
35500A0356623n135420j0252609m701503L923633P231469P812957Q988205N861616
$$ 10356623 5221203 -5031406 -9732909 -5809276 1422193 9235150 18223355 24084971
35492B4084971m020382j1390872p456107J633885L201903l724044q945548p036738
$$ 24084971 20064589 8673717 1217610 2851495 6053398 2329354 -6616194 -13652932
35484a3652932k566322j23485J367045L095946L195034J576341J531984L823937
$$ -13652932 -16219254 -16342739 -14975694 -11879748 -8684714 -7108373 -5576389 -1752452
35476a752452M631765K054376n57690p72753j289784m003177n021176j108571
$$ -1752452 2879313 4933689 4375999 3603246 2313462 -1689715 -6710891 -7819462
35468g819462L222702J973911k049060j332933L517688M485496K40722r72753
$$ -7819462 -4596760 -2622849 -4671909 -6004842 -2487154 1998342 2239064 1266311
35460A266311L918165N942676r91110p939054m019455N554213P104919j57529
$$ 1266311 5184476 11127152 10136042 2196988 -1822467 3731746 10836665 10679136
35452A0679136m226613m16655K851034J8714l558986l488089l502292n250313
$$ 10679136 6452523 6035868 8886902 8905616 5346630 1858541 -1643751 -6894064
35444f894064k938949M905405R554307N940132J726844L578872N021634j204981
$$ -6894064 -9833013 -4927608 4626699 10566831 12293675 15872547 20894181 19689200
35436A9689200q638366p694591k400519k598857o301804m627813J156926L075080
$$ 19689200 11050834 3356243 955724 -1643133 -7944937 -12572750 -11415824 -8340744
35428h340744K466199N986113Q962235J263379j1177591j0792166L039056J0088261
$$ -8340744 -5874545 111568 9073803 10337182 -840409 -11632575 -8593519 1494742
35420A494742L29214j0572437o978545L035752L611771l115866l550732L855995
$$ 1494742 1823956 -8748481 -15727026 -12691274 -9079503 -12195369 -15746101 -11890106
35412a1890106Q030409M111429j382222k959762k106655p85151J490726L259898
$$ -11890106 -3859697 251732 -1130490 -4090252 -6196907 -6982058 -5491332 -2231434
35404b231434J413718k894039m403719q75989M165565O314646M666843J306736
$$ -2231434 -817716 -3711755 -8115474 -8991463 -4825898 1488748 6155591 7462327
35396G462327j120411j581667j735670l640388n777982m095473J721069O206124
$$ 7462327 6341916 4760249 3024579 -615809 -6393791 -10489264 -8768195 -2562071
35388b562071M479935j732988o291548n170572k905L483070J187279l594639k782558
$$ -2562071 1917864 184876 -6106672 -11277244 -11280149 -7797079 -6609800 -10204439 -12986997
35379a2986997N080692J0455642N552197l428702n342118j084683l74761m432108
$$ -12986997 -7906305 2549337 8101534 4672832 -669286 -1753969 -2128730 -6560838
35371f560838n195160j150538N03665j179353J109072O965377O214769k110879
$$ -6560838 -11755998 -12906536 -12402871 -13582224 -12473152 -5507775 706994 -1403885
35363a403885n086810K538255Q433670L655319k753340j561277M69448l696169
$$ -1403885 -6490695 -3952440 4481230 8136549 5383209 3821932 4291380 595211
35355E95211n140229M122502J1810188L275543j1822372j2693057n6348O899944
$$ 595211 -4545018 -422516 11387672 14663215 2840843 -9852214 -9908562 -3008618
35347c008618J987904k328102L05806K074806j55066J165418O790994O151637
$$ -3008618 -1020714 -3348816 -3043010 -968204 -1123270 42148 6833142 12984779
35339A2984779l399430r693671n288771J256956J301082p03900J559290M416755
$$ 12984779 9585349 -108322 -5397093 -4140137 -2839055 -3542955 -1983665 2433090
35331B433090K767735j71065o17762k060863o486937p024515P73651Q211624M872635
$$ 2433090 5200825 5029760 4411998 2351135 -4135802 -11160317 -10386666 -2175042 2697593
35322B697593m893093p881010j158686N189434L585146k065136m422482k552137
$$ 2697593 -2195500 -10076510 -11235196 -6045762 -2460616 -4525752 -8948234 -11500371
35314a1500371l34772P33325K902379O935894Q868429M439848m150120r444529
$$ -11500371 -11835143 -11101818 -8199439 -1263545 7604884 12044732 7894612 -1549917
35306a549917p702202k966194k55299P44084J817612J236349j937641l126444
$$ -1549917 -9252119 -12218313 -12473612 -11729528 -9911916 -8675567 -10613208 -13739652
35298a3739652J389330O898958O315690R44023k176268j056000O76350J386110
$$ -13739652 -12350322 -5451364 864326 1808349 -367919 -1423919 -747569 638541
35290F38541J760862K16361l834680n156134o4556M742801R76346o762439o924365
$$ 638541 2399403 2615764 -1218916 -6375050 -6439606 -1696805 -720459 -7482898 -14407263
35281a4407263P77004N649268L380483J15855n55267j322760j336827L647140
$$ -14407263 -13630259 -7980991 -4600508 -4484653 -5039920 -6362680 -7699507 -4052367
35273d052367R930259Q387204J55123l982203j601892j219942m870953m630415
$$ -4052367 5877892 14265096 14420219 10438016 8836124 7616182 2745229 -1885186
35265a885186L4006o62617o915719n378748O689823J2438113J963444j0168471
$$ -1885186 -1851180 -2513797 -9429516 -14808264 -8118441 4319672 6283116 -3885355
35257c885355p933534J902642M440838J032958J246793K569880k687189r109571
$$ -3885355 -11818889 -9916247 -5475409 -4442451 -3195658 -625778 -3312967 -12422538
35249a2422538n892499L256751N769659J153020n48836K468274K787941q90333
$$ -12422538 -18315037 -15058286 -9288627 -8135607 -8684443 -6216169 -3428228 -4318561
35241d318561k482437p35519P23330K782999P208551P675208j188334j0026135
$$ -4318561 -6800998 -7536517 -6813187 -4030188 3178363 10853571 9665237 -360898
35233c60898o070322N128375O750459k447188p136889j613847K572280j377503
$$ -360898 -6431220 -1302845 5447614 3000426 -4136463 -5750310 -3178030 -4555533
35225d555533m796796j239565K115998q68135l706678L72425O412195O996910
$$ -4555533 -9352329 -10591894 -8475896 -9344031 -13050709 -12678284 -6266089 730821
35217G30821L613905R61868r06276j969249Q59011N724031M474945m037075r528821
$$ 730821 4344726 5306594 4400318 2431069 3290080 9014111 13489056 9451981 -76840
35208g6840o285018k434577m546946m940098L655341J1639740O257978n693850
$$ -76840 -6361858 -8796435 -13343381 -18283479 -14628138 -2988398 3269580 -2424270
35200b424270o315503N424475J1896781M118685n908645n487339N58640Q94631
$$ -2424270 -8739773 -3315298 8581483 12700168 6791523 1304184 1862824 2757455
35192B757455l739310m231640N19055K544291j219497m052401n94460M949451
$$ 2757455 -981855 -5213495 -4694440 -2150149 -3369646 -7422047 -8016507 -3067056
35184c067056N877550K862717J422674K612754K206309j534617m902704m636428
$$ -3067056 2810494 5673211 7095885 9708639 11914948 10380331 5477627 841199
35176H41199k044485N07633K729044L592086J99184o495770r072015k412116P543362
$$ 841199 -1203286 -695653 2033391 5625477 5824661 -671109 -9743124 -12155240 -4611878
35167d611878J0058119L564650k822268k046949K464876K907867k819330r518557
$$ -4611878 5446241 9010891 6188623 4141674 6606550 9514417 6695087 -2823470
35159b823470j0619018m272186M705331Q778975N443914K49308l21571K695523
$$ -2823470 -13442488 -17714674 -13009343 -4230368 1213546 1462854 1141283 3836806
35151C836806L320600K22421j735097J81650K332538Q60356k422935l314630j385831
$$ 3836806 7157406 7379827 5644730 5826380 8158918 9019274 6596339 3281709 1895878
35142A895878K52939k20648j476722j751108j508139k310951l395994j340227
$$ 1895878 2148817 1928169 451447 -1299661 -2807800 -5118751 -8514745 -9854972
35134i854972M866905J0013864Q019187P75935l720928k905016k517102n488549
$$ -9854972 -4988067 5025797 13044984 13820919 10099991 7194975 4677873 -810676
35126h10676o112032o01549M679038L425675N13452K978750O303717J982986n831559
$$ -810676 -6922708 -7524257 -2845219 580456 1093908 4072658 10376375 12359361 6527802
35117F527802n551999J862560L413530m358497r586149m799097K010587K345920
$$ 6527802 975803 2838363 6251893 1893396 -7692753 -12491850 -10481263 -8135343
35109h135343J13346J408353K918660K12346j981573J609190N511114J877964
$$ -8135343 -8021997 -6613644 -3694984 -3482638 -5464211 -3855021 1656093 3534057
35101C534057n541840o904747j809013J580479O82621J080103N096716P475788
$$ 3534057 -2007783 -8912530 -10721543 -9141064 -8458443 -7378340 -2281624 5194164
35093E194164M462843j73880j081430J539256L224971Q82262m254098p773552
$$ 5194164 9657007 9483127 8401697 9940953 13165924 14048186 9794088 2020536
35085B020536o197318q90288L340924M156810L544918L000656J095217k057668
$$ 2020536 -4176782 -5067070 -1726146 2430664 5975582 8976238 10071455 8013787
35077H013787k687537Q25470M336923L967211J523518j33509k362818o238051
$$ 8013787 5326250 6151720 10488643 14455854 15979372 15845863 13483045 7244994
35069G244994p484707k514933L961126M383754r30057n254121n635307m601354
$$ 7244994 -239713 -2754646 1206480 5590234 4660177 -593944 -6229251 -10830605
35061a0830605l242466k27219K604258J383948k047826q80434N955730J0507942
$$ -10830605 -14073071 -14300290 -11696032 -10312084 -12359910 -13240344 -7284614 3223328
35053C223328O782811n48735l144825p25265n1477l703257n983336j891285M347627
$$ 3223328 10006139 9457404 6312579 5587314 5535837 1832580 -4150756 -6042041 -1694414
35044a694414M400680j898237n214458K35964P733470P278236k41278n379272
$$ -1694414 2706266 808029 -4406429 -4170465 3563005 10841241 10599963 5220691
35036E220691m350286j991118q77639K085706N906456L472784n301546q816490
$$ 5220691 870405 -1120713 -1998352 87354 5993810 9466594 4165048 -4651442
35028d651442l27483R934990R067991L47779l621986p66894K60505l578438o315666
$$ -4651442 -4978925 4956065 14024056 14371835 10749849 9982955 10243460 6665022 349356
35019C49356n216382m222700m291604j301928M706081Q098631P193771N963694
$$ 349356 -4867026 -9089726 -13381330 -14683258 -9977177 -1878546 5315225 11278919
35011A1278919M960515M62165n701482o221263j062132P82715l691512n849175
$$ 11278919 16239434 16701599 11000117 4778854 3716722 4499437 807925 -5041250
35003e041250l52583N210969L130156j971896k451027o31194k173057l822637
$$ -5041250 -5393833 -182864 2947292 975396 -1475631 -2106825 -4279882 -8102519
34995h102519N42221O858180O154075j79231k658079J43666K93167l923805l991911
$$ -8102519 -7560298 -702118 5451957 5272726 2614647 2758313 3051480 -872325 -4864236
34986d864236L334775Q221748K482030o897592p834529p86941L420478M99386
$$ -4864236 -1529461 6692287 9174317 2276725 -5557804 -6344745 -2924267 -2424881
34978b424881k548546r9930L627160K442501k024813l845176k296655j884495
$$ -2424881 -4973427 -5073357 -1446197 996304 -1028509 -4873685 -7170340 -9054835
34970i054835m224264n563988k993108J512337M740384O105384O008393L899492
$$ -9054835 -13279099 -18843087 -21836195 -20323858 -15583474 -9478090 -3469697 429795
34962D29795M05694j720051j422139j139139k058702j152326L270903O716889
$$ 429795 835489 -884562 -2306701 -3445840 -5504542 -6656868 -3385965 3330924
34954C330924M434468o83187k212046j05457M15110j332236o64906L023162M065882
$$ 3330924 7765392 7082205 4870159 4764702 5179812 3847576 3182670 6205832 10271714
34945A0271714J1032m072201m105942l143498m736615o036854k771040L159181
$$ 10271714 10282746 6210545 2104603 -1038895 -5775510 -11812364 -14583404 -11424223
34937a1424223O204038M401509L1620m148802n856859l608917M48029J273296
$$ -11424223 -5220185 -818676 -787056 -4935858 -10792717 -14401634 -13953605 -12680309
34929a2680309k096448l904970K43577O458158Q115395M782363P22477k204875
$$ -12680309 -14776757 -18681727 -18438150 -11979992 -3864597 917766 1640243 -564632
34921e64632m607814n052098j399049M458458Q003436P300618L259324k915579
$$ -564632 -5172446 -10224544 -11623593 -7165135 838301 8138919 11398243 8482664
34913H482664q426101q277689j565354M352479K348561l893668m768119J194412
$$ 8482664 56563 -8221126 -9786480 -5434001 -3085440 -6979108 -11747227 -10552815
34905a0552815N787787L458962k449942o558450p140110l579186M257094J1527850
$$ -10552815 -4765028 -1306066 -3756008 -10314458 -17454568 -21033754 -16776660 -5248810
34897e248810J0606709J631066n381208l268554L055165M841799J507397j595173
$$ -5248810 5357899 6988965 1607757 -1660797 1394368 6236167 7743564 6148391
34889F148391k874506m532638n284207j046119O659785R949915M795512k966323
$$ 6148391 3273885 -1258753 -6542960 -7589079 -929294 9020621 13816133 10849810
34881A0849810n199819j616539J559999R64320o40678m59487r7964j400631j823549
$$ 10849810 5649991 4033452 5593451 6557771 5917093 5457606 5359642 3959011 2135462
34872B135462J446945N037524L068202k967948m845890n5418L559706p6889n339070
$$ 2135462 3582407 8619931 11688133 8720185 3874295 3818877 7378583 7301694 1962624
34863A962624l838545K311709M889856L256495L344353M884633J300589o658729
$$ 1962624 -1875921 435788 5325644 8582139 11926492 16811125 18111714 11452985
34855A1452985r025865k291702L833551J370347l870255l103684Q24243l16135
$$ 11452985 2427120 135418 3968969 5339316 1469061 -1634623 -810380 -1126515
34847a126515n023482m471499K375481O888831M409931M00427P10110L258653
$$ -1126515 -6149997 -10621496 -8246015 -1357184 3052747 3453174 4163284 7421937
34839G421937K963590k89052k348646o02523L410129N567431K678568l721085
$$ 7421937 10385527 10096475 7747829 7145306 10555435 16122866 18801434 15080349
34831A5080349p568654m937357M44884J957805o70365j840547M02222J440939
$$ 15080349 7511695 2574338 3019222 4977027 4306662 2466115 2868337 4309276
34823D309276j613563m716497l527015k28071R75852J140755L518391N887044
$$ 4309276 2695713 -2020784 -5547799 -5775870 -4800018 -3659263 -140872 5746172
34815E746172K957308l946694o811052k529216J945672K8249m517296m118419
$$ 5746172 8703480 4756786 -2054266 -4583482 -2637810 -2609561 -7126857 -11245276
34807a1245276O5741L17615m078158m650560K516437R396512P667333R33572j762460
$$ -11245276 -11179535 -10861920 -14940078 -19590638 -17074201 -7677689 -10356 923216 -839244
34798h39244M79092J766169J004600K516070N995012N589563K70539l826987l711318
$$ -839244 -360152 1406017 2410617 4926687 10921699 16511262 16781801 12954814 9243496
34789I243496l518623n003065l000682M516834J0099013P278037O44132j880755
$$ 9243496 5724873 721808 -2278874 2237960 12336973 19615010 20259142 18378387
34781A8378387j064672k596236o007882o222490l188691j309942j009379Q82827
$$ 18378387 17313715 14717479 8709597 2487107 -701584 -2011526 -3020905 -2138078
34773b138078L275004J454100m172081p195159m057629K061759O714297Q108191
$$ -2138078 1136926 2591026 -1581055 -8776214 -12833843 -10772084 -4057787 4050404
34765D050404N560148k16240m853196l844974R90667L396498J279495j327609
$$ 4050404 9610552 9394312 4541116 696142 1686809 5083307 6362802 5035193
34757E035193r14035J730780M393690N501365L611427p57848l720759k886526
$$ 5035193 4121158 5851938 10245628 15746993 19358420 18600572 14879813 11993287
34749A1993287j655782l427075m489776J20325O282788N230209k757507q347429
$$ 11993287 10337505 6910430 2420654 2540979 8823767 14053976 11296469 2949040
34741B949040o759036k231505J177035L492052L049611k475561p781109m003099
$$ 2949040 -3809996 -6041501 -4864466 -1372414 1677197 -798364 -8579473 -12582572
34733a2582572O278601R843395K452976m596834k921213P15762j551001m588447
$$ -12582572 -6303971 3539424 5992400 1395566 -1525647 -809885 -2360886 -6949333
34725f949333q08361N089526L966507k155588m143754n49174K471270K432321
$$ -6949333 -7757694 -2668168 1298339 -857249 -5001003 -5550177 -3078907 -646586
34717f46586J916133J442359m59295k401943k411812k024376k251735k34456L984265
$$ -646586 1269547 2711906 2252611 -149332 -2561144 -4585520 -6837255 -7071711 -3087446
34708c087446L780752l399031q788872m821806K288791L171416J306992N406152
$$ -3087446 693306 -2705725 -11494597 -16316403 -14027612 -10856196 -9549204 -4143052
34700d143052J1666767Q748350k550520r733629p845711l975247k516194r0954
$$ -4143052 7523715 16272065 13721545 3987916 -3857795 -7833042 -10349236 -10440190
34692a0440190L577203L426978J8567L3047L461762K885993j939603j983989M900146
$$ -10440190 -6862987 -3436009 -3417442 -3384395 77367 2963360 1023757 -960232 3939914
34683C939914Q855129M016263k800717m969234n489004p245995n735919R12714
$$ 3939914 12795043 16811306 14010589 9041355 3552351 -3693644 -9429563 -8516849
34675h516849N429994K944313p22998j2907R91033j680494k789237K017494O381081
$$ -8516849 -3086855 -142542 -865540 -878447 112586 -1567908 -4357145 -2339651 4041430
34666D041430L791508o35662J08483J627924l132699q961579o028146K454733
$$ 4041430 7832938 7197276 7305759 8933683 5800984 -3160595 -9188741 -6734008
34658f734008M606205o54291k789009J986853N228453J418410l420433k498521
$$ -6734008 -2127803 -2782094 -5571103 -3584250 1644203 3062613 -357820 -2856341
34650b856341J762956L434706J943066O45855J098308K160870J940298q58481
$$ -2856341 -1093385 2341321 4284387 4930242 6028550 8189420 10129718 9271237
34642I271237m996805o384810k838751K030739L527732K655818L332251M730567
$$ 9271237 4274432 -2110378 -4949129 -2918390 609342 3265160 6597411 11327978
34634A1327978K589731k619207n327156l182981p3495Q8498k196883m486630n018538
$$ 11327978 13917709 11298502 5971346 2788365 2714870 2803368 606485 -3880145 -8898683
$$ [...]
##END NTUPLES=NMR SPECTRUM
##END=
