##TITLE=31Pdec_SRLeu_Ac20
 , 24 sc
 27.09.2021
##JCAMPDX= 6.0         $$ Bruker NMR JCAMP-DX V2.0
##DATA TYPE= NMR SPECTRUM
##DATA CLASS= NTUPLES
##ORIGIN= UXNMR, Bruker Analytische Messtechnik GmbH
##OWNER= root
$$ XWIN-NMR		Version 3.5
$$ Mon Sep 27 12:05:49 2021 Russian Standard Time (UT+4h)  she@DPX200
##.OBSERVE FREQUENCY= 81.013821
##.OBSERVE NUCLEUS= ^31P
##.ACQUISITION MODE= SIMULTANEOUS
##.ACQUISITION SCHEME= undefined
##.AVERAGES= 24
##.DIGITISER RES= 16
##SPECTROMETER/DATA SYSTEM= spect
##.PULSE SEQUENCE= zgpg30
##.SOLVENT NAME= CDCl3
##.SHIFT REFERENCE= (INTERNAL, CDCl3, 0, 248.564)
##AUDIT TRAIL= $$ (NUMBER, WHEN, WHO, WHERE, WHAT)
$$ ##TITLE= Audit trail, XWIN-NMR		Version 3.5
$$ ##JCAMPDX= 5.01
$$ ##ORIGIN= Bruker BioSpin GmbH
$$ ##OWNER= she
$$ F:/spectra/data/she/nmr/P31/1/pdata/1/auditp.txt
$$ ##AUDIT TRAIL=  $$ (NUMBER, WHEN, WHO, WHERE, WHAT)
(   1,<2021-09-27 12:04:37.57 +0400>,<she>,<DPX200>,
      <created by zg, POWCHK disabled, PULCHK disabled
       configuration hash MD5:
       00 E9 B6 7A A2 85 ED C7 34 08 36 98 17 FE 4E 26
       data hash MD5: 32K
       80 C4 88 13 32 5C A3 0E E6 42 64 BD 69 E4 C8 E9>)
(   2,<2021-09-27 12:04:41.17 +0400>,<she>,<DPX200>,
      <Start of raw data processing
       efp BC_mod = 2 LB = 1 FT_mod = 6 PKNL = 1 PHC0 = -8952.579 PHC1 = 1222.27 SI = 64K 
       data hash MD5: 64K
       6A EB 54 83 0A 3B 29 79 26 8C 1F F4 76 66 F2 22>)
(   3,<2021-09-27 12:04:58.75 +0400>,<she>,<DPX200>,
      <pk PHC0 = 10.49532 PHC1 = 0 
       data hash MD5: 64K
       6C 20 3B 8A 7D E6 BA 1B C1 90 33 90 FB DF AC CB>)
(   4,<2021-09-27 12:05:01.03 +0400>,<she>,<DPX200>,
      <abs ABSG = 5 
       data hash MD5: 64K
       81 E6 90 29 D1 BC 4D AC 87 BA F0 13 90 82 50 63>)
$$ ##END=
$$ 
$$ hash MD5
$$ B4 BA C7 BD A8 B2 21 5A C0 79 07 14 46 C2 D1 06
##$RELAX= 
##$RELAX= 
##$RELAX= 
##$RELAX= 
##$RELAX= 
##$RELAX= 
##$RELAX= 
##$RELAX= 
$$ Bruker specific parameters
$$ --------------------------
##$DU= <F:/spectra>
##$EXPNO= 1
##$NAME= <P31>
##$PROCNO= 1
##$TYPE= <nmr>
##$USER= <she>
##$AMP= (0..31)
100 100 100 100 100 100 100 100 100 100 100 100 100 100 100 100 100 100 
100 100 100 100 100 100 100 100 100 100 100 100 100 100 
##$AQSEQ= 0
##$AQ_mod= 1
##$AUNM= <au_zg>
##$AUTOPOS= <>
##$BF1= 81.014009
##$BF2= 200.13
##$BF3= 200.13
##$BF4= 200.13
##$BF5= 200.13
##$BF6= 200.13
##$BF7= 200.13
##$BF8= 200.13
##$BYTORDA= 1
##$CFDGTYP= 0
##$CFRGTYP= 5
##$CHEMSTR= <none>
##$CNST= (0..31)
1 1 145 1 1 1 1 1 1 1 1 1 1 1 1 1 1 1 1 1 1 1 1 1 1 1 1 1 1 1 1 1 
##$CPDPRG= <waltz16>
##$CPDPRG1= <>
##$CPDPRG2= <waltz16>
##$CPDPRG3= <>
##$CPDPRG4= <mlev>
##$CPDPRG5= <mlev>
##$CPDPRG6= <mlev>
##$CPDPRG7= <mlev>
##$CPDPRG8= <mlev>
##$CPDPRGB= <>
##$CPDPRGT= <>
##$D= (0..31)
0 1 0 0 0 0 0 0 0 0 0 0.03 2e-05 3e-06 0 0 0 0 0 0 0 0 0 0 0 0 0 0 0 0 
0 0 
##$DATE= 1632729877
##$DBL= (0..7)
120 120 120 11 120 120 24 19 
##$DBP= (0..7)
150 150 150 150 150 150 150 150 
##$DBP07= 0
##$DBPNAM0= <>
##$DBPNAM1= <>
##$DBPNAM2= <>
$$ [...]
##$SUBNAM3= <"">
##$SUBNAM4= <"">
##$SUBNAM5= <"">
##$SUBNAM6= <"">
##$SUBNAM7= <"">
##$SUBNAM8= <"">
##$SUBNAM9= <"">
##$SW= 501.771253377433
##$SWIBOX= (0..15)
0 1 3 0 0 0 0 0 0 0 0 0 0 0 0 0 
##$SW_h= 40650.406504065
##$TD= 32768
##$TD0= 1
##$TE= 0
##$TE2= 300
##$TE3= 300
##$TEG= 300
##$TL= (0..7)
0 120 53 12 22 120 120 120 
##$TP= (0..7)
150 150 150 150 150 150 150 150 
##$TP07= 0
##$TPNAME0= <>
##$TPNAME1= <>
##$TPNAME2= <>
##$TPNAME3= <>
##$TPNAME4= <>
##$TPNAME5= <>
##$TPNAME6= <>
##$TPNAME7= <>
##$TPOAL= (0..7)
0.5 0.5 0.5 0.5 0.5 0.5 0.5 0.5 
##$TPOFFS= (0..7)
0 0 0 0 0 0 0 0 
##$TUNHIN= 0
##$TUNHOUT= 0
##$TUNXOUT= 0
##$USERA1= <user>
##$USERA2= <user>
##$USERA3= <user>
##$USERA4= <user>
##$USERA5= <user>
##$V9= 5
##$VALIST= <valist>
##$VCLIST= <CCCCCCCCCCCCCCC>
##$VD= 0
##$VDLIST= <DDDDDDDDDDDDDDD>
##$VPLIST= <PPPPPPPPPPPPPPP>
##$VTLIST= <TTTTTTTTTTTTTTT>
##$WBST= 1024
##$WBSW= 4
##$XGAIN= (0..3)
0 0 0 0 
##$XL= 0
##$YL= 0
##$YMAX_a= 5734
##$YMIN_a= -7495
##$ZGOPTNS= <>
##$ZL1= 120
##$ZL2= 120
##$ZL3= 120
##$ZL4= 120
##$ABSF1= 248.5645
##$ABSF2= -253.2056
##$ABSG= 5
##$ABSL= 3
##$ALPHA= 0
##$AQORDER= 0
##$ASSFAC= 0
##$ASSFACI= 0
##$ASSFACX= 0
##$ASSWID= 0
##$AUNMP= <proc_1d>
##$AZFE= 0.1
##$AZFW= 0.5
##$BCFW= 0
##$BC_mod= 2
##$BYTORDP= 0
##$COROFFS= 0
##$CY= -3
##$DATMOD= 1
##$DC= 0
##$DFILT= <>
##$DTYPP= 0
##$F1P= 0
##$F2P= 0
##$FCOR= 1
##$FTSIZE= 65536
##$FT_mod= 6
##$GAMMA= 0
##$GB= 0
##$INTBC= 1
##$INTSCL= 5.30512e-09
##$ISEN= 30
##$LB= 1
##$LEV0= 0
##$LPBIN= 0
##$MAXI= 10000
##$MC2= 0
##$MEAN= 0
##$ME_mod= 0
##$MI= 50
##$NCOEF= 0
##$NC_proc= -8
##$NLEV= 6
##$NOISF1= 182.463
##$NOISF2= 159.3651
##$NSP= 0
##$NTH_PI= 0
##$NZP= 0
##$OFFSET= 248.5645
##$PC= 4
##$PHC0= -8942.084
##$PHC1= 1222.27
##$PH_mod= 1
##$PKNL= yes
##$PPARMOD= 0
##$PSCAL= 0
##$PSIGN= 0
##$REVERSE= no
##$SF= 81.014009
##$SI= 65536
##$SIGF1= 159.3651
##$SIGF2= -187.1042
##$SINO= 113.3802
##$SIOLD= 16384
##$SREGLST= <1H.CDCl3>
##$SSB= 0
##$STSI= 65536
##$STSR= 0
##$SW_p= 40650.406504065
##$SYMM= 0
##$S_DEV= 0
##$TDeff= 32768
##$TDoff= 0
##$TI= <>
##$TILT= no
##$TM1= 0
##$TM2= 0
##$TOPLEV= 0
##$USERP1= <user>
##$USERP2= <user>
##$USERP3= <user>
##$USERP4= <user>
##$USERP5= <user>
##$WDW= 1
##$XDIM= 65536
##$YMAX_p= 216688121
##$YMIN_p= -496516472
$$ End of Bruker specific parameters
$$ ---------------------------------
##NTUPLES= NMR SPECTRUM
##VAR_NAME=  FREQUENCY,     SPECTRUM/REAL,   SPECTRUM/IMAG
##SYMBOL=    X,             R,               I
##VAR_TYPE=  INDEPENDENT,   DEPENDENT,       DEPENDENT
##VAR_FORM=  AFFN,          ASDF,            ASDF
##VAR_DIM=   65536,         65536,           65536
##UNITS=     HZ,            ARBITRARY UNITS, ARBITRARY UNITS
##FACTOR=    0.620285442955139, 1,           1
##FIRST=     20137.2065510759, 0,            0
##LAST=      -20513.1999529892, 0,           0
##MIN=       -20513.1999529892, -496516472,  0
##MAX=       20137.2065510759, 216688121,    0
$$ Real data points
##PAGE= N=1
##DATA TABLE= (X++(R..R)), XYDATA
$$ [...]
15145 3515373 882744 -214375 -2433924 -5412562 -5139808 -668641 3489217 2942046
15137 2942046 -1671883 -6196641 -7307575 -4989289 -2120481 -1547864 -2823169 -2782348 -11514
15128 -11514 3070980 3692280 2084426 -273036 -3453960 -7785851 -11531986 -12407381 -10367615
15119 -10367615 -7023599 -3538171 -807238 -126323 -1504158 -2471432 -691320 2890885
15111 2890885 5078974 4066594 1044568 -1210405 -946370 556969 76365 -2885984
15103 -2885984 -3900281 582842 6430419 6090605 -166185 -3673018 -94009 4040988
15095 4040988 1730445 -3722490 -4434546 146077 4122673 5002829 5237754 5334600 3015489
15086 3015489 -358199 415721 5982110 9395114 4644108 -5442777 -12821837 -13406349
15078 -13406349 -10028962 -7691535 -8239769 -9707320 -9687004 -8469196 -8166862 -9076434 -8861900
15069 -8861900 -6291306 -3734561 -4082693 -6679636 -8308166 -7121074 -3952039 -941857
15061 -941857 -221952 -2290884 -4348178 -2441650 3162124 7457770 7444880 6040239 6580739
15052 6580739 7273268 5178366 2260794 2308967 4292884 4220064 1796538 -205797 -1542469
15043 -1542469 -3519487 -3807512 961812 7698820 9069531 4192240 325323 2022043
15035 2022043 5132746 4437417 1246146 -436605 -422471 -709460 -907662 640696 3592583
15026 3592583 6579374 9294669 11309520 11308991 9581051 8544365 8921644 8469229 6299912
15017 6299912 4733463 4653937 3300876 -338676 -2453171 -675141 997821 -1384294
15009 -1384294 -4318143 -2045954 3760026 6555214 5583792 6358670 10264293 11270963
15001 11270963 5461896 -2301530 -4866830 -1723866 2085694 2978697 1453667 -319488
14993 -319488 -776124 112749 688737 -432493 -1868128 -1245821 263871 -1184482 -5462494
14984 -5462494 -6954873 -2428231 3539700 4879930 2515938 1842016 4270830 6817674
14976 6817674 8603989 11536690 14509843 13325561 8027932 4493750 5961787 8187865
14968 8187865 6710090 4179743 5385481 8452459 7103059 260191 -6454948 -8845284
14960 -8845284 -8553649 -8378674 -7807605 -5271047 -1483251 1735237 3737738 4428323 3364070
14951 3364070 1124155 -145046 812424 2620442 3252383 2562431 1754847 1523562 1850520
14942 1850520 2741617 4186163 5884641 7327679 7609814 5680527 2044672 -614672
14934 -614672 -604355 -187891 -2366856 -5162885 -3244066 3866049 9483634 7888126 1291160
14925 1291160 -3863841 -4502596 -2021710 1305279 3618320 3321139 1040901 171729 2577056
14916 2577056 5584897 6176709 5812730 7301259 9085092 7488358 3359591 1093291
14908 1093291 1213163 -471319 -5193964 -8152758 -5767364 -1603971 -1226555 -3960234
14900 -3960234 -4118367 544368 5682246 6497843 4110333 3641513 7059094 10485333 9520021
14891 9520021 5387628 3463231 6131917 9856908 10190304 7254691 4600841 4454898
14883 4454898 5946574 6715528 4708776 -224318 -5089413 -5738966 -1608587 3306880
14875 3306880 5448259 5098863 3371923 -319760 -4743917 -4891027 1580268 8989571
14867 8989571 10444010 7797639 8323845 12667993 13533812 7140277 -1096619 -4723387
14859 -4723387 -4161378 -3323393 -3219003 -2656552 -1866777 -1923848 -2679132 -3528287 -4225717 -3689178
14849 -3689178 -657677 3427498 5333977 4779501 4629452 5449835 4449551 1530901 1156507
14840 1156507 5050702 7868919 4396835 -2699820 -6817137 -6091559 -3584963 -1223373
14832 -1223373 1727435 5539395 9444226 13183422 15962327 15378973 10636497 5271931
14824 5271931 3495000 5307751 8002406 10232648 11434595 10001064 6128054 3874344
14816 3874344 5726557 7614606 4723356 -56398 -14903 4445671 6193205 2789289
14808 2789289 -134984 1337316 3576572 2634716 872159 1840551 3613508 2430406
14800 2430406 -543980 -1369815 -22628 63865 -1891667 -2772781 -415679 3595844 6276662
14791 6276662 6106608 3563145 645665 -279471 1344437 3513643 4116797 3328486 2512776
14782 2512776 2019716 1600433 1869728 3578475 6132800 8231842 9205470 8691504 6347018
14773 6347018 3182989 1498084 1730158 1167204 -1945635 -4765884 -3203881 2373269
14765 2373269 7864134 10731198 11086388 8504007 2377525 -4175469 -5603088 -1128480
14757 -1128480 3180206 2170979 -1719426 -2694777 14328 1913895 302506 -2374993
14749 -2374993 -2693441 -746624 942996 1314085 1824072 3810552 6074573 6256035 4638955
14740 4638955 4783463 8596611 12181670 9879488 2253618 -3970009 -4994285 -4524794
14732 -4524794 -6715873 -9105893 -7156482 -2459368 -584232 -2422181 -3696526 -2591123
14724 -2591123 -1761623 -2209970 -1274068 1615940 2997509 1786443 2199483 6733760 10988352
14715 10988352 9807082 4819044 1363567 1013937 1736745 2740065 4187732 4157115 1052187
14706 1052187 -2195822 -1257177 3035724 5863958 5516157 4651342 4804669 4381506 2443465
14697 2443465 226654 -1559258 -3151452 -3439746 -1223899 1430805 1478213 324888 2008322
14688 2008322 5858000 6595052 2624706 -1541106 -2605549 -2409731 -2703318 -2164926 -1140385
14679 -1140385 -2861370 -6545251 -5972043 605388 5915653 4738566 2736902 6697262
14671 6697262 12050743 9801507 1803086 -1738346 1739326 4781822 3828250 4157499
14663 4157499 8026141 8512331 969677 -7638255 -7983302 -1344050 3722018 3779042 2533665
14654 2533665 2607273 2152267 -134889 -1789528 99317 4910952 8790274 8096948 3137630
14645 3137630 -1100652 188064 5300461 7378860 3511675 -1005888 -56101 5119757
14637 5119757 8709416 8350308 6055658 3338036 186350 -2227792 -2273141 -741722 647588
14628 647588 2484640 5528781 7062540 4424359 831486 1623585 5234585 4807620 -591191
14619 -591191 -4011686 -2125540 -793027 -4747895 -8949631 -6603482 -181810 3018817
14611 3018817 2309034 2533066 4131033 2995645 -287204 260269 5828844 9501618 6154286
14602 6154286 -367899 -3454076 -2109001 582023 3073847 5228339 5705675 3725755
14594 3725755 1516148 1562753 3001445 3563804 3300370 3475409 3459236 1740692 -1232672
14585 -1232672 -3869202 -5774535 -6908917 -6191870 -3716407 -2420200 -4129879 -5585812
14577 -5585812 -2403832 4019468 7817513 6509552 3228251 892896 -1289693 -4232629
14569 -4232629 -6088370 -5284794 -3334703 -2172432 -1168427 694525 1881574 711039
14561 711039 -490625 2877360 11327690 19160300 19998509 13251051 4022934 -2447550
14553 -2447550 -4804937 -4509869 -3046977 -1450393 -954343 -1822352 -2164058 -401965 1333422
14544 1333422 -643350 -5497817 -7471283 -3256608 3439274 7131474 7450963 7734323
14536 7734323 9131957 9725090 8079486 4538995 264484 -2370022 -394819 5606848
14528 5606848 10068999 8671327 3816902 233411 -1894281 -4479562 -5458107 -1997961
14520 -1997961 2238839 890712 -4687186 -7009752 -4803026 -4860040 -9646119 -12228079
14512 -12228079 -7608175 -911324 1054395 -597858 -1519613 -2129616 -4292833 -5186785
14504 -5186785 -1621738 3258372 4297925 2304471 1509856 2110305 1718314 1436308 3661607
14495 3661607 5978079 4207727 160220 -472065 2922802 5644190 5852158 6272318 7682113
14486 7682113 7327899 4724738 3015524 3276695 2812898 359014 -1956223 -2887773 -3525650
14477 -3525650 -3647077 -1604605 1234463 1144119 -1648050 -2570756 -126105 1740101 722403
14468 722403 122591 2790993 5960837 5640933 2343674 -837753 -2625276 -3181049 -2373218
14459 -2373218 -915838 -325678 144592 2999108 7090744 7153279 1564357 -3809230 -3150767
14450 -3150767 1816844 5774451 7445849 8693323 9200100 7331809 4397776 3206606
14442 3206606 3555537 3209666 2051094 1440692 977420 -225986 -715798 727550 1511029
14433 1511029 -1055657 -4125076 -2915659 995069 1128689 -3885511 -7928669 -6443412
14425 -6443412 -2116940 798769 2594613 5291508 8006771 8817468 8078847 6572916
14417 6572916 3374295 -951137 -2016231 3132204 10380517 12716369 9045181 4596097
14409 4596097 3128446 3185364 2313613 587879 -1216002 -3023488 -3388169 319498 7346216
14400 7346216 12321962 11326108 6600735 2489229 -440495 -3562638 -5318396 -3488852
14392 -3488852 -909312 -2650224 -7087368 -6321233 2094991 9971870 9376353 3840525
14384 3840525 2949469 8901527 14854121 15195673 11003329 5358158 -299960 -3657165
14376 -3657165 -1360829 5518697 10305970 8453109 3108771 -245382 -1380102 -3489136
14368 -3489136 -6374005 -6460814 -2927273 689126 1631568 1280960 2273588 4697258 6389658
14359 6389658 5529290 2153881 -1707133 -2994591 -51235 5201380 8461078 7194100
14351 7194100 3218666 713596 1744332 3960599 3081557 -1924118 -6712470 -5974898
14343 -5974898 160971 6144428 7930914 7396279 8276444 10256090 10027404 6740572 3046057
14334 3046057 1132466 761398 1190301 2048061 1954578 -703916 -4670352 -6137643 -3377708
14325 -3377708 1262498 5106470 8304158 11595016 13501415 12341030 9435476 7741740
14317 7741740 8174902 9297455 9639754 8418615 5296502 1729080 1076161 4369155 7184755
14308 7184755 4488600 -1940586 -5165028 -2394103 2049836 4296397 6283557 10523339
14300 10523339 14140929 12893447 8236596 5272288 5226928 4896839 2710358 416690
14292 416690 -1041884 -2438671 -2735414 350976 5228557 6767870 3405555 -711512
14284 -711512 -2488305 -3718161 -5532805 -4488842 1463427 7675370 8785048 6590934
14276 6590934 6344516 7933851 6971871 3052834 576453 1753453 4479654 6982963
14268 6982963 9018868 8607159 3747188 -1980131 -1935831 3812412 7486710 4833977 1266196
14259 1266196 3144864 8314820 9963547 5977625 -78352 -4299382 -4710441 -929449
14251 -929449 4627662 7571426 6682716 5425611 5713034 4530079 580883 -1012150 3230335
14242 3230335 7071133 2703991 -5991478 -7706880 -389859 6033715 4833091 794111
14234 794111 138777 1087778 -213368 -1783932 -383891 1675990 1193990 968432 4692271
14225 4692271 8663702 6839872 1901704 2242756 8139232 10158915 3570090 -4112657
14217 -4112657 -4337517 579320 2616197 301489 -881331 2040792 6002973 7489732
14209 7489732 6629476 5181623 4220347 4510521 6250871 7887420 7560766 5879405 4933860
14200 4933860 4752031 3502042 1293918 798519 3443022 7540225 10747426 11927005
14192 11927005 10289964 5648918 202398 -2876139 -3419547 -3905996 -4659850 -3196326
14184 -3196326 730355 3939111 5475383 8496175 13615790 15594521 11135028 5323697
14176 5323697 4635124 7338335 7390461 4815051 4638890 7266032 8056016 6113980 5225470
14167 5225470 5383299 2150207 -3333709 -2763674 6466898 14936861 13865519 7326010
14159 7326010 4515849 5459339 3304471 -2482334 -4928871 -1252519 2917711 2701968
14151 2701968 272825 -614087 -501998 -1248400 -1753031 -497318 940530 686363 398829
14142 398829 2372424 4538247 2769628 -2156169 -4371625 -1066070 2969959 1856166
14134 1856166 -2871915 -4412034 -617976 2980716 1565763 -1965915 -1980637 983760
14126 983760 1346727 -2536715 -5907204 -4966970 -1980734 -949752 -1980744 -2651566 -2156963
14117 -2156963 -1251052 -54205 1468723 2306159 1908309 1675042 3043107 5142885 5816096
14108 5816096 3958704 140741 -3470003 -3507811 1511090 7758886 9182302 5376924
14100 5376924 2444054 3929751 5455103 1864152 -4563795 -7800279 -6622841 -4203278
14092 -4203278 -1738519 1731000 4752995 4630851 2646735 2798092 5485744 7368026
14084 7368026 7252280 7008831 6563694 3392622 -2078915 -5515009 -4483189 -1161400 1602893
14075 1602893 2907433 2197091 -180520 -430918 5127285 12973527 15053661 10466107
14067 10466107 7760133 12169641 17356321 15265525 8409082 5227938 7055916 7593643
14059 7593643 3873153 209420 690039 3896382 6504270 7183443 5368182 618140
14051 618140 -4765897 -6306683 -2909449 1210920 2413209 2323346 3734288 4798983 1793830
14042 1793830 -3558507 -4545370 1681600 9600472 11832859 7432868 1220042 -2803223
14034 -2803223 -4013158 -2658423 887491 4052447 3208274 -1497449 -5363983 -4907285
14026 -4907285 -1843039 382767 1165468 1488638 977548 -485387 -436371 2991855 6912159
14017 6912159 6625721 2097412 -2080450 -2769581 -936791 1350261 3099693 3830725 4193520
14008 4193520 6634642 11741458 14699830 10187552 820194 -4609029 -2399971 1829027
14000 1829027 2049618 -390366 -995537 589000 1780715 2351729 4195895 7596490 11115949
13991 11115949 13733088 14387032 11195795 4098744 -3053051 -5854543 -4105822 -1367878
13983 -1367878 -810816 -2982960 -6277107 -8152891 -7352548 -5918861 -7054456 -10235771
13975 -10235771 -11322661 -8621195 -5259947 -3778761 -2423698 519811 2994592 3487485
13967 3487485 4953615 9619775 13400882 11255612 5570439 2977161 4456484 5237528
13959 5237528 3865209 4204873 7421339 8811597 5337441 833013 335301 3459435
13951 3459435 6834929 9496118 11928552 12431459 8826127 2784079 -1231818 -1259820 719298
13942 719298 2676999 5061917 8379600 10489899 8649490 3843193 789334 2406541
13934 2406541 5632602 4787727 -1241594 -7419027 -8515276 -4385182 1433685 5721260
13926 5721260 6560729 3006345 -3427475 -8441239 -8740293 -5320586 -1317308 1661330
13918 1661330 3034492 1580712 -2393600 -5102506 -3357048 613016 2196467 1054664
13910 1054664 522169 1366665 1070352 -855142 -1954698 -1777975 -2708010 -4812672 -4939789
13901 -4939789 -2495767 -931330 -1245369 616535 6500268 11180705 9345830 3580479
13893 3580479 340633 904675 1707815 1582831 2724006 4980589 4880647 1362255 -1971033
13884 -1971033 -1866551 628847 2631018 2989510 2052271 514033 121066 3187493 9332827
13875 9332827 14307608 14269507 10444362 7642733 8491195 10858270 11124131 8438977 4931200
13866 4931200 2677167 1767829 1347454 1358161 2430186 4577177 6989427 9076255 10860330
13857 10860330 12222891 12586209 11679128 10027608 8400943 7155338 6052954 4155817
13849 4155817 242614 -5531899 -10459326 -11214755 -7518316 -2813344 -774457 -1950773
13841 -1950773 -4015488 -4193479 -1273865 3354538 6308670 5366103 2391818 1346242
13833 1346242 2972235 3822755 1488891 -2016151 -3842960 -4291192 -4398015 -2390396 3181089
13824 3181089 8499898 7913740 2284536 -1292421 616263 3246554 1633819 -1639039
13816 -1639039 -1211494 1886673 1737844 -2809718 -5981197 -3744734 445430 1251100 -1008713
13807 -1008713 -1946787 205388 3310991 5478275 6799521 7307595 6614175 5808615 6604744
13798 6604744 8120761 7600610 5022247 3531299 3976702 2833706 -1925762 -6442063
13790 -6442063 -6105078 -2396521 -332950 -991423 -1369671 -591973 -902716 -2326308 -1701656
13781 -1701656 1607251 3898090 3021129 1537475 1449168 332089 -3596575 -6557835 -4188221
13772 -4188221 1281875 4042810 3266271 3168144 4977847 4534343 -778843 -7417040 -10345313
13763 -10345313 -8911635 -5574118 -1607974 2782787 5786973 5001597 1306270 -885442
13755 -885442 1466396 6029433 7436694 3565139 -1820905 -3612456 -1544560 146750
13747 146750 -897729 -2020265 -229666 2798835 3419016 1875716 1601031 3255861 3641069
13738 3641069 1231949 -1088505 -526779 1580759 2409200 1705957 694499 -896343 -3683634
13729 -3683634 -5908781 -5152042 -2418886 -1527194 -3945511 -6619262 -5867487 -1709042 2820464
13720 2820464 5450126 6382370 6635400 6065986 3790160 222039 -2267184 -1358551 2878627
13711 2878627 8172697 12032809 12811300 9819481 4237139 -578065 -2099970 -2083005 -4332772
13702 -4332772 -8547935 -9768827 -5530476 23746 1987100 1386574 2139181 4001792
13694 4001792 3587310 948976 -320341 784939 1914338 2883512 5934445 9362684
13686 9362684 7657881 971419 -2195698 3415556 11343890 12728823 9134109 8214682
13678 8214682 10190467 8311151 1912573 -1255461 2091984 4913960 1249701 -4446528
13670 -4446528 -5273558 -2647966 -1920902 -2179092 1296496 7219555 9496931 7334782 5898994
13661 5898994 6431787 4045498 -2256631 -5217300 459880 9542184 13314315 10743012
13653 10743012 6982689 4407037 1708934 -183716 1558733 5487482 6608786 4497508
13645 4497508 4489168 8336481 9676549 3302656 -5651464 -7901923 -3058754 251733 -2537816
13636 -2537816 -5318355 -774606 8293116 12040015 6243996 -2696448 -5798390 -1143535
13628 -1143535 5740348 8655849 5980219 528674 -3624161 -4181737 -1916908 426045
13620 426045 776862 -595242 -1948239 -2012697 -774373 1016961 2473850 3068178 2999343
13611 2999343 2765058 2254568 1119974 223658 1099857 3042356 2737528 -1091787 -4408069
13602 -4408069 -2443592 3300825 6528380 4724994 1877975 1340920 805558 -2428222
13594 -2428222 -5386211 -3563444 1376432 3510656 1239383 -1387342 -1717292 -1346766
13586 -1346766 -1206480 448343 3157637 2974515 -703587 -2216229 1997789 6705120
13578 6705120 5300168 340517 -414594 3419798 4262366 -988638 -5808979 -4178803
13570 -4178803 796599 2802294 1795668 2252876 5189186 7385672 6953563 4852134
13562 4852134 1765266 -2079210 -4399328 -2543546 2059573 5180891 6106790 8502554
13554 8502554 13602263 16833370 14176456 8671590 6617512 8885102 10220888 7190396
13546 7190396 2819382 1613768 2931565 2408691 -1172913 -3943484 -2635778 667382
13538 667382 1612043 -362316 -1773394 -207054 3107033 5774648 6574926 5159643 2460791
13529 2460791 1881580 6396795 13127479 14873740 9469956 3436318 2750688 4257790
13521 4257790 1637774 -3517645 -3839210 1792721 6002443 3869885 -529984 -994497
13513 -994497 2793896 6937359 8497246 6221358 238569 -6015509 -7232111 -2530984
13505 -2530984 2851695 4498766 3692766 2915972 1008982 -3435721 -7825912 -9026646
13497 -9026646 -7853327 -6128044 -2785483 2617821 6222286 5138620 3188938 5310535
13489 5310535 9013896 8349340 4392284 3885774 7845091 9652089 5951385 2000396
13481 2000396 3214267 7412416 9091532 6893994 3340552 562550 -591561 265097
13473 265097 2334234 3893403 4398144 4299923 2904568 -208553 -1848628 1929133 8785764
13464 8785764 11111316 6051739 -328143 -1466806 1656967 3960984 3550050 1970354
13456 1970354 519620 -154914 655177 2029917 1638684 -164825 208284 3736434 6309394
13447 6309394 4890056 1904820 156455 -1907204 -5352928 -5892653 81866 7969251
13439 7969251 10020491 5860726 1723701 826088 970469 807415 1728044 3161672 2163958
13430 2163958 -1104358 -2681364 -822839 1885104 3382115 4403389 4780884 2377537
13422 2377537 -2439905 -5729197 -5600302 -4926424 -6062679 -6701255 -3997649 306049 2267200
13413 2267200 1195740 -336542 -556039 84710 599274 350328 -1160625 -3579393 -5156651
13404 -5156651 -4347569 -1806449 121287 -247492 -2568190 -5161274 -6690478 -7170392 -7182882
13395 -7182882 -6271811 -3270349 1208933 4122955 3283445 236793 -1632369 -928188 1174809
13386 1174809 2940751 3186966 1823195 765040 2444272 5826506 6579894 3424966
13378 3424966 881676 2277020 3845641 857395 -3894712 -4476060 -2192680 -3430659
13370 -3430659 -7886980 -7933502 -1178193 5028914 4901412 2200198 2372017 3559238 1211181
13361 1211181 -3569837 -6401628 -6645440 -6363981 -5119144 -1302229 3244565 4891682
13353 4891682 3458705 1987502 2355340 4048175 5773033 5796587 2791537 -1319859 -2226436
13344 -2226436 413324 946943 -4449098 -11380017 -12893911 -8559626 -3448444 -732202
13336 -732202 111192 137714 614685 3585351 8355854 10180030 7181240 5115249 9193141
13327 9193141 14598772 12887524 5474640 1689563 3930779 4490810 -1004165 -6349176
13319 -6349176 -5155356 -806563 -320397 -3636247 -5063899 -2253711 1693139 3601594
13311 3601594 3508755 3003101 3027891 3447952 3818243 4800219 8081084 13170614 15637717
13302 15637717 11994683 5559596 3094846 5794282 8607977 8767211 8840598 9668671 7041720
13293 7041720 -599874 -6783893 -4723385 3235267 9127406 9762845 8519706 8452158 8726089
13284 8726089 7794357 6181483 5394826 6185591 8005998 9056835 7677192 4556459 2120572
13275 2120572 1062326 -286085 -2367729 -3218429 -2154591 -1218659 -1175709 158622 3254864
13266 3254864 4628841 2455645 427039 2080648 5010850 5228757 3747441 3569123
13258 3569123 3252276 -343171 -5019961 -5579632 -2329695 -854986 -3231183 -5463223
13250 -5463223 -4466726 -2123189 -983964 -592774 326630 1767055 3675100 6032794 7259124
13241 7259124 5870351 3598764 3069616 2961193 241319 -3229979 -2298566 2590733 4459041
13232 4459041 -179095 -6197723 -7557780 -4832203 -1900780 -110205 666155 -371268
13224 -371268 -2430355 -2144313 1204228 3308118 1278372 -1619746 -1499344 333606 1523999
13215 1523999 3737831 7874171 8963130 3224520 -3402592 -2312536 4324821 6410890
13207 6410890 1683434 -1197836 2921013 7705324 5929448 111300 -2928567 -1932278
13199 -1932278 301023 3256205 7077400 8392280 4674241 464196 2298818 8442724
13191 8442724 10573217 6059139 1841772 4037398 9548510 11590427 9192656 6730342
13183 6730342 6614839 7161499 6854819 6405633 6003288 4092929 598744 -1079474 2285599
13174 2285599 9062594 13938493 13786066 10605094 8193066 7610812 7253860 6256904 5720625
13165 5720625 6385286 6892030 5452430 2305376 -660346 -2270549 -2881724 -2924702 -1844189
13156 -1844189 972777 4917188 8452725 10338655 10027435 7302265 2602009 -2121945
13148 -2121945 -4104509 -2410074 700254 2314989 2511657 3877076 7320101 10424651
13140 10424651 10852609 9203255 6821140 3099282 -2062996 -4988971 -1889753 4443309
13132 4443309 6551248 2272864 -2040837 -982306 2030423 968483 -2523131 -1641654
13124 -1641654 4240292 7954729 5338725 1182741 1489756 5050969 6760833 5355847
13116 5355847 3166221 927755 -1965662 -3394567 -13051 6893395 11508295 10581747
13108 10581747 6902327 4426361 3315470 1790565 66802 -355194 303497 604620
13100 604620 754001 2396350 5368727 6855391 4861107 1186736 -578710 440778
13092 440778 1672711 1263360 911674 2595535 4030599 1024071 -5407919 -8444625 -4222399
13083 -4222399 2361432 4135796 1147404 -916958 94519 856636 -501227 -1506759
13075 -1506759 -797837 -955994 -3208994 -3975412 -210455 5407961 8283213 7959431 6860852
13066 6860852 5824511 4796661 5432986 8584298 11075695 9514252 5854155 4588870
13058 4588870 5761141 5940373 5214806 7078701 10947784 11274591 6315973 1919767 2994950
13049 2994950 6030562 4744155 -249376 -2678589 151307 4394633 5717117 4024092
13041 4024092 1450891 -792071 -2082766 -1560328 333790 1010409 -1477549 -5319257
13033 -5319257 -6506643 -3833071 -784922 -1311609 -4678520 -6380977 -4110732 -506047
13025 -506047 1174231 1790526 4085387 7056386 6300487 531950 -5609605 -7206176 -5251307
13016 -5251307 -4720883 -7709645 -11244558 -11921206 -10226448 -9026165 -9237291 -8865247 -6169349
13007 -6169349 -2113245 1000465 2039597 1161138 -1169236 -3436609 -2696779 1988229
12999 1988229 6253296 4586632 -1461724 -3691850 1948655 9413941 10957582 7418690
12991 7418690 5194869 6146853 6630481 4875985 2875850 1287241 -1320028 -3658532
12983 -3658532 -2163915 2612394 5670816 5046318 4079426 4610181 3911484 911557 -595442
12974 -595442 1414962 2862287 255281 -3075630 -2368193 920102 2042716 439282
12966 439282 -862395 -967652 -1378202 -2217673 -2344625 -1721581 -427508 2412730 5625580
12957 5625580 5211329 416595 -3168517 -1435668 1177837 -1421476 -6456225 -6237050
12949 -6237050 -667880 2571003 275971 -2019576 245339 3875159 3866022 580437 -2377693
12940 -2377693 -3415117 -3091408 -1993526 -838288 -540427 -828884 -744766 -853563 -2595992
12931 -2595992 -5557614 -8017256 -9593925 -10335461 -8446049 -2966978 2481974 3481896
12923 3481896 1445917 1199420 2951759 3100277 2498066 6082391 13166293 16343747 12845539
12914 12845539 9074290 9848012 10774759 6785615 1424947 817482 3651883 4501839 3283949
12905 3283949 4001177 6694846 7961987 7965702 9837959 12573748 11346806 5737741 1652889
12896 1652889 3106530 6743493 7011119 3535174 710814 1616572 4527843 5350845 2569696
12887 2569696 -984419 -1936315 -1050267 -1838318 -4642186 -5501859 -2057778 2958311 6086507
12878 6086507 7513493 8608714 8648980 7171195 6229448 6664560 5368957 404238 -4316417
12869 -4316417 -4242044 -1176308 368453 1147179 4990767 10337363 11407097 7913246 6215315
12860 6215315 9096674 11194469 7799676 2608091 2369609 7426395 11805229 10762969
12852 10762969 4970152 -1470150 -4528131 -2667921 2093233 5796576 6237714 4655362
12844 4655362 3619416 4457888 6917072 9680618 10700826 8670252 4996459 3057979
12836 3057979 4687469 8170105 10153354 9002902 6273795 5202472 7133246 9183153
12828 9183153 7044234 977842 -3243721 -1332686 3704887 5401173 1669456 -4131347
12820 -4131347 -8204411 -8891679 -5769138 -260152 3638537 3224319 1153611 1882530 4979571
12811 4979571 6370201 5331042 4888550 5397958 3707066 -233066 -1882378 606368
12803 606368 2990098 1576626 -1528280 -2858646 -2798070 -2848564 -1678959 2096225 6192090
12794 6192090 7487148 6300300 4819173 3715704 3065063 3753701 4968166 3364890
12786 3364890 -1759279 -5467444 -3389479 1653309 3590779 1575904 -32920 1390241
12778 1390241 4359284 6767152 7410650 4890054 -675005 -5425599 -5546706 -2843658
12770 -2843658 -2245499 -4212794 -4533830 -1803003 329223 -329668 -1054009 304765 1120106
12761 1120106 -1249024 -4341335 -4407689 -2551094 -2417928 -3482919 -1793136 2785729 5314550
12752 5314550 3360025 1106578 2498322 3911678 -972129 -10222513 -13832351 -6657012
12744 -6657012 4169838 8654270 6651175 5600138 8180194 9455196 6461013 3258689
12736 3258689 3692489 5336722 4869651 4374844 6916377 9564465 6950190 -212353 -5925806
12727 -5925806 -7161308 -5959082 -4063401 -1084524 1946118 2769036 2482225 4654137
12719 4654137 8537076 8476450 2341223 -4348428 -5792905 -3301716 -1837743 -2661792 -3381861
12710 -3381861 -2779596 -1483890 609423 3845528 6704182 7474858 7258482 8135152 8932778
12701 8932778 6252284 2940 -5126835 -4849834 -9192 4868065 6487553 5517956
12693 5517956 5196332 7622431 11114617 11623288 7398394 1551748 -1084649 931284
12685 931284 4807268 7065197 6422325 3625246 276887 -1918703 -2107202 -905098 579246
12676 579246 2012421 3232319 3258914 1738158 865051 3377396 8277119 11102638 9553747
12667 9553747 6400276 5011305 4392139 1683665 -1956273 -2082186 2225524 6391152
12659 6391152 6920018 6193857 7447289 8013109 2779841 -6458016 -11043766 -6717794 181866
12650 181866 1375122 -2319270 -3546543 179833 3516534 1866253 -2499939 -4852619
12642 -4852619 -4450854 -3796624 -4130382 -4557238 -4263821 -3375578 -2355077 -1756117 -1566946
12633 -1566946 -285941 3414601 7405621 7205135 1963005 -3342730 -3914557 -921438
12625 -921438 1258449 1234518 974412 1894013 3823781 6289989 7696263 5165373 -1029939
12616 -1029939 -4836788 -1019228 6823953 10197660 7248066 4498316 6400880 9371841
12608 9371841 8592785 5288786 3661182 4554015 5751102 5609448 3366479 -1405815 -6871230
12599 -6871230 -9184868 -7344970 -5069141 -5395696 -6575592 -5934997 -4081618 -1992487
12591 -1992487 1973372 7821216 10681598 7277216 2292420 2174975 5461411 6237316
12583 6237316 4839532 6646207 10875357 9873993 1426015 -6675445 -7710487 -4356896
12575 -4356896 -1917198 -144058 2873259 4543533 1920570 -2041197 -2642081 -825803
12567 -825803 -433793 -779092 1497264 4896798 4358633 -212823 -3407518 -3113408 -3435647
12558 -3435647 -6748615 -8764427 -5162926 1350668 5007709 4952943 4502336 4172771 854810
12549 854810 -5449610 -8861347 -4602346 3757545 7755860 4435554 -132866 941580
12541 941580 6468051 9394764 6461621 1734637 52298 731583 -17000 -3150854 -6385751
12532 -6385751 -8300370 -9585692 -10463531 -9794720 -7364409 -4819319 -3419934 -2556399 -1443211
12523 -1443211 -707713 -880850 -474261 2402412 6587371 8095731 4962460 483814 -344270
12514 -344270 2837962 5428965 4444432 2690712 4342868 8456286 9922432 6012356
12506 6012356 -962498 -7116536 -10234472 -9745998 -6545976 -3174366 -1449738 192085
12498 192085 4134320 8665076 9510101 6508124 4203720 4727599 5014057 3066708 1783928
12489 1783928 3297245 4351191 1700204 -1863553 -1812362 894606 2013619 971513
12481 971513 343309 325959 -664385 -1000772 2769811 9414653 12978662 10259291 4531019
12472 4531019 1002126 1542379 4272346 5847226 4269195 1466025 1870841 6205659
12464 6205659 9077112 6148694 866096 -732470 732792 60132 -3010620 -3609146
12456 -3609146 -798261 692592 -994898 -1770116 550541 1885471 -1199616 -5693561
12448 -5693561 -7002924 -5119926 -2322956 1245425 5922812 9719701 10713863 9696410
12440 9696410 7802139 4552708 942248 971281 6418538 12647910 13358817 7923616 1098561
12431 1098561 -2866140 -3040661 -397624 3346283 6085012 6696637 5910440 5086788 5030683
12422 5030683 5995287 6983415 5314805 -173471 -5525135 -5132284 502854 4782415 4146560
12413 4146560 2488629 4100812 6921922 6415209 2430299 -1775096 -4491643 -5685911
12405 -5685911 -4599357 -1188709 1635956 798662 -2774052 -5303892 -4460204 -702042
12397 -702042 4040994 7217324 6959983 4279881 2337854 2518510 3342869 3628308 3409401
12388 3409401 1332592 -4193592 -9989220 -9735015 -3064632 2657482 2982388 2703727 6771363
12379 6771363 10980251 8634674 2061082 -437123 3190680 7078547 7110687 5446104
12371 5446104 5196672 6297713 7488796 8142825 7608790 5886379 4567371 4435623 3664329
12362 3664329 1361723 459752 3167664 6157972 5099073 1788102 1431113 4441042
12354 4441042 6492272 5748764 4620985 4799970 5476680 6144646 6792485 6059355 3372995
12345 3372995 1553586 2855560 4322757 2151829 -1510736 -2067302 -591373 -1445473
12337 -1445473 -3390935 -1124952 4613021 6786975 2895730 -1857979 -3889106 -5905200
12329 -5905200 -9649533 -11380229 -8311569 -3438320 -196789 2313217 5233751 6244163
12321 6244163 3881082 1243594 1566527 3544392 4151465 2865051 609824 -2074464
12313 -2074464 -3681939 -2273949 630662 687023 -2743316 -4979497 -3112467 -82117
12305 -82117 1003755 1901507 5110863 8804450 9667022 7680394 4853510 2034398 -318966
12296 -318966 -1112027 -682823 -883436 -1394512 269894 3519203 4326858 2423012 3295743
12287 3295743 9390587 14691759 12904940 6544435 2470825 1954679 902579 -2406020
12279 -2406020 -5218095 -4693743 -315400 6657205 12832598 13926417 9842923 6337852
12271 6337852 8201212 13088534 15394887 13436441 9101401 3492198 -2472245 -5600992
12263 -5600992 -3533287 1183375 4260265 5245466 6049798 6093518 3557661 -87810 -1427862
12254 -1427862 -30445 1848943 3222883 4325999 4273513 2725555 2192750 4606891 7420274
12245 7420274 7425358 6426788 8166521 11350095 11228346 7132307 3058286 1332020 808276
12236 808276 825030 1792263 2259766 525628 -1300171 -126006 1867738 -222352 -5474814
12227 -5474814 -7768481 -5553020 -4083750 -6273873 -8138183 -6050251 -2350490 -502732
12219 -502732 -282199 -1098176 -4381485 -8663788 -7985980 -418892 6711734 6076196 818631
12210 818631 -805702 1889094 2395041 -1200132 -2901293 1363556 7409639 9244831
12202 9244831 6860906 4179429 2900081 2101792 1628657 2248214 3478538 4076370 4090864
12193 4090864 4286530 4348655 3897071 4393729 7238120 10333961 9789458 5565361 2207170
12184 2207170 2659720 4471643 4181545 2454720 1886326 2319758 2237667 2857246 6139886
12175 6139886 9700356 8891870 4073786 530971 284048 -469384 -3928584 -6523895 -5331451
12166 -5331451 -3121166 -2681836 -1271987 3629713 7481720 4680328 -1458417 -2486813
12158 -2486813 2645386 6819868 6655810 6821897 10157531 11417373 5683026 -2791787
12150 -2791787 -6019659 -3023054 638098 2024241 3580477 6830754 8663402 6001707
12142 6001707 863235 -2076031 -1606129 -909926 -2122964 -2430135 2168166 9973528 13656883
12133 13656883 8781438 -18203 -4067015 -676884 4891217 7027176 5756386 4222275
12125 4222275 3547693 2683712 1564933 1553377 2881387 3813222 3158885 2281757 3096283
12116 3096283 4450127 2741505 -2517414 -5890917 -2073300 6083166 10119199 7448418
12108 7448418 5173687 9503009 16338981 17585871 13120881 9743272 10077065 10098561 7959814
12099 7959814 7610346 11042417 13398177 9917274 3164924 -911900 -739544 1055745
12091 1055745 2663176 3764975 3429284 1625741 1482343 5914580 12604646 16011693
12083 16011693 14217515 10479001 7911721 5936329 2857942 -794000 -3088497 -3319513
12075 -3319513 -2429184 -1488375 -659648 465041 1834520 2487228 1626950 106687 -204457
12066 -204457 1095004 2317470 2199623 1671582 2168314 3558400 4872527 5607002 5028401
12057 5028401 2016866 -2522620 -4948331 -3113349 230658 1117900 -106785 -525420
12049 -525420 -385206 -2070388 -3731761 -187012 8023574 12729363 9177820 3537888
12041 3537888 3742883 7310900 5967725 5031 -1361287 4867625 9118931 2821265
12033 2821265 -8407076 -11851438 -4248102 5578805 9108167 6740730 3612128 2193958
12025 2193958 1280928 -605746 -2874493 -3123040 312426 5294302 6860629 3131965
12017 3131965 -1637458 -2560100 -379124 1530964 3872160 9348156 15172161 14794105
12009 14794105 8034531 2509453 2511195 3098848 -954123 -6456681 -7337646 -4082044 -1530131
12000 -1530131 -641010 1043394 2675401 539184 -4805616 -7451985 -3458855 4538930
11992 4538930 10900656 12207444 8565681 2595906 -2178586 -3929730 -3797392 -3418884
11984 -3418884 -2366839 33045 1948720 1001363 -2027174 -4292272 -4836430 -4720886 -4277558
11975 -4277558 -3223627 -2483817 -2677153 -1803641 1964880 6029105 5996956 2356366 264251
11966 264251 2169252 4764998 4550866 2763551 2779105 5184427 7461632 7139889 4026736
11957 4026736 360159 -774170 1672727 5252346 6508542 4655262 1714669 -199362
11949 -199362 -412099 360131 68177 -3195988 -8129042 -10667949 -9579199 -8791822 -10987362
11940 -10987362 -12010908 -6557422 2748149 7778404 5661750 1448637 26182 941804
11932 941804 2005735 2700070 2507874 439904 -2131065 -2063539 849364 3399719 3927428
11923 3927428 3842522 3683071 2145717 -87040 -175891 2101944 3919182 4596684 6239144
11914 6239144 8316182 7473837 4352787 4277318 8642128 11997596 10883944 8910702 8952464
11905 8952464 7313401 1408222 -3359825 -1873187 923327 -2722642 -10033127 -11212644
11897 -11212644 -4669461 998581 636202 -1200537 32367 1390725 -940944 -4283186
11889 -4283186 -4267337 -2358950 -2714882 -4432407 -2887146 2279200 5970517 4891931 1546771
11880 1546771 -268263 -203211 374116 1628781 3874026 5227327 4231206 3537382 6877836
11871 6877836 12508086 14110390 9429210 3713018 2265276 3680270 3964470 3641791
11863 3641791 5742836 9034166 8968424 4903584 1280584 1147710 2717758 2962887 983050
11854 983050 -2631111 -6394474 -7698703 -5241495 -1485368 494148 1507169 3615745
11846 3615745 4804485 1972282 -2020708 -1342427 2937096 3845290 419458 -26606 5649241
11837 5649241 10424146 8269490 3391442 2330998 3838194 3684156 3572397 7077569
11829 7077569 11030946 9508351 3821301 411470 300596 -1480201 -6271720 -9077515
11821 -9077515 -6650736 -2206756 -103734 -262297 72344 1864793 3186036 1385453
11813 1385453 -3685392 -8139865 -7549352 -2832128 464856 253329 869817 5228593 9326496
11804 9326496 9244764 8459741 11723446 15887932 14470379 8364987 3785075 1561775 -2599846
11795 -2599846 -7971377 -8416671 -3289545 344309 -1030436 -2242354 722885 3453735
11787 3453735 899328 -3782469 -4317936 -1080340 321503 -2198891 -5213681 -5376262
11779 -5376262 -2723943 1021568 4068667 4755778 2725670 -237724 -2210206 -3277178
11771 -3277178 -4174126 -3941555 -1143414 2996510 4896411 2709891 -1107186 -2258381
11763 -2258381 675504 4825511 6632971 5905473 5086940 5305638 5495431 5410965 6387088
11754 6387088 8079885 7928048 5902346 6139143 10600856 14524153 12594232 6927828
11746 6927828 3651063 3464750 1729535 -2666056 -5014219 -2492875 1540021 3104974
11738 3104974 2781329 2770200 2638571 1002985 -1118259 -1377177 818637 3799509 5062916
11729 5062916 2884642 -1635588 -4200048 -1616072 3419983 4992305 1921897 -480616
11721 -480616 2084591 6986573 8284539 3798576 -3435711 -8877941 -9849536 -6667565
11713 -6667565 -2024288 1526589 4044845 7146040 10581167 11789315 9272121 4665517
11705 4665517 966353 69047 2046861 5285724 7392940 7423356 6829923 6969503 6933473
11696 6933473 5654755 4372953 4380088 4163897 2019519 -360292 -618722 18551 -299252
11687 -299252 848654 6241392 11976558 11497015 6106028 3628616 5966157 6516827 2248816
11678 2248816 -526264 3080073 7946410 7293260 3299365 2429792 4891097 5847767 3779576
11669 3779576 878601 -2169630 -5119879 -4173521 3676465 13190460 14894725 7230998
11661 7230998 -1210687 -2696555 1602053 5917638 7333718 6606698 5229312 4333840
11653 4333840 4506570 5029168 4712145 3937011 3906553 3769188 1279223 -2965673 -4962998
11644 -4962998 -2661746 541464 -23575 -4023836 -6390654 -3520278 2667477 7180173
11636 7180173 7184140 4052920 869882 -895870 -1728222 -1991434 -1083436 971221 2516954
11627 2516954 2203097 1314034 2504394 5851552 7640296 4497738 -1789129 -5587741
11619 -5587741 -4360139 -2299161 -4721541 -10111850 -11461895 -5872836 1292448 3696321
11611 3696321 1552047 -1045015 -2462296 -2954167 -1078026 3754684 7364019 5618972
11603 5618972 1840120 2716171 7485341 8754195 4660026 1904769 4321549 6805314
11595 6805314 4876700 2522647 4623321 8186982 8143064 6563727 8388098 11904906
11587 11904906 11575223 7746473 5577982 5907936 5045891 2810056 2875489 5036436 4841116
11578 4841116 1818274 562987 2066415 1454657 -3069599 -6209479 -4065702 -165307
11570 -165307 1148247 1281456 2486442 2180793 -1689795 -4385422 -683490 5742078 6885227
11561 6885227 2652037 734560 4367086 7940503 6598094 3363097 3382015 6267006
11553 6267006 8016675 6878861 3767058 -215196 -3438058 -3611784 -1139613 -56913
11545 -56913 -2443413 -4639686 -2782795 701483 1014288 -814549 293389 4230922 4948391
11536 4948391 215973 -4040600 -2147817 3367118 5924237 3589100 -58984 -1445926
11528 -1445926 -104844 2262815 3415820 2461600 1269104 1941731 2519585 -842888 -6296823
11519 -6296823 -6485980 466165 5970640 2353879 -5684495 -7835056 -2669456 2567797
11511 2567797 4298863 5833228 8550326 8843288 5767311 3942238 5816224 7595490
11503 7595490 6233564 4599360 5855461 7780310 6904428 4260496 2989329 3537683
11495 3537683 4816332 7011131 9777603 10506020 7744751 3865194 1517589 255055
11487 255055 -623801 641788 4602105 7502755 6179281 3506525 4355376 7904896 8793325
11478 8793325 5189480 1190769 835469 3312410 5045660 4086025 1352776 -1305472
11470 -1305472 -3530128 -6639609 -10666813 -12075378 -7252150 1395839 6443376 4234712
11462 4234712 -671577 -2106902 -50 1616648 1379808 1403338 2907203 4664462 5170443
11453 5170443 3889065 1226834 -925560 -196241 2934003 4842123 3684911 2029420
11445 2029420 2293606 2641722 621685 -2012428 -2051926 -81300 1225451 2151779 4778460
11436 4778460 8041381 8520374 5744574 2775645 1775611 2451090 4368141 7231291
11428 7231291 9210607 8493582 6406421 5904199 7238931 8064409 7290288 5752943 3692310
11419 3692310 846055 -1430782 -1394967 174105 1358874 2559900 5108589 7378036
11411 7378036 6431406 3171704 1538869 2475972 3003906 1767032 1076225 2253711 2981753
11402 2981753 1005434 -2704602 -5920069 -7435601 -6369880 -2305710 2632915 4821103
11394 4821103 3562591 1753672 1189423 474531 -1047027 -895873 2599901 6799225 7919910
11385 7919910 5776365 2957763 930105 -689226 -2152397 -3041602 -3157192 -2633357 -1808800
11376 -1808800 -1548111 -2343313 -2671980 -431705 3097456 3549563 -320561 -3566800 -1377916
11367 -1377916 3660205 4835624 948452 -2193676 -788478 1343604 -779453 -4902488
11359 -4902488 -4430507 1627649 6796193 6027664 1907711 -275680 146795 243065 -1030760
11350 -1030760 -2582100 -4613656 -7574650 -8554328 -3994042 3557888 6696137 2875138
11342 2875138 -1901396 -1574144 2193988 4023326 2812626 1639334 2189430 3254490
11334 3254490 3301623 1506457 -2215487 -5735263 -5510810 -1661574 284138 -3864354 -10709585
11325 -10709585 -13437878 -10290393 -5168275 -1687990 -516455 -862773 -687892 2741123
11317 2741123 8465379 10303523 4642007 -2444923 -1943459 5527769 10640801 8679355
11309 8679355 4743278 4217693 5030355 2800637 -1574394 -3618136 -1431503 3039777
11301 3039777 6701295 7206579 4359409 1133955 1077892 3729680 5137161 3559371 1608950
11292 1608950 1997417 4434068 7491029 9942550 9490710 4383842 -2382440 -4914012
11284 -4914012 -2227122 383105 -204596 -545129 1978862 3111522 -1438244 -7562804
11276 -7562804 -7976989 -3290565 -691939 -2547631 -3662230 -805547 1984882 495897
11268 495897 -2831780 -3238265 -886528 795768 1505629 3908123 8028076 10467988 9684044
11259 9684044 8106774 7832968 7656362 6093385 4108083 2342810 -1349333 -7991843
11251 -7991843 -13251388 -11606868 -4050693 2717240 4798812 4449300 4424082 3831232 1507803
11242 1507803 -787706 -1286573 -902742 -377331 1957209 6610422 10227151 9735058 6575284
11233 6575284 3697001 1128816 -2075936 -4335931 -3833684 -1774770 400230 4062207
11225 4062207 9184507 10353785 3064290 -7897409 -12758378 -8775663 -2042113 2168744
11217 2168744 4381785 5752331 4693710 1192636 -699300 2011023 6782663 8731574
11209 8731574 6293724 2277930 883251 4095792 9479610 12034558 9979559 7137344
11201 7137344 7131974 7703240 4744231 -342323 -2482632 -619333 1865132 3231047 4134874
11192 4134874 3385403 -495104 -3863195 -1179967 5806032 9159753 6196822 2707214
11184 2707214 3045179 4432738 4036018 4569112 8571169 12764909 12524856 7726392 914561
11175 914561 -5904840 -9830057 -7509372 -542208 4109212 2522853 -1581337 -3438581
11167 -3438581 -3463679 -3544641 -2295335 1678947 5931111 7580456 6963992 4950674 1118438
11158 1118438 -2458048 -1119743 4812593 8130346 5067209 1646841 3946195 7769246
11150 7769246 5395018 -1752362 -5328117 -2458823 1756460 2831153 1110043 -1902882
11142 -1902882 -5217581 -6484136 -3748755 815846 3078493 2351632 1100371 697831
11134 697831 1229422 3629905 7859992 10871083 10557478 9508639 10525420 11279522 8629266
11125 8629266 5291095 5959835 9156714 9789462 8029842 8226840 10045137 8656988 3891919
11116 3891919 1282943 2862054 4460769 3872524 4142877 6199871 5818724 1834680 328623
11107 328623 5255281 10602451 8225053 -431261 -6940971 -7810130 -7187313 -8279434 -8316337
11098 -8316337 -3858451 3069891 6945526 5141611 265084 -3415696 -4352903 -4051043
11090 -4051043 -3956229 -3577556 -2171089 -637491 -118055 125587 1213296 1823828 -265451
11081 -265451 -3820064 -4477350 -506908 4400008 5706114 3312656 440753 -1029554
11073 -1029554 -1746528 -2275662 -1831601 -30008 1867731 2542838 2621515 3837784 6254369
11064 6254369 7662825 6624550 5040348 5908581 8804635 9853073 6935437 2783591
11056 2783591 1343651 2712664 3659815 2047319 -1470186 -5559650 -9653628 -12963907
11048 -12963907 -13876444 -11300385 -6053993 -558713 2674611 2614844 328151 -2112758
11040 -2112758 -3524575 -4039109 -3820516 -2541708 -475721 1165176 1661789 1516196 1251862
11031 1251862 799925 712953 2358261 5660663 7995414 6966785 3611556 1336214 1807908
11022 1807908 3027630 1828796 -2117283 -5379809 -4532740 -620476 1849024 1043202
11014 1043202 433061 3145818 6316002 5010820 266113 -1699054 1707860 6164777
11006 6164777 6841545 3777187 -377254 -3838365 -5306982 -3925141 -1321807 -269688
10998 -269688 -136101 2382955 6922120 8685227 5876697 2822947 3119083 4731405 4993513
10989 4993513 5214754 6385864 5454470 834742 -2845653 -1113928 2778211 2451127 -2100556
10980 -2100556 -5240666 -3967032 -267715 3171255 4890135 3847753 1004103 6758
10972 6758 2404593 4545162 3263845 1438898 2814192 4697547 2312986 -2110520 -2006900
10963 -2006900 2875716 5901445 3779892 493345 -21424 1049247 1250261 613615 -74191
10954 -74191 -454416 1002769 5549680 10349983 10599114 6505240 3768752 5722472 9065935
10945 9065935 9070206 5470220 1442043 -386374 632110 3487412 6205004 7621648 8175028
10936 8175028 7521536 3472681 -3607731 -7894189 -4659065 1716908 2282821 -4052995
10928 -4052995 -8779708 -5594164 1793064 5750678 3697327 -1562644 -6360891 -8220306
10920 -8220306 -6414656 -2928142 -878197 -828040 -755775 265880 1453034 3207423 6556264
10911 6556264 9433395 8214964 3913045 1901564 3924197 5513060 3592229 1283866
10903 1283866 1816070 2768271 901122 -1562632 -781632 1878311 2625888 2382933 4647281
10894 4647281 7430405 4592261 -3805434 -9486150 -7393778 -3148401 -4177095 -8043632
10886 -8043632 -6482459 1019417 5511534 1622436 -4700189 -5098357 -62728 3703468
10878 3703468 3440661 2115972 2096506 2725719 3444699 4349243 4208710 2528777 2427924
10869 2427924 6177421 9361031 6176284 -425865 -1981942 2050767 3449336 -532413
10861 -532413 -2417403 2050685 6129393 4009055 874145 2899687 5709920 2570281
10853 2570281 -2780424 -2188201 3126532 5684597 4778454 5376516 6813005 3937151 -1730259
10844 -1730259 -3082451 338436 1579968 -1563879 -3571352 -1692148 122833 -175250
10836 -175250 780571 3967773 4866677 1263819 -3041814 -5103853 -6497890 -7570620 -5144935
10827 -5144935 842711 5048131 4601424 3342223 4728762 6204749 4423272 1066263
10819 1066263 -448411 37989 1114437 2766274 4625784 4719024 2821610 2052618 4569429
10810 4569429 8245489 9779512 8954573 8093155 8832643 10360080 9897599 5461987 -796979
10801 -796979 -3933511 -2534521 -636130 -947075 -579248 2653390 4990785 3447821 2328482
10792 2328482 5673952 8493198 4571938 -1738224 -2193985 803273 -1461857 -7819784
10784 -7819784 -8937648 -4413466 -3762588 -9088894 -11303630 -6797319 -3589631 -5897775
10776 -5897775 -6350653 -411323 4041973 -96505 -7045708 -7937025 -3784428 -425271
10768 -425271 1260677 2005598 -1167001 -8576928 -13042342 -9470890 -3245491 -1727397
10760 -1727397 -3529323 -3395078 -1477842 -302669 1566597 5332888 7039911 4071163
10752 4071163 961106 1662066 2147470 -1572848 -4399034 -88607 7108818 8365774
10744 8365774 3756754 368866 182867 -671849 -2682301 -2177972 945639 2694840 2077639
10735 2077639 2224034 4616402 7539690 9523009 9761701 6735678 887385 -3412853
10727 -3412853 -3013274 -753526 -990335 -3378546 -5303496 -6770362 -8103455 -6857053
10719 -6857053 -2517715 -279926 -4006301 -9036897 -8470632 -3399403 -266607 -975384
10711 -975384 -2566047 -4281893 -7655788 -10969223 -10503953 -6704479 -3264972 -955166
10703 -955166 2091134 4999027 4872066 2453727 1705392 3677206 5315077 4384303 1736029
10694 1736029 -1097626 -3196601 -3620559 -2423213 -1566095 -2353151 -3129253 -1739663 1283142
10685 1283142 3987654 5531375 5638269 3842987 1045352 -590804 -712783 -1156981 -2474924
10676 -2474924 -3313993 -3601236 -4381334 -4591366 -2902454 -2156650 -5535716 -8966212 -5698401
10667 -5698401 1361407 1937256 -5321253 -10011806 -6962491 -4235133 -8500325 -14008493
10659 -14008493 -13718426 -10710133 -9748221 -7476795 -947752 3163355 -1135061 -7267149
10651 -7267149 -5802439 404364 2092973 -918000 -1487153 1994510 5312893 7290936
10643 7290936 8905403 7315650 676413 -4758596 -2337120 3441325 2943273 -3826518
10635 -3826518 -8066830 -5546659 -268605 3116147 2575802 -3001561 -11166773 -14595392
10627 -14595392 -9691091 -3019696 -2386265 -6127960 -8310209 -8789107 -9996940 -9787674
10619 -9787674 -6449989 -4860496 -8355460 -10827999 -6776066 -2263097 -4759943 -9141115
10611 -9141115 -6494323 -503756 -1064667 -6674779 -7809072 -4063101 -3210178 -5857337
10603 -5857337 -5630179 -2892950 -4014950 -7979396 -7511952 -2979922 -1825917 -4550935
10595 -4550935 -4445129 -1171211 -1465053 -5762005 -6816319 -2781155 52220 -1348584
10587 -1348584 -3411234 -4449833 -6131600 -6715939 -3187723 632691 -1460769 -6833997
10579 -6833997 -7888232 -5152961 -5058162 -6793321 -3834813 2835890 5572904 3187262
10571 3187262 1164374 52927 -4110371 -9142987 -8948802 -5207857 -4738766 -7006780
10563 -7006780 -6580298 -5476448 -9698134 -15868913 -15316162 -9521273 -7594098 -10583678
10555 -10583678 -12419713 -13601728 -18778725 -23466111 -19202956 -9678625 -5610096 -6229365
10547 -6229365 -2841830 2149205 -1511634 -11492571 -15039033 -10953442 -10210604 -14772423
10539 -14772423 -15145651 -9593089 -6713271 -8093636 -6962715 -4339908 -7720386 -13888725
10531 -13888725 -12336586 -5340052 -4982052 -11166892 -12890020 -9808236 -11276449 -15921062
10523 -15921062 -14442614 -10276608 -14170652 -21449755 -19353560 -12694749 -15453397 -22137375
10515 -22137375 -17215449 -7389735 -11452216 -23442261 -22303081 -13220259 -19103115 -34909670
10507 -34909670 -34781338 -22248166 -24999007 -40452138 -39385524 -24801690 -28923254 -48124786
10499 -48124786 -45559365 -25339445 -31707816 -63171462 -69572556 -52041003 -70311650
10492 -70311650 -122366996 -131679993 -106810137 -179106619 -378403831 -496516472 -331902953
10485 -331902953 6774345 216688121 185874160 84679289 74448544 112225521 98822512
10478 98822512 55420971 52153271 74273496 66918331 41014113 39921216 51863257
10471 51863257 38914957 14278637 16086341 34645897 33157324 16327561 16444136 30908599
10463 30908599 31083081 17931902 15959977 23933625 20393708 8308035 8980243 19789375
10455 19789375 20258465 12725126 16376013 27152846 23469354 7814728 4087135 14899365
10447 14899365 18154349 7165749 -7797 5678729 12459195 13967709 18649202 27725103
10439 27725103 29600359 22149879 17815320 21273795 22882531 18755689 17252032 20805478
10431 20805478 20303599 12811272 7661503 9634410 11605091 8822729 6265742 7141448
10423 7141448 6989445 3616431 1558812 3114200 5020809 6353478 10071687 15182677
10415 15182677 16638287 14114534 12423928 13066947 13345114 12790609 12467538 10067523 4173822
10406 4173822 381044 3906341 9502164 8756834 3870874 3226003 6688784 7432600 5838035
10397 5838035 8618385 15023013 16721720 12076960 8779717 10841418 13590082 13340911
10389 13340911 12312969 11919914 9887580 6172772 4286069 4998235 5095533 3286187 1581420
10380 1581420 700636 -492030 -1490053 -956061 394204 2051859 5841059 11064238 12003078
10371 12003078 6297205 911949 2701293 8097572 10086944 10031889 13176817 17216902
10363 17216902 15922257 10760521 8438376 9495628 9443852 8625672 10500269 12371440
10355 12371440 8677598 2122806 809393 4958813 6812274 3562595 511295 1122172
10347 1122172 3086603 4561788 5932158 5524402 1522396 -2618462 -2349663 157743
10339 157743 361585 539550 5214880 10596542 9650165 5205804 5758999 9848085 8222624
10330 8222624 1618901 1758393 11777283 19554998 15757815 6550219 2061960 2440569
10322 2440569 2372166 1207171 1343928 2294061 2320664 1852170 1394517 110735 -1092680
10313 -1092680 378924 3992846 6247351 6644754 7977287 9957474 8772991 3930991
10305 3930991 -688679 -3327409 -5498271 -6445234 -3671905 640157 1513892 13049
10297 13049 1892132 6725949 7614963 3280225 699200 3046528 4804392 2486048 571006
10288 571006 2230570 3416257 1446239 643603 3577047 5183042 2137189 -31692
10280 -31692 3489425 7660316 6224608 2837430 4510865 9322912 10327895 7870020
10272 7870020 7978471 10533690 9085574 2787057 -473943 4629745 13028262 16017759
10264 16017759 11722914 5828675 4174259 6915783 9357035 7585943 3046977 806241
10256 806241 3288107 7486481 8955445 6429608 1599652 -3152730 -5300393 -2982357
10248 -2982357 2548318 6932876 6993097 3882372 1030243 487274 1956907 3599533 3265220
10239 3265220 806068 -916403 265604 1872614 300371 -2338717 -395948 5462600
10231 5462600 7022890 247812 -7602947 -7410744 -289871 5461003 6326778 5980033 7008031
10222 7008031 6976489 4013273 1053245 1731920 5150227 7550945 7521773 6898980 7105122
10213 7105122 7062863 5408391 3101737 2462300 4301770 7287461 9688725 10403392 8872066
10204 8872066 5982987 4617925 6554855 8884873 7052711 2070860 347371 4553709
10196 4553709 9357643 9239797 5888884 3765797 2911410 1425070 871973 2818541 3597115
10187 3597115 -63909 -3174112 1088158 8917405 9722952 2436070 -2528039 224626
10179 224626 3248009 -245514 -4779986 -2010322 5449467 8357123 4771414 1171191
10171 1171191 1729403 4203147 6056426 7811776 9358413 8571351 5536139 3926491
10163 3926491 5831679 8195005 6898790 2461896 -912273 -1001879 422658 1403912 2805451
10154 2805451 5686632 7748315 5774567 1199575 -629439 2159976 5053481 3775576
10146 3775576 222077 -1490809 -1712364 -3565550 -6632432 -7195048 -3999025 606441
10138 606441 4972905 9528869 13807475 15801571 14727388 11687283 7738395 3715331
10130 3715331 1048135 161560 -503965 -1251065 550640 5341133 7948986 4669203 698069
10121 698069 3423923 10151112 10754900 2621405 -5331763 -5252030 515143 5436164 7124650
10112 7124650 6393480 3913479 1603978 2713261 7131289 10410091 9799971 7286369
10104 7286369 5063195 3091544 3119270 9005598 19423450 25815479 22404648 14054633
10096 14054633 9483714 10254732 11382560 9985548 8085945 8182090 10465132 13932479
10088 13932479 16955399 17084340 12915987 6188796 548146 -1561915 -284454 2344617
10080 2344617 4059549 4408616 5066247 7014758 8573135 8250536 7830152 9397555 11037671
10071 11037671 9776734 7374799 7921079 10380950 9397751 3702975 -2099041 -4747847
10063 -4747847 -5529118 -5537034 -3863175 -1670281 -1811497 -2870035 64043 6891630 11318146
10054 11318146 10215592 7392458 5692859 2673421 -2623981 -5970933 -5100362 -3647555
10046 -3647555 -3745970 -1787809 3689071 7223110 5273588 2850832 4887850 7696299
10038 7696299 6199776 3282177 3762876 4822402 1663493 -1920485 1233708 8709202
10030 8709202 10910814 5270365 -1391928 -4515930 -6620075 -9267606 -8791870 -3191436
10022 -3191436 3039180 4597170 1913648 -698318 -668517 1032906 2046944 1472276 991594
10013 991594 2427357 4001894 1780030 -3990565 -7746378 -6025082 -1822336 1299099
10005 1299099 4477881 8908749 11275800 9333637 7148014 8436190 9450070 5861287
9997 5861287 2072780 4596836 9686386 8030263 212062 -3375704 1538820 7672241
9989 7672241 8528506 6432171 5242900 4064928 2278635 2902695 6300044 7423615 4096447
9980 4096447 1716694 4639070 8694537 7922561 3674358 860516 -703937 -4470857
9972 -4470857 -9375301 -10656569 -7531801 -4239320 -3344819 -2800520 -398433 2623067 3652183
9963 3652183 2037519 -560936 -1885800 -1018374 625460 905234 134919 966719 4034900
9954 4034900 6150694 4973016 2958785 3358584 4337301 1635457 -3625287 -5027860 -38812
9945 -38812 5542694 5145290 16618 -3357027 -2123990 881215 2984148 4895812 7189061
9936 7189061 7624271 4522023 386573 -650711 2025152 5151924 5819392 4214180 2417452
9927 2417452 2026759 3025826 4033225 3643588 1872698 -123356 -1614285 -2367807 -1426671
9918 -1426671 1930533 5726220 6645429 4744212 3557480 4221736 3499852 -10059 -2082777
9909 -2082777 1028543 6581817 9785628 10699391 11888318 12621395 10900084 8303376 7137747
9900 7137747 5692081 2211633 203629 2972551 6304329 4470075 458871 1513543
9892 1513543 6999207 9923565 8371343 6031035 3803286 833344 768435 6015404 9923648
9883 9923648 7299828 6649112 15481901 20962714 8606173 -5817120 4263539 23495643
9875 23495643 1877998 -69009262 -126262929 -112255185 -50604782 -8721786 -7469739
9868 -7469739 -11925453 380571 10772534 2431038 -10737457 -12291947 -8220556 -7917839
9860 -7917839 -5659170 3096514 7980971 1923224 -4396727 -888681 4573537 1153690
9852 1153690 -6470285 -8573413 -7035661 -7773354 -7356273 -835586 6193865 6338263 3384540
9843 3384540 4627478 7685688 6547675 3756859 4970435 7460637 5205628 71511
9835 71511 -2501830 -3592967 -6347380 -6945672 -881391 6369573 5935140 -691926 -4749845
9826 -4749845 -3876088 -2653151 -2345157 -251212 2443183 1606211 -2007576 -3851651 -3108127
9817 -3108127 -1908149 611384 5902305 10157379 8761013 4416490 3227667 5081160
9809 5081160 5599552 4921923 6318504 8697752 9078182 9879659 14508360 18129663 13110783
9800 13110783 2228926 -4206337 -3878406 -4115106 -7592993 -8006869 -2545488 2161474
9792 2161474 799672 -2956858 -3988939 -3141282 -2801421 -2193279 -1235977 -2414299 -4806502
9783 -4806502 -2937288 4105510 9029010 6754268 2274439 2449827 5466381 4966193 568738
9774 568738 -2452369 -1546219 1018287 2971813 4006328 4028640 3616881 5061042 9117676
9765 9117676 11954948 9332404 3118954 -289570 1842383 5342853 4816705 130789
9757 130789 -3875416 -2890238 2492033 7555593 8347373 5428653 2293419 941608 713209
9748 713209 905912 1851698 3004643 2702550 888202 -323421 75608 536045 52258
9739 52258 147930 2008391 4056277 4575674 4588585 5488254 5570375 2164689 -3417993 -6217553
9729 -6217553 -3534376 1519584 3381155 82579 -4731196 -5695394 -1463171 3808323
9721 3808323 5166847 2387845 -533941 -842921 311754 909920 1115902 2055818 3696801
9712 3696801 5367351 6429692 5247628 298941 -5583989 -5444464 3286194 12843285
9704 12843285 13040424 4472039 -1968557 352317 5846861 6241592 2331390 823901
9696 823901 3338869 5395011 4882804 4444318 4852662 2938033 -1450445 -2745445 1892369
9687 1892369 6615242 4836549 -713526 -2236281 1309082 3724546 2115677 488967
9679 488967 1688854 2764312 1258471 211544 2948386 7430278 9910621 10370555 10074863
9670 10074863 7455426 1696076 -2423236 491097 7626457 10182195 4928003 -1721342
9662 -1721342 -2608888 1743674 5854915 6748068 5714772 4910093 5221663 6576256 7960339
9653 7960339 7420643 3925979 -580876 -2397189 39716 4256883 6559531 6330183 6283152
9644 6283152 8181015 10031733 9188848 6895844 6815635 9130141 9484000 5086553 -1136494
9635 -1136494 -4594548 -4757888 -4240766 -4199472 -3770849 -2829973 -2049019 -753722 2195656
9626 2195656 5443700 5969781 3371629 897955 1425110 4208991 6276140 5549029 2158033
9617 2158033 -1890457 -3865439 -2410773 947798 3198680 2847108 751978 -1611439
9609 -1611439 -3316407 -3522216 -1530256 2030418 5039440 5546121 3302806 -281979 -3222932
9600 -3222932 -4257472 -3729029 -2968317 -2360943 -735568 2431365 4960672 3752475 -1147724
9591 -1147724 -5552153 -5171262 -445636 3450606 2026623 -3413713 -7242213 -6325641 -3462946
9582 -3462946 -2543909 -2473020 718339 6704652 10216824 8430818 5011826 4734978 7181030
9573 7181030 8297561 6021817 1948808 -1036938 -928979 2134700 5357908 5616072 3244222
9564 3244222 1502637 1761558 2217084 2129297 3300572 5660323 5871205 3084581 1630663
9555 1630663 4332674 7366710 6185956 2646033 1065414 651493 -2142643 -6200091
9547 -6200091 -7030181 -4142968 -1266367 -92556 740257 1341966 685246 115594 1252453
9538 1252453 1488276 -2377818 -7062318 -6315661 -1217702 644568 -2929597 -5640413 -3629013
9529 -3629013 -1653124 -4431310 -8556353 -8062610 -3087203 1895009 4573398 5042300 2925896
9520 2925896 -1228715 -4143767 -3366908 -759713 690234 1405013 3446207 6199386 7112640
9511 7112640 5616368 3741046 3498813 5049776 6484209 5029820 405149 -3091497
9503 -3091497 -980576 4730900 7382232 4891615 2198413 2785179 3378324 491086 -2897570
9494 -2897570 -1938376 2644606 6614656 8661641 9782280 8846091 4399861 -400796 -110605
9485 -110605 5648314 11329614 12297975 9238709 5596027 3592175 3221510 2963628 1133780
9476 1133780 -2061392 -4063934 -2703337 1271903 5338235 7825870 8634756 8702238 9304028
9467 9304028 10227440 8773262 3363962 -2124704 -1956381 2944463 5323287 2119774 -1210071
9458 -1210071 232767 3651802 4793723 5135583 7119399 7953568 5177348 3382681 7262295
9449 7262295 12113388 10451785 4998544 4778261 9769170 10600064 4314887 -720037 1166064
9440 1166064 4143548 1267828 -4571892 -6380402 -3731596 -1417882 -1518981 -2368877 -2653771
9431 -2653771 -2140486 -498506 1469549 1767348 561539 584920 2427434 3323493 2554762
9422 2554762 3353141 6787972 8815841 6913637 4703652 5818918 7832626 6875308 3816384
9413 3816384 948321 -2852428 -7947231 -9490561 -4100354 2676038 3169685 -864801
9405 -864801 -1600633 1837950 2561537 -2042934 -6153665 -4873958 -234635 4036231 6887185
9396 6887185 7136709 3100806 -2501312 -3741096 -255891 1616347 -691216 -1493745 3098976
9387 3098976 7878509 7015622 3522074 3322598 4989943 3161304 -1414035 -3280064 -1596732
9378 -1596732 -421368 -920929 -534994 879499 1160275 1538690 4832744 8110751 5373418
9369 5373418 -1358980 -2359478 5423199 12540947 10280650 2550741 -1349788 133311
9361 133311 1941162 2463220 4785385 9560982 13200887 12976735 9347910 3961774 -686662
9352 -686662 -1086111 3384343 7766183 7276560 4255490 4358443 7359653 7883492 4714737
9343 4714737 2559081 3648226 4312214 2065739 -130466 171887 323655 -2013845 -3694643
9334 -3694643 -1124987 3212046 4374070 2475004 1488294 2365083 2519865 1305406 960057
9325 960057 1988336 2155080 894213 674799 2596887 4191448 3592071 2900036 4659910
9316 4659910 7015810 5807097 1132507 -1494950 1949382 8038216 9476559 4256339
9308 4256339 -1693412 -2202697 1499112 3554670 1912768 -147010 -435981 -871150 -2513402
9299 -2513402 -2126141 2999419 9822144 12883370 11039511 7507370 4762705 2982916
9291 2982916 2494688 3884976 5745717 5684747 3977668 3450816 5337690 7689786 8253821
9282 8253821 6739924 4054335 1392254 102592 349810 215526 -1460291 -1980617 2059770
9273 2059770 8500560 10510623 5115449 -2621332 -5860582 -3498744 770347 4163899
9265 4163899 6544240 8020954 7929839 6095965 3344326 850174 -234547 592995 2101148
9256 2101148 2164472 807886 1006672 4955468 10644908 13667429 11628257 5691559 -975062
9247 -975062 -4928444 -4140362 -50589 2960509 2206446 198319 1495195 6505613 10679992
9238 10679992 10033221 5474611 1085563 -302495 987245 2808103 3391398 2573112 1446514
9229 1446514 982794 1200837 1675198 2146786 2267348 1640055 816606 1298082 3496792
9220 3496792 5511514 5150586 2536010 -440763 -2406365 -2882736 -1483297 1165240 2431516
9211 2431516 268134 -3183680 -3316246 910178 5232861 5625611 3190324 1720355 2447141
9202 2447141 3649189 4122148 4238485 4018640 2824748 1202306 709663 1352074 1309410
9193 1309410 86427 -142193 2215858 5241404 5685389 3021656 -490321 -2920992 -3893169
9184 -3893169 -3441655 -1988956 -1071572 -1532222 -1285206 1770777 4375954 96952 -10741187
9175 -10741187 -17835827 -12275678 1670279 11530861 11804959 8065044 6295213 5342407
9167 5342407 2272848 -1291457 -2551849 -2481504 -2584430 -602762 5138013 10240766 9314817
9158 9314817 4572483 2691832 4007840 2135826 -4887045 -10527956 -9510723 -4995341
9150 -4995341 -1924693 979725 6875335 12632918 11905863 4883521 -1240692 -1776790 529475
9141 529475 1026326 -703301 -2086531 -1840794 -788342 -90538 -385779 -1773660 -3608925
9132 -3608925 -4896880 -5260958 -4787444 -2957753 990635 6245726 10050525 9879925 5703276
9123 5703276 4897 -4120862 -5141148 -3893129 -2180060 -608567 1444357 3830727
9115 3830727 5288901 5747319 6958018 9327885 10010355 6477316 797206 -2178704 -407373
9106 -407373 3706558 6872926 8142799 8762068 10259901 12275109 11588721 5187867 -4320157
9097 -4320157 -9250526 -5727087 747958 2603039 374163 150644 2939532 3719418 957141
9088 957141 -624767 1293067 2409066 -359632 -3231673 -2220825 64226 -494395 -2210589
9079 -2210589 -1163386 1486559 1889603 683270 1508795 3845326 3504539 -118324 -2933166
9070 -2933166 -2603883 -1072227 85868 2133847 5498028 7383993 5130351 -129886
9062 -129886 -4390246 -4204947 651063 6554444 8826447 6666288 3931053 3464615 3218729
9053 3218729 593650 -2553987 -3253701 -2769958 -3517152 -3375578 499908 4168981 1008399
9044 1008399 -6836498 -9228808 -1975053 7410597 10506339 7691042 3749508 409239
9036 409239 -2225257 -2428541 -291415 -129587 -4403944 -8752073 -7863670 -3099023 531477
9027 531477 1982952 3630022 5514886 5574789 4277394 4004759 4440948 3003995 -372571
9018 -372571 -2803394 -2892775 -2401589 -3238871 -5156550 -6462300 -5541525 -2460880 -105135
9009 -105135 -1762697 -6177651 -7790915 -4041152 706236 1280999 -1636068 -4464999 -6753911
9000 -6753911 -9645999 -11344951 -9419941 -5516714 -2656670 47446 4618237 8463067
8992 8463067 7669895 4267460 3343538 4257235 2323840 -1497689 -1330203 2574374 2954855
8983 2954855 -1732530 -3210972 3258031 10120051 8854115 2961898 1621274 5543096
8975 5543096 7893205 6271945 5069090 6866435 9264165 10519945 11648815 12156373
8967 12156373 9776752 5676609 4256819 6061590 6224469 2325772 -1194787 274694
8959 274694 4593903 6565842 5452296 4531506 5208905 6007022 6481071 7769300 9066660
8950 9066660 7585739 3295005 354730 1699705 4539816 3866520 -794166 -4749941
8942 -4749941 -4045292 131598 3287625 2351917 -1847479 -5688141 -6046283 -3460956 -1996239
8933 -1996239 -4748566 -9703311 -11879047 -9664159 -6591616 -5992541 -6628281 -5538291 -2749796
8924 -2749796 -248543 1996662 5343042 8398164 7464924 1877937 -4121156 -6241795
8916 -6241795 -4728350 -2773073 -2275426 -2850988 -3694550 -4488403 -4825082 -4165778 -2573662
8907 -2573662 -822802 385932 1068354 1749277 2712218 3726351 4744084 6218888 7649751
8898 7649751 6511599 1057881 -5501734 -6790670 -1049109 5728735 7080003 3788651
8890 3788651 825832 -724596 -3535087 -7231416 -7884458 -4971034 -3070409 -4496326
8882 -4496326 -5190557 -1096806 5172135 7630683 4433254 -1057833 -4909098 -5558786 -3496595
8873 -3496595 -462135 1690991 2622314 3077022 2618566 45953 -3493151 -4987995 -4319041
8864 -4319041 -5000403 -8352718 -10632747 -8555186 -4159550 -1087162 628015 2496248
8856 2496248 3576421 2806555 2571960 5243849 8294007 7676788 4297687 2122225 1424378
8847 1424378 -565233 -3287143 -3103303 90611 2296531 2076405 2191439 3586945 3478502
8838 3478502 1213419 424352 2730039 4502233 3183630 1999997 4261506 7030355
8830 7030355 5333354 -75348 -4053802 -4501221 -3840901 -3881215 -3508324 -1830345 -326383
8821 -326383 -869429 -3299001 -5410206 -4706910 -872032 2952617 2971994 -306112 -2177131
8812 -2177131 -107995 2882585 3308876 2375106 2727304 3151544 1060475 -1940561 -2136120
8803 -2136120 -8018 953482 884321 2880329 5684483 4030787 -1890355 -4330372 893630
8794 893630 7343203 7245709 2713112 1069253 2634013 1217131 -4222962 -6670126 -1803067
8785 -1803067 4926677 5717923 559078 -4178069 -4613623 -2693299 -1705817 -2113893 -2340422
8776 -2340422 -1490053 -304866 -158313 -1571726 -3634586 -4902890 -4638990 -2842737 236110
8767 236110 3578297 5153373 3976106 2071363 2384643 4912068 7182890 8332501 9566621
8758 9566621 10342127 8168641 3783596 2240312 5785822 9419377 7754813 3365194
8750 3365194 3137807 8058359 12265593 11883758 9217204 7422124 6287735 5083830 5000295
8741 5000295 6364628 7209696 6949679 7866567 10437106 10977110 7290871 3254345 3559867
8732 3559867 6411055 6158506 1847876 -1540872 -124172 4680838 9205026 11174576
8724 11174576 9726520 5018359 -1000384 -5530599 -7326336 -6737358 -3982846 282906
8716 282906 3529629 3824118 3452193 6176059 10537229 10380270 3644748 -3687776 -5108380
8707 -5108380 -1377477 2394001 4069656 4682206 3840333 172287 -4244260 -4696334 73632
8698 73632 5965432 8460068 6732152 2610736 -1422902 -2713912 -331757 2451675 953959
8689 953959 -4201726 -6738773 -3338018 1005114 -247372 -5818596 -8482742 -4940398
8681 -4940398 672314 2980619 1011887 -2843516 -5753081 -5223554 -344855 5980026
8673 5980026 8588366 5651534 874464 -1176026 67988 2259495 3807423 4596570
8665 4596570 4775356 4657692 4560916 3585604 401970 -3573397 -4388648 -1014511 1955271
8656 1955271 -90397 -5484739 -8693027 -7332739 -3471140 607689 4130829 6135744
8648 6135744 5880877 4868413 5247938 6467168 6545143 5894219 6204483 6288088 3528262
8639 3528262 -628530 -1523400 1634571 4314917 3467765 997264 -1030881 -3427413 -5759534
8630 -5759534 -4546316 783984 4808913 3407080 253595 1130012 4954219 5982517
8622 5982517 2822746 -498911 -1571871 -2162964 -3467395 -3774880 -2391184 -2241364 -6374386
8613 -6374386 -13523980 -18559864 -17004454 -9255524 -766996 2877134 1539095 -295468
8605 -295468 -366 553563 -280752 -792488 -25985 -709089 -4119100 -5884258 -1969706
8596 -1969706 4170562 6030450 3309762 803037 -80501 -2098810 -5401076 -6742467
8588 -6742467 -5571896 -4583306 -3845276 -730538 3642307 4491176 1206828 -1308901 -701374
8579 -701374 14046 -448138 1113259 5056547 5908244 840161 -5182335 -7093837 -6386980
8570 -6386980 -5431681 -1907409 4884240 8517086 4157829 -2083086 -1139960 5218923 7714312
8561 7714312 4376823 2268671 4771388 6944404 5378129 3837818 5515440 6918867
8553 6918867 4169393 70010 -71494 3730449 6830354 6336621 3386592 509043 -691839
8544 -691839 -254508 95294 -1341337 -3794437 -5000356 -4894956 -5657386 -7320187 -6566415
8535 -6566415 -1703290 3887879 5518688 2500490 -2147212 -5401253 -5851094 -3543956
8527 -3543956 -364902 759267 -1154064 -4028260 -5699626 -6242086 -6140463 -4702159 -2492555
8518 -2492555 -2824326 -7477190 -12556122 -12388825 -6827254 -866310 2715966 5823824 9149291
8509 9149291 8795500 2352055 -5017636 -5553572 1018979 7160429 7620660 5048241 3690273
8500 3690273 2448148 -1520562 -5784300 -5212464 -457730 2231461 169894 -2770525
8492 -2770525 -3860403 -5722687 -9414219 -9673979 -2884726 5070929 6001397 1182414 -1745082
8483 -1745082 -1374085 -3070132 -7221937 -6688289 1371852 9648436 10944425 7293446 4141640
8474 4141640 1948487 -769901 -1836452 420161 1901074 -1278082 -5077585 -3191971
8466 -3191971 2359197 4263528 1849603 1467349 5006133 6531296 2177098 -3993057
8458 -3993057 -6686722 -5679090 -2697240 1940967 6275260 6010160 1027304 -2229409
8450 -2229409 664614 5320573 5063805 609140 -2084434 -956243 736062 716140 105663
8441 105663 -235197 -1386700 -3898982 -6666179 -8427030 -8284231 -5527949 -1099583 2147908
8432 2147908 3039201 4041575 6849783 8557588 6236311 2857128 3257211 5719662 3886008
8423 3886008 -3009581 -8324918 -7757006 -4748870 -3699759 -3445889 -1195228 1626754 2012069
8414 2012069 955588 2048389 5898941 9248866 8922607 4804654 64841 -663179 4355385
8405 4355385 10452201 10642915 4676994 137473 2335392 7489728 9234066 7385536
8397 7385536 5592921 4191278 1157907 -2525729 -4362076 -5175445 -6685164 -6334277 -1128805
8388 -1128805 5026740 5505449 1923952 2442419 8093516 9877355 2809370 -5701411 -6976488
8379 -6976488 -3407247 -2665209 -4955158 -4263810 501363 3887721 3098871 1755345 3186365
8370 3186365 5569619 6012759 5448432 6686576 9782722 11795579 10571997 7432334 5816023
8361 5816023 7267042 9178200 7689850 2796199 -1392513 -1992754 -494532 493777 734333
8352 734333 715218 -441525 -2608743 -2801716 982165 6140786 8928239 9324317 8895151
8343 8895151 6451575 751110 -4409743 -3722982 1492240 4506054 2951451 1662122
8335 1662122 4492265 8830066 10428768 8766984 5017933 -605210 -6184917 -7099634
8327 -7099634 -1987075 3349808 2510555 -2918599 -5624835 -2402288 2276358 2554318 -2051882
8318 -2051882 -6809260 -6834252 -1669749 4166760 5458973 1732380 -2504178 -3438439 -2055707
8309 -2055707 -1466432 -2342816 -3087681 -2914397 -2442735 -2265100 -2880393 -4998644 -8047389
8300 -8047389 -9546331 -7977822 -5214237 -4085683 -4571767 -4413992 -2463767 571495 3567477
8291 3567477 5159126 3898502 523591 -1515843 -464231 565715 -1879696 -5698192
8283 -5698192 -6203518 -3780563 -3225013 -5335615 -4943324 816243 7427355 9319795 7290138
8274 7290138 6002993 7112036 8751198 9764822 10434926 10081519 7652416 4453178 3203319
8265 3203319 4221327 5007698 3805869 1490731 -185150 -254927 1639096 5063805 8108438
8256 8108438 8796017 7739623 7598095 9066271 9141897 4872636 -2161519 -6836971 -6019943
8247 -6019943 -1956851 373749 -1372905 -5022755 -7147464 -6865892 -5531090 -3890227
8239 -3890227 -1635239 570577 1357366 1756989 5142395 11914421 16685000 14092164 6150207
8230 6150207 100797 -729867 -17037 -1814089 -5010814 -6497610 -6372041 -6692982 -7163177
8221 -7163177 -5668993 -2300031 420906 1238979 1299984 1344948 463266 -1521997 -2756991
8212 -2756991 -1879753 -346401 -791600 -3808530 -7318047 -8663605 -6946802 -3989750 -3094557
8203 -3094557 -5761543 -9535805 -10583752 -8644281 -7444723 -9411715 -12200020 -12103431 -9031466
8194 -9031466 -5990184 -5020982 -5837574 -7232716 -7466748 -4543393 961039 4290932 1198825
8185 1198825 -6022539 -10711257 -10071880 -7419703 -5881891 -4529894 -2355654 -1251834
8177 -1251834 -2024746 -1699307 1295156 2966452 -462671 -5680761 -6811699 -4655834 -4955330
8168 -4955330 -8257786 -8522725 -2871377 3820791 6402918 5713617 4287117 1266931 -4049084
8159 -4049084 -8007535 -7199042 -4439804 -5037937 -8872369 -10972385 -8815731 -4558016 -820411
8150 -820411 1364494 978920 -2093142 -4685128 -3339535 -5015 -163738 -4431411 -6868241
8141 -6868241 -3575170 1594706 2952083 931604 333092 2926375 5689789 5476281 2315099
8132 2315099 -1624506 -4070622 -3838339 -1632257 536890 1528213 1689319 845197 -1988088
8123 -1988088 -5371024 -4791155 1619914 8734853 9700546 4610593 -71596 -351244 1479645
8114 1479645 2396393 3118856 4737051 5072744 2137477 -1570432 -2476795 -1950155 -4092260
8105 -4092260 -7816555 -6508496 2317911 11507178 12521330 6777940 3751621 7982018
8097 7982018 13056653 10745334 2183192 -4103029 -3468670 191055 1289767 -283248
8089 -283248 -1021395 191571 1219475 667339 -369275 -686540 -666473 -786590 -287976
8080 -287976 1325650 2610426 1798121 -24946 776816 5678710 10708865 10115393 3634815
8071 3634815 -2268354 -2034227 2120066 3617298 365674 -3569812 -4803796 -4583495 -4575680
8062 -4575680 -3256681 408405 3282897 2219482 -374220 454524 4915520 8578297
8054 8578297 9120222 8494381 8251396 7175106 4634276 2354555 1290575 27208 -2110337
8045 -2110337 -3333785 -2339433 -154405 2349407 5634038 8591519 8147478 4329098 2178794
8036 2178794 5095394 9210588 8555490 3583055 -127292 -231484 426503 -111717 -176444
8027 -176444 1126093 1566478 107685 -318282 2609842 6101698 5927803 2955493 2155055
8018 2155055 5255999 7996202 6033981 990180 -1842338 -706606 537968 -1917801
8010 -1917801 -6588312 -9130462 -8479397 -7449178 -7272077 -5124680 986623 7648671 9643885
8001 9643885 6988886 4911478 6617687 9234664 8275289 3759604 -237182 -987948 129614
7992 129614 218508 -1619888 -4139773 -6076324 -6919203 -5918187 -2232351 3074392 6769900
7983 6769900 6758680 4511486 2448080 417853 -2370003 -3432995 262143 5722803 5885758
7974 5885758 191324 -2703507 3141649 11631543 13147829 8164507 4888788 5907086
7966 5907086 5949743 2769110 1181238 3831012 5906375 3188049 -1109558 -2396535 -2234007
7957 -2234007 -4368897 -7516145 -7950769 -6283794 -5914908 -6847940 -6481503 -4930838 -4285866
7948 -4285866 -3879822 -1588101 1211226 1481584 569714 2395812 5728458 4937437 -316093
7939 -316093 -2933084 1239938 6996553 7797544 4981727 3867921 4824531 4338896 2447933
7930 2447933 2490655 4125385 3081377 -912940 -1722035 4596500 12818103 14303157 7928974
7921 7928974 1356076 1406211 6335670 9077320 6309340 1984926 1721392 5622025 8495234
7912 8495234 6812912 3179490 2615128 5942538 9076186 8544171 5492715 3597798 4720141
7903 4720141 7631105 9756608 9031871 5085423 -14531 -2896894 -2262793 -632943 -1051201
7894 -1051201 -2446973 -727893 4913248 9534280 8449016 3803065 1947676 4798050
7886 4798050 7480820 5707572 2127402 2511829 7521060 11759253 10748440 5691209
7878 5691209 615012 -2427638 -3752484 -3812780 -2847914 -1698312 -832481 935650 4737501
7869 4737501 8838730 9700786 6363886 1933438 -171449 100599 541016 -50124 -1237217
7860 -1237217 -2437793 -3151921 -2328034 538392 3864523 5417996 5287437 5475440 6427342
7851 6427342 6296606 4280402 2149171 1216512 412961 -662968 498341 5284027 9684545
7842 9684545 8320582 2172621 -2123103 -1298065 577887 -1022343 -4150606 -3553365 1683844
7833 1683844 7216626 9116862 7428420 4448067 2127114 1431038 2285859 3577908 4195272
7824 4195272 4059093 3464501 2241785 775831 798829 3221462 5760527 5013559 1058656
7815 1058656 -2053535 -1027290 3035782 6441357 6987680 5211779 2416086 -1184772
7807 -1184772 -5949091 -10906747 -13355203 -11373429 -6532582 -2613818 -1196062 -151131
7799 -151131 2643806 6032865 7566546 6950765 5448472 3429777 952017 -651360 -563306
7790 -563306 -560592 -2114262 -2762482 512120 5094959 4952751 -547827 -5196109 -4685274
7781 -4685274 -1586336 675549 3285648 7572350 10061408 7584203 3903415 4872241
7773 4872241 8781189 8168263 1127129 -5546671 -5931323 -2268780 -279733 -1560891 -3598979
7764 -3598979 -4038378 -1830315 3353111 9652376 12668903 9667419 3281984 -1359436
7756 -1359436 -2337207 -1566522 -880928 -443953 -693679 -2625398 -5286803 -5641588 -2481408
7747 -2481408 1460705 3228719 4063031 7470876 13075016 15295893 9879419 144464
7739 144464 -5750512 -3749802 2012599 4844186 3291616 1517518 3015928 6462048
7731 6462048 8133617 6351034 2266993 -2459192 -7080217 -11038346 -13102059 -11799885
7723 -11799885 -6636145 935314 7608489 10014632 7427516 2715653 -237521 -401169
7715 -401169 -292226 -2448745 -5987322 -7657866 -5964561 -2828937 -768696 171187 1570789
7706 1570789 3824335 5870492 7200376 8162381 8274849 6433059 3422607 1976153 2987177
7697 2987177 3692568 1573673 -1596490 -2136012 133529 1762232 847937 -500780 299219
7688 299219 2503579 3150677 833030 -2746309 -4592197 -3406586 -882231 484581 1097271
7679 1097271 4063186 9891992 13654475 10672053 3612721 -354761 950452 3019608
7671 3019608 2920605 3289909 5574615 5387741 -406918 -6625028 -6210646 -912173 1506769
7662 1506769 -626172 -1257153 2212004 3867138 -1155261 -8087454 -8555122 -1685733 5665797
7653 5665797 7982518 6161423 4207038 4256974 5224366 4605694 1541561 -1506360 -1356939
7644 -1356939 1349213 2616041 863108 -1045618 -1113041 -1466831 -3253385 -2571732 3413283
7635 3413283 9516904 8203978 806327 -3756776 -1513430 2188418 2180249 428539 514702
7626 514702 1490148 1740301 3796252 9643901 14817403 13275227 6271885 671911 -618832
7617 -618832 -1070529 -3486057 -5804748 -5039090 -1212569 3950281 8750015 10733667 7747872
7608 7747872 1597158 -2303914 -1036589 2317968 3193357 1457431 608535 2577720 5629141
7599 5629141 6780804 4683173 634632 -2064556 -525031 4645985 9181672 9261824 5471796
7590 5471796 1737046 698904 1265012 821531 -1173247 -2747990 -2516236 -1942369 -3050310
7581 -3050310 -4456584 -2412978 3223725 7138737 5354919 1346117 1374259 5337120 7288635
7572 7288635 4811349 2266593 3271121 5280417 4581051 2228220 1228509 1274547 540158
7563 540158 204608 2656824 6579762 8083030 6229457 3863171 3176737 3603160 4085304
7554 4085304 4661561 5487830 6168821 6010873 3869164 -959263 -6323669 -7955071 -4899760
7545 -4899760 -1686327 -2020537 -3185070 -994240 2432423 1720412 -2511224 -4215105 -1631985
7536 -1631985 591817 201668 960970 4554603 5851652 1238197 -3795392 -1700022 5787670
7527 5787670 9715765 5889174 -976262 -4861300 -5086965 -4280333 -3604849 -2077763 1066564
7518 1066564 4648410 5891589 2962615 -2246239 -5294657 -4430423 -2782194 -3312449 -3866970
7509 -3866970 -815107 3886079 4183604 -988511 -4990623 -2391149 3171252 4074729 -422571
7500 -422571 -3443944 -858747 2797740 1785493 -1412516 382414 7342097 11012299
7492 11012299 6336206 -637149 -1488276 2624964 3845759 -295057 -4767634 -6167872
7484 -6167872 -6481844 -6782977 -4559830 -1921 1776471 -1339187 -4218495 -2646681 -125761
7475 -125761 -1072597 -2518513 360469 4439247 2668397 -3990083 -7096864 -3303412 1459558
7466 1459558 2007443 1143932 3746931 8895126 11701880 9859203 5349169 1619193 920881
7457 920881 2834080 4543206 4124343 3186043 3820092 4092955 736451 -4187030 -4698227
7448 -4698227 47171 3639752 1625349 -2281918 -2459730 611274 2586237 1852217 -518233
7439 -518233 -4426492 -9390461 -11461204 -6856341 1585239 6160364 3242206 -2891826
7431 -2891826 -5778226 -3270247 2434877 8204774 11638016 11298915 7423284 2044065
7423 2044065 -2498767 -4901921 -4658780 -1636767 3192843 7343091 8531521 7129063
7415 7129063 6008821 7279796 9679133 10054423 7098681 2526850 -1206893 -2854244
7407 -2854244 -2166798 22398 1038969 -1537361 -5705928 -6050529 -1117619 3540604 3062787
7398 3062787 619596 2103491 6272897 6883283 3537410 2755786 7126034 10825964 8895102
7389 8895102 4401648 2224188 1238758 -2250123 -7452019 -10571048 -10243104 -7027480 -750175
7380 -750175 6846301 10146518 6197677 818497 1957559 8429733 11692919 8174047
7372 8174047 3015323 954424 404619 -992704 -1031666 2755545 7528569 8280586 4441862
7363 4441862 -229530 -3064456 -4696560 -6350913 -7403224 -6051411 -1430216 4918462
7355 4918462 9487243 9642306 6474864 3697615 3160628 2910994 730732 -1940504 -1681975
7346 -1681975 1699118 3835196 775873 -5743202 -9560934 -6797886 -102058 4576389
7338 4576389 4455616 1737665 -483261 -1958322 -4159695 -6991321 -8106286 -5400748
7330 -5400748 205595 4552236 3700063 -1394024 -4858739 -2547345 2457869 3943703
7322 3943703 1223040 -633843 611572 874240 -2999042 -7446961 -7413200 -3670008 -784752
7313 -784752 -531097 -1432548 -2545133 -3492361 -2667547 362137 2339161 503103 -2296819
7304 -2296819 -1382456 2069213 2377786 -1744235 -4771714 -1940133 4629518 8613162 5731942
7295 5731942 -2873015 -11104622 -12386559 -6407542 -250050 225312 -1955667 -168845
7287 -168845 5093898 7057244 3504450 -132899 393259 2616108 2778756 1160880 -684137
7278 -684137 -3096838 -5744015 -6049696 -3126043 242111 1968400 3410733 5356255 5095319
7269 5095319 604101 -5339804 -8199523 -6708913 -2927320 351551 835607 -1820500
7261 -1820500 -4633090 -4441481 -3059162 -5124710 -10060082 -11601326 -7279655 -2517262
7253 -2517262 -2071730 -3068512 -829173 3468152 5980069 6685563 7226914 5869321 424742
7244 424742 -6226271 -8876827 -6644230 -2796865 -140369 -239403 -4075709 -9239174 -9979461
7235 -9979461 -4912951 -948532 -3942042 -9352898 -8983689 -3446713 142529 225541 1358162
7226 1358162 3879402 2873240 -1698656 -3390931 -438291 90248 -6712892 -15615476
7218 -15615476 -18826901 -15849546 -11433113 -8638937 -8058700 -9477096 -10378046 -6986771
7210 -6986771 -475591 2372797 -1220014 -4507243 -553767 7035020 9091018 3985516
7202 3985516 -889399 212292 5289224 9278874 9604390 6325916 1328293 -1437711
7194 -1437711 1270750 7533953 11591460 10643407 7340928 4680488 2261632 -330519
7186 -330519 -346677 3871658 7737647 4658723 -4363493 -10096293 -6304063 1829494 4102016
7177 4102016 -1727370 -7715995 -6540049 -173201 4124310 2961076 -1325219 -5786983
7169 -5786983 -9721074 -12606053 -12806862 -9679710 -5065656 -1588132 -452329 -1231851 -2653487
7160 -2653487 -3263973 -2331587 -457578 1156156 1832844 1540537 847398 1259989 3975112
7151 3975112 7278815 7382177 3689236 774658 2317132 5524324 5477462 2882330 2357716
7142 2357716 4115644 3356478 -1534203 -6047307 -6517169 -4794286 -3740522 -3011496 -2066669
7133 -2066669 -2625454 -4760941 -4943371 -1771324 593954 -864565 -2046596 1911084 7640916
7124 7640916 7655072 1809148 -2268736 -209874 4002949 5071036 2819455 -291386 -3112315
7115 -3112315 -4692996 -3274028 753425 3984831 4644575 5215102 7899044 10418470 9553325
7106 9553325 6441983 4611650 4339825 3032840 601728 338186 3762279 7947022 9271592
7097 9271592 7340120 3901571 223186 -2765141 -3709507 -2430859 -1063966 -1435415 -2174860
7088 -2174860 -763677 2033192 2505732 -756539 -4377914 -4136242 332266 5920006 9514579
7079 9514579 9678765 6422777 1330824 -2812931 -4338985 -4300499 -4463484 -4477367 -2777072
7070 -2777072 389144 3008444 4190529 4819286 5209145 4409661 2466089 1244141 1960907
7061 1960907 3576937 4615868 4911345 4489159 2638462 -120575 -703078 3416648 10199588
7052 10199588 14431752 13360018 9094361 4939139 1400014 -2599868 -6040676 -6179571
7044 -6179571 -2995249 -621249 -2367468 -5956113 -6462822 -3171501 -11169 1003658
7036 1003658 2506227 6128542 8453705 6347796 2925820 3136712 5578620 4699558 357441
7027 357441 -1553424 888297 1824399 -2887497 -8140894 -6472915 1474609 8803501 12109780
7018 12109780 13689553 15130658 14484271 10623299 5874508 2711765 1117957 721325
7010 721325 2561666 6744272 10651232 11794840 10957287 10262660 9302422 5957212 902479
7001 902479 -1766824 174806 3470157 3487754 566447 -956718 303213 845109 -1433688
6992 -1433688 -3340206 -2009608 -633364 -3426255 -7337780 -5474129 1530355 4850177
6984 4850177 261218 -5196371 -3501286 2907677 5518644 1758470 -3506800 -6214221
6976 -6214221 -6543043 -4907026 -714494 3959179 4611986 117075 -5365018 -7831040 -7523206
6967 -7523206 -6098284 -3199031 1598946 5900918 6577397 3768447 582236 -670997
6959 -670997 -220598 727701 1461966 1385958 -377956 -3889949 -7206204 -7452640 -3903719
6950 -3903719 438409 1522449 -1274141 -4418185 -4350066 -1144291 2503937 4445391 4131920
6941 4131920 1955078 -803433 -2260116 -1783267 -913507 -1065177 -1232565 297603 2795819
6932 2795819 3794357 2604901 977896 165467 -574927 -1914301 -2644292 -1160232 1993254
6923 1993254 4122882 3136688 125088 -1203419 1667468 6876024 9822124 8164496
6915 8164496 3927921 376933 -1405359 -1992773 -1701564 -885614 -738757 -2002005 -3683745
6906 -3683745 -4318308 -3553990 -1645991 1075770 3236578 2940431 679947 -460396 791937
6897 791937 1722800 -9473 -2446521 -2483920 -478496 1351757 2629132 3470396 2149391
6888 2149391 -1591777 -3379603 428069 5945690 5964836 -34944 -5739039 -7086225 -5448957
6879 -5448957 -2331598 2045575 4500139 1073100 -4691138 -3772328 4536844 8981432
6871 8981432 2044619 -7970297 -8239406 535488 6505507 4399668 1189232 3452900
6863 3452900 7660105 6593398 -134906 -6336104 -7332945 -4327663 -1669337 -2039509 -4359871
6854 -4359871 -5556678 -4109608 -1465672 262044 874621 1368222 1750434 1134672 -562538
6845 -562538 -2376866 -3375022 -3144401 -2011658 -1489426 -3154450 -6089223 -7127824 -5009740
6836 -5009740 -2348051 -1612773 -1350166 783043 3055931 1577348 -3337616 -6594444 -4930633
6827 -4930633 -1070682 184954 -1986525 -3891028 -1921320 3423254 8009281 8402142
6819 8402142 5732670 4540754 7418340 12019387 14141542 12149757 7119151 730710
6811 730710 -4665238 -5849229 -1965999 3024899 4597928 3775226 5182160 9160419 10442741
6802 10442741 6005202 -182941 -2854235 -2221151 -1633928 -1416297 475493 3115835 2878412
6793 2878412 -538120 -2620975 -225376 4067186 6041298 5654951 5770042 6866753 6702480
6784 6702480 4729701 2978724 1826774 -1257344 -6709487 -10062397 -7520603 -1944983
6776 -1944983 812189 54259 44591 2293119 3534207 2307784 1803464 3549276 3724082
6767 3724082 -54793 -3072609 -421880 4014429 2635280 -3566651 -5734792 -680271
6759 -680271 4354097 3277761 125675 1329629 4801337 3719351 -2012291 -5721689
6751 -5721689 -4757618 -4018562 -6980850 -9473872 -6249539 439811 3656477 1235874 -2268804
6742 -2268804 -2874904 -2055859 -2788054 -3957677 -1784456 4113140 8951921 8062710 2589810
6733 2589810 -1520186 -266731 3705655 4119026 -1457629 -8595101 -11349984 -9228493
6725 -9228493 -6688796 -6327834 -5824695 -2864474 51870 -1245462 -6281809 -10183311 -9769059
6716 -9769059 -6287193 -2226149 1174158 2685880 1021671 -2345822 -3370055 -592688
6708 -592688 2446470 2266918 363760 106028 962510 -230713 -3220531 -3715695 584654
6699 584654 6438617 8746717 6059619 1777867 1034202 6197507 14089461 18220754 15408823
6690 15408823 9264027 5160834 3376840 619269 -2900683 -2965258 1402408 5268521
6682 5268521 4744226 2365608 2207468 3160036 1496451 -1986854 -2366715 2050528 6929517
6673 6929517 7435523 3680796 -439303 -1707221 184395 3234880 4895609 4166420 2524876
6664 2524876 2107164 3031148 3514194 2317708 -375809 -4165874 -8417641 -10928398 -9237941
6655 -9237941 -4470821 -1504079 -3230837 -6398270 -5834839 -1815558 113985 -2968676
6647 -2968676 -6959111 -6210336 -1165296 2480228 1473584 -1392900 -2129290 -1059225 -1231484
6638 -1231484 -3151445 -4301721 -3711882 -3782730 -6312405 -9269234 -9699163 -8178626 -7715790
6629 -7715790 -8947455 -9181934 -6388677 -1797599 1939206 3062538 779410 -4386374
6621 -4386374 -9248732 -9723823 -5991304 -3593345 -6712416 -12150178 -13219129 -8493863
6613 -8493863 -3070150 -1413044 -2681994 -3740075 -3290889 -1683197 492250 2058292
6605 2058292 1906338 1236494 2543682 5197184 5365971 2323459 1089614 5387998 11108930
6596 11108930 11262822 5463988 -293637 -2181600 -1810155 -1161609 498413 3407497 5457075
6587 5457075 5542264 5350370 5917029 5454937 2622300 -782198 -2581941 -3406309 -4916715
6578 -4916715 -6667316 -6781632 -4419015 -135302 4698974 7762235 7093024 3817848 1363869
6569 1363869 617022 -1393518 -6002943 -9134980 -6282215 783716 5899816 6050558 3647321
6560 3647321 1836385 923469 -134252 -1415833 -2302644 -2609291 -2709947 -3150513 -4141789
6551 -4141789 -5057950 -5006988 -4271774 -4209975 -5300240 -6488457 -6714108 -5458503 -1835255
6542 -1835255 4207840 9436949 9603990 5410221 2438775 3347965 4383586 2293276 -62375
6533 -62375 878219 2789994 1611800 -1349780 -2433019 -2639766 -4923678 -6850016 -3427191
6524 -3427191 3975701 9004597 9812624 9401781 7184749 -502939 -10549378 -13813703
6516 -13813703 -8897995 -5535683 -9485722 -13369387 -9210099 -1611709 259966 -2819120
6508 -2819120 -3619796 -1906377 -3635744 -8682931 -9947619 -5306520 -1282043 -2781122
6500 -2781122 -6893035 -9534249 -11418403 -13886597 -14434277 -10658965 -4886789 -1115569
6492 -1115569 -95278 -432411 -1887219 -4381450 -5836666 -4391410 -1767390 -1551671 -4357282
6483 -4357282 -6815206 -5597914 -1196708 2544201 2115217 -2420367 -7642960 -10216574
6475 -10216574 -9755468 -8053626 -6551860 -5760838 -6277789 -8424658 -10888277 -11365886 -9022924
6466 -9022924 -5487520 -3333497 -3897505 -5857522 -5668581 -1121299 4648207 5198903 -1142703
6457 -1142703 -7900306 -8316014 -4222343 -2775121 -6055509 -9280358 -9017987 -7506283 -7624919
6448 -7624919 -8665093 -9144914 -9544840 -9965175 -8848412 -6344465 -5353653 -6782928 -7276819
6439 -7276819 -4387433 -673656 325670 -853202 -1611703 -1409924 -786356 695577 2219559
6430 2219559 766300 -3630112 -5004231 1277582 11144762 16992024 17560014 16502917
6422 16502917 13644841 5921891 -3307771 -5067439 2268475 8535158 4924660 -4351337
6414 -4351337 -8855717 -5759460 -782989 1718898 2923694 4296991 4072002 672315
6406 672315 -3910944 -6217793 -5224713 -2928139 -1748915 -1923915 -1368529 1617046 5577518
6397 5577518 6909679 3975227 -1012134 -4602467 -5233754 -3511891 -1294707 -981948 -3489622
6388 -3489622 -6239947 -5669770 -2461715 -1064004 -2825536 -3690685 -1131941 968898 -1804466
6379 -1804466 -7589641 -12205694 -16294618 -22019304 -25136189 -18552494 -4135628 6697155
6371 6697155 6495358 -265947 -5252492 -6288612 -5799018 -4762027 -3084710 -2184466 -2478650
6362 -2478650 -1297243 2346823 4077033 408034 -3957077 -1338598 7381274 12730096
6354 12730096 8808216 -32667 -6159278 -7280613 -5611437 -2692684 1211944 4861528
6346 4861528 6665596 6711988 5875775 3803075 -76844 -4201118 -5752307 -3976019 -1065307
6337 -1065307 448415 11769 -1335739 -2432502 -2603826 -1749687 -645112 -761567 -2948572
6328 -2948572 -6160063 -8066265 -7291496 -4690309 -2026470 87166 2006840 3052170
6320 3052170 1222279 -4117599 -10109103 -12359007 -9243053 -3512657 769666 2489786
6312 2489786 4037189 7433463 10809760 10295823 5527833 956517 -33973 -83858 -3580443
6303 -3580443 -8780272 -9144014 -3225351 2115571 1245135 -2200577 -1406792 3049048 4819615
6294 4819615 2299558 668530 2835363 4912839 3394683 1323490 2998258 6371797
6286 6371797 5947572 1425151 -1775879 -561198 1927123 1776420 -120879 -495845 804921
6277 804921 1082994 -322260 -850688 756842 1620421 -1336663 -6207987 -7861623 -4781283
6268 -4781283 -1232236 -1480885 -4235058 -4796136 -1250678 3609927 5774749 3647753 -1106956
6259 -1106956 -4746900 -4359859 -1329110 -738428 -5066176 -9757369 -8331887 -1262338 4192335
6250 4192335 3420874 -415185 -2141457 -1318164 -419390 308770 2187511 4205645 3863751
6241 3863751 1263733 -1169097 -2776845 -5051810 -7832485 -8794665 -7750995 -7953876 -11156660
6232 -11156660 -14327421 -13911405 -10978980 -8839819 -7283693 -3362307 2591527 6352547
6224 6352547 6289601 6048976 8264026 9554804 5905001 268758 -555744 4115244 7523999
6215 7523999 5134023 665517 27685 3184534 5527156 4845761 3269637 3276991 4681607
6206 4681607 5408213 3656389 -227327 -3315628 -2930060 -377884 596034 -228992 1043269
6197 1043269 5154598 6547625 1521936 -4674557 -4628733 322233 2582114 -72407 -2724387
6188 -2724387 -2837192 -3664446 -6580738 -7519233 -4340207 -1321997 -2035371 -3092674 58481
6179 58481 5358118 7532974 6261754 5502969 6436598 6167781 2851945 -1962665 -5802652
6170 -5802652 -6934094 -4318442 971528 5011431 4708560 1585472 -764747 -1760454 -3115857
6161 -3115857 -4303529 -2928524 579083 2812672 2434199 1477071 858041 -1137453 -4136784
6152 -4136784 -3769033 2176691 8868482 9970642 6259428 4029391 5423996 5565835 864657
6143 864657 -4626644 -4884838 -847909 1149408 -1305010 -3995696 -3150811 -382977 1243629
6134 1243629 1728629 1849171 127416 -4117189 -7583158 -7110925 -4817312 -4688724 -5954429
6125 -5954429 -4860303 -1669728 -279059 -1382820 -1911303 -1472955 -3110230 -6462831 -6584109
6116 -6584109 -1998847 1968546 1123481 -1705344 -2365608 -1807891 -2285871 -1772117 2215315
6107 2215315 6422989 5408618 -262059 -4441928 -3336960 1048321 4894377 6607713
6099 6607713 7108697 8354480 10986141 12423674 9524861 4244730 2791074 6699106
6091 6699106 9195081 4449094 -3708047 -7516909 -6243729 -5185301 -6114006 -5663917 -2616791
6082 -2616791 -230967 -547306 -1792119 -2605536 -4198933 -6774036 -7562417 -4282960 1624259
6073 1624259 6111839 5627264 -132844 -6890478 -8826792 -5115086 -1203690 -1129878 -1930770
6064 -1930770 534736 4171953 4687697 3547328 4714861 5897497 1496175 -6528409
6056 -6528409 -9797050 -6506924 -4309149 -7583319 -10530264 -7548868 -2986890 -4159149
6048 -4159149 -9718644 -11710966 -6649815 1044162 5452600 4794932 1298172 -1520603
6040 -1520603 -1687768 -436732 -391137 -1884698 -3147485 -4202995 -7173703 -11701952 -13739937
6031 -13739937 -10850532 -5683677 -2190423 -1057717 -752860 -579935 -884412 -2254192 -5559102
6022 -5559102 -10511193 -13836848 -12060338 -6553543 -2083346 106984 3091977 7181551
6014 7181551 7796311 3144805 -1325667 -152560 4646237 7452188 6802525 4837170 2056044
6005 2056044 -2416403 -7050077 -8888421 -7652479 -5644606 -4334762 -3593328 -3217985 -2859069
5996 -2859069 -1525950 852188 2607321 2627097 1890261 1477812 1173000 1215338 2705839
5987 2705839 4780604 4515808 1593559 -192282 1557840 4066779 3829501 1793625 1043664
5978 1043664 1927835 2565667 2146551 1220195 682376 2099953 6238894 9892246 8100715
5969 8100715 1489260 -3138138 -2109903 191178 -974772 -3498836 -3369910 -1551964
5961 -1551964 -485046 1375548 5269314 6888893 2619992 -2659884 -1835394 3162200
5953 3162200 4540626 1252234 -225720 2856069 6057623 6297271 5945913 6722956 6597095
5944 6597095 5008638 4988623 7611154 9613816 8705717 6381011 3692669 -589960 -5381320
5935 -5381320 -5932767 -248518 6936465 9538719 6744214 2239331 -479823 -330571 1464663
5926 1464663 2467566 1769279 1431759 2787962 2722956 -2108658 -8352027 -8798441 -2491391
5917 -2491391 3605153 4120760 998377 -1773257 -3485785 -4403374 -3390482 -892145 104964
5908 104964 -1015319 -723341 2758030 5973090 5739947 4067753 4011713 4299011 2225149
5899 2225149 -791767 -792844 2875135 6441882 5793715 140458 -7068016 -10157590 -6407108
5890 -6407108 193224 3112877 1347260 -557201 -666328 -2233513 -6363416 -8174871
5882 -8174871 -4028005 2248681 4554940 2187761 -1341557 -3376151 -2500567 1980037
5874 1980037 7088422 7029493 1241367 -3006211 -927789 1913738 -1603404 -8191948 -9047414
5865 -9047414 -3665272 34164 -1745284 -4549096 -4377211 -2581825 -798809 1709007
5857 1709007 3567075 778934 -6428510 -11789792 -11129459 -7765377 -6955622 -9049300 -10975756
5848 -10975756 -10911985 -8715133 -4840650 -1269936 -673340 -2674633 -3897044 -3297175 -3790221
5839 -3790221 -6572535 -7961232 -4909843 40689 2858928 3721762 4586215 4086599 -187160
5830 -187160 -6145086 -9082054 -8404031 -7554771 -7254165 -4074461 2571403 6662680 2388974
5821 2388974 -7522770 -13969745 -11726268 -4873096 -1287775 -3695698 -7972985 -9495156
5813 -9495156 -8396895 -7213528 -5754751 -1843837 3347872 4938538 959632 -4125315
5805 -4125315 -5240255 -3292444 -2585813 -3952083 -4865047 -5145359 -7373296 -11284387 -12893178
5796 -12893178 -10910292 -9287772 -10493546 -10537946 -5038044 2830965 5878220 3196529
5788 3196529 1314998 4416450 8508089 7643606 2109929 -2766097 -3540798 -1038728 2800253
5779 2800253 6959537 10205320 10775112 8356177 5021162 3298461 3760615 4610017 3225658
5770 3225658 -1398881 -6903566 -8858175 -5213005 749782 3414090 901349 -3293543
5762 -3293543 -4949827 -3637927 -1692577 -329935 1335963 3899369 6102879 6176130 3763114
5753 3763114 -9241 -3715133 -6265802 -6856861 -5264959 -2426871 -77109 653111 -27528
5744 -27528 -1462202 -3549248 -6282091 -8969836 -10911097 -12308136 -13206299 -12037699 -7259256
5735 -7259256 -637076 3439283 3050469 1156711 1307743 2742279 2068126 -1343703 -4495207
5726 -4495207 -5302456 -5406464 -7337276 -10475452 -11507088 -8785670 -5016881 -4461392 -7448778
5717 -7448778 -9356124 -6543126 -1668571 20395 -1249316 -262493 3812509 4521228 -1705174
5708 -1705174 -7888697 -5327981 3294081 7208194 2781149 -2587463 -2763749 -1101689
5700 -1101689 -2903528 -6340214 -6350614 -3348615 -2069831 -3609645 -3973235 -568183 3784286
5691 3784286 4377863 186631 -4912827 -5979459 -2194595 1985949 2004846 -972991 -1771526
$$ [...]
##END NTUPLES=NMR SPECTRUM
##END=
