##TITLE=31Pdec_SRGlu_Ac20
 , 24 sc
 27.09.2021
##JCAMPDX= 6.0         $$ Bruker NMR JCAMP-DX V2.0
##DATA TYPE= NMR SPECTRUM
##DATA CLASS= NTUPLES
##ORIGIN= UXNMR, Bruker Analytische Messtechnik GmbH
##OWNER= root
$$ XWIN-NMR		Version 3.5
$$ Mon Sep 27 12:13:27 2021 Russian Standard Time (UT+4h)  she@DPX200
##.OBSERVE FREQUENCY= 81.013821
##.OBSERVE NUCLEUS= ^31P
##.ACQUISITION MODE= SIMULTANEOUS
##.ACQUISITION SCHEME= undefined
##.AVERAGES= 24
##.DIGITISER RES= 16
##SPECTROMETER/DATA SYSTEM= spect
##.PULSE SEQUENCE= zgpg30
##.SOLVENT NAME= CDCl3
##.SHIFT REFERENCE= (INTERNAL, CDCl3, 0, 248.564)
##AUDIT TRAIL= $$ (NUMBER, WHEN, WHO, WHERE, WHAT)
$$ ##TITLE= Audit trail, XWIN-NMR		Version 3.5
$$ ##JCAMPDX= 5.01
$$ ##ORIGIN= Bruker BioSpin GmbH
$$ ##OWNER= she
$$ F:/spectra/data/she/nmr/P31/1/pdata/1/auditp.txt
$$ ##AUDIT TRAIL=  $$ (NUMBER, WHEN, WHO, WHERE, WHAT)
(   1,<2021-09-27 12:10:55.35 +0400>,<she>,<DPX200>,
      <created by zg, POWCHK disabled, PULCHK disabled
       configuration hash MD5:
       00 E9 B6 7A A2 85 ED C7 34 08 36 98 17 FE 4E 26
       data hash MD5: 32K
       F2 6B C9 FC A3 2F E2 F7 B8 98 E5 19 05 BF 20 5B>)
(   2,<2021-09-27 12:11:19.26 +0400>,<she>,<DPX200>,
      <Start of raw data processing
       efp BC_mod = 2 LB = 1 FT_mod = 6 PKNL = 1 PHC0 = -8942.084 PHC1 = 1222.27 SI = 64K 
       data hash MD5: 64K
       CA BB 4D 5D 10 40 72 AB D9 05 91 A5 DE C2 6F 4E>)
(   3,<2021-09-27 12:12:44.57 +0400>,<she>,<DPX200>,
      <pk PHC0 = 472.6973 PHC1 = -1139.001 
       data hash MD5: 64K
       4C EE F4 72 FC 5D 95 09 0C B9 29 A7 90 81 C1 32>)
(   4,<2021-09-27 12:12:48.42 +0400>,<she>,<DPX200>,
      <abs ABSG = 5 
       data hash MD5: 64K
       9B E0 2B 05 59 5A F9 EB 5E F7 82 26 BE 94 D4 1C>)
$$ ##END=
$$ 
$$ hash MD5
$$ B3 B6 FC D5 DB 6B 27 CF 4C 85 1E BC F3 25 04 F3
##$RELAX= 
##$RELAX= 
##$RELAX= 
##$RELAX= 
##$RELAX= 
##$RELAX= 
##$RELAX= 
##$RELAX= 
$$ Bruker specific parameters
$$ --------------------------
##$DU= <F:/spectra>
##$EXPNO= 1
##$NAME= <P31>
##$PROCNO= 1
##$TYPE= <nmr>
##$USER= <she>
##$AMP= (0..31)
100 100 100 100 100 100 100 100 100 100 100 100 100 100 100 100 100 100 
100 100 100 100 100 100 100 100 100 100 100 100 100 100 
##$AQSEQ= 0
##$AQ_mod= 1
##$AUNM= <au_zg>
##$AUTOPOS= <>
##$BF1= 81.014009
##$BF2= 200.13
##$BF3= 200.13
##$BF4= 200.13
##$BF5= 200.13
##$BF6= 200.13
##$BF7= 200.13
##$BF8= 200.13
##$BYTORDA= 1
##$CFDGTYP= 0
##$CFRGTYP= 5
##$CHEMSTR= <none>
##$CNST= (0..31)
1 1 145 1 1 1 1 1 1 1 1 1 1 1 1 1 1 1 1 1 1 1 1 1 1 1 1 1 1 1 1 1 
##$CPDPRG= <waltz16>
##$CPDPRG1= <>
##$CPDPRG2= <waltz16>
##$CPDPRG3= <>
##$CPDPRG4= <mlev>
##$CPDPRG5= <mlev>
##$CPDPRG6= <mlev>
##$CPDPRG7= <mlev>
##$CPDPRG8= <mlev>
##$CPDPRGB= <>
##$CPDPRGT= <>
##$D= (0..31)
0 1 0 0 0 0 0 0 0 0 0 0.03 2e-05 3e-06 0 0 0 0 0 0 0 0 0 0 0 0 0 0 0 0 
0 0 
##$DATE= 1632730254
##$DBL= (0..7)
120 120 120 11 120 120 24 19 
##$DBP= (0..7)
150 150 150 150 150 150 150 150 
##$DBP07= 0
##$DBPNAM0= <>
##$DBPNAM1= <>
##$DBPNAM2= <>
$$ [...]
##$SUBNAM3= <"">
##$SUBNAM4= <"">
##$SUBNAM5= <"">
##$SUBNAM6= <"">
##$SUBNAM7= <"">
##$SUBNAM8= <"">
##$SUBNAM9= <"">
##$SW= 501.771253377433
##$SWIBOX= (0..15)
0 1 3 0 0 0 0 0 0 0 0 0 0 0 0 0 
##$SW_h= 40650.406504065
##$TD= 32768
##$TD0= 1
##$TE= 0
##$TE2= 300
##$TE3= 300
##$TEG= 300
##$TL= (0..7)
0 120 53 12 22 120 120 120 
##$TP= (0..7)
150 150 150 150 150 150 150 150 
##$TP07= 0
##$TPNAME0= <>
##$TPNAME1= <>
##$TPNAME2= <>
##$TPNAME3= <>
##$TPNAME4= <>
##$TPNAME5= <>
##$TPNAME6= <>
##$TPNAME7= <>
##$TPOAL= (0..7)
0.5 0.5 0.5 0.5 0.5 0.5 0.5 0.5 
##$TPOFFS= (0..7)
0 0 0 0 0 0 0 0 
##$TUNHIN= 0
##$TUNHOUT= 0
##$TUNXOUT= 0
##$USERA1= <user>
##$USERA2= <user>
##$USERA3= <user>
##$USERA4= <user>
##$USERA5= <user>
##$V9= 5
##$VALIST= <valist>
##$VCLIST= <CCCCCCCCCCCCCCC>
##$VD= 0
##$VDLIST= <DDDDDDDDDDDDDDD>
##$VPLIST= <PPPPPPPPPPPPPPP>
##$VTLIST= <TTTTTTTTTTTTTTT>
##$WBST= 1024
##$WBSW= 4
##$XGAIN= (0..3)
0 0 0 0 
##$XL= 0
##$YL= 0
##$YMAX_a= 10299
##$YMIN_a= -13559
##$ZGOPTNS= <>
##$ZL1= 120
##$ZL2= 120
##$ZL3= 120
##$ZL4= 120
##$ABSF1= 248.5645
##$ABSF2= -253.2056
##$ABSG= 5
##$ABSL= 3
##$ALPHA= 0
##$AQORDER= 0
##$ASSFAC= 0
##$ASSFACI= 0
##$ASSFACX= 0
##$ASSWID= 0
##$AUNMP= <proc_1d>
##$AZFE= 0.1
##$AZFW= 0.5
##$BCFW= 0
##$BC_mod= 2
##$BYTORDP= 0
##$COROFFS= 0
##$CY= -3
##$DATMOD= 1
##$DC= 0
##$DFILT= <>
##$DTYPP= 0
##$F1P= 0
##$F2P= 0
##$FCOR= 1
##$FTSIZE= 65536
##$FT_mod= 6
##$GAMMA= 0
##$GB= 0
##$INTBC= 1
##$INTSCL= 5.30512e-09
##$ISEN= 30
##$LB= 1
##$LEV0= 0
##$LPBIN= 0
##$MAXI= 10000
##$MC2= 0
##$MEAN= 0
##$ME_mod= 0
##$MI= 50
##$NCOEF= 0
##$NC_proc= -7
##$NLEV= 6
##$NOISF1= 182.463
##$NOISF2= 159.3651
##$NSP= 0
##$NTH_PI= 0
##$NZP= 0
##$OFFSET= 248.5645
##$PC= 4
##$PHC0= -8469.387
##$PHC1= 83.26904
##$PH_mod= 1
##$PKNL= yes
##$PPARMOD= 0
##$PSCAL= 0
##$PSIGN= 0
##$REVERSE= no
##$SF= 81.014009
##$SI= 65536
##$SIGF1= 159.3651
##$SIGF2= -187.1042
##$SINO= 113.3802
##$SIOLD= 16384
##$SREGLST= <1H.CDCl3>
##$SSB= 0
##$STSI= 65536
##$STSR= 0
##$SW_p= 40650.406504065
##$SYMM= 0
##$S_DEV= 0
##$TDeff= 32768
##$TDoff= 0
##$TI= <>
##$TILT= no
##$TM1= 0
##$TM2= 0
##$TOPLEV= 0
##$USERP1= <user>
##$USERP2= <user>
##$USERP3= <user>
##$USERP4= <user>
##$USERP5= <user>
##$WDW= 1
##$XDIM= 65536
##$YMAX_p= 267273000
##$YMIN_p= -79377094
$$ End of Bruker specific parameters
$$ ---------------------------------
##NTUPLES= NMR SPECTRUM
##VAR_NAME=  FREQUENCY,     SPECTRUM/REAL,   SPECTRUM/IMAG
##SYMBOL=    X,             R,               I
##VAR_TYPE=  INDEPENDENT,   DEPENDENT,       DEPENDENT
##VAR_FORM=  AFFN,          ASDF,            ASDF
##VAR_DIM=   65536,         65536,           65536
##UNITS=     HZ,            ARBITRARY UNITS, ARBITRARY UNITS
##FACTOR=    0.620285442955139, 1,           1
##FIRST=     20137.2065510759, 0,            0
##LAST=      -20513.1999529892, 0,           0
##MIN=       -20513.1999529892, -79377094,   0
##MAX=       20137.2065510759, 267273000,    0
$$ Real data points
##PAGE= N=1
##DATA TABLE= (X++(R..R)), XYDATA
$$ [...]
##PAGE= N=2
##DATA TABLE= (X++(I..I)), XYDATA
13133E27324N79940J668682J684691K12347j515717k044412j257265j5662J145560
13124I85488K109924K248655P04533j818020k804942r21507J531489J185838j578097
13115A643361k892745r93944J293840J100746l32343m65462J24272n36039j568834
13106b627148o71657J275226J258724n29226p72173J201407K217697R08187L431
13097B264468J015377J101347j680632l916564j810257K181121K478127j226204
13089D06783l520241j250848K357877K792129J78430j818071j058981J108704
13081h04218K206005J419570l8170o37253j54987M67396M83831p5504r54161j766887
13071A45622j587791J36034J976797J549506j105522k933050j812498O15573J580497
$$ y = [527324, 1107264, 2775946, 4460637, 4672984, 3157267, 1112855, -144410, -160072, 985488, 3095412, 5344067, 6048600, 4230580, 1425638, 504131, 2035620, 3221458, 1643361, -1249384, -2243328, -949488, 151258, -181085, -646547, -522275, -1058314, -2627148, -3298805, -2023579, -764855, -1294081, -2066254, -864847, 1352850, 2261037, 2264468, 3279845, 4381192, 2700560, -1216004, -3026261, -845140, 1632987, 406783, -3113458, -4364306, -2006429, 785700, 964130, -853941, -1912922, -804218, 1401787, 2821357, 2783187, 2145934, 1990947, 2458343, 2942174, 2866670, 1912509, 145622, -1442169, -1306135, 670662, 2220168, 1114646, -1818404, -3630902, -3015329, -1434832]
13062a434832J022105Q50962J584347J885696Q63825r49428k445943k459268l97631
13053a480167K217071K232822j130439m151983k980447J052784L402600K604667
13045A766908J089233J99537j383750l548338l351863K32178L581451L112666
13037A698022J97809j384966r25090o58116j464021j853448q96169M89223J242249
13028c554507J121085M6301j586065k129205l44113K178045K495392M38919j123510
13019b457658o44898J34027l36288p65666J69165Q89941l53740j671047J2761
13010e023403L533391M321866Q93984l047971l952813k581421j307836l21914
13002g486117J209150K596271K817851K493599K284481J080144j599056l171401
$$ y = [-1434832, -412727, 438235, 2022582, 3908278, 4772103, 3822675, 1376732, -1082536, -1480167, 736904, 2969726, 1839287, -2312696, -5293143, -4240359, -837759, 1766908, 2856141, 3055678, 1671928, -1876410, -5228273, -4996095, -1414644, 1698022, 1895831, 510865, -414225, -1072341, -2536362, -4389810, -5285979, -4796756, -3554507, -2433422, -2387121, -3973186, -6102391, -6446504, -4268459, -1773067, -1334148, -2457658, -3102556, -2968529, -3304817, -4070483, -3901318, -3011377, -3365117, -5036164, -5023403, -1490012, 2831854, 3725838, 677867, -3274946, -5856367, -7164203, -7486117, -6276967, -3680696, -862845, 1630754, 3915235, 4995379, 3396323, 224922]
12994B24922j222948K122273K690834L73250j131740m57639j93297j669959k405679
12985a669983n81094J538770J132435r24736j866439j044733K24903J114519J343551
12976g32807K89463j756200k691628j085689J451251K292930J240544J28586o0287
12967i23837J78904L66090L72071j59295j176565j568457n08139J123137J797143
12958d98948J144455j86860j462734j793717m84334J529645K103474Q24246k19000
12949I56227K36482P04410q8013p74089m0103O92270o2921q10898J98945J361329
12939B373639L98483j256956q14312O99019J83787j604202r37024K126012L023997
12930D192443k09710l759717l651268o72391K171061L612053L494554J373925
$$ y = [224922, -998026, 1124247, 3815081, 4188331, 3056591, 2598952, 2405655, 735696, -1669983, -2251077, -712307, 420128, -504608, -2371047, -3415780, -3190877, -2076358, -732807, -443344, -2199544, -4891172, -5976861, -4525610, -2232680, -992136, -863550, -923837, -744933, -378843, -6772, -166067, -1342632, -2911089, -3419228, -2296091, -498948, 645507, 458647, -1004087, -2797804, -3282138, -1752493, 350981, 1175227, 956227, 1192709, 1897119, 1809106, 1035017, 994914, 1687184, 1624263, 813365, 1012310, 2373639, 2772122, 1515166, 700854, 1399873, 1583660, -20542, -957566, 1168446, 4192443, 3982733, 223016, -3428252, -4100643, -1929582, 1682471, 5177025, 6550950]
12922F550950j862194l448360k092153N2831N69156o1041k65114l21169j302859
12913b179953k534352k293465l80265J593228K128368J209332J43245K56338J194713
12904h62811J036297p96761j883434k14747J975969J118038j702961j968276Q46167
12895b452519K031418n97817k727095l87632L477821L427046m65141l401919k891757
12886c987595q22363N68318J066595J042031N97042K37340L58860L79953o8336
12877f28155p5727P61292R36457m90887j587317l04786J825034J735847m01905
12868A769853j604855p39759M07431O10481O44122R04993M54952q22400j530351
12859I4467j084491o78802j067997j219001j66106J254891J548121M63598r63309
$$ y = [6550950, 4688756, 1240396, -851757, -798926, -229770, -290811, -555925, -877094, -2179953, -4714305, -7007770, -7388035, -5794807, -3666439, -2457107, -2313862, -2057524, -862811, 173486, -623275, -2506709, -2721456, -745487, 372551, -1330410, -3298686, -2452519, -421101, -1018918, -3746013, -4133645, -655824, 2771222, 2306081, -1095838, -3987595, -4809958, -4241640, -3175045, -2133014, -1535972, -1298632, -939772, -559819, -628155, -703882, 57410, 993867, 502980, -1084337, -1389123, 435911, 2171758, 1769853, 164998, -574761, -167330, 443151, 1087273, 1992266, 2447218, 1624818, 94467, -990024, -1668826, -2736823, -3955824, -4121930, -2867039, -1318918, -855320, -1818629]
12850a818629j565148q45386P03135J854346J748870P26027l15402r33806j020404
12841a466397m52609L42887L99324k62990k27389J009878J685124M31414j066422
12832C92820l97785J607592J993585K83486r94351n32577k8067r10445j942131
12823e27873j486341j41320M76048J44461k48356l55691l79371j93600L07551
12814b404492N28782k0037n75883O4268J542128J851334r0916k461248k346234
12805c912298L19085K115790O21950j809846j091608K350552L590137K45171l813739
12796a384806l849505n27099K066632K415617K047779J497753j81702k242380
12788a57711k406050o45996M82155m2124l12837Q65188J869574J124705m10107
$$ y = [-1818629, -3383777, -4229163, -3526028, -1671682, 77188, 803215, 487813, -445993, -1466397, -1919006, -1576119, -1176795, -1439785, -1667174, -657296, 1027828, 1459242, 392820, -4965, 1602627, 3596212, 3879698, 2885347, 2352770, 2324703, 1414258, -527873, -2014214, -2155534, -1679486, -1535025, -1783381, -2139072, -2518443, -2712043, -2404492, -1875710, -1895747, -2471630, -2407362, -865234, 986100, 895184, -1566064, -3912298, -3593213, -1477423, -855473, -2665319, -3756927, -1406375, 2183762, 2428933, -1384806, -5234311, -5761410, -3694778, -1279161, 768618, 2266371, 2084669, -157711, -2563761, -3209757, -2727602, -2769726, -3082563, -2217375, -347801, 776904, 366797]
12779C66797j096495r07492m87087K00993R37883P14426n17506j172207l98122
12770b358810M94233K98593p6411N42643J292476P35416n46105q47249j17151
12761e82365J06264p85314j734821j743782q91362M10579J864853K735951J992140
12752A372143l73141k722516l083198j095035J513247K522194J388715l28127
12744h05718q86011l39431m6884n30791q33820j69275P90560R30665M11500M98422
12734i80783J624309K329261Q75115k090501l543144j693691J270447J810326
12726c98661k1528p97850P69215J722801r0172k106300j186074R86091P06400
12717d16078j247648p08743K724349M559070K257919j273695k635185k344354
$$ y = [366797, -729698, -1637190, -2124277, -1923284, -985401, -270975, -788481, -1960688, -2358810, -1864577, -1565984, -1642395, -1099752, 192724, 928140, 382035, -465214, -582365, -476101, -1261415, -2996236, -4740018, -5631380, -5220801, -3355948, -619997, 1372143, 999002, -1723514, -4806712, -5901747, -4388500, -1866306, -477591, -805718, -1691729, -2031160, -2078044, -2608835, -3442655, -3611930, -2821370, -1890705, -1479205, -980783, 643526, 2972787, 3847902, 1757401, -1785743, -3479434, -2208987, -398661, -420189, -1218039, -448824, 1273977, 1183805, -922495, -2108569, -1122478, -416078, -1663726, -2372469, 351880, 4910950, 7168869, 5895174, 3259989, 915635]
12709I15635k150783j530540L37535J872552J366613j4156k40100K26067k48837
12700E33986j187947q26668O46930J307308N91697q6388J95225O49794L01759
12691B125696n57014q00590J82573J632049J929420M64230j313486j725714j205283
12682G31881j088904p60625J217181L331901K195635j792769l911949k025210
12674b102859J40505o41673j686392N62292L705386K947930p89896k112957M18262
12665D40598K742995K256844R47312O59829J80638j281631j974287j038247n05581
12656B428470j741559k976447k419662r68297J47195J476643K923250K232146
12648A101739j276740m084410k836817O86931K337796J655088J454905K460089
$$ y = [915635, -1235148, -2765688, -2428153, -555601, 811012, 796856, 556756, 782823, 533986, -653961, -1480629, -833699, 473609, 1065306, 978918, 1174143, 1823937, 2125696, 1568682, 768092, 950665, 2582714, 4512134, 4976364, 3662878, 1937164, 731881, -357023, -1117648, 99533, 3431434, 5627069, 3834300, -77649, -2102859, -1962354, -2604027, -4290419, -3728127, -22741, 2925189, 2135293, 22336, 440598, 3183593, 5440437, 6387749, 7047578, 7228216, 5946585, 3972298, 2934051, 2428470, 686911, -2289536, -4709198, -5677495, -5530300, -4053657, -1130407, 1101739, -175001, -4259411, -7096228, -6409297, -4071501, -2416413, -961508, 1498581]
12640A498581K408768M75719j218921j291449j072314j729846k135683j067164
12632d132309O43603J659140J999272J947518R27226q95187j616902j91187J431218
12623A772392R59208o71885r19600J47318K47477r28363j294958m03306l11874
12614a403591j369626q30488K265329M328771K391561r32589j487283j63609p56133
12605B042342k779021j986049J967995M072300J623426j783801k293535j175317
12597c11660j033788q53846J038377K403926L44518k993201l005620J15808J666708
12588b628778j43778j802078m19061K132688K705460J235046l64484j209139j365860
12579a859984n86904R71829J976165J457816L19646O7638P09567R71098J55543
$$ y = [1498581, 3907349, 4383068, 3164147, 1872698, 800384, -929462, -3065145, -4132309, -3488706, -1829566, 169706, 2117224, 3044450, 2149263, 532361, 341174, 1772392, 2731600, 2059715, 1140115, 1287433, 1534910, 606547, -688411, -1091717, -1403591, -2773217, -3603705, -1338376, 2990395, 5381956, 4449367, 2962084, 2798475, 2042342, -736679, -2722728, -754733, 3317567, 4940993, 3157192, 863657, -311660, -1345448, -2199294, -1160917, 1243009, 1587527, -1405674, -4411294, -4295486, -2628778, -2772556, -4574634, -4993695, -2861007, -155547, 1079499, 715015, -494124, -1859984, -2446888, -1475059, 501106, 1958922, 2278568, 2346206, 3055773, 4026871, 4182414]
12570D182414j064858j543967q76820K38090P84030N73880K36451N51n84193j312616
12560F32962j046932K75720Q17593n15809k012977j594271J6811P70040O60633
12551a996230R65864J205618J8364j588041j280601N30963J174931K81722J34196
12542e53214J136979J004563o60483j226908O1075L52454j536043k429392k41527
12533d092496J990243J149527n53807M49739K751948K472803p9820j319522n22916
12524B245699m7067l55849J06860O29795q91673k850220j318607K741639L554503
12515C815080m25849l452474j454719J553549M28406k547639j831838J904701
12507b010783K988123O3359k244878j258454J36171n34194r45174J432082M219502
$$ y = [4182414, 3117556, 1573589, 696769, 934859, 1718889, 2292769, 2529220, 2529771, 1945578, 632962, -413970, -138250, 679343, 163534, -1849443, -3443714, -3426903, -2656863, -1996230, -1030366, 175252, 193616, -1394425, -2675026, -2144063, -969132, -687410, -553214, 583765, 1588328, 927845, -299063, -237988, 114466, -1421577, -3850969, -4092496, -2102253, -952726, -1506533, -1056794, 1695154, 4167957, 4088137, 2768615, 2245699, 2198632, 1842783, 1949643, 2579438, 1687765, -1162455, -2481062, 260577, 3815080, 3389231, -63243, -1517962, 35587, 463993, -2083646, -3915484, -2010783, 977340, 1040699, -1204179, -2462633, -2326462, -2860656, -3805830, -2373748, 1845754]
12498A845754L399516m68438k957831j870873M58673R96574k77617j219693o44581
12489g38516L90615K04534j046874j161693J102048L424921K254908k027806m737386
12480b335249k956204M93178J380566R4059J2419J421420J350135p18233j501508
12471b759417N26129K339646J291710o70666n75131O76549M16252r24197q96619
12462e75744L01688K32150j184968j385618K66170J332249O00583P3223J180236
12453H39969K102811R49149q94979j046523M3691J34731j054974j706894j033522
12444a666541k11188j30618j94592K17697O61581O43529N39924P44442P75757
12435A379991J38192m75701L1608J175054R17314j492026l621392k414419J452672
$$ y = [1845754, 5245270, 4776832, 1819001, -51872, 406801, 1403375, 1125758, -93935, -738516, -347901, -143367, -1190241, -2351934, -1249886, 2175035, 4429943, 2402137, -2335249, -5291453, -4798275, -3417709, -3323650, -3311231, -1889811, -539676, -1257909, -2759417, -2233288, 106358, 1398068, 727402, 152271, 828820, 1245072, 320875, -575744, -274056, -41906, -1226874, -2612492, -2346322, -1014073, -413490, -340267, 839969, 2942780, 3891929, 2996950, 1950427, 1994118, 2128849, 1073875, -633019, -1666541, -1877729, -2008347, -2202939, -1985242, -1323661, -680132, -140208, 604234, 1379991, 1518183, 1042482, 1074090, 2249144, 3166458, 1674432, -1946960, -4361379, -2908707]
12426b908707L725903J912167j437390k405717r61798j3906l47477J08447J862754
12417d65724K259419k42346l007659k651784L06710K460049J995683P5074j475366
12408g45944j838649r39309P02042J807670J352867j40110j161112r53488l5601
12399a951634O92936P28693K30601j1266N68852J200728N39033j056458j492218
12390e50733n8853J148609L94469q33939k85694J108806N64590j876300l031945
12381c420990j290694J110935J530706M07210j34418M45867Q82913L23421o85539
12372h30589j196984r24676l18669j4538j52855k01783K65788P71009M79943n21711
12362b645065j169166o31502R73311K832144L677461K272251j044860l550178
$$ y = [-2908707, 817196, 2729363, 1291973, -1113744, -2075542, -2089448, -2436925, -2328478, -465724, 1793695, 1551349, -1456310, -4108094, -3801384, -1341335, 654348, 729422, -745944, -2584593, -3523902, -2821860, -1014190, 338677, 198567, -962545, -1916033, -1951634, -1258698, -530005, -299404, -310670, 258182, 1458910, 1997943, 941485, -550733, -609586, 539023, 933492, 99553, -186141, 922665, 1487255, -389045, -3420990, -4711684, -3600749, -2070043, -1662833, -1797251, -1351384, -468471, -145050, -830589, -2027573, -2952249, -3270918, -3285456, -3438311, -3640094, -3374306, -2603297, -2123354, -2645065, -3814231, -4445733, -3472422, -640278, 3037183, 5309434, 4264574, 714396]
12354G14396k608297P28408K397793M31523k383526k352817J71210J793098J112178
12345C966J03405L32637N03173q76379k458296j875307M73275J853127J170200
12336g70199J36462R2307R3505o99728j002154K96072J603043Q95062p07807n22695
12326e86132J178895J473092k86860j238873K85232J979732J239927r76835k072445
12317I95733j545808o46622K0892M20487Q5952p63538n76685J035992J799179
12308H25582N9945k135375j980263l13663J17978n52125k730J596084J695725
12299f88842J30593l38689J098567J792139K17957j521239j441490o85979p82217
12290b219200p54136O48137K094719J579656l39068j435228r10882J76615P30586
$$ y = [714396, -1893901, -1165493, 1232300, 1663823, -719703, -3072520, -2901310, -1108212, 3966, 107371, 440008, 943181, 66802, -2391494, -4266801, -3793526, -1940399, -770199, -633737, -541430, -447925, -1147653, -2149807, -1853735, -250692, 644370, -63437, -586132, 592763, 2065855, 1778995, 540122, 825354, 2805086, 4045013, 3068178, 995733, -550075, -1196697, -1175805, -755318, -669366, -1432904, -2009589, -973597, 825582, 885527, -1249848, -3230111, -3543774, -3425796, -3977921, -3980651, -2384567, -688842, -558249, -896938, 201629, 1993768, 2211725, 690486, -751004, -1436983, -2219200, -2973336, -2325199, -230480, 1349176, 1010108, -425120, -1336002, -1159387, -428801]
12281d28801M86163j83984m58549Q5790N04546k94248j373692q80358O37663Q14860
12271a090610k99588j04105J522849J224904j801661l212783k38732L136880K183314
12262A320468q61804n77946K555685L122349j36735k566645j428335M37622L18053
12253B182712l00317K79208M50717j229456k649265j416393J121786K111479J334597
12244A885068M18161j82967p48125n52239O95070J117907p94924l072175k612828
12235c847052R0457J589305N53575q26771p73619k63349m56238m46484P09764
12226c670412J686200P55155j168486j607743k50117O50568r9345p91298K58291
12217d237187J780795J508367j13515o61743K18643L79916p45243p34534J565492
$$ y = [-428801, 57362, -126622, -585171, -499381, 5165, -289083, -1662775, -2543133, -1905470, -1090610, -1390198, -1494303, 28546, 1253450, -548211, -3760994, -3999726, -862846, 1320468, 458664, -119282, 2436403, 5558752, 5422017, 2855372, 1427037, 1864659, 2182712, 1882395, 2161603, 2612320, 1382864, -1266401, -2682794, -1561008, 550471, 1885068, 2303229, 2120262, 1372137, 819898, 1514968, 2632875, 1837951, -1234224, -3847052, -3756595, -2167290, -1613715, -2440486, -3214105, -3477454, -3933692, -4380176, -3670412, -1984212, -1229057, -2397543, -4005286, -4255403, -3604835, -3704180, -4495478, -4237187, -2456392, -948025, -1061540, -1723283, -1504640, -1124724, -1869967, -2604501, -1039009]
12208a039009L258658J510029j772933k631335r27189J18799o03066j091636o11140
12199c788822q52293j913703j251769J679141L478231J813626q30811j141914
12191b808314P6549P7968r49146p01851R05282J654446O74138o97600j325594
12182c094122j136917p0612J514945J973562L09111j559338r78141J410830K449484
12173H18802J064705o54704j100349j063072j375088j184205K71070J992288K426860
12164A196307J196396q63884k315355j817676L65039J784143M81622j995542k353659
12155d322609k13869J457539Q70986k97676l1891J061958J289819M85973l19249
12146a9019n01333n0067O88595Q69411j8681r56100o11789K70050j33388j314210
$$ y = [-1039009, 2219649, 3729678, 1956745, -674590, -1601779, -1482980, -2086046, -3177682, -3788822, -4641115, -6554818, -7806587, -6127446, -2649215, -835589, -1666400, -2808314, -2731765, -2653797, -3602943, -4304794, -3399512, -1745066, -1070928, -1768528, -3094122, -4231039, -4301651, -2786706, -813144, -504033, -2063371, -3041512, -1630682, 818802, 1883507, 1228803, 128454, -934618, -2309706, -3493911, -3222841, -1230553, 1196307, 2392703, 1528819, -786536, -2604212, -2239173, -455030, 26592, -1968950, -4322609, -4536478, -3078939, -2207953, -2505629, -2537520, -1475562, -185743, 300230, -19019, -520352, -570419, 118176, 987587, 968906, 12806, -598983, -328933, -462321, -1776531]
12136a776531q58538J222712J896315O1289j359576k63927J093296K01086j135504
12127i19378M6572K412078K156664q90432k987970k002912K45647J277332O88278
12118B5879o15255j486939p78446J341226K582062J250373q33656p24024J043132
12109A804352J416981O227m71715P82344J181074n12366j826228q94374L27248
12100A813543l26985j393572n74837J023155Q53445n55885o45723N74383O21147
12091A388671r81545j857148r23430j07003p24477j045011O47306K760596K502439
12082A660398k1584k105235k143613q99252N66186J977829K677710J590819p69772
12073B533486k075466j158740K54788J39905q97146j014616k49544J1595q6756
$$ y = [-1776531, -2635069, -1412357, 483958, 545247, -814329, -1078256, 15040, 216126, -919378, -872806, 1539272, 3695936, 2805504, -182466, -2185378, -1939731, -662399, 25879, -589376, -2076315, -2854761, -1513535, 1068527, 2318900, 1485244, 761220, 1804352, 3221333, 3227560, 2755845, 3538189, 4719263, 4206897, 2380669, 1486295, 1813543, 1486558, 92986, -481851, 541304, 1394749, 838864, 193141, 767524, 1388671, 407126, -1450022, -2373452, -2480455, -3204932, -4249943, -3602637, -842041, 1660398, 1638814, -466421, -2610034, -3509286, -2943100, -965271, 1712439, 3303258, 2533486, 458020, -700720, -445932, -306027, -1203173, -2217789, -2467333, -2455738, -2542494]
12064b542494Q18050K228875J898791l39089j651230m28677J130647N72446r04772
12055G82547o06366J181298J772839M12077q39109n78954P6290k45540r64344
12046I90738o17003Q99594K017694J219077j091534k572726j523445N53930N23370
12037C99695j770895k727952k83922K546252K078460k74424l85933J759566K094965
12028C435812p49574l241576k622218o67451J10813L73386J475002K090741N47845
12019G52780j468944r46338J667941K823793Q91965j788376k358728r36676K64171
12010a098412R3469m34513j3970R08212P63980n65316j108572L36599J929910
12001H11387J185527j109858j753466J86174K093213J737698K7972j107556j311343
$$ y = [-2542494, -1724444, 504431, 2403222, 2064133, 412903, -15774, 1114873, 1687319, 782547, 176181, 1357479, 3130318, 3542395, 2703286, 2124332, 2200622, 1955082, 990738, 373735, 1273329, 3291023, 4510100, 3418566, 845840, -677605, -123675, 399695, -1371200, -4099152, -4383074, -1836822, 241638, -32786, -418719, 1340847, 3435812, 2686238, -555338, -3177556, -3845007, -3734194, -3360808, -1885806, 204935, 752780, -716164, -1662502, 5439, 2829232, 3721197, 1932821, -425907, -1362583, -1098412, -1004943, -1439456, -1453426, -545214, 218766, -346550, -1455122, -1118523, 811387, 1996914, 887056, -866410, -680236, 1412977, 3150675, 3178647, 2071091, 759748]
11992G59748j048022l27797M47302K20880p56411n51637J379854K632674J147882
11983C904473j598519k661084j497486J67521J126244J351583Q61696j62598q30257
11974F61573o50686l91020n90508m70426L12307M58962o31119j092183M74998
11965a918102J945101N15642k521819l211241p17340J702709J759713R02663J059913
11956d82761J466112M49113j495921k265449r60539J141241K126528J338082r7598
11947A218808n44119J61561M78088n79669j797341j468059K536O90669k3788p83138
11937b644452l65474Q78898J825147J757345P00082o21797j269107j112211q86261
11928a737830p35815K17304J974645K740714J384298m84685p42705J13889J89967
$$ y = [759748, -288274, -616071, -168769, 52111, -704300, -1255937, 123917, 2756591, 3904473, 2305954, -355130, -1852616, -1685095, -558851, 792732, 1654428, 1491830, 661573, 10887, -380133, -970641, -1441067, -1128760, -669798, -1300917, -2393100, -1918102, 26999, 542641, -1979178, -5190419, -5907759, -4205050, -2445337, -1542674, -482761, 983351, 1432464, -63457, -2328906, -3289445, -2148204, -21676, 1316406, 1218808, 674689, 836250, 1314338, 734669, -1062672, -2530731, -2528195, -1837526, -1861314, -2644452, -3009926, -2131028, -305881, 1451464, 2151546, 1529749, 260642, -851569, -1737830, -2473645, -2256341, -281696, 2459018, 3843316, 3358631, 2615926, 2729815, 2919782]
11919B919782n07041m81580K46754K34310n99198q76205l42595l7292P52N87921
11909A145608J073206N7441j489924j062579R57392J193976j330771l264006k160772
11900d880429k32923l13490j085308L09540L017374L619483J570212j34798K76574
11891B146235J068671J94750j684599k536569j687156p8551J183557J566967J037714
11882A211019J17845k26317N68375J819409J988290K84832k099440k821977r15025
11873g2989J786126K410755K06519k726992l818569k379424L81655K642034K961483
11864A390598J080522j533964k616130j327782P86121J564702N90646o83436q55402
11855a604125r7606K61393n10113j388729o32931J749951L295597J819357j540539
$$ y = [2919782, 2412741, 1931161, 2177915, 2412225, 1813027, 936822, 594227, 556935, 557687, 1145608, 2218814, 2276255, 786331, -276248, 681144, 1875120, 544349, -2719657, -4880429, -5113352, -5426842, -6512150, -6202610, -3185236, 434247, 2004459, 1869661, 2146235, 3214906, 3409656, 1725057, -811512, -2498668, -2577219, -1393662, 173305, 1211019, 1328864, 1102547, 1670922, 3490331, 5478621, 5763453, 3664013, 842036, -72989, 1713137, 4123892, 4330411, 1603419, -2215150, -4594574, -4212919, -1570885, 1390598, 2471120, 937156, -1678974, -3006756, -2220635, -655933, -65287, -748723, -1604125, -1701731, -1440338, -1950451, -3339180, -3972111, -2222160, 1073437, 2892794, 1352255]
11846A352255l356300k054872L63158J199381K79411o21962m81400J63139N77764
11837b579426O68727M68163r1974o04238l00405P40263J237953L44136r00083
11828a016884q14853M17120Q97505m1330o58864M17430J793838J386358l38862
11819B041458j376748j488488j839219j976583m57082J551162J080531j457085
11811c922054j959951Q84547L014998J459169p86719o350J900729J082393j268460
11802C98302j161614Q86368Q41297j357776j476706J491921L399865J823428n20302
11793D324783j061743j065621j730235j326042Q58872J911922j3283j994913r49094
11784a045354J139371N49514j969767k503725j36974K056845J716006k10901j434480
$$ y = [1352255, -2004045, -4058917, -3695759, -2496378, -2216967, -2838929, -3320329, -3157190, -2579426, -1910699, -1442536, -1534510, -2138748, -2439153, -1698890, -460937, -116801, -1016884, -1831737, -1414617, -517112, -558442, -1217306, -799876, 993962, 2380320, 2041458, 664710, -823778, -2662997, -4639580, -5096662, -3545500, -2464969, -3922054, -5882005, -4997458, -1982460, -523291, -1310010, -1316360, 584369, 1666762, 398302, -763312, 123056, 964353, -393423, -1870129, -378208, 3021657, 4845085, 4324783, 3263040, 2197419, 467184, -858858, 14, 1911936, 1898653, -96260, -1045354, 94017, 643531, -1326236, -3829961, -3966935, -1910090, -194084, -404985, -1839465]
11775a839465o51045J754282L620475K473167j260743l758619k454662K94150
11767a822460O35525j086040j213899J302283L319562K292058k95703j479153
11759A652173o83093M04384M95662j78475p80346p54047L405J010477J194431
11750B364571k19940k381093l021057r83708J752737K077450r946j123811N82711
11741i62086K525568J712181n83605j210564m25677q52730k173251j459863J164154
11732b265873K018358N1654j137700O74598K643908J712425o82946j675657j387475
11723d8708j185118n40878J066168J754744J29365j732583j458729k85803m24699
11714b726241q69951L35651J781455R89870n46218O15677L562752L632088l67721
$$ y = [-1839465, -2490510, -736228, 2884247, 5357414, 4096671, 338052, -2116610, -1822460, -1186935, -2272975, -3486874, -2184591, 1134971, 3427029, 3131326, 1652173, 969080, 1373464, 1869126, 1690651, 910305, 156258, 159663, 1170140, 2364571, 2144631, -236462, -3257519, -4241227, -2488490, -411040, -420986, -1544797, -962086, 1563482, 3275663, 2692058, 1481494, 1055817, 203087, -1970164, -3430027, -2265873, -247515, -195861, -1333561, -658963, 1984945, 3697370, 3014424, 1338767, -48708, -1233826, -1774704, -708536, 1046208, 1175573, -557010, -2015739, -2301542, -2726241, -3596192, -3260541, -1479086, -489216, -1035434, -419757, 3142995, 6775083, 6407362]
11705F407362m012116l531650n51799J139215P45479L14518J096343K069785J779077
11696E456214M28057m30783k27198l92602j859442k601773l15045K910604K476426
11687E444458j488624l388789o61177J936399L7681l120902k244105J222093K020090
11678b42876P1259k63006J527705J526484j024109k177336k01285J839035J684422
11669B740293P63673J99131r14119j887320l74022K400261J805125k500668m561982
11660b329628j031866L127001K096903k022504k992068R6419K579811J920552
11652A444620M64457N20963R33533k40208k252960k454390K21346L416426L475328
11643E529115j64951l550703k741440R64116K795907J113664j022062j153912
$$ y = [6407362, 2395246, -1136404, -1688203, -548988, 196491, 511009, 1607352, 3677137, 5456214, 5884271, 5453488, 5226290, 4833688, 2974246, 372473, 57428, 2968032, 5444458, 3955834, 567045, -94132, 1842267, 1879948, -1240954, -3485059, -2262966, -242876, -171617, -434623, 1093082, 2619566, 1595457, -581879, -783164, 1055871, 2740293, 3503966, 3703097, 2788978, 901658, 527636, 2927897, 4733022, 2232354, -2329628, -3361494, -234493, 1862410, -160094, -3152162, -3055743, -475932, 1444620, 1909077, 2430040, 3363573, 3123365, 870405, -1583985, -1362639, 2053787, 5529115, 5364164, 1813461, -927979, 36137, 2832044, 3945708, 2923646, 1769734]
11635A769734n12281n66194k69054J139210J828348L53707j720022k457074k249736
11626b683362j770283j39835K414537L166178J112248m53415R72962K482880M34332
11617E536242k932796k679270P42025K143916j36473k092260p84063J650835K106449
11608C554605N98818j312459k787076k924984q87210J744413J785302q42820k299518
11599c370929m81251J706045J078250q71951q70159P35580J173856L05115M90534
11590a04910J908204J896443m49881k344149j302434J353369K536983J287933
11582D781558p90898j809027j110917N82404J612718P28458j357316k585159k094513
11573b042692r37635N9548J272720K289781J291717j756775l466264j246117K441875
$$ y = [1769734, 1257453, 691259, 422205, 1561415, 3389763, 3743470, 2023448, -433626, -2683362, -4453645, -4593480, -2178943, 987235, 2099483, 1646068, 2619030, 5101910, 5536242, 2603446, -75824, 666201, 2810117, 2673644, 581384, -202679, 1448156, 3554605, 4153423, 2840964, 53888, -2871096, -3758306, -2013893, -228591, -1071411, -3370929, -3852180, -2146135, -1067885, -1939836, -2809995, -2074415, -900559, -595444, -104910, 1803294, 3699737, 3249856, 905707, -396727, 956642, 3493625, 4781558, 3990660, 2181633, 1070716, 1653120, 3265838, 3994296, 2636980, 51821, -2042692, -2980327, -2920779, -1648059, 641722, 1933439, 176664, -3289600, -4535717, -2093842]
11564b093842L199852R17594p38405m07161l39962j324135r34805J530114K709071
11555B518321M69305k103526j368963J142359J483133m15017j326296k86986N47967
11546F60297P0824n39828o86341j052186j298147k56966J273187J026709r15627
11537a718078j778944l35573J275221R72189n09775j418967j357405o86331N18804
11528e038859J758061J978450J184033P54593J320680J681285O28434j304611
11520B962066k540953k042910q7515J648086J223589j086895k282662l86832K334794
11511b59232K383661K54184o36122L13307K13104j878214l039446j417235P06286
11502c359707Q21451r367M17367J800279K446447J975208R08870n43134j634428
$$ y = [-2093842, 1106010, 2023604, 1285199, 878038, 538076, -786059, -1720864, -190750, 2518321, 2987626, 884100, -484863, 657496, 2140629, 1725612, 399316, 112330, 660297, 731121, 191293, -495048, -1547234, -2845381, -3102347, -1829160, -802451, -1718078, -3497022, -3832595, -2557374, -1585185, -2094960, -3513927, -4871332, -5557663, -5038859, -3280798, -1302348, -118315, 636278, 1956958, 3638243, 4266677, 2962066, 421113, -1621797, -1709312, -61226, 1162363, 75468, -2207194, -2594026, -259232, 2124429, 2378613, 1742491, 2055798, 2268902, 390688, -2648758, -4065993, -3359707, -2538256, -2547623, -2130256, -329977, 2116470, 4091678, 5000548, 4457414, 2822986]
11493B822986j099603M28108M19428j437178j920262O65324L040517J694475j423310
11484C190485j835204M67132J276418r74921k799746j046194K537135L886413
11476D701518J866627r05290j745439q74041l79830j062549j490504n42226N06912
11467G5178l1256j197298o84202J166670J551258k21028j377331l6379J949481
11458A195093K144810R78891J39500k32988p05685q58938m25848l51285r13370
11449I70180p16920O14198R38507r96619k809665j775162R39817K076981Q80494
11440A21811p41278j358268q23807P85219K584382K531593R1166k084276j523952
11431d17410N32934J465665J294112J421216J248081l71664j832710r21616Q06857
$$ y = [2822986, 1723383, 2151491, 2570919, 1133741, -786521, -121197, 2919320, 4613795, 3190485, 1355281, 1822413, 3098831, 2123910, -675836, -1722030, 815105, 4701518, 6568145, 5662855, 3917416, 3043375, 2663545, 1600996, 110492, -431734, 75178, 43922, -1153376, -1837578, -670908, 880350, 659322, -718009, -754388, 1195093, 3339903, 4318794, 4458294, 4225306, 3519621, 2660683, 2234835, 1883550, 970180, 253260, 867458, 1805965, 809346, -2000319, -3775481, -2835664, -758683, 121811, -619467, -1977735, -2801542, -2016323, 568059, 3099652, 3190818, 1106542, -417410, 115524, 1581189, 2875301, 4296517, 5544598, 5172934, 3340224, 2418608, 3225465]
11422C225465L234k730058l431563j060237J186156J273619P37901P37403n1595
11413a09675j933175k405197j16910K445035K549104R74229o9449m49162j042969
11404a58169j093901N09102K387786J920437q41882k795744j754664Q32293J909454
11395I14712N87641j132011j188869P6209R56062J025074J199165J341661K9572
11386C809216k438909l147086n73585K415924K167796n25248j769185l67343J009935
11377E81515M54215o11122l02204R23190J497732Q84349m40508j633137j617036
11368b63006j03885J323846Q83060o56860r98786p4653r5181j438193j590944
11359c014602N76676K503016J877351K98246M61156J703237J317243q65636k247458
$$ y = [3225465, 3228699, 498641, -2932922, -3993159, -2807003, -1533384, -795483, -58080, -109675, -2042850, -4448047, -4564957, -2119922, 429182, 1403411, 1333962, 884800, -158169, -1252070, -742968, 1644818, 3565255, 2723373, -72371, -1827035, -994742, 914712, 1502353, 370342, -818527, -742318, 213744, 1238818, 2437983, 3779644, 3809216, 1370307, -1776779, -2350364, 65560, 2233356, 1708108, -61077, -428420, 581515, 1035730, 424608, 122404, 1045594, 2543326, 3427675, 2987167, 1354030, -263006, -366891, 956955, 1840015, 1183155, 184369, 109716, 14535, -1423658, -3014602, -2437926, 65090, 1942441, 2240687, 2701843, 4405080, 5722323, 4856687, 2609229]
11350B609229j522343k62326j04032n62625m46372J43501K34766m70089j260003
11341a640294j212643K49J643353K149618N68819j897977k647225o53032J955847
11332a733285K291128K72127j491509j304776j90399M69272J137509K404978K758243
11323D613288N94339k419760k955052q57291P22493M10695L62617J751962K221039
11314D444330K12685j506835p6847K284017J454670j855703l070872r15038R40519
11305A910926j8094j597797j035188P48236J250707L24082l53668k06947K448
11296A024705M196K34498N69314K74359p54862j632179j550054p47380j74091
11287b751494k48813k25368P47418K044729K000872K69042j407866j557993r07275
$$ y = [2609229, 1086886, 824560, 720528, 157903, -288469, -144968, 89798, -380291, -1640294, -2852937, -2852688, -1209335, 940283, 1509102, -388875, -3036100, -3689132, -1733285, 557843, 829970, -661539, -1966315, -2156714, -1687442, -549933, 1855045, 4613288, 5207627, 2787867, -167185, -1024476, -301983, 108712, 471329, 2223291, 4444330, 4657015, 3150180, 3073333, 5357350, 6812020, 4956317, 1885445, 970407, 1910926, 1892832, 295035, -740153, 8083, 1258790, 1582872, 1229204, 1022257, 1024705, 1028901, 1263399, 1832713, 2107072, 1352210, -279969, -1830023, -2577403, -2751494, -3000307, -3225675, -2478257, -433528, 1567344, 1836386, 428520, -1129473, -2036748]
11278b036748p79222p62887L15739J878637K047944N01717q57700m25839J081221
11269I62862J531652k10898k842263l582544j233372J860505K352856M65437k66260
11260i62025J489970K572313M15610k530218k466744j734J361991Q41693N41595
11251A262451R61620M41995j025627j250182M01009J882306J685562M92919o90340
11242D161713j488932j179538N60883J939817Q91053j413622j895467l85374K17938
11233A408471j137493k139760j283374j21723j45530m75666o5509M33828L60106
11224c166650L40210Q13789J242478J424858J607513J167007m75384j836509j124316
11215g004L42465j01529j660650j228790P47461N94772j734830j775527J710084
$$ y = [-2036748, -2815970, -3578857, -3263118, -1384481, 663463, 1165180, 307480, -118359, 962862, 2494514, 2283616, -558647, -4141191, -5374563, -3514058, -1161202, -695765, -962025, 527945, 3100258, 3515868, 985650, -1481094, -1482828, -120837, 720856, 1262451, 2224071, 2666066, 1640439, 390257, 791266, 2673572, 4359134, 4852053, 4161713, 2672781, 1493243, 2054126, 3993943, 4884996, 3471374, 1575907, 1190533, 1408471, 270978, -1868782, -3152156, -3273879, -3419409, -3895075, -3960584, -3526756, -3166650, -2826440, -2012651, -770173, 654685, 2262198, 3429205, 2953821, 1117312, -7004, 335461, 233932, -1426718, -2655508, -1908047, -1313275, -3048105, -4823632, -3113548]
11206c113548L854339J489851j577435r80398J370876J485764J51070L25387R99770
11197D005676n81847k809771j732016J875649L104191N22739j900759j228068
11189A255794N40655M41367j079532j702166q64730L4561l093l52245K23968J711122
11179B05701K340022O95652j867195k483273o55433J154622J327238R95467J219481
11170B932282J094407J98445K0010R95251J050693o48414j580916j75262J009595
11161D896091l06804j784222n42200J430886O83922j434284j274319L00952m64244
11152A505778k884934k461252J127147K949139Q74595j188340j37798J523694
11144A308029N56495j691858k067673n14298Q41149J144623Q56071K72088q5503
$$ y = [-3113548, 740791, 2230642, 653207, -327191, 1043685, 2529449, 2680519, 3005906, 4005676, 3423829, 614058, -1117958, 757691, 3861882, 4384621, 2483862, 1255794, 1796449, 2237816, 1158284, -543882, -1408612, -1374051, -1377144, -1729389, -1505421, 205701, 2545723, 3241375, 1374180, -1109093, -1764526, -609904, 717334, 1712801, 2932282, 4026689, 4225134, 4245144, 5240395, 6291088, 5642674, 4061758, 3886496, 4896091, 4589287, 2805065, 2262865, 3693751, 4377673, 2943389, 1669070, 1970022, 1505778, -1379156, -3840408, -2713261, 235878, 1110473, -77867, -215665, 1308029, 1864524, 172666, -1895007, -2409305, -1568156, -423533, 432538, 704626, 619123]
11135F19123N08421J211942J46530k080547k195538P73295L333270K477158q5062
11126D708592j235479j281324k286266l704040l273697j062005P35544J336844
11118f061831J710924J909165J040998k56426j84495J165632J697183O40110m09474
11109A251786l75132k76549r39530j264071k10506J142553J195393L23202J0035
11100H57181K35347l22598j615035j769807J9553J809675J413229m97319j439902
11091a309676o98239J28000J54770M81478J532872J491610o55759k418469r98063
11082b291476J943245K170131o52313k217027k60287J932979R70084j212540q79764
11073d96968J093515Q14855j818412k759499n21837J450847O56116m89422P40861
$$ y = [619123, 1127544, 2339486, 2486016, 405469, -1790069, -1016774, 2316496, 4793654, 4708592, 3473113, 2191789, -94477, -3798517, -7072214, -8134219, -7398675, -6061831, -4350907, -2441742, -1400744, -1657170, -1841665, -676033, 1021150, 1661260, 1251786, 876654, 600105, -339425, -1603496, -1814002, -671449, 523944, 847146, 857181, 1092528, 769930, -845105, -2614912, -2595359, -785684, 627545, 130226, -1309676, -2007915, -1879915, -1725145, -1243667, 289205, 1780815, 1125056, -1293413, -2291476, -348231, 1821900, 1169587, -1047440, -1307727, 625252, 1595336, 382796, -496968, 596547, 1411402, -407010, -3166509, -3688346, -2237499, -1581383, -2070805, -1329944]
11064a329944K301019P09450k719137l323911j47377K583762J643527j010198
11056a292809j730263k11499J032544O39459k70516j98359Q63578J721773J376573
11047A930481M8714j058730j213137j031489j230882j105491L24677K032399J881061
11038E77603m0103j249208o62988q7997p65886j070031L82318J753183Q57934
11029c05175q56715m58155J528796J877731j3454j150507K03914J962132J684627
11020D473194k6019j149897j264364j263001j408731j213070n31737K71347P65407
11011a346871N58648l69436j174952q55795L18102J019287O72217J2802k74497
11002a440495k71266J8471Q82191J853265J753325L90185q96978j010513l81525
$$ y = [-1329944, 971075, 1680525, -1038612, -4362523, -4509900, -1926138, -282611, -1292809, -3023072, -3234571, -2202027, -1562568, -1833084, -2031443, -1167865, 553908, 1930481, 1979195, 920465, -292672, -1324161, -2555043, -3660534, -3335857, -1303458, 577603, 537500, -711708, -1374696, -1462693, -2228579, -3298610, -2916292, -1163109, -305175, -1161890, -1620045, -91249, 1786482, 1773028, 622521, 826435, 2788567, 4473194, 4447175, 3297278, 2032914, 769913, -638818, -1851888, -2383625, -2112278, -1346871, -788223, -1157659, -2332611, -3188406, -2870304, -1851017, -1178800, -1165998, -1440495, -1711761, -1693290, -811099, 1042166, 2795491, 3185676, 2288698, 1278185, 896660]
10993H96660J72364Q10192J857727K340583P30445k587610m660718k931736J235022
10984b137071L447459J589552j275217j200713Q83117J000550r77119r26228K099344
10975B503674L250748m33062m519181l696079J32452J512575J05685k59442R71806
10966d30824R85946k40354j34147O67964p89466l207080k168671J674816K715487
10957i26329r1991j266749J490096L260799R28128j246189L49676J990414l24989
10948D162866l155844j594014J877140J636405j494205k167123K57528J396312
10940I19065l20308j816238j149016K17808R96420J492328J458784L04150q57114
10931A245879o40871p2570o96695j350154j90730J643374J998133J523758J656418
$$ y = [896660, 1069024, 1879216, 3736943, 6077526, 6807971, 4220361, -440357, -3372093, -2137071, 1310388, 2899940, 1624723, 424010, 1307127, 2307677, 1330558, 404330, 2503674, 5754422, 5321360, 802179, -2893900, -2761448, -1248873, -1143188, -1402630, -430824, 555122, 314768, 180621, 848585, 59119, -3147961, -5316632, -3641816, -926329, -1018320, -2285069, -794973, 2465826, 3393954, 2147765, 2497441, 4487855, 4162866, 1007022, -586992, 1290148, 2926553, 1432348, -734775, -477247, 919065, 598757, -1217481, -2366497, -2148689, -1152269, 340059, 1798843, 2102993, 1245879, 605008, 532438, -164257, -1514411, -1705141, -61767, 1936366, 3460124, 5116542]
10922E116542R08326k220408m646144k464204K032467K939516k72209k381734
10914i87848j097169J29657r45422j665035J9536J602997O07901j040984n01217
10905c877584J218110J211059o39195j781160p05791J511490K800361K089751
10897A827041J81285j012538o31961J27101p456m94975m95359p74112j927348
10888c208322k239724j46356K461126K604388Q06863j62876q8793q56619j962815
10879b793128j020864J313728J645427l27833r49400J214734K826186J263168
10871C172018j364024j963219q32716P0285L48805L82152j60342r02361j55593
10862a404995K263636L752965K382824l55624k039740k486166k519936j649604
$$ y = [5116542, 6024868, 3804460, -841684, -3305888, -1273421, 1666095, 1393886, -987848, -2085017, -1955360, -2900782, -4565817, -4546281, -2943284, -2335383, -3376367, -3877584, -2659474, -1448415, -2087610, -3868770, -4574561, -3063071, -262710, 1827041, 2008326, 995788, 363827, 490928, 483472, -11503, -506862, -1280974, -3208322, -5448046, -5594402, -3133276, -528888, 277975, 115099, 26306, -830313, -2793128, -3813992, -2500264, -854837, -1182670, -2132070, -917336, 1908850, 3172018, 1807994, -155225, -987941, -917656, -568851, -186699, -347041, -1249402, -1404995, 858641, 4611606, 6994430, 6638806, 4599066, 2112900, -407036, -2056640]
10854b056640O21657K622627K165660k54366j926833j375547J74977Q26882M03111
10845A201528L21545J308905J875678P1966l170761m219376j411685K239129K920538
10836A137467R73151m62622k42460L44721P58848J423964J524177J23542j092151
10827D488637L7270J749693M15553l069456l768200l75568K491363J360510j304923
10818B024879j716230j11594J206929J684855J535945N2947k232477k532082J12478
10809B5650K350127J221475j104169p51569J680103K185956m37323l076468k843896
10800g50114k97696K014451K151990l8406k664617k996548m51736K122902J720008
10791H10234q73653k194653p75434J335749J878889J223188R95690J304422Q63094
$$ y = [-2056640, -1434983, 1187644, 3353304, 3098938, 1172105, -203442, -28465, 798417, 1201528, 1523073, 2831978, 4707656, 4779622, 1608861, -2610515, -4022200, -1783071, 1137467, 2110618, 1647996, 1405536, 1750257, 2509105, 3933069, 5457246, 5580788, 4488637, 4525907, 6275600, 6691153, 3621697, -146503, -522071, 1969292, 3329802, 2024879, 308649, 197055, 1403984, 3088839, 4624784, 4677731, 2445254, -86828, 25650, 2375777, 3597252, 2493083, 1741514, 3421617, 5607573, 5170250, 2093782, -750114, -1047810, 966641, 3118631, 3080225, 415608, -2580940, -3032676, -909774, 810234, -63419, -2258072, -3033506, -1697757, 181132, 1404320, 2400010, 3704432, 4567526]
10782D567526n36390j328204n85565K05155o92333k126777j391322J304423K547018
10773A963531Q86203q00971p7071J084975J49917j110119J94990K285593J231315
10764E808363k040403k874174o69077M23871q26544o54308K245668L440904K92727
10755E147027k794810j194878K351303K302599p59876j666525N90392J604416
10747E579648r08252l541173k604610P20155K618314J573889q27507k490800k509089
10738b389425j084908P82021J677272Q90396n83658q35795O45417J950693R96661
10729B048674j392512k126326k3982K360283K256832L88663o02727n1066O18109
10720C475948O47445M01605k82910j735333k799279j905528L75639J908375J749348
$$ y = [4567526, 4031136, 2702932, 2117367, 2322522, 1630189, -496588, -1887910, -583487, 1963531, 2849734, 2048763, 1971692, 3056667, 3206584, 2096465, 2291455, 4577048, 5808363, 3767960, 893786, 224709, 648580, -177964, -832272, 1413396, 4854300, 5147027, 2352217, 1157339, 3508642, 5811241, 5051365, 3384840, 3975232, 5579648, 4671396, 1130223, -1474387, -754232, 1864082, 3437971, 2610464, 119664, -2389425, -3474333, -2692312, -1015040, -124644, -708302, -1544097, -898680, 1052013, 2048674, 656162, -1470164, -1494146, 866137, 3122969, 3511632, 2908905, 2857839, 3475948, 4123393, 4524998, 4242088, 2506755, -292524, -2198052, -1822413, 85962, 1835310]
10711A835310M48029j502430l248163k809253L71286L165872K332976n59566j399516
10702a365455J31750O95681o67150j346019l15541K87276l06154L784J746756
10693a135072K354077Q28256k61676N24014R09201n73413j421515M40524K469421
10684D133817J187678k318037l936399k113782Q20130J967411N91678j639678
10676a307182k029078M49997L326805L134828q661k475716k029842r2589J254227
10667B22789J634253J120850l68215j569156p10852J307312J572583k43880j203316
10658A762368O3190J265341M61768j122404j687357j275440l98491Q43012J406608
10649A318595J59974j363923n72055J460549J063044j655478k377288K70318K344774
$$ y = [1835310, 2283339, 780909, -2467254, -5276507, -4905221, -1739349, 593627, 34061, -1365455, -1233705, -538024, -1205174, -2551193, -2866734, -2579458, -2885612, -2881828, -1135072, 1219005, 2047261, 1785585, 2309599, 3218800, 2645387, 1223872, 1664396, 4133817, 5321495, 3003458, -932941, -3046723, -2226593, -259182, 332496, -1307182, -3336260, -2886263, 440542, 3575370, 3566709, 1090993, -938849, -1031438, 222789, 1857042, 2977892, 2609677, 1040521, 329669, 1636981, 3209564, 2965684, 1762368, 1825558, 3090899, 3552667, 2430263, 742906, -532534, -931025, -88013, 1318595, 1478569, 114646, -457409, 1003140, 2066184, 410706, -1966582, -1696264, 648510]
10640F48510J318002p3311O31397J295231k33936j775778q31388R62876J182996
10631C124599Q63732J557572J476570j249595m151019l520051j16743K036705
10623B1770J307984l08702o89579K69637J378661J338757j03772j450889j108642
10614F55225J98281O04080L26634R29000J810978J005207q10694j199360o33502
10605B885849j569750k993030j453122K059238K519619o41556k019418P49898
10597d62272L088393J510640q18958k43347J443305J263267J86304j6212m41037
10588E510083j787421j793656M72280J970041O66385j009891p25573N9922j90404
10579C171766k00729N10171j57472k302982k541048J19475J904270N49841j121950
$$ y = [648510, 1966512, 1893201, 2524598, 3819829, 3585893, 1810115, 978727, 1941603, 3124599, 3988331, 5545903, 7022473, 5772878, 1621859, -1898192, -2014935, 21770, 1329754, 1021052, 331473, 601110, 1979771, 3318528, 3214756, 1763867, 655225, 853506, 1457586, 1784220, 2713220, 4524198, 5529405, 4718711, 3519351, 2885849, 1316099, -1676931, -3130053, -1070815, 1448804, 807248, -1212170, -462272, 2626121, 4136761, 3317803, 3074456, 4517761, 5781028, 5967332, 5951120, 5510083, 3722662, 1929006, 2401286, 4371327, 5037712, 4027821, 3302248, 3362170, 3171766, 2971037, 3481208, 3323736, 1020754, -1520294, -1400819, 503451, 1053292, -68658]
10570f8658o03730M83137N37486O85762J048234k16619k189963j425573J492521
10561b57403K155509L63617M53563K368053J131659k965681l368819R17104K771160
10552C568762l34473j782113J728035M094650J384759j292774j80199M82816j885498
10543E783965k524559P27951K512432O26990L01556K473840N61939n287485n055582
10534A21047L072239O884635P48368m187487k14147L487306p07702m227097L16898
10525E294060M092672n58813m364466J037915O049961J263158l923551N62322
10517I453258N407449K7837n964594r93894N338158L79800o676658k350394N066303
10508I687265K466638k006980L240461P485719j187987q383988R77713J0373504
$$ y = [-68658, -672388, -189251, 348235, 1033997, 2082231, 1865612, -324351, -1749924, -257403, 1898106, 2261723, 2715286, 5083339, 6214998, 3249317, -119502, 797602, 3568762, 3234289, 1452176, 3180211, 7274861, 8659620, 7366846, 7186647, 7669463, 5783965, 3259406, 3987357, 6499789, 7126779, 7428335, 9902175, 10464114, 5176629, 121047, 3193286, 10077921, 10826289, 6638802, 6424655, 9911961, 9204259, 4977162, 5294060, 9386732, 8827919, 4463453, 5501368, 11551329, 12814487, 8890936, 9453258, 14860707, 14888544, 8923950, 7930056, 13268214, 13648014, 6971356, 4620962, 9687265, 12153903, 10146923, 13387384, 20873103, 19685116, 11301128, 12278841, 22652345]
10500B2652345Q03430j0373149o84457J1665181J278758j0786430N364934K2976830
10492D2897442K262356k3114426O024855M9749585M133781j19257905j68292814
10485b05597126o1448962Q2104064J07055151L0385594j6963883O822993K8510881
10478b9131288P225750j2053321K075525J5788043K749842j0256013m51242J0436185
10470a3616519K554672o338084L91345P232246L64716n488726J618276O807194
10462f474880j351022p734171q3529P249207Q89626o658606j543322O014108K566869
10453g125720l767787p56344M701434J489652m192085j859548L354230K086958
10445f069210j290090R20470L825493M44948l578048r26568K886505M04355l224149
$$ y = [22652345, 23455775, 13082626, 12398169, 24063350, 25342108, 14555678, 19920612, 42897442, 45159798, 22045372, 28070227, 77819812, 81953593, -37304312, -205597126, -267046088, -184942024, -77886873, -47501279, -64465162, -57642169, -29131288, -21905538, -33958859, -31883334, -16095291, -13345449, -23601462, -24052704, -13616519, -11061847, -17399931, -17008586, -9776340, -9411624, -14900350, -13282074, -6474880, -7825902, -15560073, -15643602, -8394395, -7504769, -14163375, -15706697, -9692589, -7125720, -10893507, -11649851, -6948417, -5458765, -9650850, -11510398, -8156168, -6069210, -7359300, -6438830, -2613337, -2168389, -5746437, -6673005, -3786500, -3382145, -6606294]
10436f606294o80620K999924M06600l517275p58198M506388L638956j122096k026196
10427c158811L28075N63880l95006R64402K018749o12933k986359q03569J784729
10418b296843l59207l604700k460813L69853M9301r28729J342121L352961Q17749
10409c718307k119274O195L548468K204076j559830j396116J445024J336156j132502
10400a386110j229513O59756O27220r03712q31289J30771k66431m92356J113037
10391b578627J515126j403105l115942K78533L906438J420583l898129m111825
10383g986948P32677L762309K571794Q38986L45954o53891k047863j776637m05275
10374d618894m8167k3559J285802K258854Q24679j014974n60755N18235k43814
$$ y = [-6606294, -7286914, -4286990, -3880390, -7397665, -8155863, -3649475, -10519, -1132615, -3158811, -2830736, -2266856, -2661862, -1697460, 321289, -291644, -3278003, -4081572, -2296843, -2656050, -6260750, -8721563, -8351710, -8302409, -9231138, -7889017, -4536056, -3718307, -5837581, -5831386, -2282918, -78842, -1638672, -3034788, -1589764, -253608, -1386110, -2615623, -1955867, -1328647, -2232359, -3063648, -2932877, -3199308, -3691664, -2578627, -1063501, -2466606, -5582548, -5304015, -1397577, 23006, -3875123, -7986948, -7254271, -3491962, -920168, -81182, 264772, -389119, -2436982, -4213619, -4618894, -4667061, -4690620, -3404818, -1145964, -321285, -1336259, -1897014, -1378779, -1622593]
10365a622593p25649J731247M052934J671899l441728n381470k984225L7045J679489
10356d983051K551084K102874k41952j859277k93400J887982Q87237j692862j544920
10347c186285R44745J773377K77823o99834m56589p65461j425179n82048J182540
10338b936911J694995J288754J755342K272745O90721k093619l112195j796926
10330b237094j2251J072234J054764p08181l009120k398807J519948L615262L33824
10321g69421m085965l613127N03218K483103J234715M39234J137592P71490j022005
10312b921166j661437o20087L1576O352R18842K178297J427773q87354j717456
10303c244660k95734J037334Q78099J12836n40827j103138r28948K92100J037606
$$ y = [-1622593, -2348242, -616995, 3435939, 5107838, 1666110, -3715360, -6699585, -6662540, -4983051, -2431967, -329093, -571045, -2430322, -2723722, -835740, 51497, -1641365, -3186285, -2241540, -468163, -190340, -890174, -1346763, -2112224, -3537403, -4119451, -2936911, -1241916, 46838, 1802180, 4074925, 4765646, 2672027, -440168, -2237094, -2249345, -1177111, -122347, -830528, -3839648, -6238455, -4718507, -1103245, -769421, -4855386, -8468513, -7965295, -5482192, -4247477, -3808243, -2670651, -1899161, -2921166, -4582603, -5202690, -5171114, -5164762, -4245920, -2067623, -639850, -1527204, -3244660, -3540394, -2503060, -1624961, -1512125, -2052952, -3156090, -4085038, -3792938, -2755332]
10294b755332K95885r3818J456425K784120J235239j522304k011677n20614R1235
10285a040841m60491l41862K45104j51125o07184N26759J678372L66683j867766
10276a652351j716020k4356j99424j660400o24981K790800M101366J734412o66719
10267B082327m89886K55583o08816j691562j017637M92299P79740k75162j228370
10258a701484j086161K3483J171737J364703O82955J51460o5845p97313j484413
10249a740878k82565K104331K105062r29691k536572q4660K240645M1741l570710
10240b653297k777253J365837K792452R9579k384263k291483j385880l89898J864604
10231e759602L936169K719519n69022j421286L78994N27301j611898j513572J953028
$$ y = [-2755332, -2459447, -2553265, -1096840, 1687280, 2922519, 1400215, -611462, -1132076, -1040841, -1501332, -1843194, -1598090, -1749215, -2356399, -1829640, -151268, 215415, -1652351, -3368371, -3392727, -3592151, -5252551, -5877532, -3086732, 1014634, 2749046, 2082327, 1592441, 1848024, 1239208, -452354, -1469991, -977692, -197952, -473114, -1701484, -2787645, -2764162, -1592425, -227722, 455233, 606693, 540848, -256465, -1740878, -2023443, 80888, 2185950, 1256259, -1280313, -1364973, 875672, 917413, -2653297, -5430550, -4064713, -1272261, -1172682, -3556945, -5848428, -7234308, -7624206, -5759602, -1823433, 896086, 327064, -1094222, -715228, -187927, -1799825, -3313397, -1360369]
10222a360369L557695N20377k253902j80784L301515K393576j849458l796212
10214C32438k166934q66765j836309k382877l37784K196677K066090k99890j535896
10205d831250O3862K299179K049520m13406j677493N2816K375658K172573k2614
10196B068845j222944m20909N99011L78660n70267j180303j075345m34677J23741
10187a734188k9296k92533P63258K643034K540775m72066l068335k038772R68224
10178g19899K080531P59722o13986j098300j440466j213390M54164K099926J574454
10169A882756k09226p06755j03583n35930j770068j654236l15926J77571l7781
10160c273178J008547K809573K686361M69726j268982j749189k482258l101537
$$ y = [-1360369, 2197326, 2717703, 463801, 283017, 3584532, 5978108, 4128650, 332438, -1834496, -2701261, -4537570, -6920447, -7258231, -5061554, -2995464, -3295354, -4831250, -4767388, -2468209, -418689, -832095, -2509588, -2456772, -81114, 2091459, 2068845, 845901, 424992, 1024003, 1402663, 832396, -347907, -1423252, -1857929, -1734188, -1763484, -2056017, -1292759, 1350275, 3891050, 3418984, 350649, -1688123, -719899, 1360632, 2120354, 1506368, 408068, -1032398, -2245788, -1791624, 308302, 1882756, 1673530, 966775, 863192, 327262, -1442806, -3097042, -3412968, -3235397, -3273178, -2264631, 544942, 3231303, 3701029, 2432047, 682858, -1799400, -4900937]
10152d900937j338043K116105L325502R92385j537481j576139m56756o043N24290
10143b857117J943520K746706J471302q56764k261756j959776j92662J999795
10135C3248K556927M25667k087221j800862N44511J250621n52693j877226j097503
10126b604531j45941m06459l60965J024146K065658J419771M21260N15794Q44021
10117B772754N9472j456767k404197j923122J85385K691091K830578l50470l287284
10108h82560k053923J475145K045994p18352j831693O39216K495398P03308j752731
10099A19802j304776O80285J269750P59815M68437o01773k956727l615555k31535
10090e412277M076607M336956P63806j837461r92843Q27008O34105j134090k081206
$$ y = [-4900937, -6238980, -4122875, -797373, 195012, -1342469, -2918608, -3375364, -3381407, -2857117, -913597, 1833109, 3304411, 2447647, 185891, -1773885, -1966547, 33248, 2590175, 3015842, 928621, -872241, -327730, 922891, 370198, -1507028, -2604531, -2750472, -3156931, -3517896, -2493750, -428092, 991679, 1412939, 1928733, 2772754, 2832226, 1375459, -1028738, -2951860, -2766475, -75384, 2755194, 2404724, -882560, -2936483, -1461338, 584656, -133696, -1965389, -1326173, 1169225, 1872533, 119802, -1184974, -504689, 765061, 1524876, 1993313, 1391540, -1565187, -5180742, -5412277, -1335670, 3001286, 3765092, 1927631, 934788, 1761796, 2395901, 1261811, -819395]
10081h19395j368344m25376n97805j143638m38583J118094J265836k89630p50956
10072c449797J064146J834768r24411l500272j143969L462778L458708j187238
10064c85287l271395J94243L734038K981934J045673J437178J526311j647196
10056E615499m681225l068693R86766K142212K53510p50838k2930o4761j306032
10047h96492j710579r85421o22173m51261P47739J985051J345679k11590j59116
10038i58163J155821J111877o51944j927506j799997j323868n98504J327379L526993
10029a37912L446296O12336k469695l483618k299999L7184K167459K539012Q50822
10020A261885r29994r74040l06720q64648j799226p12235J872446K646698N66275
$$ y = [-819395, -2187739, -2613115, -3210920, -4354558, -4793141, -3675047, -2409211, -2698841, -3449797, -2385651, -550883, -1475294, -4975566, -6119535, -2656757, 801951, -385287, -3656682, -3462439, 271599, 3253533, 4299206, 5736384, 7262695, 5615499, 934274, -2134419, -1147653, 994559, 1248069, 497231, 474301, 409540, -896492, -2607071, -3592492, -4214665, -4665926, -3918187, -1933136, -587457, -799047, -958163, 197658, 1309535, 657591, -1269915, -3069912, -4393780, -4992284, -3664905, -137912, 3308384, 3920720, 1451025, -2032593, -4332592, -4295408, -2127949, 411063, 1261885, 331891, -642149, -948869, -1813517, -3612743, -4324978, -2452532, 194166, 760441]
10011G60441j352099m48788J852794K360012M91625j422772j505995m56291j22030
10002A56897q83067j332865n73652L37238K27247m946J011990K066794P47378
9993A753014k071712k527942L60992K611869J115183j660824j714856L91459J058438
9984f84379m78592j596864q56590L34406N53131J6093p19820j342448r93728R23724
9974d845067L001277K917755O25311j280571q48292R15478J542697L7622k140159
9965g3949k713032j098353Q75635J234659L93081J87677P81320N97704n43881
9956c59139q08839L30240Q64680k38667j001099N7636R00092q21006l487995l584449
9946h148546r01787J417354J595120J073489J386656J641492K02318k432541l695423
$$ y = [760441, -591658, -1040446, 812348, 3172360, 3663985, 2241213, 735218, 278927, 156897, -726170, -2059035, -2632687, -2295449, -2068202, -2073148, -1061158, 1005636, 1753014, -318698, -2846640, -2485648, 126221, 1241404, -419420, -2134276, -1742817, -684379, -1162971, -2759835, -3616425, -3282019, -2728888, -2712795, -3432615, -4775063, -5768791, -4845067, -1843790, 1073965, 1699276, 418705, -429587, 485891, 2028588, 2066210, -73949, -2786981, -3885334, -3009699, -1775040, -1381959, -1194282, -412962, 184742, -359139, -1167978, -837738, 26942, -211725, -1212824, -1155188, -255096, -1076102, -4564097, -8148546, -9050333, -7632979, -6037859, -4964370, -3577714, -1936222, -1733904, -4166445, -7861868]
9937g861868j922040J298456K573885Q56210j064618m44862J435769J478208j81544
9928c832404n62057J094914K273992J543450L72060r4487n17505q24738J22632
9919d24143J404920M95117k092078k749719n95480J112561P38036N19740J374069
9910b16977Q81123j269743j586460O41520J133134j594095k706507L90538K730920
9901a596547L82779k347584p35529J805042M23731j986491p07862J290437r06664
9892d378688l881917j619293K658768J511079l072197k872063J835043L117088
9884f702180j05907j181792P17860n08431m457902l760666O43031j040220q113968
9875b4510175n590546J1796950K6577833K1436159L448660p756372o838706l502432
$$ y = [-7861868, -9783908, -8485452, -5911567, -5055357, -6119975, -6564837, -5129068, -3650860, -3832404, -4394461, -3299547, -1025555, 517895, 889955, 795468, 277963, -546775, -424143, 980777, 1475894, -616184, -3365903, -3961383, -2848822, -2110786, -1591046, -216977, 664146, -605597, -2192057, -1550537, -417403, -2011498, -4718005, -4327467, -1596547, -1213768, -3561352, -4296881, -2491839, -2068108, -4054599, -4762461, -3472024, -4378688, -8260605, -9879898, -7221130, -5710051, -8782248, -11654311, -9819268, -6702180, -6808087, -7989879, -7272019, -7780450, -12238352, -15999018, -15355987, -16396207, -24510175, -30100721, -18303771, 8274062, 29710221, 33158881, 25402509, 18563803, 15061371]
9867A5061371l166697k248968P0264l95670l151657k709641J112827K440231k20472
9858F791588j894691n88051j04092j786985j723672J382641K970188K53998l147242
9849B153682l217110r04143J078332J997141J498232j005389l394927k072364
9841c866546K010978L548601J041073p27110J081357K552027K27753k514965j390506
9832A962662J199484N32168j948015j182717K428606L379416J47514k527763j506365
9823B484990L64304j13579j334650n30948J084850N94461j403238j648184N73250
9814G1256K417069J749351k24495j181900n57689N77262J072807L80426j222622
9805C081465k432848j898613K255J279576Q10187l00212n57969j66572j35469
$$ y = [15061371, 11894674, 9645706, 9715970, 9320300, 6168643, 3459002, 4571829, 7012060, 6791588, 4896897, 4308846, 4204754, 2417769, 694097, 2076738, 5046926, 5300924, 2153682, -1063428, -1967571, -889239, 1107902, 2606134, 1600745, -1794182, -3866546, -1855568, 1693033, 2734106, 2006996, 3088353, 5640380, 5868133, 3353168, 1962662, 3162146, 3694314, 1746299, 563582, 2992188, 6371604, 6519118, 3991355, 2484990, 2849294, 2735715, 1401065, 870117, 1954967, 2549428, 1146190, -501994, 71256, 2488325, 4237676, 4013181, 2831281, 2273592, 2850854, 3923661, 4304087, 3081465, 648617, -1249996, -1247741, 31835, 842022, 541810, -16159, -182731, -318200]
9796c18200k55062M50335J624810J609164j28350j856438j578410M44445J852884
9787A845178R09243j272966j809975K30782K031705M35497l281406m467073j445572
9778f824587K027701K237906N41592K50451J087727N48773r78114r55460K03170
9769a860841m22426k537431k295673J112232L312850J390121j583921j567839
9761d452928N32916J405333Q42678Q67927J392079O78398r49198j361924p1202
9752a115921J416367K130830J973137K91941l040126n577895m278930K73957M058758
9743c867882M347605K220123J67957p24672p13373l08127l9270k03880l87323
9734D91158k0773N55774M44258m64830j313247j356886o24402K47224M44745j85043
$$ y = [-318200, -573262, -122927, 1501883, 3111047, 2982697, 1126259, -452151, -7706, 1845178, 2754421, 1481455, -328520, -97738, 1933967, 2369464, -911942, -5379015, -6824587, -4796886, -2558980, -2017388, -1766937, -679210, -130437, -1108551, -2064011, -1860841, -2283267, -4820698, -7116371, -6004139, -2691289, -1301168, -2885089, -4452928, -3920012, -2514679, -1672001, -804074, 588005, 1266403, 317205, -1044719, -1115921, 300446, 2431276, 4404413, 4696354, 1656228, -3921667, -8200597, -7926640, -3867882, 479723, 2699846, 2867803, 2143131, 1429758, 1121631, 1082361, 878481, 491158, 470385, 1026159, 1470417, 1005587, -307660, -1664546, -2288948, -2041724, -1596979, -1782022]
9724a782022m90254P52321K655019K815926P13939j367307j755326j510683j710074
9715a678461j164647Q63977K100305N31679j617768q08455K114374L003656P15561
9706D060221j520208j253511K05938O73405q7157j288557k286422k107988k15037
9697c819316J754518J473552m47890j022871M70709J468442N71318k95297L35114
9688D88279P85428m24184j381756J48247K457193J942135j492507m079337l189329
9679d745831k86996J575778J394873M39918o4041k32572m87448k67625J141590
9670a532354K736752K410005J01457j469246o29541N97658j15183j278762j38530
9661F82256K068625J627807j329864k663922r15467N99995k08185q82435N59764
$$ y = [-1782022, -2272276, -1519955, 1135064, 3950990, 4664929, 3297622, 1542296, 31613, -1678461, -2843108, -1979131, 121174, 652853, -964915, -1773370, 341004, 3344660, 4060221, 2540013, 1286502, 1492440, 2165845, 2078688, 790131, -1496291, -3604279, -3819316, -2064798, -591246, -1039136, -2062007, -1591298, -122856, 448462, 153165, 488279, 1273707, 849523, -532233, -383986, 2073207, 4015342, 2522835, -1556502, -4745831, -5032827, -3457049, -2062176, -1622258, -1686299, -1918871, -2406319, -2673944, -1532354, 1204398, 3614403, 3715860, 2246614, 1617073, 2214731, 2099548, 820786, 682256, 2750881, 4378688, 3048824, 384902, -530565, 69430, -138755, -1021190, -461426]
9652d61426J772579M69709j264593q43340M1481j189643k651310r12163K615630
9643b423076L311453N56149j542115o44057R81941P55178q13280j989967k130195
9634c937969j241297L55623J383336P80635l30264j8784J288173J465839K75890
9625B1182m54265j39902k7990m14381k51367K78471j41310j027184m87064J065921
9615a577889J069586o66788j318157M0666P95371l57649r39511O52890J864435
9606d37046L59278j680407j137646R07683J398088M63015M27407J283591J179528
9597B763491L74879O96202J562989N27393k150102l264169j656818L8698j78394
9588a285831o36197Q04159K908894K752805N025k570607k621266p37457P53360
$$ y = [-461426, 1311153, 1780862, 516269, -327071, -285590, -1475233, -4126543, -5038706, -2423076, 888377, 1444526, -97589, -741646, 240295, 995473, 182193, -1807774, -3937969, -5179266, -4823643, -3440307, -2659672, -2989936, -3008720, -1720547, -254708, 21182, -433083, -572985, -600975, -1015356, -1266723, -988252, -1129562, -2156746, -2643810, -1577889, -508303, -1175091, -2493248, -2452582, -1657211, -2014860, -2954371, -2301481, -437046, -77768, -1758175, -2895821, -1988138, -590050, -127035, 300372, 1583963, 2763491, 3138370, 3834572, 5397561, 5924954, 3774852, 510683, -1146135, -1107437, -1285831, -1922028, -1117869, 1791025, 4543830, 4548855, 1978248, -643018, -1380475, -627115]
9579f27115O71471L9958K83734J038449O50925j215900k749030k311046m49274
9570d667828J204474J923617J838237J056420K4511k38099N09419J061820N55928
9561C268499j90810k93217l53831r33056j004141J39151Q77411m78520k534426
9552a502940k468559j20889K052370K546911J896069P31648o66477j233628j22070
9543A112435J343034J179765n4826j93068P28579N53924j058406j888467q45144
9534H77826M70693N97333J9620n04778r80764j030513j40153O62339k8661j120761
9524a177819l90663J284361Q74098j237219j158651J735276K810324n19337m047713
9515a827343k957023R86821K638961J083312m29330k79896K18570L62314Q70185
$$ y = [-627115, 44356, 84314, 368048, 1406497, 2057422, 841522, -1907508, -4218554, -4667828, -3463354, -1539737, 298500, 1354920, 1379431, 1141332, 1650751, 2712571, 3268499, 3077689, 2784472, 2430641, 1497585, 493444, 632595, 1510006, 1031486, -1502940, -3971499, -4092388, -2040018, 506893, 2402962, 3134610, 2468133, 1234505, 1112435, 2455469, 3635234, 3580408, 3387340, 4115919, 4669843, 3611437, 1722970, 877826, 1348519, 1945852, 1965472, 1460694, 479930, -550583, -690736, -28397, -57058, -1177819, -1568482, -284121, 589977, -647242, -1805893, -70617, 2739707, 2220370, -1827343, -4784366, -3797545, -1158584, -75272, -504602, -784498, -565928, -203614, 666571]
9506F66571J432052P82036q10411j777967j769554j631116j371243m00799P78666
9497d101765J275752J442304J719599J009256j304841k952782j484673J478412
9489b918738K099890O0481j127176K63259J828760J260517l11766p61170j95099
9480A98958R4166M7454L07901M64024l72876j728191j958217m05665J476579J615548
9470b60319k01185j858360j433734K75953R20665P5231l16948O13078J085276
9461a100343j61373j373827n17673J319756J717052P02672P0370l5951r22682
9452c01999k240753k049715j52637J204796N51234q49013q95112Q19653K775257
9443a138289L030261J114571j060837j059479P40726J301588n71401k146624j010057
$$ y = [666571, 2098623, 2880659, 2070248, 292281, -1477273, -3108389, -4479632, -4880431, -4101765, -2826013, -1383709, 335890, 1345146, 40305, -2912477, -4397150, -2918738, -818848, -758367, -1885543, -1622284, 206476, 1466993, 1155227, 394057, 198958, 293124, 340578, 648479, 1112503, 739627, -988564, -2946781, -3352446, -1875867, -260319, -461504, -2319864, -3753598, -3477645, -2556980, -2481749, -2798697, -2185619, -1100343, -1261716, -2635543, -3153216, -1833460, -116408, 586264, 656634, 620683, -301999, -2542752, -4592467, -4745104, -3540308, -2989074, -3838087, -4733199, -3913546, -1138289, 1891972, 3006543, 1945706, 886227, 1626953, 2928541, 2357140, 210516, -799541]
9434g99541J069605J183878r2894m35569j26178q05891j454579K0774K162420
9425G22025J541158j369110k480563m35712J746526J823857Q15077l02473j993690
9416F7095l298223j945754J295783K570601P83006o13234O02711K037438J258642
9407B758065k73239m52801q4327m25011m72217M85417O97480q11892j792165m97098
9397h67788R77752K05288j396367j215377J00676K79805m87156m79918K04530
9388b678555M10543M87253J139688J317852J23991r00492k93944M63803k51051
9379a80912p17675J056344K804555J071703k529402l104326j24352J722192r7410
9370i9283k438700j834062O29252J942713J654573J290330J295338Q69050j41749
$$ y = [-799541, 270064, 1453942, 1361048, 925479, 799301, -6590, -1461169, -1440395, 722025, 2263183, 894073, -1586490, -2022202, -275676, 1548181, 2363258, 2060785, 67095, -3231128, -5176882, -3881099, -1310498, -527492, -1140726, -538015, 1499423, 2758065, 2484826, 2032025, 1947698, 1522687, 1050470, 1535887, 2233367, 1421475, -370690, -867788, 109964, 315252, -1081115, -2296492, -2195816, -1916011, -2403167, -2883085, -2678555, -2268012, -1780759, -641071, 676781, 800772, -99720, -393664, 70139, -180912, -898587, 157757, 2962312, 4034015, 1504613, -1599713, -1724065, -1873, -99283, -2537983, -4372045, -3742793, -1800080, -145507, 1144823, 2440161, 3309211, 3167462]
9361C167462r33800j005305p55993q95480j491340j578917j99639J881855K508935
9352F97778R14037j066823j593824j130625p35156J25426J863326K567447M49485
9343B091071k568238k903743m79689J342956R09104J09814O24812J413409J015950
9334A555446j47374j006039j413980j410547n64920R51111J974458J794876Q95467
9325B628498q8584r62253j407161j153293p34079p24334m89647O77366J635547
9316f17940P86647q64603o59437J459782K410227N09224k033946k416074p98748
9307b224868Q45986J494097J147900j36797j647127j770504M1315K046158K285845
9298B082005J006105j25186k93572P0134L13743m8957j182155k288630k003429
$$ y = [3167462, 2233662, 1228357, 472364, -423116, -1914456, -3493373, -3693012, -1811157, 697778, 1611815, 544992, -1048832, -2179457, -2914613, -2789187, -925861, 1641586, 2091071, -477167, -3380910, -3860599, -2517643, -1608539, -1498725, -873913, 539496, 1555446, 1408072, 402033, -1011947, -2422494, -2987414, -2036303, -61845, 1733031, 2628498, 2539914, 1577661, 170500, -982793, -1716872, -2441206, -2930853, -2253487, -617940, 168707, -695896, -1355333, 104449, 2514676, 3023900, 989954, -1426120, -2224868, -1378882, 115215, 1263115, 1126318, -520809, -2291313, -2249998, -203840, 2082005, 3088110, 2962924, 2669352, 2739486, 3053229, 3004272, 1822117, -466513, -2469942]
9289b469942k50926J261319J239558M10875J1939q7698m95501o77272J44578J189071
9279B76001R06953o61267j759552j182088M17414J532752J311006R9521q77455
9270F3285n92730N15999Q46944j78887j039237k77680J085668R55774m64471p83858
9260A30807Q13753K074404J039961r44561j394147n72366q33795k465227k809927
9251d961098k98174K852608L505543J685712m4624l68138l00753p59021j097286
9242B14769n33816N05737J133952J034206L02422p73938j486074j278790p50514
9233a632046r09915j320129n08225J451799K555252J762835M31652j53820p23591
9224I53812j993269k576209j068219J119415J438870k552p37659K04001J078595
$$ y = [-2469942, -2720868, -1459549, -219991, 190884, 202823, 115125, -380376, -1057648, -913070, 276001, 1182954, 521687, -1237865, -2419953, -2002539, -469787, 841219, 940740, 63285, -529445, -13446, 833498, 654611, -384626, -662306, 423362, 1379136, 914665, 130807, 944560, 3018964, 4058925, 3114364, 1720217, 1147851, 314056, -2151171, -4961098, -5259272, -2406664, 1098879, 2784591, 2739967, 2371829, 2071076, 1312055, 214769, -319047, 186690, 1320642, 2354848, 2657270, 1883332, 397258, -881532, -1632046, -2541961, -3862090, -4370315, -2918516, -363264, 1399571, 1831223, 1677403, 953812, -1039457, -3615666, -4683885, -3564470, -2125600, -2128152, -2865811, -2661810, -1583215]
9215a583215M26618p25421n88967P42176J486817O16372p47688p65052M91930
9206f46430Q07510r35896k391819p57542K360566K290302j751102m614068k279164
9197g917643K255425L398395P92901j273677p35741L87218N44751P01522J218075
9188f28774N55234j511524k441662m51086K640127L688110J937727p08305k069050
9179A010797j560178m30687l35500j123242p60903J488804L147650J769222j121445
9170B084518j985851l04350J309352J399249Q16643l7863j544809k455720r30409
9161a649240J664372J867348l86723j505759l20458J68187j344724j788338M87258
9152b808077K004838n4621k492934j050405K463774K989730P0118k124900j503517
$$ y = [-1583215, -1156597, -1882018, -2470985, -1728809, -241992, 374380, -373308, -1138360, -646430, 161080, -774816, -3166635, -3924177, -1563611, 726691, -1024411, -5638479, -7917643, -5662218, -2263823, -1470922, -2744599, -3480340, -3093122, -2548371, -1846849, -628774, -73540, -1585064, -4026726, -4477812, -1837685, 1850425, 3788152, 3079847, 1010797, -549381, -980068, -1315568, -2438810, -3199713, -1710909, 1436741, 3205963, 2084518, 98667, -205683, 1103669, 2502918, 3319561, 3281698, 1736889, -718831, -1649240, 15132, 1882480, 1495757, -10002, -330460, -162273, -1506997, -3295335, -2808077, -803239, -857860, -3350794, -4401199, -1937425, 1052305, 1122423, -1002477, -2505994]
9143b505994o9392M06765N05737P56206O36531K96909M13945L82202o24763j253027
9133a054881K68844K416194J971679p23283j941937m42307Q17506o8362r81788
9124B61665K980J079630J01246j457180j149594J9173o34566k593227k671447
9115g041320q2006K379561K593360J629805J130034P70274j92197q86757k64323
9106C6431P21944L78384r42147j242706J12251J611295K007909J778106J580760
9097F042227R13353n79418j739598j335520j43874l8745j255503k042203j207534
9088a386815K58136O77708j8456k97115P76523J940711J018862j943754l767896
9079b742096j765780K171793L333068M33181k541779k097518J1036L48871m39702
$$ y = [-2505994, -2575386, -2168621, -1662884, -906678, -270147, 26762, 440707, 822909, 198146, -1054881, -786037, 1630157, 3601836, 2878553, 936616, 494309, 1311815, 1243453, 261665, 264645, 1344275, 1445521, -11659, -1161253, -1142080, -1776646, -4369873, -7041320, -7123326, -4743765, -2150405, -520600, 609434, 1379708, 1187511, 300754, 36431, 758375, 1136759, 194612, -1048094, -935843, 675452, 2683361, 4461467, 6042227, 6955580, 6376162, 4636564, 3301044, 3157170, 3118425, 1862922, -179281, -1386815, -1128679, -450971, -469427, -766542, 9981, 1950692, 2969554, 1025800, -2742096, -4507876, -2336083, 996985, 1430166, -1111613, -3209131, -3198095, -2849224, -3288926]
9070c288926P07233L348421L802786J177638j252733j430150j144818j868797
9062E0654j850464L74961K728231K496349K61750j466183j726344j142918k20488
9053d94452M76997J01118q41165m65359J295972J771142k54969k007813r34853
9044a353382J100791J050780j76147K67512J640819O17927k686767m159424j751804
9035e449695J663554K617648J165775n44614j216433n63358J295823L155054L063134
9026E186888O50978k045422k982012k240957j128025l36967K12341O59010J061316
9017i62850J380574J271490M93946l88213m69334K64540Q50977M87160p98400
9008B129890k305883k883857j570980J090097K944923K429935L75860j257935
$$ y = [-3288926, -2581693, 766728, 4569514, 5747152, 4494419, 3064269, 1919451, 50654, -1799810, -1424849, 1303382, 3799731, 4061481, 2595298, 868954, -273964, -494452, -17455, 83663, -757502, -1222861, 73111, 1844253, 1589284, -418529, -1353382, -252591, 798189, 622042, 889554, 2530373, 3148300, 461533, -3697891, -5449695, -3786141, -1168493, -2718, -547332, -1763765, -2327123, -1031300, 2123754, 5186888, 5837866, 3792444, 810432, -1430525, -2558550, -2895517, -2683176, -2024166, -962850, 417724, 1689214, 2183160, 1794947, 1325613, 1590153, 2441130, 2928290, 2129890, -175993, -3059850, -4630830, -3540733, -595810, 1834125, 2209985, 952050]
9000I52050j670494j250076l73695M49987K51587r78795j469256K5141K037027
8991b026524K361446J195544K20301l37297j202604j632294m97966Q87610L59254
8982f72530j010822j17433K661276L194487j6732l103872k515937n3006M75609
8973a158960j013325j597610j65437J530200J913631J179915P9533r55046j459591
8964a646690j095547k33363M21540O22325N21575K56416k6919k15815l82255k79111
8954b057844Q72401K844076L321347N69043l080867l330893k5735K093709J18921
8945A324158k856892k628236N6721J533661J032262O20533P04151l00805k085371
8936b599818k178504j90152J103608J05776j127685m08302J082369R81601l40007
$$ y = [952050, -718444, -1968520, -2342215, -1892228, -1640641, -2619436, -4088692, -4063551, -2026524, 334922, 1530466, 1750767, 1413470, 210866, -1421428, -1919394, -1031784, -672530, -1683352, -1800785, 860491, 4054978, 4038246, 934374, -1581563, -1634569, -1158960, -2172285, -3769895, -3935332, -2405132, -491501, 688414, 767947, -187099, -1646690, -2742237, -2975600, -2554060, -1931735, -1410160, -1153744, -1180663, -1396478, -1778733, -2057844, -1185443, 1658633, 4979980, 5549023, 2468156, -862737, -888472, 1205237, 1324158, -1532734, -4160970, -4104249, -2570588, -1538326, -917793, -213642, -514447, -2599818, -4778322, -4968474, -3864866, -3759090, -4886775, -5295077, -4212708, -3231107, -3571114]
8927c571114n79725O32912J225734J44375r27617k93733R49455N19701j354968
8918c254980j883751K64289K751156K686334N83042p46776m81759m97986j685293
8909b265724k220861o74976J378839J668593N87567K21143J000482J422510O75776
8900A793349l78509q31627p56567m67151r363M28689N56088M75859M05677J65989
8890A382434k67569k32784N45275R59004k2355j407166j385220k16746L8703j149937
8880a756361j803905n30582J286650J649426Q16332M26669P27795M78185o89104
8871F05105j531524j175664m94476o99623j352275q39250J285368L394340L652469
8862B844470K167530N68299k28112q29427j812464k413801j506644P06759K753193
$$ y = [-3571114, -4150839, -3517927, -2292193, -2147818, -3075435, -3369168, -2419713, -1900012, -3254980, -5138731, -4874442, -2123286, 563048, 1146090, 399314, -82445, -580431, -2265724, -4486585, -5161561, -3782722, -2114129, -1526562, -1305419, -304937, 1117573, 1793349, 1414840, 583213, -173354, -640505, -649868, -221179, 334909, 810768, 1216445, 1382434, 1114865, 882081, 1427356, 2386360, 2364005, 956839, -428381, -645127, -606424, -1756361, -3560266, -4090848, -2804198, -1154772, -338440, 88229, 816024, 1294209, 605105, -926419, -2102083, -2596559, -3296182, -4648457, -5487707, -4202339, -807999, 2844470, 5012000, 5580299, 5352187, 4522760, 2710296, 296495, -1210149, -503390, 2249803]
8853B249803L348507K248899O5607k069802k972027k306146r55911k8610K22444
8844a97236Q6850l29866p70744m84750O62653J332123L74590j059800q04280J001795
8834a88665J859180O41757o85175k27454P94008J5387k197866l041056j193223
8825d223107J501486K623445J881754N49460n35239j293714j409836l30406J545134
8816C08977K571820J451993j071634k731860k144203k70327Q61187M76259n04401
8807a052189j016609q93947l40918N28380J194782Q33784l46428q36999P8049
8798a852095Q71811j30138j865432j683444O71346K366999J471982l80592o95968
8789a225531J97274K07030p94027p88522Q62515K095860J202029o20447j094045
$$ y = [2249803, 5598310, 7847209, 7912816, 5843014, 2870987, 564841, -391070, -419680, -197236, -110386, -440252, -1210996, -1695746, -1033093, 299030, 673620, -386180, -1190460, -188665, 1670515, 2312272, 1627097, 1399643, 2193651, 2209038, 11172, -3029884, -4223107, -2721621, -98176, 1783578, 2333038, 1797799, 504085, -905751, -1236157, 308977, 2880797, 4332790, 3261156, 529296, -1614907, -1885234, -1024047, -547788, -1052189, -2068798, -2962745, -3303663, -2775283, -1580501, -746717, -1093145, -1930144, -1852095, -980284, -1110422, -2975854, -4659298, -3987952, -1620953, -148971, -529563, -1225531, -1028257, -821227, -1615254, -2403776, -1541261, 554599, 1756628, 1136181, 42136]
8780D2136m2817P56349K70070p27829j170544j003787p24079n38456l85256k11201
8770c735414Q6022N50079Q07425L46933n39276o74029N37686J932433J754267
8761A066126N7899j008002M2513J724061J247722j589246l627165k187840J450422
8752b823510L653800K766338L13482j722286k878631l140514j901812P39311K940769
8743b053053K870533R20239r52765j566795j182430m06517L75391P58771N62985
8734f73641J73220q3592m81523j062767r57446L74159J823652J804843K87893
8725A204798j483076k640058k742336j137918J777174L431621J706630j579279
8717a462444k521827n56820R73773K51808m25033R87099K627465J998152K15318
$$ y = [42136, -681, 755668, 1025738, 297909, -872635, -1876422, -2600501, -3138957, -3524213, -3735414, -3649392, -3099313, -2291888, -1944955, -2484231, -3158260, -2620574, -688141, 1066126, 1124025, 116023, 158536, 1882597, 3130319, 1541073, -2086092, -4273932, -2823510, 830290, 3596628, 3910110, 2187824, -690807, -3831321, -5733133, -4993822, -2053053, 817480, 1737719, 784954, -781841, -1964271, -2370788, -1995397, -1236626, -673641, -500421, -584013, -1065536, -2128303, -3085749, -2711590, -887938, 916905, 1204798, -278278, -2918336, -5660672, -6798590, -5021416, -1589795, 116835, -1462444, -3984271, -4541091, -3567318, -3315510, -3740543, -2753444, -125979, 1872173, 2087491]
8708B087491j52435M58877j76910j663882j594514j51074j74467k095833k572248
8699f034995K23290L147793K445779o13847j528413Q85131K844830J084742k465757
8690a1447l251079k50673K626970J754167j444360k632840n81031J447605P16589
8681a626099j205887j397717j51184J76416l56113O30181L224085M153456J616202
8672E063340j597193j863925K74516J218271n84353k904768k944445n32601K153364
8663a717794K980452J688441j43693r00825p29291r31132j584529j212666N07814
8654b043223J493443K89419j225307n35679J207732O96934j907077k431892J037464
8645c418186M624585L796816l48806k999754k379283j077955j012467p82931Q86601
$$ y = [2087491, 1935056, 2393933, 2217023, 553141, -1041373, -1192447, -1366914, -3462747, -6034995, -5811705, -2663912, -218133, -831980, -2360393, -1475262, 1369568, 2454310, -11447, -3262526, -3513199, -886229, 867938, -576422, -3209262, -3790293, -2342688, -1626099, -2831986, -4229703, -4380887, -4204471, -4560584, -3930403, -706318, 3447138, 5063340, 3466147, 1602222, 1876738, 3095009, 2510656, -394112, -3338557, -3871158, -1717794, 1262658, 2951099, 2807406, 1906581, 1177290, 246158, -1338371, -2551037, -2043223, -549780, -260361, -1485668, -2021347, -813615, -116681, -2023758, -4455650, -3418186, 1206399, 5003215, 4654409, 1654655, -724628, -1802583, -2815050, -3597981, -2711380]
8636b711380K247887J248264q75515j243488M15697J548405N50662j334701k139798
8627b293967j499320l44827M57202O09491M12612N71090J163796R45525j019273
8618i97671l121845k552766N67121K557485J031571j594848j533845R30374K151119
8609b563305O36100j119277p19692Q61061J321348M11644l14513k5867N82300
8600i30201N57725k31153j093812j147529k65337N53765M13320n0768L71722J205491
8590f16777P54656q53719j274608L63216J618955M12274j453436r60880J337855
8581f72464K172844N36014j213179j203136j79779N56246O85163j32966k088125
8572a539382l413424j712190J867943L000096L67653j907176n31825J682412N57724
$$ y = [-2711380, -463493, 784771, -90744, -1334232, -918535, 629870, 1180532, -154169, -2293967, -3793287, -4138114, -3680912, -3071421, -2658809, -2087719, -923923, 21602, -997671, -4119516, -6672282, -6105161, -3547676, -2516105, -4110953, -5644798, -4714424, -2563305, -1927205, -3046482, -3766174, -2905113, -1583765, -1172121, -1486634, -1512501, -930201, -372476, -603629, -1697441, -2844970, -3110307, -2556542, -2143222, -2193990, -1822268, -616777, 137879, -715840, -1990448, -1627232, -8277, 403997, -1049439, -2010319, -672464, 1500380, 2036394, 823215, -379921, -559700, -3454, 681709, 548743, -1539382, -4952806, -6664996, -4797053, -1796957, -1429304, -3336480, -3868305, -2185893, -1628169]
8563a628169k289577j997672J382198K874046P05124j145380J05226J740447P70209
8554E16452r97445n97710Q91430P92032j64596M12527J638120P23221j661040
8545A552991k005896J19592J234526k77021j750121r96161L24543J00131o98621
8536b396037l00915O39198O22937J0792k94337r17899k210937k268371K57506
8527f858063K885335K227328p54437j987139m45073O68930o14849k016231r14694
8518g808893J622562K721429J691274K48938j9657J023844K316224K155539l59139
8509C592121l582302m335828j664900J731320K848158J748795M40379o0484L7328
8500G54587O40473J468406J353524l05405k065483k107565p52038K92957M57275
$$ y = [-1628169, -3917746, -5915418, -4533220, -1659174, -954050, -2099430, -1994204, -253757, 516452, -480993, -1078703, -187273, 604759, 440163, 852690, 2490810, 3214031, 1552991, -452905, -333313, 901213, 624192, -1125929, -2122090, -1797547, -1697416, -2396037, -2696952, -2057754, -1434817, -1424025, -1718362, -2636261, -4847198, -7115569, -6858063, -3972728, -1745400, -2499837, -4486976, -4932049, -4263119, -4877968, -6894199, -7808893, -6186331, -3464902, -1773628, -1524690, -1544347, -520503, 1795721, 3951260, 3592121, 9819, -4326009, -5990909, -4259589, -1411431, 337364, 777743, 717259, 754587, 1395060, 2863466, 4216990, 3911585, 1846102, -261463, -1013501, -720544, -263269]
8491b63269L56117R1363n28785p30162J43345Q46863j56959j791798j693945j61389
8481c888619K36140q76188r71154Q24576J968278Q83374k37768O43097J652479
8472B34215K40638k107270j973030N11590J903857P17971q53182o61683P46482
8463a240412J716212J510388K97665j073260j124507O40563K230909J264169j482450
8454B739277k846676j704674j62299P6804r8679M24408R12543M82289j47204p2798
8444c97009K59620K37575K47484M97778L07338k96872q8712R68140Q57374j286820
8434A305896l099296k204355K01046J306323P52973K38652K89708J13149k09048
8425a304952n0098p8789j103456j709354L1984K837544L309481Q80421j389000
$$ y = [-263269, 92848, 184211, -344574, -1074736, -931391, -84528, -241487, -2033285, -3727230, -3888619, -3652479, -4528667, -5499821, -4675245, -2706967, -1823593, -2061361, -1418264, 234215, 474853, -1632417, -3605447, -3093857, -1190000, -472029, -1325211, -1986894, -1240412, 475800, 1986188, 2283853, 1210593, 86086, 726649, 2957558, 4221727, 2739277, -107399, -1812073, -1974372, -1897568, -1996247, -1571839, -659296, -177007, -324211, -397009, -137389, 100186, 347670, 845448, 1152786, 855914, 767202, 1735342, 2592716, 1305896, -1793400, -3997755, -3796709, -2490386, -1737413, -1498761, -1209053, -1095904, -1304952, -1355050, -1433839, -2537295, -4246649, -4214665, -1377121, 1932360, 2812781, 1423781]
8416A423781j427263n94955o88381j301682j357811q99521k09464P53011J212177
8407c090108J93505j036035j7936K427508K288972j208189l070017L29593M897849
8398A715142M131885j305212m531796k392863Q86868J013075l46247M67664K699887
8389B338403K543043o42213l085620j783532J606073L089431J250322j404356
8381C911551j770058K05899J832752J212441o73911j793083j778028j678856j811704
8372b342997j460354n13618K23148N62710J266237K330880K365062N84476j595773
8363A419771k050562n19422J190229J345643J8025j231657j048684K99896J234070
8354F57309P83460j68676k04735N07039N87525k40741p88830o14732p95644j643793
$$ y = [1423781, -3482, -598437, -1286818, -2588500, -3946311, -4845832, -5055296, -4302285, -3090108, -2896603, -3932638, -3950574, -1523066, 765906, -442283, -3512300, -3182707, 1715142, 5847027, 4541815, 10019, -2382844, -1495976, -482901, -829148, -361484, 2338403, 4881446, 4239233, 1153613, -629919, 976154, 4065585, 5315907, 3911551, 2141493, 2347392, 4180144, 5392585, 4718674, 2925591, 1147563, -531293, -2342997, -3803351, -4316969, -4093821, -3531111, -2264874, 66006, 2431068, 3015544, 1419771, -630791, -1150213, 40016, 1385659, 1403684, 172027, -876657, -576761, 657309, 1440769, 1272093, 1067358, 1574397, 2161922, 1921181, 1132351, 517619, -278025, -1921818]
8344a921818j513931N23492K371495J513933r79086j683471J13782J431455L94258
8335B50109q43532J60583J788037P10697k479879l420021j94085L648822L872639
8326C493370J019760j191171j344039j249400j880067j608590N99786K871736
8318G11385L000774J507068K70019m06463j206396j469459j10576J629456J206632
8309E132440j252713k781153k033840j059264j352697j143333J085751K990369
8301d14440J615098j375709j594523J410541L349683J656340r80570j174487K70641
8292B762574N00013p07916j330228p81478k21226J97100J471228L049975K693952
8283G633994j21520k789176k805260r50209J16653n07243j161274j85886J852862
$$ y = [-1921818, -3435749, -2912257, -540762, 973171, -5915, -1689386, -1575604, -144149, 250109, -593423, -432840, 1355197, 2065894, -413985, -3834006, -4028091, -379269, 3493370, 4513130, 3321959, 1977920, 728520, -1151547, -2760137, -2160351, 711385, 3712159, 5219227, 5489246, 5082783, 3876387, 2406928, 2296352, 3925808, 5132440, 3879727, 1098574, -935266, -1994530, -3347227, -4490560, -3404809, -414440, 1200658, -175051, -1769574, -359033, 2990650, 4646990, 3666420, 2491933, 2762574, 3262587, 2554671, 1224443, 442965, 221739, 418839, 1890067, 4940042, 7633994, 7512474, 4723298, 1918038, 967829, 1084482, 577239, -584035, -769921, 1082941]
8274A082941K858302J702663m40966j564991j372591j396630k254013k252859
8266c638144j33967K111747J597204q42558j426848P66591K123940K07103k092417
8257a327349j005573J967893K263565n94247k365222q03300J213901P33642p64109
8248f80799m82763P95354K92711j710691j983253N68697L059121K771315P15108
8239C344800m10029l7706L13261j41126p11125j023218j558560k039275j148691
8230c411669J091159K244849N01139k207370k324474L72323K411736J717170M07904
8221H02767R99842K232854J334467j095900j782867k743J234511p9883k033132
8212A609916k055484o24186K67575M18960Q36792J131638J12965j525143j657153
$$ y = [1082941, 3941243, 5643906, 5202940, 3637949, 2265358, 868728, -1385285, -3638144, -3772111, -1660364, -63160, -905718, -2332566, -1565975, 557965, 765068, -1327349, -2332922, -365029, 1898536, 1304289, -1060933, -1864233, -650332, 83310, -680799, -1163562, -368208, -75497, -1786188, -3769441, -3200744, -141623, 2629692, 3344800, 2934771, 2897065, 3210326, 3069200, 2358075, 1334857, -223703, -2262978, -3411669, -2320510, -75661, 425478, -1781892, -4106366, -3734043, -1322307, 394863, 802767, 1802609, 4035463, 5369930, 4274030, 2491163, 2488420, 3722931, 3643048, 1609916, -445568, -1069754, -802179, -383219, 453573, 1585211, 1698176, 173033, -1484120]
8203a484120k1235J213967Q01757K62810J162504K217831J043377j904232l227355
8194F5304r20999K722216L749702J374524j342074j713698p25026j028831k802005
8185f20887l486499j539639J452778L049204K775454J669472L65067r17915j404026
8176A343009n05987Q01598R14994j55828q75457n03640J31985L19168L25909J59656
8166A955407q40207k289651k277251k3390K259953J980830j81996j271054l03605
8157i90964P40401M01397j62830M24717J324190J045825p3899p90193j148767
8148G69877j717954j589426L67398K696075K574295R0783j462448l73133J147003
8139B502470P87586l18253j3219J043236O17962j335604k802602k801400j948163
$$ y = [-1484120, -1505355, -291388, 510369, 773179, 1935683, 4153514, 5196891, 3292659, 65304, -855695, 1866521, 5616223, 6990747, 5648673, 3934975, 3209949, 2181118, -620887, -4107386, -5647025, -4194247, -1145043, 1630411, 3299883, 3664950, 2747035, 1343009, 837022, 1638620, 2553614, 2397786, 1522329, 1018689, 1150674, 1469842, 1795751, 1955407, 1115200, -1174451, -3451702, -3475092, -1215139, 765691, 583695, -687359, -990964, -250563, 150834, -11996, 412721, 1736911, 2782736, 2708837, 1918644, 769877, -948077, -2537503, -2170105, 525970, 3100265, 3191048, 1728600, 1355467, 2502470, 3290056, 2971803, 2958584, 4001820, 4619782, 3284178, 481576, -2319824, -4267987]
8130d267987n80017J283001K557985K050462N05375m56888r23181j812264k174385
8121c817899m87384J732450J323307j185412j623003J272321L418156J663010
8113B295546j237925j058442J396445J975944m07392k824511l015889j683501
8105d559725k36752Q97700J398874P40966o55068j433151q67738M55135J446278
8096b813481J348484K37429p52786n09778L35960R6699j119206j237570K37234
8087d177015J027280m7692q01637M24054J466587J18374j427015L2618K857144
8078e27302K781130j69276j904529j031381l61973j306112j728624n21585L37266
8069d432386j01659P8786J498375J703301j39126r07446J193077K866925Q53965
$$ y = [-4267987, -4848004, -3565003, -1007018, 1043444, 1548819, 1091931, 168750, -1643514, -3817899, -4305283, -2572833, -1249526, -2434938, -4057941, -2785620, 632536, 2295546, 1057621, -821, 1395624, 3371568, 2964176, 139665, -2876224, -4559725, -4796477, -3898777, -2499903, -1758937, -2414005, -3847156, -4714894, -4259759, -2813481, -1464997, -1227568, -1980354, -2490132, -2154172, -2057473, -3176679, -4414249, -4177015, -3149735, -3197427, -3999064, -3575010, -2108423, -1990049, -3417064, -3384446, -527302, 2253828, 2084552, 180023, -851358, -1213331, -2519443, -4248067, -4769652, -4432386, -4534045, -4455259, -2956884, -1253583, -1392709, -2300155, -1107078, 1759847, 2613812]
8060B613812k417012k435379M94698K262062J345933J7851j00085K00420K64128
8051B246428N29831P37201K726j064979q24716N77129J155864J57129r65996j012881
8041A537736m78578n2359N18257J379138J760631Q87926j077802l122284l785911
8032b433246k095778Q26502J969761p7970k609295j916072J517762L486482J864827
8023E32973p35884j007360P25218J733742P96216q38541j554297j035629j22417
8014a505979K13620j05112j42165O64802J286341L98962j265392j486772K33376
8005a708319J754180J274466m13813j578618j840039j590461o54538Q80324J712362
7996b164456R70698r0314J88157J243531J297246L27519j31018K06912J44044
$$ y = [2613812, 196800, -2238579, -1743881, 518181, 1864114, 1881965, 1781880, 1982300, 2246428, 2776259, 3513460, 3516186, 2451207, 1626491, 2203620, 3359484, 3516613, 2550617, 1537736, 1059158, 1006799, 1525056, 2904194, 4664825, 5552751, 4474949, 1352665, -2433246, -4529024, -3702522, -1732761, -1810731, -4420026, -6336098, -4818336, -1331854, 532973, -202911, -1210271, -485053, 1248689, 2044905, 1206364, -347933, -1383562, -1505979, -1292359, -1397471, -1539636, -874834, 411507, 810469, -454923, -1941695, -1708319, 45861, 1320327, 906514, -672104, -2512143, -4102604, -4757142, -3876818, -2164456, -1193758, -1284072, -1095915, 147616, 1444862, 1772381, 1641363, 1848275, 1992319]
7987A992319m32565k84461M73592R3568j448465j622962M75578J860104P2643
7978A179351k463489j863190J034924J888296k98331j816119l64122J590792J238096
7969A26208l58463q61255n68979q99033j218791k28585J161798J330081R14343
7960f02676J284675J426582k45749k118239j351056J002410J191107q86922j260945
7951a560813J213872K449978j13600k845189j501268J992566K565395l13050k292038
7942d04147p10120K238713L081034J109928j559918k355182o75722J146363K70778
7933B141727k492041l044838m4118K298795L65459k747704j647161K735935M363368
7924A929422J415838j393337p99967L67986j023230k900630j912760P36197J497216
$$ y = [1992319, 1559754, 1275293, 1748885, 1842453, 393988, -1228974, -753396, 1106708, 1179351, -1284138, -3147328, -2112404, -224108, -522439, -2338558, -2702680, -1111888, 126208, -232255, -1093510, -1662489, -2561522, -3780313, -4008898, -2847100, -1517019, -602676, 681999, 2108581, 1862832, -255407, -1606463, -604053, 587054, -299868, -1560813, -346941, 2103037, 1989437, -855752, -2357020, -364454, 2200941, 1887891, -404147, -1114267, 1124446, 4205480, 5315408, 3755490, 1400308, 724586, 1870949, 2141727, -350314, -3395152, -3439270, -1140475, -775016, -3522720, -5169881, -2433946, 1929422, 3345260, 1951923, 1151956, 1519942, 496712, -2403918, -4316678, -3580481, -2083265]
7915b083265K07464l74152O20247J460830J193196N52699n8390p41187o84356
7906I3086P34139J853079N96386j772631j886063M71367J658537k35371k336950
7897h24421j493582Q49953J075457r58359j858186R0362K530034K523273L27669
7888B262200j531866j686790r97914o37867m37454L78517J491268J517983O2113
7879D20190j074660J31003K865425L868146J517632j880452l135447k254467j586145
7870a128775j776927j245537K94719Q02191m66809j092547O78227K541985J403258
7861I785j547335k330420l8581K215946K187112R23831j92917j370373k226762
7852b369714j132573J465892K297847J71254j491293N0977K088263Q75025j822167
$$ y = [-2083265, -1875801, -2249953, -1629706, -168876, 1024320, 1577019, 1518629, 777442, 93086, 827225, 2680304, 3276690, 1504059, -382004, 89363, 1747900, 1512529, -824421, -2318003, -1468050, -392593, -1350952, -3209138, -3118776, -588742, 1934531, 2262200, 730334, -956456, -1954370, -2592237, -3029691, -2651174, -1159906, 358077, 420190, -654470, -523467, 2341958, 6210104, 7727736, 5847284, 2711837, 457370, -1128775, -2905702, -4151239, -3856520, -3054329, -3521138, -4613685, -3935458, -1393473, 9785, -1537550, -3867970, -3906551, -1690605, 496507, 1420338, 1227421, -142952, -2369714, -3502287, -2036395, 261452, 432706, -1058587, -1007610, 1080653, 1955678, 133511]
7843A33511j531867J266474K022733J55759o3749K352382K601791j491497m605351
7834H40186j989585K540727K490479j042298j804166Q82514J419046j875317l475303
7825b013717j4084L709938K344193j531782j935432R34044J699356j148064l260375
7816a215923j786041N95889N94933r21616j328948l23617P76708J537037J969752
7807a01826J402783j30128r31588o6035P57466j99355j679531j383401L12699
$$ y = [133511, -1398356, -131882, 1890851, 2046610, 1982861, 4335243, 6937034, 5445537, 840186, -1149399, 1391328, 3881807, 2839509, 1035343, 1917857, 3336903, 1461586, -2013717, -2027801, 1682137, 4026330, 2494548, 559116, 1493160, 3192516, 2044452, -1215923, -3001964, -2406075, -1811142, -2732758, -4061706, -4385323, -3608615, -2071578, -101826, 1300957, 1170829, 239241, 173206, 930672, 731317, -948214, -2331615, -2018916]
$$ [...]
##END NTUPLES=NMR SPECTRUM
##END=
