##TITLE=31Pdec_SRAla_1_1
 , 24 sc
 28.04.2021
##JCAMPDX= 6.0         $$ Bruker NMR JCAMP-DX V2.0
##DATA TYPE= NMR SPECTRUM
##DATA CLASS= NTUPLES
##ORIGIN= UXNMR, Bruker Analytische Messtechnik GmbH
##OWNER= root
$$ XWIN-NMR		Version 3.5
$$ Wed Apr 28 13:07:00 2021 Russian Standard Time (UT+4h)  she@DPX200
##.OBSERVE FREQUENCY= 81.013821
##.OBSERVE NUCLEUS= ^31P
##.ACQUISITION MODE= SIMULTANEOUS
##.ACQUISITION SCHEME= undefined
##.AVERAGES= 24
##.DIGITISER RES= 16
##SPECTROMETER/DATA SYSTEM= spect
##.PULSE SEQUENCE= zgpg30
##.SOLVENT NAME= CDCl3
##.SHIFT REFERENCE= (INTERNAL, CDCl3, 0, 248.564)
##AUDIT TRAIL= $$ (NUMBER, WHEN, WHO, WHERE, WHAT)
$$ ##TITLE= Audit trail, XWIN-NMR		Version 3.5
$$ ##JCAMPDX= 5.01
$$ ##ORIGIN= Bruker BioSpin GmbH
$$ ##OWNER= she
$$ F:/spectra/data/she/nmr/P31/1/pdata/1/auditp.txt
$$ ##AUDIT TRAIL=  $$ (NUMBER, WHEN, WHO, WHERE, WHAT)
(   1,<2021-04-28 13:05:16.26 +0400>,<she>,<DPX200>,
      <created by zg, POWCHK disabled, PULCHK disabled
       configuration hash MD5:
       00 E9 B6 7A A2 85 ED C7 34 08 36 98 17 FE 4E 26
       data hash MD5: 32K
       E6 62 CF 99 AE 41 9F 40 AD 7C 42 8E F0 74 55 5A>)
(   2,<2021-04-28 13:05:19.10 +0400>,<she>,<DPX200>,
      <Start of raw data processing
       efp BC_mod = 2 LB = 1 FT_mod = 6 PKNL = 1 PHC0 = -6282.538 PHC1 = 217.8009 SI = 64K 
       data hash MD5: 64K
       27 59 21 FB 0F D2 B7 48 2E 79 48 14 8B EA 97 B7>)
(   3,<2021-04-28 13:05:37.01 +0400>,<she>,<DPX200>,
      <pk PHC0 = 18.04884 PHC1 = 181.2 
       data hash MD5: 64K
       84 D3 2A EC 05 F5 4F B8 F6 D4 E5 DA F1 BF 0C 8B>)
(   4,<2021-04-28 13:06:15.04 +0400>,<she>,<DPX200>,
      <pk PHC0 = 32.5194 PHC1 = -306.0001 
       data hash MD5: 64K
       6F DB 5E 02 91 61 C0 D7 E8 0A 34 4B 46 D4 5E 5B>)
$$ ##END=
$$ 
$$ hash MD5
$$ D3 D6 1B 4F 55 07 87 AD 51 06 FC AF 6D 81 62 6B
##$RELAX= 
##$RELAX= 
##$RELAX= 
##$RELAX= 
##$RELAX= 
##$RELAX= 
##$RELAX= 
##$RELAX= 
$$ Bruker specific parameters
$$ --------------------------
##$DU= <F:/spectra>
##$EXPNO= 1
##$NAME= <P31>
##$PROCNO= 1
##$TYPE= <nmr>
##$USER= <she>
##$AMP= (0..31)
100 100 100 100 100 100 100 100 100 100 100 100 100 100 100 100 100 100 
100 100 100 100 100 100 100 100 100 100 100 100 100 100 
##$AQSEQ= 0
##$AQ_mod= 1
##$AUNM= <au_zg>
##$AUTOPOS= <>
##$BF1= 81.014009
##$BF2= 200.13
##$BF3= 200.13
##$BF4= 200.13
##$BF5= 200.13
##$BF6= 200.13
##$BF7= 200.13
##$BF8= 200.13
##$BYTORDA= 1
##$CFDGTYP= 0
##$CFRGTYP= 5
##$CHEMSTR= <none>
##$CNST= (0..31)
1 1 145 1 1 1 1 1 1 1 1 1 1 1 1 1 1 1 1 1 1 1 1 1 1 1 1 1 1 1 1 1 
##$CPDPRG= <waltz16>
##$CPDPRG1= <>
##$CPDPRG2= <waltz16>
##$CPDPRG3= <>
##$CPDPRG4= <mlev>
##$CPDPRG5= <mlev>
##$CPDPRG6= <mlev>
##$CPDPRG7= <mlev>
##$CPDPRG8= <mlev>
##$CPDPRGB= <>
##$CPDPRGT= <>
##$D= (0..31)
0 1 0 0 0 0 0 0 0 0 0 0.03 2e-05 3e-06 0 0 0 0 0 0 0 0 0 0 0 0 0 0 0 0 
0 0 
##$DATE= 1619600715
##$DBL= (0..7)
120 120 120 11 120 120 24 19 
##$DBP= (0..7)
150 150 150 150 150 150 150 150 
##$DBP07= 0
##$DBPNAM0= <>
##$DBPNAM1= <>
$$ [...]
##$SUBNAM2= <"">
##$SUBNAM3= <"">
##$SUBNAM4= <"">
##$SUBNAM5= <"">
##$SUBNAM6= <"">
##$SUBNAM7= <"">
##$SUBNAM8= <"">
##$SUBNAM9= <"">
##$SW= 501.771253377433
##$SWIBOX= (0..15)
0 1 3 0 0 0 0 0 0 0 0 0 0 0 0 0 
##$SW_h= 40650.406504065
##$TD= 32768
##$TD0= 1
##$TE= 0
##$TE2= 300
##$TE3= 300
##$TEG= 300
##$TL= (0..7)
0 120 53 12 22 120 120 120 
##$TP= (0..7)
150 150 150 150 150 150 150 150 
##$TP07= 0
##$TPNAME0= <>
##$TPNAME1= <>
##$TPNAME2= <>
##$TPNAME3= <>
##$TPNAME4= <>
##$TPNAME5= <>
##$TPNAME6= <>
##$TPNAME7= <>
##$TPOAL= (0..7)
0.5 0.5 0.5 0.5 0.5 0.5 0.5 0.5 
##$TPOFFS= (0..7)
0 0 0 0 0 0 0 0 
##$TUNHIN= 0
##$TUNHOUT= 0
##$TUNXOUT= 0
##$USERA1= <user>
##$USERA2= <user>
##$USERA3= <user>
##$USERA4= <user>
##$USERA5= <user>
##$V9= 5
##$VALIST= <valist>
##$VCLIST= <CCCCCCCCCCCCCCC>
##$VD= 0
##$VDLIST= <DDDDDDDDDDDDDDD>
##$VPLIST= <PPPPPPPPPPPPPPP>
##$VTLIST= <TTTTTTTTTTTTTTT>
##$WBST= 1024
##$WBSW= 4
##$XGAIN= (0..3)
0 0 0 0 
##$XL= 0
##$YL= 0
##$YMAX_a= 13121
##$YMIN_a= -15462
##$ZGOPTNS= <>
##$ZL1= 120
##$ZL2= 120
##$ZL3= 120
##$ZL4= 120
##$ABSF1= 0
##$ABSF2= 0
##$ABSG= 0
##$ABSL= 0
##$ALPHA= 0
##$AQORDER= 0
##$ASSFAC= 0
##$ASSFACI= 0
##$ASSFACX= 0
##$ASSWID= 0
##$AUNMP= <proc_1d>
##$AZFE= 0.1
##$AZFW= 0.5
##$BCFW= 0
##$BC_mod= 2
##$BYTORDP= 0
##$COROFFS= 0
##$CY= -3
##$DATMOD= 1
##$DC= 0
##$DFILT= <>
##$DTYPP= 0
##$F1P= 0
##$F2P= 0
##$FCOR= 1
##$FTSIZE= 65536
##$FT_mod= 6
##$GAMMA= 0
##$GB= 0
##$INTBC= 1
##$INTSCL= 5.30512e-09
##$ISEN= 30
##$LB= 1
##$LEV0= 0
##$LPBIN= 0
##$MAXI= 10000
##$MC2= 0
##$MEAN= 0
##$ME_mod= 0
##$MI= 50
##$NCOEF= 0
##$NC_proc= -6
##$NLEV= 6
##$NOISF1= 182.463
##$NOISF2= 159.3651
##$NSP= 0
##$NTH_PI= 0
##$NZP= 0
##$OFFSET= 248.5645
##$PC= 4
##$PHC0= -6231.969
##$PHC1= 93.00079
##$PH_mod= 1
##$PKNL= yes
##$PPARMOD= 0
##$PSCAL= 0
##$PSIGN= 0
##$REVERSE= no
##$SF= 81.014009
##$SI= 65536
##$SIGF1= 159.3651
##$SIGF2= -187.1042
##$SINO= 113.3802
##$SIOLD= 16384
##$SREGLST= <1H.CDCl3>
##$SSB= 0
##$STSI= 65536
##$STSR= 0
##$SW_p= 40650.406504065
##$SYMM= 0
##$S_DEV= 0
##$TDeff= 32768
##$TDoff= 0
##$TI= <>
##$TILT= no
##$TM1= 0
##$TM2= 0
##$TOPLEV= 0
##$USERP1= <user>
##$USERP2= <user>
##$USERP3= <user>
##$USERP4= <user>
##$USERP5= <user>
##$WDW= 1
##$XDIM= 65536
##$YMAX_p= 272359857
##$YMIN_p= -281969480
$$ End of Bruker specific parameters
$$ ---------------------------------
##NTUPLES= NMR SPECTRUM
##VAR_NAME=  FREQUENCY,     SPECTRUM/REAL,   SPECTRUM/IMAG
##SYMBOL=    X,             R,               I
##VAR_TYPE=  INDEPENDENT,   DEPENDENT,       DEPENDENT
##VAR_FORM=  AFFN,          ASDF,            ASDF
##VAR_DIM=   65536,         65536,           65536
##UNITS=     HZ,            ARBITRARY UNITS, ARBITRARY UNITS
##FACTOR=    0.620285442955139, 1,           1
##FIRST=     20137.2065510759, 0,            0
##LAST=      -20513.1999529892, 0,           0
##MIN=       -20513.1999529892, -281969480,  0
##MAX=       20137.2065510759, 272359857,    0
$$ Real data points
##PAGE= N=1
##DATA TABLE= (X++(R..R)), XYDATA
$$ [...]
61055B845440k199347k648100j886667j22267J462210J475204p199j276985q32894
61046c190605J090632K806402K638926N54857j347702r59596P79103O55631j913676
61037A113972l120994k48675L344340K454448k000304l823980n66921K966546
61029A18432J968695j632006k619429O8602K766921K605237M36731j457825k013299
61020B42059j325129K08236J861567K596200J807480o1305j777790k236622j402359
61011h7663l99436k93649p99103p67552L8906N29325j8942o82306m1094J806988
61001g14526L137355K524180M23456j339544j470757l77994N41465M66124k73709
60992B916050r23640j090457q61498o42354q40936j287752j233280m81184J7465
$$ y = [2845440, 646093, -2002007, -3888674, -4010941, -2548731, -1073527, -1080726, -2357711, -3190605, -2099973, 706429, 3345355, 3900212, 2552510, 1592914, 2372017, 3027648, 1113972, -2007022, -2255697, 1088643, 3543091, 1542787, -2281193, -2848114, 118432, 2087127, 455121, -2164308, -2095706, 671215, 3276452, 3713183, 2255358, 242059, -1083070, -874834, 986733, 3582933, 5390413, 5329108, 3551318, 1314696, -87663, -487099, -780748, -1579851, -2347403, -2308497, -1779172, -1798114, -2480420, -2521514, -714526, 2422829, 4947009, 5370465, 4030921, 2560164, 2182170, 2723635, 3189759, 2916050, 1992410, 901953, 40455, -601899, -1442835, -2730587, -3963867, -4445051, -4427586]
60983d427586l72800o28154L54108J514650J039336l88246l30037J338033K061855
60974A61159R48541K62838J272298J832189J66375j846349j682437n5457P78999
60965A838156M39438l27422j563932k741180j955159O85333J561740j198506l741215
60956g002747j841460K310802L445692J236730l19572r559j04508p46677L22911
60947b708388K357518J881292r06995j765910M00324J694318K11025q35265O69584
60938I97503J825171J04425k129339j918361m01015J99797M98037J418400J316467
60929A911085p59243k137258n16578J991089K345900J266925Q59739M79691j076958
60920D364392j987016l70193J477708M00473k032155k077280l57489n72118k529506
$$ y = [-4427586, -4800386, -5428540, -5074432, -3559782, -2520446, -2908692, -3238729, -1900696, 161159, 1109700, 1372538, 2644836, 4477025, 4643400, 2797051, 1114614, 1059157, 1838156, 2277594, 1950172, 386240, -2354940, -4310099, -3624766, -2063026, -3261532, -7002747, -8844207, -6533405, -3087713, -1850983, -2170555, -2180114, -2284622, -3031299, -2708388, -350870, 1530422, 623427, -1142483, -742159, 952159, 1163184, 327919, 997503, 2822674, 2927099, 797760, -1120601, -1521616, -1321819, -823782, 594618, 1911085, 1151842, -985416, -1501994, 489095, 2834995, 4101920, 4961659, 5441350, 4364392, 2377376, 2007183, 3484891, 3885364, 1853209, -224071, -581560, -1153678, -3683184]
60911c683184k093305J531091L784780J614303j997512k562181M7422K518700
60903h39886K649921R65563p38240r40189M85669J789796J013455j337018k538250
60894E10821j149759J042071J425157j09334j289626n12993J154798J366345m21652
60885B015828k040464j412353M94953J018350k34638r36838R1707J056739L50913
60876D04197q72864r60946l90029j71044K43400J162044R18208j219415k365273
60867c251722K13417L990112L837536o19875m250750l427368k41172J317683M22670
60858b009469q27327o61711P25315J697272Q38331j051532j230242J180147K852646
60849A513430M62185l641888l770277Q55866M288561J846565l602852n742910
$$ y = [-3683184, -5776489, -4245398, -460618, 1153685, -843827, -3406008, -3358586, -839886, 1810035, 2775598, 2037358, 1097169, 1582838, 3372634, 4386089, 3049071, 510821, -638938, 403133, 1828290, 1718956, 429330, -83663, 1071135, 2437480, 2015828, -24636, -1436989, -942036, 76314, -158324, -1095162, -1003455, 53284, 404197, -468667, -1429613, -1819642, -1990686, -1747286, -585242, 332966, -886449, -3251722, -3038305, 951807, 4789343, 4169468, -81282, -3508650, -3749822, -2432139, -2009469, -2836796, -3498507, -2773192, -1075920, -237589, -1289121, -2519363, -1339216, 1513430, 1975615, -1666273, -5436550, -4580684, -292123, 1554442, -2048410, -7791320]
60841g791320k613478K226700M553977L141061j82987k164616q11325K136605
60833a505383K723223k4911k399137j284598J185418J117172q80993q16246J958340
60824G2885L371137Q71698k609333k886044o8626K474339K952485K365581J677917
60815H222039L16622k151745m467688m596536j819542K139474M024074J931574
60807C598272k127496l693581j026334K378590K173795j061867k978699j774012
60799d511332l4244J55962K89228J888934L178333K071366L203m63325L9121o46773
60789A970473j658762m43372J986369J722080j600645l540804j547069J214018
60781a897712J073946o99553p96191O14891R19071j41389m47142M65047Q04436
$$ y = [-7791320, -10404798, -8178098, -3624121, -483060, -666047, -2830663, -3641988, -1505383, 1217840, 1192929, -1206208, -2490806, -1305388, -188216, -1069209, -1885455, 72885, 3444022, 4315720, 1706387, -1179657, -1248283, 1226056, 4178541, 6544122, 8222039, 8538661, 6386916, 1919228, -2677308, -4496850, -2357376, 1666698, 3598272, 1470776, -2222805, -3249139, -870549, 1303246, 241379, -2737320, -4511332, -4545576, -4389614, -4100386, -2211452, 966881, 3038247, 3041450, 2578125, 2617246, 1970473, 311711, -131661, 1854708, 3576788, 1976143, -1564661, -3111730, -1897712, -823766, -1523319, -2319510, -1704619, -785548, -926937, -1374079, -909032, -104596]
60772a04596l2878m47637L60090Q86376j35397j554983j478442J4980J144575
60763a347912R28106K15049R8112K64209k78740j280953j328531j01724Q69452
60754a962932N75574J56357P09038J049172j13660j186635N4221K142991J598457
60745C022583j260624k338256k55254J509526M66757j173216r23080j14964n93151
60736a659679r42837M39151J610659L00542j725489j545495j12558j99284j198204
60727e033194m59285J541372J962412P17620L47580J178880R88483n37404j224761
60718e18297n53510l89753j147929j050066K08218P46943J38591J69020J194704
60709a202079J274072j47126j082763m98155L13305O56774J309830J699314L0090
$$ y = [-104596, -137474, -585111, -225021, 661355, 525958, -1029025, -2507467, -2492487, -1347912, -419806, -204757, -106645, 157564, -121176, -1402129, -2730660, -2832384, -1962932, -1387358, -1231001, -521963, 527209, 413549, -773086, -718865, 1424126, 3022583, 1761959, -576297, -831551, 677975, 1144732, -28484, -951564, -1066528, -1659679, -2602516, -2163365, -552706, -252164, -1977653, -3523148, -3635706, -3834990, -5033194, -5492479, -3951107, -1988695, -1271075, -923495, 255385, 1243868, 706464, -518297, -1071807, -1461560, -2609489, -3659555, -3451337, -2704394, -2565803, -2396783, -1202079, 71993, -75133, -1157896, -1656051, -1342746, -685972, 623858, 2323172, 2353262]
60700B353262k671085k739787L05408K312290R50858o77453L07091J552998l0730
60691A662852k370227j514241J589612K522331L46679j499691q72644O74702J346614
60682A885987J313825Q73112m87580k333788l078902k247042q41273P97638L014836
60673a103187M405047K490745j871861l863009q79823L069318K373459k235817
60665B384872m594716j814769K002582K193107j3818m42218J219140J624016k11180
60656B347016j441261m54997N58536l53728j666807j313239q1265L42976L46200
60647a716569Q22194Q17735m77972j436653o58822J16677r07068j743067J21458
60638e062087K579143J860712p21970n07484K541127L516754P21101j852760j587016
$$ y = [2353262, -317823, -3057610, -2752202, -439912, 510946, -166507, 140584, 1693582, 1662852, -707375, -2221616, -632004, 1890327, 2237006, 737315, -135329, 539373, 1885987, 3199812, 4072924, 3585344, 1251556, -1827346, -4074388, -4915661, -4118023, -1103187, 3301860, 5792605, 3920744, 57735, -822088, 2247230, 4620689, 2384872, -2209844, -4024613, -2022031, 171076, 157258, -284960, 934180, 2558196, 2347016, 905755, 450758, 1009294, 655566, -1011241, -2324480, -2405745, -2062769, -1716569, -894375, -76640, -554612, -1991265, -2650087, -2533410, -3440478, -5183545, -5062087, -2482944, -622232, -1344202, -1851686, 689441, 4206195, 4927296, 3074536, 1487520]
60629A487520q74645j472593j050521J420245K319669l65531k235186R78661N785802
60620E993421N473494j27052m872231m928512k158864L46230J482406J030691
60612B239583o43462j657414o21156O87715k08889k011899j327419J494139K303699
60603B54897n05205l447270l007075n2748K352980K919069K214148Q58709o23301
60594I64204j486262j626878j780861k066137j494974K93770J991822K222816
60586b982500J299140N21075L58951J55349n98084j288324p33156J218602K903476
60577H54529K364648k26782k531373k678041r56042J282032K908584K843871O40902
60568D502328j808868j475450J349828K314740q95090m213518k461605K776895
$$ y = [1487520, 612875, -859718, -1910239, -489994, 1829675, 1464144, -771042, 207619, 5993421, 11466915, 11339863, 6467632, 1539120, -619744, -273514, 1208892, 2239583, 1596121, -61293, -682449, 5266, -203623, -2215522, -3542941, -2048802, 254897, -250308, -3697578, -6704653, -6757401, -4404421, -1485352, 728796, 1587505, 964204, -522058, -2148936, -3929797, -5995934, -7490908, -7197138, -5205316, -2982500, -1683360, -1162285, -803334, -647985, -1246069, -2534393, -3267549, -2048947, 854529, 3219177, 2992395, 461022, -2217019, -3173061, -1891029, 1017555, 3861426, 4502328, 2693460, 1218010, 2567838, 4882578, 3987488, -226030, -2687635, 89260]
60560H9260M855312J193441l608456m477844j841700O49672J236801P23091R4485
60551a085938k84284l9507R40705J851603J512050l84785k645979l197048j005717
60542d338900K214730L381200J879662L82115O04948N77570j522214l295186j599773
60533a715848J711752K151922k20946j110651N69372J122483r89211k288187o10370
60524a379684J030671P5246r47024O31691K333967Q66377j834638j984744m52687
60515a660825m12166r31730R57475L403608J779159k671559l308751J448223M882967
60506C486401K029511k931530l374323K82513K552745J222623j132614k162587
60498b7261j841687m85377J477126K206768K86167k400446k603262l04300J450102
$$ y = [89260, 4944572, 6138013, 2529557, -1948287, -3789987, -3140315, -1903514, -1180423, -1085938, -1370222, -1409729, -469024, 1382579, 2894629, 2509844, -136135, -3333183, -4338900, -2124170, 1257030, 3136692, 3518807, 4123755, 4701325, 3179111, -116075, -1715848, -4096, 2147826, 1926880, 816229, 1385601, 2508084, 1518873, -769314, -1379684, -349013, -273767, -1220791, -589100, 1744867, 2611244, 776606, -1208138, -1660825, -2072991, -3004721, -2047246, 1356362, 3135521, 463962, -2844789, -1396566, 3486401, 5515912, 2584382, -789941, -507428, 2045317, 3267940, 2135326, -27261, -1868948, -2354325, -877199, 1329569, 1615736, -784710, -3387972, -3692272, -2242170]
60489b242170J075262j11392q62087j302741j045908P81845K963782K814846M02253
60480B473690r94192K5457P59761p24888j919157j75715K161829J061785k430985
60471B37585l303882j43544K818814K117663l35753q67802P04283J803351J160460
60462D191175k51906j344296j883670j744772q33797K46120N52334p4809q44772
60453a988393r23772j94426O82732Q45493K15924j99715L88014J240472J127181
60444A193510L89914M04593R83605L60647j631095k605679j183912N61824J74644
60435a351949j380413j423794J50204J151117J049538J460599K425692J529115
60427C610109j876829m402044k927722P02218K090068L95891j023813o9362J230799
$$ y = [-2242170, -1166908, -1278300, -2140387, -3443128, -4489036, -3707191, -743409, 2071437, 2473690, 1479498, 1504955, 2264716, 1539828, -379329, -555044, 1606785, 2668570, 237585, -3066297, -3209841, -391027, 1726636, 1390883, 523081, 1227364, 3030715, 4191175, 3939269, 2594973, 711303, -1033469, -1867266, -1621146, -1068812, -1143621, -1988393, -2912165, -3106591, -2423859, -1578366, -1362442, -1562157, -1174143, 66329, 1193510, 1583424, 1988017, 2971622, 3332269, 1701174, -904505, -2088417, -1526593, -1351949, -2732362, -4156156, -4005952, -2854835, -1805297, -344698, 2080994, 3610109, 1733280, -2668764, -5596486, -4894268, -2804200, -2408309, -3432122, -3501484, -2270685]
60418b270685N66774p60274k78289J203909Q84256r84912j045395J558903L210430
60409B084717J317437j512327j712676m17441r22410k397917j081704K725729
60401a916592M177047J454026j221798m46317J112989j86662k456244j515761
60393i99312J770927K535913n09653l326675k797412o20214K52191k25929l08973
60384d229137N73913J689845K361969K146017P79219j043492j811336r38515M29223
60375d2294R22695M82453o2620j58209J73942N38599L62782n19342j336941j074211
60365g13146K31910J508633J919549J442331L38922j043858j939391j585646k80911
60356a21607O42653K14338j136320k028013j441952K58485J507101J100701l43133
$$ y = [-2270685, -1703911, -2464185, -2742474, -1538565, -654309, -1639221, -2684616, -1125713, 2084717, 3402154, 1889827, 177151, -240290, -1162700, -3560617, -4642321, -1916592, 2260455, 3714481, 2492683, 2046366, 3159355, 2972693, 516449, -999312, 771615, 3307528, 2797875, -528800, -3326212, -3946426, -3694235, -3920164, -4229137, -3655224, -1965379, 396590, 2542607, 3321826, 2278334, 466998, -471517, -42294, 880401, 1362854, 1300234, 1142025, 1315967, 1854566, 2217348, 1698006, 361065, -713146, -481236, 1027397, 2946946, 4389277, 4728199, 3684341, 1744950, 159304, -121607, 521046, 735384, -400936, -2428949, -3870901, -3612416, -2105315, -1004614, -1347747]
60347a347747j078769l92292Q17225J604165J815375J219498m61657k129746j889730
60338a843678N4665J166758L51159m20511K43898O59803n19556j266286K61334
60329a312414J733091K72315j997435q60903K714296L558593N28660j671626q8970
60320B875607K099303J124346j574081k164360k87483R95870k23797k472678k799022
60311b426295j7110L531890L920620N34652k301889r62534J954703J553963j422774
60302D365226j956526M35918P71076k362969l749537m62441K676368R60117k517389
60293a840157k388467M39976J675080J258096J719032J883980r40373m371956
60285b564789l484270Q59700K854132Q32825r66531k30982L19168r02501j255760
$$ y = [-1347747, -2426516, -2818808, -2001583, -397418, 1417957, 2637455, 2175798, 46052, -1843678, -1789013, -622255, -271096, -691607, -447709, 212094, -307462, -1573748, -1312414, 420677, 692992, -1304443, -2165346, 548950, 4107543, 4636203, 2964577, 2875607, 4974910, 6099256, 4525175, 2360815, 2073332, 3069202, 2845405, 372727, -2426295, -2443405, 1088485, 5009105, 5543757, 3241868, 2279334, 4234037, 5788000, 4365226, 2408700, 2844618, 3615694, 1252725, -2496812, -2959253, -282885, 677232, -1840157, -4228624, -3788648, -2113568, -855472, 863560, 2747540, 1807167, -2564789, -6049059, -5189359, -2335227, -1502402, -2468933, -2699915, -2380747, -3283248, -4539008]
60276d539008O26972J709971j5024j621897j86330K304842K618512J546314J616908
60267D061260K120975N53638k533490m021907k891589j126761k65398J22299N55122
60258c425851P62262R39369J749614K620794J868557p54777l020990k680601k13805
60249b155428J701727J225075p33062j741423o93513J007499J288222l1962j170055
60240a302920p26530O94361J438991P90490l70746o51744L08358J365510J099504
60231B645274m36121j639875j279358N1664P50782m3567j795206l007022k196382
60222f949811N40003K833256K412727L72235m2628J601574K128101K42877q14852
60213B323482J128563K623464j7387l822234l329737L29425J247121j028802p35657
$$ y = [-4539008, -3912036, -2202065, -2217089, -3838986, -4025316, -1720474, 898038, 2444352, 4061260, 6182235, 6735873, 4202383, 180476, -2711113, -3837874, -4103272, -3980973, -3425851, -2663589, -1724220, 25394, 2646188, 4514745, 3759968, 738978, -1941623, -2155428, -453701, 771374, 38312, -1703111, -2396624, -1389125, -100903, -132865, -1302920, -2029450, -1335089, 103902, 894392, 523646, -128098, 180260, 1545770, 2645274, 2209153, 569278, -710080, -658416, 92366, 48799, -1746407, -4753429, -6949811, -6409808, -3576552, -1163825, -791590, -834218, 767356, 2895457, 3138334, 2323482, 3452045, 6075509, 6058122, 2235888, -1093849, -764424, 482697, -546105, -1281762]
60204a281762L368305M534582r91176o667584n064584R02546L011019K83127j083220
60195b988747J375258L250858J528742q19238o04832O03019J92608q41437k74361
60186A421870J063200P16613j197461k198187j256461n867p3261r54352j088177
60177c572083n7554J007034J013383L06014N3210N04124P45921L81993K91991
60168F74033J003954J483826P22406m75539p38190l16083l56053o91778k98843
60159A007733M81813L15996o10519o55447M41847R91547K37978l39496L60813
60150B232265J104331M23742q59204r37536J31549O22962k18862j249254j168254
60141H1739j13721P38338N62484l46723r99395q78945n50641p19799r06255J1927
$$ y = [-1281762, 2086543, 6621125, 5629949, -1037635, -6102219, -5199673, -2188654, -1905527, -2988747, -1613489, 1637369, 3166111, 2346873, 1742041, 2345060, 2537668, 1696231, 1421870, 2485070, 3201683, 2004222, -193965, -1450426, -1456293, -1529554, -2483906, -3572083, -3629637, -2622603, -1609220, -1303206, -1249996, -745872, 49, 382042, 674033, 1677987, 3161813, 3884219, 3408680, 2670490, 2354407, 1998354, 1306576, 1007733, 1489546, 1805542, 1195023, 539576, 981423, 1972970, 2210948, 1871452, 2232265, 3336596, 3760338, 2901134, 1963598, 2095147, 2718109, 2499247, 1249993, 81739, -31982, 706356, 1268840, 922117, -77278, -956223, -1506864, -2226663, -3132918, -3120991]
60131c120991J766945K387900P19682j617670j965995J1332J909132J666656O637
60122A763628q51968k03910N23242J42739n41082k14966N89711J80524j400191
60113a2273j998856n36315J157995J008576k54344n35343J70391M0840j215904
60104b175233j662222j79393J793278K311918J190005m67728j626910j595624
60096b411909k59343J295920J597532P41956K45178N49769L82213p03290j101907
60087C36119K14441J611030J078330p35885j643661j022982O1856R08341J312462
60078B120051M65631j915994l766929k587279O27056J969267r3460k490027j979392
60069g651076L89465J343171L27319l05980N04183R97985r8688j148272p1274
$$ y = [-3120991, -1354046, 1033854, 1753536, 135866, -1830129, -1818797, 90335, 1756991, 1763628, 911660, 707750, 1230992, 1373731, 832649, 617683, 1207394, 1387918, -12273, -2011129, -2547444, -1389449, -380873, -635217, -1170560, -1000169, -959329, -2175233, -3837455, -4016848, -2223570, 88348, 1278353, 810625, -816285, -2411909, -2671252, -1375332, 222200, 964156, 1209334, 1759103, 2141316, 1438026, 336119, 550560, 2161590, 3239920, 2504035, 860374, -162608, -100752, 807589, 2120051, 2585682, 669688, -3097241, -5684520, -5057464, -3088197, -3181657, -5671684, -7651076, -7261611, -5918440, -5591121, -5897101, -5392918, -4394933, -4493621, -5641893, -5713167]
60060e713167K264693L076069J423982r45754k319291k621176k091500n17516
60052g443660J283392J305392o56120j623561O73864L840961L588243j43451k963316
60043b138256k099676M54465J691487J440901R87513N58180J55528O33537J801768
60034C485447J495943j118118l239528k162149L58718O54147j142630j545327
60026c213497N13177K071087Q77000j481504k345926j352218K45928J567757K117269
60017a000927J423911j06037j162655j198227r96037j025357n71856Q05853K193313
60008a638019K421562J295198o60659k615894l395009k300510k53588J089335
60000f057584J395197J464129J245396J0588j525026j611330l58849K54752j20717
$$ y = [-5713167, -3448474, -372405, 1051577, 105823, -2213468, -4834644, -6926144, -7443660, -6160268, -4854876, -5510996, -7134557, -6460693, -2619732, 968511, 825060, -2138256, -4237932, -3783467, -2091980, -651079, 336434, 894614, 1050142, 1683679, 3485447, 4981390, 3863272, 623744, -1538405, -1179687, -525540, -1668170, -3213497, -2700320, -629233, 247767, -1233737, -3579663, -4931881, -4685953, -3118196, -1000927, 422984, 316947, -845708, -2043935, -3039972, -4065329, -4637185, -3831332, -1638019, 783543, 2078741, 1418082, -1197812, -4592821, -6893331, -7146919, -6057584, -4662387, -3198258, -1952862, -1942274, -3467300, -5078630, -5437479, -5182727, -5303444]
59991e303444N24176K682263L637097J522187j489800k397010j618577j362063
59983c805171j481786r8684K496214L652163K182381j2885o60234J89173P38833
59974C200004k25502j961205k449908o87683J717799K167066L79613j324293j323082
59965e07191m40405J49615N39036O34105m67320k201561k147223K62263K171114
59956b007567J585285N03760J119878J791251L12716j452554n94777J214052J06992
59947B579036l125899l861939j079005J305377J100672P51211K189410L422587
59939C281450K337830J17446j306519k033847k494709j930819m49274J73484n18725
59930b823683o01654O74189J235654n031p36315R28778K880624K047424r51816
$$ y = [-5303444, -4779268, -2097005, 1540092, 3062279, 1572479, -824531, -2443108, -3805171, -5286957, -5385641, -2889427, 762736, 2945117, 2932232, 2271998, 2461171, 3200004, 2974502, 1013297, -1436611, -2124294, -406495, 1760571, 2140184, 815891, -507191, -947596, -797981, -258945, 375160, -92160, -2293721, -4440944, -4178681, -2007567, -422282, 81478, 1201356, 2992607, 3305323, 1852769, 1257992, 2472044, 2579036, -546863, -4408802, -5487807, -4182430, -3081758, -2330547, -141137, 3281450, 5619280, 5736726, 4430207, 2396360, -98349, -2029168, -2478442, -2304958, -2823683, -3425337, -2751148, -1515494, -1520525, -2256840, -1328062, 1552562, 3599986, 2648170]
59921B648170k805928j820603P44366K392403J180558k456317m729406j885696
59913f732453M189078O876836L218878j929208k722816K2691J481658K71377j003188
59904C672853r31007p34757j138637j327003q79106j62389P62222J585971J135848
59895A983995o67140j681681n29506J049685J105368N38043N84993j08097k416995
59886a41335l424616n82383L045579K722356m66881j543199R5362L80292j673236
59877a588061k229429L60752K678162K148547O76166L20578N7761r22133j049602
59868D52741J72774O23898k87001k5244K143938K881932K76633k480748k189586
59859A569337n76871n33721j038809M4366J248381J26036j813555j413303O18759
$$ y = [2648170, -157758, -1978361, -1233995, 1158408, 2338966, -117351, -4846757, -6732453, -2543375, 4333461, 7552339, 5623131, 2900315, 2923006, 4404664, 4676041, 3672853, 2741846, 2007089, 868452, -458551, -1337657, -1500046, -737824, 848147, 1983995, 1316855, -364826, -894332, 155353, 1260721, 1798764, 2383757, 2275660, -141335, -3565951, -4148334, -1102755, 1619601, 1152720, -390479, -295117, 85175, -1588061, -3817490, -3456738, -778576, 1369971, 2046137, 2366715, 2424476, 1502343, 452741, 625515, 1249413, 962412, 937168, 3081106, 5963038, 6239671, 3758923, 1569337, 992466, 458745, -580064, -535698, 712683, 838719, -974836, -2388139, -1769380]
59850a769380R97726n35680j218275j85719N92728K1549r20867j440426j384693
59841e843037q954K690498M160595K118861j411678k375379n48065N89764l23729
59832i51124r32324N0368N96654n78295j358620J11810J904673J121389j499370
59823a534839k451213l13940K380846K357545n16174l119359k678652j3399J548022
59814d341163N12753r30168k78937J649254K203852Q01685q73304j792105k268909
59805e317042k099057n45226J695413K802377K409920J835534J555303O23618
59797B960840j041959k000695j537629o33621j11373L27093P18255M56559j35728
59788i98258J20870R68412O33826j066589j782361j35703J836948J501422o07021
$$ y = [-1769380, -771654, -1307334, -2525609, -2711328, -2118600, -2097051, -3017918, -4458344, -5843037, -5851991, -3161493, 999102, 3117963, 1706285, -669094, -1217159, -627395, -951124, -1883448, -1833080, -1236426, -1814721, -3173341, -3061531, -1156858, -35469, -1534839, -3986052, -4299992, -1919146, 438399, -77775, -3197134, -5875786, -5889185, -4341163, -3828410, -4758578, -5037515, -3388261, -1184409, -382724, -1256028, -3048133, -5317042, -7416099, -7961325, -6265912, -3463535, -1053615, 781919, 2337222, 2960840, 1918881, -81814, -1619443, -2253064, -2364437, -2037344, -1319089, -862530, -998258, -877388, 91024, 724850, -341739, -2124100, -2259803, -422855, 1078567, 471546]
59779D71546j710651o09601J105417J339263j66112j735164j562951J90242J285664
59770a392347R7000k040968k487263q76331P81233J345778J595193J858228J228571
59761A09094j04087l57762P90113J125449n84411k303203j788248J17989J214403
59752a780663J059471L44536r27520k360827k142747K64416K114070J040577p92826
59743c181513K72333L291615L771820O70905j988352j452355n3327o47469j780833
59734a097176n09722K307451L115106J074155r88296j072779n02064j072924k095805
59725h42054j819291l01748Q82806J051541Q86929Q11451M60205j35690k78093
59716G16056J37985M01578M45205J090707K184351K111173K80528j514375j719683
$$ y = [471546, -1239105, -1848706, -743289, 595974, 429862, -1305302, -2868253, -2678011, -1392347, -1295347, -3336315, -5823578, -6699909, -5918676, -4572898, -2977705, -1119477, 109094, 5007, -352755, 437358, 1562807, 978396, -1324807, -3113055, -2995066, -1780663, -721192, -376656, -1304176, -3665003, -5807750, -5543334, -3429264, -2388687, -3181513, -2909180, 382435, 4154255, 4825160, 2836808, 1384453, 1331126, 683657, -1097176, -1606898, 700553, 3815659, 4889814, 3901518, 2828739, 2326675, 1253751, -842054, -2661345, -2963093, -2080287, -1028746, -141817, 669634, 1129839, 994149, 716056, 854041, 1255619, 1700824, 2791531, 4975882, 7087055, 7367583, 5853208, 4133525]
59707D133525j384122j935100k229760n42496J768181J938998M80778L66094J575555
59698D171653Q11185k304282l324405J98566L921728K447810k783204n442037
59690b302986k828287J445416K994219J503335n25658j317330r63709l23103J48849
59681b169254M82899L73604q93154k708604k427207J243439M839509L689856j015504
59672A415584l146051p20786J188233q01028k508810L07666L853942K258923k212263
59663c64590k645941J005539K232694o97427k239863K84666K178938R567k345773
59654b582190n24895L097066L734797J483866l28166q26316j295773j661240j106240
59645i091l43041k06939J13761R70860P78787q99287j603913r7948Q07229j138667
$$ y = [4133525, 2749403, 814303, -1415457, -1957953, -189772, 1749226, 2230004, 2596098, 4171653, 4982838, 2678556, -645849, -447283, 3474445, 5922255, 3139051, -2302986, -5131273, -3685857, -691638, 811697, 286039, -1031291, -1995000, -2318103, -2169254, -1686355, -1312751, -2205905, -4914509, -7341716, -6098277, -1258768, 2431088, 1415584, -1730467, -2451253, -1263020, -2064048, -4572858, -4265192, -411250, 1847673, -364590, -3010531, -2004992, 227702, -469725, -2709588, -2424922, -245984, -236417, -2582190, -3107085, -10019, 3724778, 5208644, 4880478, 4054162, 2758389, 1097149, -9091, -352132, -559071, -445310, 525550, 1304337, 405050, -1198863, -1296811, -489582, -1628249]
59635a628249l168629j592330K157351L824985K710311J429088Q81104j26111
59627D487520j312166j285220p56794j359093j937858j40823K809276L225863
59619C730705P46372j247280j245463j378076k786609l318140j306311J640952
59611e163850L141972K746496J133716q86060j835680o37284J141612P73215j371834
59602i57697j985060Q5283K044431J508230l87861j520176j573897r59269L73120
59593c372896J707776J734258J014924J443838K324302N69872l661654n524036
59585c763616k182265K709762M296972K902546J573708M78501j808321l831478
59577C75809l008814n67192n843j306223j212436R76869K433884J888818J277217
$$ y = [-1628249, -4796878, -6389208, -4231857, -406872, 2303439, 3732527, 4613631, 4487520, 3175354, 1890134, 1133340, -225753, -2163611, -2304434, 504842, 3730705, 4477077, 3229797, 1984334, 606258, -2180351, -5498491, -6804802, -5163850, -2021878, 724618, 1858334, 972274, -863406, -1500690, -359078, 414137, -957697, -2942757, -2857474, -813043, 695187, 307326, -1212850, -2786747, -3746016, -3372896, -1665120, 69138, 1084062, 2527900, 4852202, 5422074, 1760420, -3763616, -5945881, -3236119, 1060853, 3963399, 5537107, 6015608, 4207287, 375809, -2633005, -3200197, -3206040, -4512263, -5724699, -4747830, -2313946, -425128, 852089]
59568H52089J538354J055962m33434n50628J197578J507553j463885m280352k945127
59559c521890J040825K931634J498114j04555L48822J366558P05744j413968k980605
59550a29321k619364p29669R78339J001563k76877r02546q6532M16560r61176
59541c309023k659584j955718Q12073K579926K021294R06278N68286k2299j428677
59532b487444j820971O5395K249129K182196M50161o67203q45155j118685q81590
59523b874167J118732L314001K583756n77744j821391P90887L530419K131075
59515H195568k305323n039448l772882o34192J055050J11498j924695k344045
59507f658469m6439K670408K480783l11838j773792r8053J558029J83324k101164
$$ y = [852089, 2390443, 3446405, 3012971, 2462343, 3659921, 5167474, 3703589, -576763, -3521890, -2481065, 450569, 1948683, 1844128, 2192950, 3559508, 4265252, 2851284, -129321, -2748685, -3478354, -2500015, -1498452, -1775329, -2677875, -2764407, -2347847, -3309023, -5968607, -7924325, -7112252, -4532326, -2511032, -1604754, -1036468, -1058767, -2487444, -4308415, -4243020, -1993891, 188305, 638466, -28737, -873892, -1992577, -2874167, -1755435, 1558566, 4142322, 3564578, 1743187, 2534074, 6064493, 8195568, 5890245, 850797, -2922085, -3556277, -2501227, -2389729, -4314424, -6658469, -6704908, -4034500, -1553717, -1865555, -3639347, -3737400, -2179371, -1996047, -4097211]
59498d097211j555253J016932J808024K77196o63664j27171k09836j263435q92287
59489e706705J300173K362314R90989k05514N58654J165997k26710j587007o92741
59480b040550P55336K28003j094465p04228N24393J67500r05756p4806J654024
59471a490549P33200k452503l179550L54344L901449L437721O87219m86261o715
59462A498355k77511j150103m20971J455267J390905j071311k346650k84455K178722
59453I72248J455864j026801j122131J346246K330782K31397j437831P9956J959835
59444D789565J87514l681543m340736m75327L382909L165741L0323k238299j874831
59435a054684J17927J832609J867023K84622j263010j643110k049389l578067
$$ y = [-4097211, -5652464, -4635532, -2827508, -2550312, -3213976, -3341147, -3550983, -4814418, -5706705, -4406532, -2044218, -1053229, -1258743, -700089, 465908, 239198, -1347809, -2040550, -1285214, -1057211, -2151676, -2855904, -2331511, -2164011, -3069767, -3144573, -1490549, -757349, -3209852, -6389402, -6035058, -2133609, 1304112, 1991331, 1505070, 1498355, 1220844, 70741, -350230, 1105037, 2495942, 1424631, -922019, -1206474, 972248, 2428112, 1401311, 279180, 1625426, 3956208, 4187605, 2749774, 2829730, 4789565, 4977079, 1295536, -3045200, -3520527, -137618, 3028123, 3058446, 820147, -1054684, -936757, 895852, 2762875, 3047497, 1784487, 141377, -1908012, -5486079]
59427e486079l912140j51298N146013N589074J26312m306881k240399K621412
59419b613986L213550q58331l959937k869588L79634K964326L986459L110101
59411C352228M78839j961475k176028q02187L43793J268304K327216J671776j746323
59402B756143m376110k303015J928149K441696o47823j584535J000588J749819
59394I64912j661202l821859o51161L338182K283896j662898k474107L9441J374588
59385b270208P59165J400265L195680K099396k451548n510647l906754o16493
59377g301144N28562K66168R78262J747049K50775k238520j839454K044724N179556
59368c84022L975840J90495j688790m55943Q18361k23698j826004j195650J004324
$$ y = [-5486079, -9398219, -9549517, -4403504, 1185570, 1311882, -2994999, -5235398, -2613986, 599564, -258767, -4218704, -7088292, -6708658, -3744332, 242127, 3352228, 3831067, 1869592, -306436, -1108623, -764830, 503474, 2830690, 4502466, 2756143, -1619967, -3922982, -1994833, 446863, -200960, -1785495, -784907, 964912, -696290, -4518149, -5169310, -1831128, 452768, -1210130, -3684237, -3644796, -2270208, -1511043, -110778, 3084902, 5184298, 2732750, -2777897, -6684651, -7301144, -6772582, -6506414, -5528152, -3781103, -3530328, -5768848, -7608302, -5563578, -384022, 3591818, 3782313, 2093523, 1637580, 2455941, 2232243, 406239, -789411, 214913]
59359B14913J847941Q57691L60116J114738J025658p33176j720779m26023N88379
59350C129458j297796l978833l472717j01393K033322J200829j20347K28566J287590
59341a091321J635189J715366K028788J528747l59724j959707j452095M36112
59333B481355J496779R38392k40645j101793j492789j236324j08259J090170O89048
59324B515934j707860l850508k926761P09194L212885J792186j461376k202282
59316c918588K49662K298485J698957N66033J169373J916379M53950j718640j560624
59307A154987J33551j8823j940725j901007J071476L096570J482852j093404j043017
59298I42460O48635O18652j262136j943034n0418K308328K670029R86000j083813
$$ y = [214913, 2062854, 2920545, 3280661, 4395399, 5421057, 4687881, 2967102, 2541079, 3129458, 1831662, -2147171, -5619888, -5721281, -3687959, -2487130, -2607477, -2378911, -1091321, 543868, 2259234, 4288022, 5816769, 5457045, 3497338, 2045243, 2481355, 3978134, 4916526, 4675881, 3574088, 2081299, 844975, 736716, 1826886, 2515934, 808074, -3042434, -5969195, -5260001, -2047116, -254930, -1716306, -3918588, -3668926, -1370441, 328516, 894549, 2063922, 3980301, 4434251, 2715611, 1154987, 1288538, 1269715, -671010, -2572017, -1500541, 1596029, 3078881, 1985477, 942460, 1591095, 2209747, 947611, -995423, -1045841, 1262487, 3932516, 4918516, 3834703]
59289C834703k160300j993070j196329n32943k76877l13668o04728q90964l15953
59280d450129J371697K498467J222549j269601j661526O72504K313789P47070
59272A444820j814084j810065M25560J593403M00172j254057j574402p70295L04645
59263c054303J210918J449838P32675j11481L6818R12281J377382J250484J057675
59254D862287M47996j167899k642000k021489K65949J372465n0649j813137j257066
59245b003543J015127J929965n4501k871170l038921K81801L849216L701571o3148
59236B746397l260376k913711o79873L66816J99712O32048J487560J351621J033278
59227I63472K403537M153255K893454j103219l541845k612301j549904k782873
$$ y = [3834703, 1674403, -318667, -1514996, -2047939, -2324816, -2638484, -3243212, -4134176, -4450129, -3078432, -579965, 642584, -627017, -2288543, -1616039, 697750, 1444820, -369264, -2179329, -1753769, -160366, 239806, -1014251, -2588653, -3358948, -3054303, -1843385, -393547, 339128, 227647, 264465, 1176746, 2554128, 3804612, 4862287, 5310283, 4142384, 1500384, -521105, -255156, 1117309, 1066660, -746477, -2003543, -988416, 941549, 887048, -1984122, -5023043, -4741242, -892026, 2809545, 2746397, -513979, -3427690, -4107563, -3740747, -3541035, -2908987, -1421427, -69806, 963472, 3367009, 7520264, 10413718, 9310499, 5768654, 3156353, 1606449, -1176424]
59219a176424l768303j622739J707958K575162J220886M06075M80107k32107j487171
59210a896556j470057l56435L7043k74552L29812J647802J758011O01712K93024
59201F69804J454263K091465P57312j509424k895851k516111l99725K217484L002743
59192B871960J229804l69839P11836K252403L47196l695034m445083p81317K172267
59183B94193J154501o92768j99331L60390j575204l043195n44689K741289J300426
59174b04388l244280m025503K08224L214816J349294j224208j20802K386658K149017
59165D88828J43169k66738K18140j364797l832553l049459P65690K579837N57559
59156c760324p42801K145669N419573L518617k130748m951394k655001L38443
$$ y = [-1176424, -4944727, -6567466, -4859508, -2284346, -1063460, -657385, -177278, -409385, -1896556, -3366613, -3723048, -3686005, -3960557, -3630745, -1982943, -224932, 376780, 669804, 2124067, 4215532, 4972844, 3463420, 567569, -1948542, -2348267, -130783, 2871960, 4101764, 3731925, 4443761, 6696164, 7043360, 3348326, -1096757, -1878074, 294193, 1448694, 755926, 556595, 916985, -658219, -3701414, -4246103, -1504814, -204388, -3448668, -7474171, -7265947, -4051131, -2701837, -3926045, -4046847, -1660189, 488828, 631997, 365259, 583399, -781398, -4613951, -7663410, -6897720, -4317883, -3760324, -4503125, -2357456, 3062117, 6580734, 4449986, -501408, -3156409, -2817966]
59148b817966L54337o79984J29212J481161Q19746o02461J69264K248457J906648
59139C008414j210790l079394j277394J639955K225439O96647m76674m13998k37301
59130H74904q54681j874462k133653p57175J499812K229712L06036j726447p97339
59121c233293J607689J262636j639826j968474J928698M439939R59240m461166
59113a104557m696845K85393M290649L976689J533891o49328k422178l088181
59105a874467j417695J006357J080550o39928o13453J329437J372261j374051
59097a130989k691091k33837K303528J159478j609137j890750K54061J964980
59089a873757K432336K507951J649522q56274l131744k778614o62129M98744K60027
$$ y = [-2817966, -2463629, -3143613, -3014401, -1533240, -713494, -1315955, -1146691, 1101766, 3008414, 1797624, -1281770, -2559164, -919209, 1306230, 2002877, 1526203, 1112205, 874904, 20223, -1854239, -3987892, -4745067, -3245255, -1015543, -709507, -2435954, -3233293, -1625604, -362968, -2002794, -3971268, -2042570, 2397369, 3356609, -1104557, -5801402, -5516009, -1225360, 2751329, 4285220, 3635892, 1213714, -1874467, -3292162, -2285805, -1205255, -1845183, -2458636, -1129199, 243062, -1130989, -3822080, -4055917, -1752389, -592911, -2202048, -4092798, -3838737, -1873757, 558579, 3066530, 4716052, 3859778, 728034, -2050580, -2712709, -2213965, -1953938]
59080a953938J74892M70642J47924l72381K13642J373594J388908L42740j92849
59071A593174l1670k92242q58031o26717K9625j92248p90018j52069J154269R25510
59061G59583o52948q43204J034158K082284K94617k299371k701649q64536J222841
59052a968225K352003K171530L15794k377385l183836m26651L557735M562784
59044E003749J562732k091221k769474n55183J408804Q35538j193312j838103
59036C63530k79463J146977L07780j415137j094480J003956J431544j080275l239165
59027b854733k045525M98793M46144j923137k516139L15766L439664L652347J710504
59018G23684J05644p04620j594112j986660n44656J854814K439919L50101j851430
$$ y = [-1953938, -1779046, -1308404, -1160480, -1532861, -1319219, 54375, 1443283, 1786023, 1593174, 1561504, 1269262, 411231, -215486, -185861, -378109, -1168127, -1320196, -165927, 759583, 106635, -736569, 297589, 2379873, 2674490, 375119, -2326530, -3191066, -1968225, 383778, 2555308, 2871102, 493717, -2690119, -3116770, 440965, 5003749, 6566481, 4475260, 1705786, 1150603, 2559407, 3394945, 2201633, 363530, 84067, 1231044, 1538824, 123687, -970793, 33163, 1464707, 384432, -2854733, -4900258, -4401465, -3955321, -5878458, -8394597, -8078831, -4639167, -986820, 723684, 829328, 124708, -1469404, -3456064, -4000720, -2145906, 294013, 644114, -1207316]
59009a207316j487819P46448J890398O19726j291153j442494K52593J645651J016668
59000G42702r39363k048247j283570J98745Q64994Q17124J076549J399894M04624
58991A233452j810922k844554j049376J667809J907988n53838k000698N42452
58983b907687N086045O571955K869746k450612m205039j720656P37722q8457k171814
58974A721203j667399R79327J680626p32214k470856p68200J730671J358789p17165
58965A114782q40587Q73499J060119q73203j825565m46914Q07034K19630m85196
58956c96401K63400J010738J79177j026057r69985m20744o19742o67361N91609
58947b055366J829027J035001j172902k418414j771530j09537J590921K420165
$$ y = [-1207316, -2695135, -1948687, -58289, 561437, -729716, -2172210, -1919617, -273966, 742702, -196661, -2244908, -3528478, -3329733, -2464739, -1647615, -571066, 828828, 1233452, -577470, -3422024, -4471400, -2803591, -895603, -1449441, -3450139, -2907687, 2178358, 8750313, 11620059, 9169447, 4964408, 3243752, 3981474, 3893017, 1721203, 53804, 1033131, 2713757, 1981543, -489313, -1257513, 473158, 1831947, 1114782, 274195, 1147694, 2207813, 1334610, -490955, -937869, -130835, 88795, -396401, -133001, 877737, 1056914, 30857, -939128, -1359872, -1979614, -2646975, -2055366, -226339, 808662, -364240, -2782654, -4554184, -4663721, -3072800, -652635]
58939f52635J319258j193526k351782m73774K147348K045906o76195k833001k621573
58930e289974j151272L4130O46984R92842J400600K097228K478402J455787l51965
58921B312762o18991Q31248P04595k511845m749940j932349K868003L141355j233312
58912a188474l797164j433140J613297J324280k88873j9711R19296K12250n39630
58903c197869J143020L213689J750494k321068l987853j463804J579001J805791
58895a478599M88094M09711J415131J340302j90021j219063m11585J130791J435220
58886B919981J64383j103817r28359K51299P97572M7166q67581o44529K78280
58877I14395J89598j442932k765776j639476J250465K699531J091084j144352
$$ y = [-652635, 666623, -526903, -2878685, -3352459, -1205111, 840795, 164600, -2668401, -5289974, -6441246, -6407116, -5760132, -4767290, -3366690, -1269462, 1208940, 2664727, 2312762, 1693771, 2525019, 3229614, 717769, -4032171, -5964520, -3096517, 44838, -1188474, -4985638, -6418778, -4805481, -3481201, -3770074, -3789785, -2870489, -2658239, -3197869, -2054849, 1158840, 2909334, 588266, -3399587, -4863391, -3284390, -1478599, -990505, -580794, 834337, 2174639, 1984618, 765555, 353970, 1484761, 2919981, 3084364, 1980547, 1052188, 1303487, 2101059, 2148225, 1280644, 636115, 914395, 1103993, -338939, -3104715, -4744191, -3493726, -794195, 296889, -847463]
58869h47463p71945J575271K410409P02675r00746o71521k19544q38125q57241
58860d18230R06593K177408Q76337r50628n37272O86642j70152j891003j244921
58851e65226Q20066N29591j890649k491612o78771j1233j240302q31028J953359
58842d405805K863162K15096j516124P06231L023205J359943j563857j276681
58834e94830O85500R3764k153551j927564N20148J240437k11325m46623J108930
58825a685114J182317j022100j891789N85128L342824K832349k66511k848654
58817B28450l275734j820505O06618K654586L006747J738722J38865j063460j992802
58808B21487k339826j507601l393R52052J060763P33489j24657j360178j514559
$$ y = [-847463, -1619408, -44137, 2366272, 3068947, 2168201, 1496680, 1277136, 439011, -418230, 488363, 2665771, 3542108, 2591480, 2054208, 2740850, 2570698, 679695, -565226, 254840, 784431, -1106218, -3597830, -4276601, -4287834, -5528136, -6359164, -4405805, -1542643, -1327547, -2843671, -2137440, 885765, 2245708, 681851, -594830, 90670, 184434, -1969117, -3896681, -3376533, -2136096, -2347421, -2794044, -1685114, -502797, -1524897, -3416686, -2831558, 511266, 3343615, 3077104, 228450, -3047284, -4867789, -4261171, -1606585, 1400162, 3138884, 3277749, 2214289, 221487, -2118339, -3625940, -3629333, -2677281, -1616518, -883029, -1007686, -2367864, -3882423]
58799c882423K52203K044038J567747k21291o55270K24342J15474j062339q47116
58790b464635J299291K789757J965345J64694j042753j607109j283140N12961
58782C34411K225098J072063k249789l401711p35000J831520P07218j945174j821668
58773c983032J088680L119624K289944q3748j968712k153593k88489K248874K693941
58764B963489L18360j895966j324263L16609k4778j506785j032215R38716P39086
58755e07747k141957l550587r72273K504750K790482L64999j398565j249962n04065
58746d664925R4478R87684J844469J560067J92462j063805j689924j774835n44795
58737e059124K599646N535499M768613K89122l551716l495406j236062O8438N02346
$$ y = [-3882423, -3630220, -1586182, -18435, -239726, -894996, -670654, -555180, -1617519, -2464635, -1165344, 1624413, 3589758, 3754452, 2711699, 1104590, -178550, 334411, 2559509, 3631572, 1381783, -2019928, -2754928, -923408, -216190, -2161364, -3983032, -2894352, 225272, 2515216, 2431468, 462756, -1690837, -1979326, 269548, 2963489, 3281849, 1385883, 61620, 378229, 353451, -1153334, -2185549, -1246833, -507747, -2649704, -6200291, -7172564, -4667814, -1877332, -1512333, -2910898, -4160860, -4664925, -4570447, -3582763, -1738294, -178227, 14235, -1049570, -2739494, -4514329, -5059124, -2459478, 3076021, 7844634, 8133756, 4582040, 1086634, -149428, -80990, 421356]
58728D21356J661631K455402P07778k128695k341594p441Q99215p80428j382991
58719d95767R93790K714841O16403k447535k311125l04934k99815j499156m8197
58710c081495L373993L794754J47041k589612j045612J774905J758631m61195
58702C671410j744320j290871l50992M57521Q93564J31967j624343k344690j014059
58693c214813N21437M62868j34935M57888J579857J579769N99501k86688j052227
58684E12657j632530p89550J362405J782763j242407m111572k286395K442187
58676c962442L797785J62648l060957j616746J714141K149753R8085n82886P58581
58667e42038J080472p19869j843892k47856J985681J834931k76103j548448r62087
$$ y = [421356, 2082987, 4538389, 5246167, 3117472, 775878, 768437, 1667652, 887224, -495767, 498023, 3212864, 3829267, 1381732, -929393, -1234327, -1534142, -3033298, -3081495, 292498, 4087252, 4234293, 1644681, 599069, 2373974, 4132605, 3671410, 1927090, 636219, 285227, 742748, 1636312, 1768279, 143936, -2200754, -3214813, -2693376, -2230508, -2365443, -1907555, -327698, 1252071, 1851572, 1564884, 512657, -1119873, -1909423, -547018, 1235745, -6662, -4118234, -6404629, -3962442, -164657, -2009, -3062966, -4679712, -2965571, -815818, -717733, -1300619, -542038, 538434, -181435, -2025327, -2273183, -287502, 1547429, 1271326, -277122, -1239209]
58658a239209P2750O31452J270430J924214J336317m97646j592921j060487p70621
58649G4279k035247k746781n86491K534337K724002L1808j647038n87599P54679
58640a484051N18655K63428J318371J913851M47133j292282r94099L31455K68258
58631A290719j047304j749813j557681j406394r61314O36706K401655K607878
58623B14452J603856R92335P25605l52179j716076j736119p06535n25695j450644
58614b951000j813277r61406R0111R21378J947622K380764R19179j143830o55234
58605a265693K540110M429872K101907k251661m412492l267871r48421O27436
58597b446813J222564J066321J16943j331778k323446j859893J58950K448966
$$ y = [-1239209, -1166459, -535007, 735423, 2659637, 3995954, 3498308, 1905387, 844900, 74279, -1960968, -4707749, -5294240, -2759903, -35901, -4093, -1651131, -2238730, -1484051, -965396, -701968, 616403, 2530254, 2977387, 1685105, 691006, 1022461, 1290719, 243415, -1506398, -3064079, -4470473, -5431787, -4795081, -2393426, 214452, 1818308, 2810643, 3536248, 3184069, 1467993, -268126, -974661, -1500356, -2951000, -4764277, -5725683, -5635572, -4714194, -2766572, -385808, 533371, -610459, -1265693, 1274417, 5704289, 7806196, 5554535, 1142043, -2125828, -3074249, -2446813, -1224249, -157928, -40985, -1372763, -3696209, -5556102, -5397152, -2948186]
58589b948186L195600K027856O03300L36426L88672o71800k160923k278955j127262
58580b635272k92056J36889J322952K594867J824216o35789j688741k01242J189773
58571A615597L55101j292694j725961j319866r89016j44637J277737J489702j5789
58562g49826p07097R08230K215153P02278j440993p97743J478045J725795m4243
58553C289599p60282K21j48179j295752j039759M32522J66136j877193k081740
58544c314427M54959J925551L16777j117415J46491J235824q07780l229231j959030
58535f348281J336448J981437j3091n62704J239517K108431Q02472j8969Q67143
58526A392403J010252q26227j892090m1080K420384K277028J04546j360532j402717
$$ y = [-2948186, 247414, 2275270, 2878570, 3214996, 3603668, 2931868, 770945, -1508010, -2635272, -2927328, -2790439, -1467487, 1127380, 2951596, 2315807, 627066, 425824, 1615597, 1970698, 678004, -1047957, -2367823, -3356839, -3501476, -2223739, -734037, -749826, -1456923, -548693, 1666460, 2368738, 927745, 130002, 1608047, 3333842, 3289599, 2529317, 2529538, 2381359, 1085607, 45848, 478370, 644506, -1232687, -3314427, -2859468, -933917, -617140, -1734555, -1588064, -352240, -1160020, -4389251, -6348281, -5011833, -3030396, -3043487, -3606191, -2366674, -258243, 544229, 525260, 1392403, 2402655, 1576428, -315662, -356742, 2063642, 4340670, 4445216, 3084684, 1681967]
58517A681967j107353o45802M39495J354800R59506k08065q30632q38486o87105
58508A18325J38787J728433K219890L77932j477352l82828K164936J862977j546442
58499E204658l266036n83153K921085K736672j76921j576320l73440P35857J53240
58490E775642o12754m9972J011036J031936m1718j089239j241148m72846N08871
58481D819808Q26561M30189K23698N63926M44317o95750j360189m2263J851442
58472G061739J552235p19961j670437J92793K279388J845212j72411j135671o07198
58463H625689J3114L72118J138225J834653J268171j7555q8566J319391K236544
58454A6701784J490535L26185K16480R06072J709154L030975N077419O390578
$$ y = [1681967, 574614, -71188, 368307, 1723107, 2682613, 2474548, 1643916, 805430, 118325, 257112, 1985545, 4205435, 4583367, 3106015, 2723187, 4888123, 6751100, 5204658, 1938622, 1355469, 4276554, 7013226, 6836305, 5259985, 4886545, 5622402, 5775642, 5162888, 5112916, 6123952, 7155888, 7114170, 6024931, 4783783, 4310937, 4819808, 5646369, 6076558, 6300256, 6864182, 7308499, 6612749, 5252560, 5210297, 7061739, 8613974, 7894013, 6223576, 6416369, 8695757, 10540969, 10368558, 9232887, 8625689, 8638803, 9010921, 10149146, 11983799, 13251970, 13234415, 13145849, 14465240, 16701784, 18192319, 18518504, 18734984, 19641056, 21350210, 24381185, 29458604, 35849182]
58446C5849182N546823L628826L194684N001500P353510Q699712R295600R942571
58438H8512408J0589704J1073839J2227785J5068994J9115984K2335375K2913844
58431B01837933K0790026J7387440J3983097J0510987O244628J605746j582342
58424B70777515k478619l256959p271405j4902036k2416031k5599244k3762010
58417A71091211j9694003j6522097j5266948j4792560j3403717j0771687q465406
58410G2174793p983794q414737p397817m592288k350490k214846k826403k630668
58402C3763750k426972l176399l447497j894346m34163j392970k885001j382075
58394A6724327J764635J470149k814479n328164k552996J416595J318336j640215
$$ y = [35849182, 41396005, 45024831, 48219515, 53221015, 60574525, 69274237, 78569837, 88512408, 99102112, 110175951, 122403736, 137472730, 156588714, 178924089, 201837933, 222627959, 240015399, 253998496, 264509483, 270754111, 272359857, 270777515, 268298896, 265041937, 257770532, 242868496, 220452465, 194853221, 171091211, 151397208, 134875111, 119608163, 104815603, 91411886, 80640199, 72174793, 64190999, 55776262, 48378445, 43786157, 41435667, 39220821, 36394418, 33763750, 31336778, 28160379, 24712882, 22818536, 22384373, 20991403, 18106402, 16724327, 18488962, 19959111, 17144632, 11816468, 9263472, 10680067, 11998403, 10358188]
58386A0358188k687894q53392J056400J595827J321503n1461k631679l698458
58378D409034p43303L449623L497217q09634m082376l187468q63515l21177p74810
58369E73591m36845r2173j005112k055722j492105M08006K220809L082317K355298
58360C558064j52841k642453k635045p82132k27389j203133l52782K821327L709233
58351B092849M4842l193039j127792K809467K085174k357105l723530l97394K019128
58342a747400L66121j398399L50185K741769J545580j813824k738556m23920J729613
58333a388831J479801J38508j46416R13620K002948J832229M09425q36134o06795
58324C798355M79122N97485p00019j905420j768347o84222L74281Q49354L69809
$$ y = [10358188, 7670294, 6816902, 7873302, 9469129, 10790632, 10739171, 8107492, 4409034, 3665731, 7115354, 10612571, 9802937, 5720561, 2533093, 1669578, 1348401, 573591, 136746, 44573, -960539, -3016261, -4508366, -4100360, -1879551, 1202766, 3558064, 3405223, 762770, -1872275, -2654407, -2881796, -4084929, -4437711, -1616384, 2092849, 2137691, -1055348, -2183140, 626327, 2711501, 354396, -3369134, -3766528, -1747400, -1381279, -2779678, -2429493, 312276, 1857856, 44032, -2694524, -3118444, -1388831, 90970, 229478, 83062, 996682, 2999630, 4831859, 5241284, 4405150, 3798355, 4277477, 4874962, 4174943, 2269523, 501176, -183046, 191235, 1040589, 1410398]
58315A410398q59063j407547k27306J189832N62035j371732j729351l84104l64114
58306c180952k390804l049244m36707K286244J960246N13121J200392K693579
58298d04125J468877j811343l135821j531342j3254k45053n49211K34019Q15983
58289e171270M12455K88995J113174J550106P28222k50654l12860J61179O35248
58280h45405J026968N65828j496246l490601k452197J386670M013518K883650
58272A592185J27800j002897l22579M64075O89503L54078j053394l075062l396435
58263e622726p82109K488188L257892J349164j037168k309847k024595j60633
58255d841834J957600J745144j169913l256012j624798J452991J872654j3948
$$ y = [1410398, 551335, -856212, -1083518, 106314, 668349, -703383, -2432734, -2816838, -3180952, -5571756, -8621000, -9057707, -6771463, -4811217, -4298096, -3097704, -404125, 1064752, -746591, -3882412, -5413754, -5427008, -5672061, -6221272, -5987253, -5171270, -4758815, -4469820, -3356646, -1806540, -1078318, -1328972, -1641832, -1480653, -845405, 181563, 747391, -748855, -4239456, -6691653, -5304983, -1291465, 1592185, 1719985, 717088, 394509, 858584, 1548087, 1902165, 848771, -2226291, -5622726, -6404835, -3916647, -658755, 690409, -346759, -2656606, -4681201, -4841834, -2884234, -1139090, -2309003, -5565015, -7189813, -5736822, -3864168, -3878116]
58247c878116m46576J314136K142987P34684m24131J85461O23439m40735r70861
58238a159712O31946K101099P04760k119437k682077l81940J702989J128773j174653
58229a248252k444299j063345J832554L173691J200065j832423j868969J408413
58221h42565L619538J669795j881367k776566j030928K57038K79091P72694J749425
58212A816155J247785m00004k61972J994934K506585r53596m778310m216002o4951
58203c109376K693408J765354l61316r31209k38872K98494O07631R86177O38185
58194B348476r47935k369866j978094m66622J82278j8575Q11412K652151K607801
58185B821026o94733l990270l356247K9798J449231l68010j580550M84363L127314
$$ y = [-3878116, -4324692, -3010556, -867569, -132885, -557016, -371555, 251884, -188851, -1159712, -527766, 1573333, 2278093, 158656, -2523421, -2905361, -1202372, -73599, -1248252, -3692551, -4755896, -2923342, 250349, 1450414, -382009, -2250978, -842565, 2776973, 4446768, 2565401, -211165, -1242093, -985055, -705964, 66730, 1816155, 3063940, 2663936, 2401964, 4396898, 6903483, 5949887, 1171577, -3044425, -3109376, -415968, 1349386, 988070, 56861, -182011, 116483, 724114, 1710291, 2348476, 1400541, -969325, -2947419, -3414041, -3231763, -3250338, -2438926, 213225, 2821026, 2126293, -1863977, -5220224, -5190426, -3741195, -4109205, -5689755, -5205392, -2078078]
58176b078078K688809J41615r86153k09917J23240n02522k90326Q90699R39132
58167G16499m68850r24911M82883J358526J32852j061833N6653K041924K074796
58158D408539L02374r45047r07550o51744n61256k16715j14737r75070j787370
58149a448576r86230P61515J363563O25139K25265N21106J94726p01356m17763
58140A37389R81948R50277j159350k074679N30470L579953K384247k315888m770207
58131a755840j925558K525102L228505n629k675392j812777P20826J480801k9142
58122b49104j456839j161477J41183J104164J288856N85123j071217k511275j751714
58113e082300R36307K267727L91783j722306m16995K527707K062016k039275l996715
$$ y = [-2078078, 610731, 752346, -233807, -443724, -320484, -823006, -1113332, -222633, 716499, 247649, -677262, -194379, 1164147, 1296999, 235166, 291819, 2333743, 4408539, 4710913, 3765866, 2858316, 2206572, 1645316, 1428601, 1313864, 338794, -1448576, -2434806, -1673291, -309728, 315411, 540676, 1061782, 1256508, 555152, 137389, 1119337, 2069614, 910264, -1164415, -633945, 2946008, 5330255, 3014367, -1755840, -3681398, -1156296, 2072209, 2066580, -608812, -2421589, -1700763, -219962, -249104, -1705943, -2867420, -2726237, -1622073, -333217, 251906, -819311, -3330586, -5082300, -4145993, -1878266, -1486483, -3208789, -3625784, -1098077, 963939, -1075336, -5072051]
58104e072051m14613M475659M727059N26492l157759l375387j206858J300645
58096b196813K741926J984934n66131k078870o09251J516246P26986k199762l118789
58087c799524p18136K046417K875813K580541J884061k23508l367034m651165
58079c372535k827294n60818j65747J09279K653290N695623N436128J762759j509829
58070G220856j830057n55380k07376j303489k490860k370867o78915J491423K435991
58061A711326J366710q10647k425908k362098n51603J823072K628214P71865j867814
58052B83117k286252m62963O29869k44753p24793Q67678K447263J680065k17243
58043A971988j035375j324159k231886k080234P62408L555437K499213q54962
$$ y = [-5072051, -5486664, -1011005, 3716054, 4242546, 1084787, -2290600, -3497458, -2196813, 545113, 2530047, 1963916, -114954, -724205, 792041, 1519027, -680735, -3799524, -4517660, -2471243, 404570, 2985111, 4869172, 4645664, 1278630, -3372535, -6199829, -6760647, -6926394, -6817115, -4163825, 1531798, 6967926, 8730685, 7220856, 5390799, 4835419, 4628043, 3324554, 833694, -1537173, -2216088, -724665, 1711326, 3078036, 2267389, -158519, -2520617, -3072220, -1249148, 1379066, 2150931, 283117, -2003135, -2466098, -1836229, -2080982, -2805775, -1938097, 509166, 2189231, 1971988, 936613, -387546, -2619432, -4699666, -3937258, -381821, 2117392, 1262430]
58035A262430j593058P51266J806829k9172j331519k36571L92775j250120k181164
58026b408304M7497K709377K369665L22228m12413l25362j321940k021402O3173
58017i77481L290284L559487M75077k363844k835877k160788j498067n32643L12350
58008b731502j62936j214822o39616J383125K041168L29472j240895n60121J089276
57999a706851J385527J84293j028665j274091n58994M54648O46734l27058q94491
57990c118948M90385K351614J725037j036152k129795Q035K183276J431575o16728
57981A288299r60157j04708m08230j486087j013124Q21091J345061j86079j516720
57972b220654j156213k64002J2735L42764J112707R81331o86930j868804n71727
$$ y = [1262430, -330628, 420638, 2227467, 2198295, 866776, 630205, 1022980, -227140, -2408304, -2360807, 348570, 2718235, 3040463, 2628050, 2302688, 980748, -1040654, -977481, 2312803, 5872290, 6347367, 3983523, 1147646, -1013142, -2511209, -3043852, -2731502, -2894438, -4109260, -4748876, -3365751, -1324583, -995111, -2236006, -2796127, -1706851, -321324, -137031, -1165696, -2439787, -2998781, -2544133, -1897399, -2224457, -3118948, -2628563, -276949, 1448088, 411936, -1717859, -1709824, 473452, 1905027, 1288299, 328142, 223434, -184796, -1670883, -2684007, -1862916, -517855, -703934, -2220654, -3376867, -3640869, -3628134, -3285370, -2172663, -1191332, -1878262, -3747066, -4318793]
57963d318793J742661J870710m08829j806471k19839K250654K398674M87856l75279
57954A621344J071650K525177J687032m63530j436245q91032n84110j297385j897047
57945C35854j496376o93429k22097N4553K62290O0787l28622j67J090806J769266
57935H32865J412046O61820j58142j552545k976988k572224j58890J593788Q49903
57926b068367n35160j26486J059010N84231r15127q38540O83421J108785K49800
57917g98433N34538K014317J553423j461489k972522m95716K349351J279937j726010
57908B77396j613079J436082K182025j184916l882643j678121K803712L872242
57900B212698M82757l054000l112840n87030J489974J841011J387079J094223
$$ y = [-4318793, -2576132, -705422, -1114251, -2920722, -3140561, -889907, 1508767, 1996623, 1621344, 2692994, 5218171, 6905203, 6441673, 5005428, 4114396, 3530286, 2232901, 335854, -1160522, -1853951, -2076048, -2021495, -1759205, -1698418, -2027040, -2027207, -936401, 832865, 2244911, 2906731, 2748589, 1196044, -1780944, -4353168, -4512058, -2918270, -2068367, -2603527, -2730013, -1671003, -1086772, -2001899, -2840439, -2157018, -1048233, -798433, -263895, 1750422, 3303845, 1842356, -1130166, -1625882, 723469, 2003406, 277396, -1335683, 100399, 2282424, 1097508, -2785135, -4463256, -1659544, 2212698, 2695455, -358545, -3471385, -4058415, -2568441, -727430, 659649, 1753872]
57892A753872Q18991J45104p13841j323117j731850k058441j723875j35981J814387
57883c154751K203125O15820r34594o06787Q02003J254390L75562o64251j361601
57874a471084j938901j708369J40817K089268J395191j575598k880744l31400
57866f280820L212041L882213J925741K77480q2982k52353k01313R93390K211962
57857E685359J214557j317928k209288q56354j68823j255157j180798J639554
57849A551122L640054J334209k577998k872367J47909J277487j291950l400707
57841b192241j752071J233371J703826L1392p37219K43107J264588J254308P10761
57832A759822J77408j81201l8466M97909M87973l06810n94956K75843P52269l89745
$$ y = [1753872, 2572863, 2717967, 2004126, 681009, -1050841, -3109282, -4833157, -4969138, -3154751, -951626, -335806, -1270400, -1877187, -1075184, 179206, 554768, -109483, -1471084, -3409985, -5118354, -4977537, -2888269, -1493078, -3068676, -5949420, -6280820, -3068779, 813434, 2739175, 3016655, 2933673, 2681320, 2480007, 3473397, 5685359, 6899916, 5581988, 3372700, 2516346, 2347523, 1092366, -88432, 1551122, 5191176, 6525385, 3947387, 1075020, 1222929, 2500416, 1208466, -2192241, -3944312, -2710941, -1007115, -975723, -1712942, -1469835, -205247, 1049061, 1759822, 1937230, 1756029, 1717563, 2215472, 2703445, 2396635, 1801679, 2077522, 2829791, 2440046]
57822B440046j427035j42346K261667K654053O96798j049663j398838j559507
57814B475175j824524q62332J004951J451144K30395o4128J089415M72843l076742
57805H96197n156357j891894L584563N271135K671284J40648n64419j570650l180034
57796B00473k711056k2115J223392k44801q00525J672366L508281J170861k422633
57787A574243k199526J079891K304889J63389j452157k28118J287121M97697j168684
57778A858745j153586J67505P56734L84703M13993J041836Q76622p92427k680362
57769H73763k843205r07695J240153J263809q32631k324093j048838J598871K471409
57760e08457J040752j31966M81567J172635O2517j685104j609008L28477J782536
$$ y = [2440046, 1013011, 870665, 3132332, 5786385, 6483183, 5433520, 4034682, 2475175, 650651, -211681, 793270, 2244414, 2474809, 2410681, 3500096, 3972939, 896197, -4260160, -6152054, -2567491, 2703644, 5374928, 5515576, 4951157, 3380507, 200473, -2510583, -2532698, -1309306, -1554107, -2354632, -682266, 2826015, 3996876, 1574243, -625283, 454608, 2759497, 2922886, 1470729, 1242611, 2529732, 3027429, 1858745, 705159, 872664, 1629398, 2014101, 2428094, 3469930, 4346552, 3554125, 873763, -1969442, -2877137, -1636984, -373175, -1205806, -3529899, -4578737, -2979866, -508457, 532295, 400329, 881896, 2054531, 2117048, 431944, -1177064, -848587, 933949]
57751I33949J294199k15836j139886r80138l14060K4791m11031j141752r13065
57742b862829Q72258K935415L143403R34208j840604k731910j095443J371025
57734G25523K338641J145794o31690j166747p10072j092217k808471l844606k249602
57725h293447J052737L207294K721413P17362q30261j033669l35786K37933l0345
57716b586769p88435q33561L73088J763484J924955Q54173l87148j193286j473848
57707b347347q16185Q52127K142518J600562J36282l1737R53432N07430j941859
57698A055223l214944j026566K050514K082174m31745j589236r1097J382794Q90163
57689A107280k39835m96806n21667q49389l56577J031553R52758j449037k829613
$$ y = [933949, 2228148, 2012312, 872426, -107712, -421772, -396981, -808012, -1949764, -2862829, -1990571, 944844, 4088247, 5022455, 3181851, 449941, -645502, 725523, 3064164, 4209958, 3578268, 2411521, 1701449, 609232, -2199239, -6043845, -8293447, -7240710, -4033416, -1312003, -594641, -1424902, -2458571, -2794357, -2556424, -2586769, -3375204, -4208765, -3835677, -2072193, -147238, 706935, 319787, -873499, -2347347, -3163532, -2311405, -168887, 1431675, 1567957, 1536220, 2489652, 2997082, 1055223, -2159721, -3186287, -1135773, 946401, 514656, -1074580, -1165677, 217117, 1107280, 867445, 370639, -151028, -1000417, -1356994, -325441, 627317, -821720, -3651333]
57680c651333l12222L255233K901980q40946k644156n32747J653412R38429o15898
57671A51752o07958n44450k018739k563269K76490L561069K685135j120208k261354
57662b441532O80628L088633J690562j046039j638577n41596J04858L44054J078921
57653A319912J293574l08680k364748k389987m46714J135944J203861P63913O93603
57644I00678M27897o65968j876045j746249J95944K464691K684321K95357k156544
57635E24082j767577Q06069K021974L23800j881898j984443n84777L11890L84425
57626a846455L77969K06072k35988Q2683J488881K075805M05233j585086j068670
57617i9556J267082K180051O53868j181661j712502j573248j499611j055448o5641
$$ y = [-3651333, -3963555, -708322, 2193658, 1352712, -1291444, -1824191, -170779, 767650, 151752, -456206, -1000656, -3019395, -5582664, -5306174, -1745105, 940030, -180178, -2441532, -1760904, 1327729, 3018291, 1972252, 333675, -207921, -103063, 240991, 1319912, 2613486, 2304806, -59942, -2449929, -2896643, -1760699, -556838, 207075, 900678, 1328575, 662607, -1213438, -2959687, -2763743, -299052, 2385269, 2680626, 524082, -1243495, -437426, 1584548, 1908348, 26450, -1957993, -2542770, -2230880, -1846455, -1468486, -1262414, -1498402, -1415719, 73162, 2148967, 2554200, 969114, -99556, 1167526, 3347577, 4001445, 2819784, 1107282, -465966, -1965577, -3021025, -3086666]
57608c086666P64571J103988J134663M61877j163226k244550j038553J351466
57600b716430J965725L23206r69344m83559O5713q05553j804940j297599M3216
57591e679565Q02010J131609J741949K185853J796906R41346k8605j509453l027951
57582a645901k802025o27256P77224m69280k094559q66940K263768L447351J742580
57573b75038K25767R89100K259722J708634k957q13402n97830q26624j780533
57564H86839k070040q44739R48588J766704J036213o52889k166066k429458j134692
57555d659540P51281J677860J125423J23340k02995j3960n4065k15300J00634
57546a367322N64244K77926m67971m12275L68316J97858j289153j888211m3653
$$ y = [-3086666, -2322095, -1218107, -83444, 378433, -784793, -3029343, -4067896, -2716430, -750705, -427499, -1396843, -1880402, -1814689, -2620242, -4425182, -5722781, -5679565, -4877555, -3745946, -2003997, 181856, 1978762, 2920108, 2891503, 1382050, -1645901, -4447926, -5075182, -4297958, -4767238, -6861797, -7728737, -5464969, -2017618, -275038, -49271, 939829, 3199551, 4908185, 4905228, 4091826, 3493996, 2667372, 886839, -1183201, -2027940, -1079352, 687352, 1723565, 1070676, -1095390, -3524848, -4659540, -3908259, -2230399, -1104976, -981636, -1184631, -1198591, -1252656, -1467956, -1367322, -803078, -525152, -993123, -1405398, -1037082, -839224, -2128377, -4016588, -4060241]
57537d060241K276944K058316m07216j942130q45709J344935K413022J801209
57529B639130J97380j456603k142849j325822K97198J482567J723258J068007
57521B482266m77741k103819j961612L12970K082765J164942m70389L46536K417751
57512C793669J736723j659932l233362j236805M94495q87371k619994j444351
57504e056928Q27243R68985K43659J786718M284442L567952k68630k501599j004230
57495B847612P78916l79835k556981k037265R04770K508264Q53992j866192k641482
57486a588201j360041j30873J61926Q09584K385549K827688L36923k915299k838837
57477b311581O94312L037411J035239k591754l140767j95239K401838J709513
$$ y = [-4060241, -1783297, 275019, -132197, -2074327, -2920036, -1575101, 837921, 2639130, 2836510, 1379907, -762942, -2088764, -1791566, -308999, 1414259, 2482266, 2004525, -99294, -2060906, -1747936, 334829, 1499771, 1029382, 1375918, 3793669, 5530392, 3870460, 637098, -599707, -105212, -992583, -3612577, -5056928, -4229685, -3260700, -3017041, -1230323, 3054119, 6622071, 6353441, 3851842, 2847612, 3626528, 3246693, 689712, -1347553, -442783, 2065481, 2919473, 1053281, -1588201, -2948242, -3079115, -2917189, -2107605, 277944, 3105632, 3442555, 527256, -2311581, -1617269, 1420142, 2455381, -136373, -3277140, -3472379, -1070541, 638972]
57469F38972j352047l670343k989825K76674L282669L456390J474145K34951N62317
57460A913903K42004j696685k675322o78062J974833J919544j62336j036628j14658
57451c13407L45293m21447n85328Q55450K351353K103678K27006j717762k107990
57442G36846m46714J770852K191045O33458m65243R3469J70710j835727l469103
57433f20407j797831J386416J823323q59899k962881k328322l36461J461425K876362
57424a358275L107561J001260k053689k799643n11444K065877K719348J974109
57416D145104R11102l57735j446929j533348r49493o94610m34904N43044R87970
57407A170201n21755k075178o74840K259219K211038j123163k751018m8775L199671
$$ y = [638972, -713075, -4383418, -7373243, -7096569, -3813900, -357510, 1116635, 1351586, 1913903, 2155907, 459222, -2216100, -2894162, -919329, 1000215, 837879, -198749, -313407, 31886, -389561, -974889, -119439, 2231914, 4335592, 4562598, 2844836, 736846, 290132, 2060984, 4252029, 4885487, 4420244, 4513713, 4684423, 2848696, -620407, -2418238, -1031822, 791501, -68398, -3031279, -5359601, -5696062, -4234637, -1358275, 1749286, 2750546, 696857, -2102786, -2614230, -548353, 2170995, 4145104, 5056206, 4698471, 3251542, 1718194, 768701, 74091, -360813, 182231, 1170201, 648446, -1426732, -2101572, 157647, 2368685, 1245522, -1505496, -1554271, 1645400]
57398A645400K691312n59819k894235l029986j748291L86653K337905K244272
57390A073211J63539j200237m56833M09177k48820j007459m74456N6279m74088
57381b159687m66707J040799J738613j29131k143936j356187R77958J828609J179991
57372E10322O80818j90088k424330l793404j435993K833550M190909J481979j618756
57363B35007k047509m74677J000451J093714o86894l326844l791938l31168L954438
57354d375420M241146O94509j629588j41270J931929J095564j108535j097327
57346c88992Q48422J091995j561583l693583j985390J820051K867194j51004k847769
57337d000659j208928K432895K759333l92794j857329M57296K265548L59965j795847
$$ y = [1645400, 4336712, 3776893, 882658, -2147328, -3895619, -3508966, -1171061, 1073211, 1236750, 36513, -420320, -11143, -259963, -1267422, -1741878, -1685599, -2159687, -2626394, -1585595, 153018, 23887, -2120049, -3476236, -2498278, -669669, 510322, 1191140, 1001052, -1423278, -5216682, -6652675, -3819125, 371784, 1853763, 235007, -1812502, -2287179, -1286728, -193014, -879908, -4206752, -7998690, -8329858, -4375420, -134274, 560235, -1069353, -1210623, 721306, 1816870, 708335, -388992, 459430, 1551425, -10158, -3703741, -5689131, -3869080, -1001886, -1152890, -4000659, -5209587, -2776692, -17359, -410153, -2267482, -1810186, 455362, 815327, -980520]
57328i80520j51331K544607J140403k973082l811317m70914J808171N28587n74381
57319b939777J326995L257796J692244j685537k972808j771738n52244l16220
57311c961289K9503J049973J910240J679627K35597j525168j922033k09711J686275
57302a026986J063957j467860k174647N41073L544349L273025N18115j146069
57294C124957k09856J575993J994347O11898j347168k241155j474260k29976q5552
57285A719228q28319r18701j69879q9250j098821j523927k68119J458936K104419
57276C85567J587986K95505j505424k278236p6054L574209L775370j113917n838506
57267a193500m749078L80985L240888K008924N33370J036821J085424j012617
$$ y = [-980520, -1131851, 1412756, 2553159, -419923, -4231240, -4702154, -2893983, -2365396, -2939777, -1612782, 1645014, 3337258, 1651721, -1321087, -3092825, -3645069, -3961289, -3931786, -2881813, -971573, 708054, 943651, -581517, -2503550, -2713261, -1026986, 36971, -1430889, -3605536, -3064463, 479886, 3752911, 4271026, 3124957, 2915101, 4491094, 6485441, 7097339, 5750171, 3509016, 2034756, 1804780, 1719228, 890909, -27792, -197671, -286921, -1385742, -2909669, -3177788, -1718852, 385567, 1973553, 2269058, 763634, -1514602, -1590656, 1983553, 5758923, 4645006, -1193500, -5942578, -5561593, -2320705, -311781, 221589, 1258410, 2343834, 1331217]
57259A331217k713522j589750O27400J245682Q82775J446060K234510J444986
57251D909358j27355l64360L43059L4069q23432m7785J723852J276148j696782
57242E226772l369386j668139L89071k90649j871721r79553J466417J858943j11789
57233F49966j283984l77436N22027J51994k9924Q41946J144114k90325j977203
57224f48825k160808j257767m58147J76656Q18678Q78704K57456m7212K94633
57215b146632L09675j88145O5759J271453J712201P77498L38928J383282J852739
57206E376758M6224k226910k415446j017610k260M98975J158714J142545j42707
57197B418283q70528M29588J692881L05422k426267l375487k472998j596079l41739
$$ y = [1331217, -1382305, -2972055, -2344655, -1098973, -216198, 1229862, 3464372, 4909358, 4782003, 4417643, 4760702, 4794771, 3971339, 3923554, 5647406, 6923554, 5226772, 1857386, 189247, 578318, 287669, -1584052, -2563605, -1097188, 761755, 649966, -634018, -1011454, -489427, -337433, -367357, 474589, 1618703, 1328378, -648825, -2809633, -4067400, -4525547, -4348891, -3530213, -2651509, -2394053, -2441265, -2146632, -1836957, -2025102, -1959343, -687890, 1024311, 1801809, 2140737, 3524019, 5376758, 5422982, 3196072, 780626, -236984, -239244, 259731, 1418445, 2560990, 2418283, 1547755, 1977343, 3670224, 3975646, 1549379, -1826108, -4299106, -5895185, -6236924]
57188f236924K521294M780567L157559o89965j880693Q7415R06570j037690k479575
57179h71442j634269r09723j439915o61755K052205K876103J3433k431907j078233
57170d085503R81430j84647k153964l20516L740470M317976N24976k724721k396538
57161b301037o18540J93943O21858J360485J160329m55098j491074m82791J078393
57152i33532J173207L28359L65749J287930J372983j9398j426044j405992n44983
57143A98279m65990j309360j414501J30600J809634J598627l30524k226717l266521
57134e276473l590595k552508N05674L842256M559344K779272J702419K603744
57126D573133K830613L22256k828470l511699j876088j34489Q26866J272085R24644
$$ y = [-6236924, -3715630, 1064937, 4222496, 3532531, 1651838, 1739253, 2645823, 1608133, -871442, -2505711, -3415434, -4855349, -5517104, -3464899, -588796, -575363, -3007270, -4085503, -3104073, -3288720, -5442684, -5763200, -2022730, 2295246, 2820222, 95501, -2301037, -2919577, -2725634, -2103776, -743291, 417038, -38060, -1529134, -2011925, -933532, 239675, 568034, 933783, 2221713, 3594696, 3575298, 2149254, 743262, 198279, -267711, -1577071, -2991572, -2860972, -1051338, 547289, 216765, -2009952, -5276473, -8867068, -11419576, -10913902, -7071646, -2512302, 266970, 1969389, 4573133, 7403746, 7726002, 4897532, 1385833, -490255, -624744, 202122, 1474207, 2398851]
57117B398851j16440m20373N18734Q12696o83471j771490k94653J817095J329138
57108C590087r81684j654348k60739L49781o55621p93185R78511K111733P28007
57099C412542j144401p96278R33151J091872r09512k548398j765357L88689J284459
57090e3233J19696j173027o57664Q95735J247585J69494k53288R01193J837278
57081C033769J015134m59426r56503q37505r79969p03790N79844J358186J79839
57072B229579j614499j917380j226171j229446j431133l59085J037949P35253
57064c774933m46336k5115J516090J340785m81238o33065J703166K955761O91119
57055B846234k574636l220973j271666Q81033K025744K153659R96724j111366
$$ y = [2398851, 2282411, 1862038, 2380772, 3193468, 2509997, 738507, 443854, 2260949, 3590087, 2608403, 954055, 693316, 1043097, 387476, -405709, 572802, 2684535, 3412542, 2268141, 1471863, 2405014, 3496886, 2587374, 38976, -1726381, -1337692, -53233, 66463, -1106564, -1764228, -868493, 379092, 548586, 295298, 1196491, 3033769, 4048903, 3589477, 2632974, 1795469, 815500, 111710, 691554, 2049740, 2229579, 615080, -1302300, -2528471, -3757917, -5189050, -5548135, -4510186, -3774933, -4221269, -4246384, -2730294, -1389509, -1870747, -2503812, -800646, 2155115, 2846234, 271598, -2949375, -4221041, -3340008, -1314264, 839395, 1836119, 724753]
57047G24753k388765j702270l58524m4917j70352Q62320K642089L009198J078501
57038C652033j575181k864755k265203p40997O53789J588799J960935J227462
57030A636882q45623k819835k487526N7399J829624Q47669r45299o53081J149734
57021b230056J644863L91388m43983j17121k90258j682793k724748k187663o07746
57012h248117J347162L337921L894925J497433k218104l372567r82012J702278
57004c041081K062846J293426J272507J292883k5188j929476k717923j987718
56996c779724k63453J756902K536692O78415k219227k427137O06831K748866J077223
56987G15388j660626j327770J325967K096240l84128l072647k815635J88731L124467
$$ y = [724753, -1664012, -3366282, -3724806, -3769723, -3940075, -3077755, -435666, 2573532, 3652033, 2076852, -787903, -3053106, -3794103, -3140314, -1551515, 409420, 1636882, 791259, -2028576, -4516102, -4458703, -2629079, -1781410, -2726709, -3379790, -2230056, -585193, -193805, -637788, -754909, -1045167, -2727960, -5452708, -7640371, -8248117, -6900955, -3563034, 331891, 1829324, -388780, -3761347, -4743359, -3041081, -978235, 315191, 1587698, 2880581, 2855393, 925917, -1792006, -3779724, -4043177, -2286275, 250417, 928832, -1290395, -3717532, -3110701, -361835, 715388, -945238, -2273008, -947041, 1149199, 765071, -2307576, -5123211, -4934480, -1810013]
56978a810013L350979Q65566j398085q27766J176791R71010j598570k578296k33817
56969b082201J929155Q75513j068320m83108J342340J123459n10585n19950Q79636
56960A485939Q54261p17630j211359j96386q098j234021j680285m01806P85129
56951b324256N39591k71376o57561o37921J0664J499677K435916J259632o75369
56942A178997m45732J798322K663615N82127j957586k207611o00401O75510M67667
56933B154908q14821j825448j151206Q87134J763173P6089j642066l67092K148838
56924A229509J497177k263731m156933j738165J545804K093310R44324M68180
56916c80525J96170q85422j105347J109563L427963K418637j044787k755259j143462
$$ y = [-1810013, 1540966, 2406532, 1008447, 180681, 1357472, 2328482, 729912, -1848384, -2082201, -153046, 722467, -345853, -828961, 513379, 1636838, 1126253, 606303, 1485939, 2340200, 1622570, 411211, 214825, 206727, -1027294, -2707579, -3109385, -2324256, -1784665, -2056041, -2713602, -3351523, -3340859, -1841182, 594734, 1854366, 1178997, 733265, 2531587, 5195202, 5777329, 3819743, 1612132, 1011731, 1687241, 2154908, 1340087, -485361, -1636567, -749433, 1013740, 1089829, -552237, -919329, 1229509, 2726686, 462955, -3693978, -5432143, -3886339, -1793029, -848705, -380525, -184355, -1069777, -2175124, -1065561, 2362402, 4781039, 3736252, 980993, -162469]
56907a62469R11745N91860j150687j474452L34650K111599J734250k44319j490443
56898A161734j037326l17577o17807j029415k87217P49591N29113k88055J58643
56889i78316J587232J893380N89864p06320j146180j360696j344136l90741Q06570
56880a049343Q04392J51152N30947J341385N45317j151104r34167J019071J411399
56871B669049m48591j359730O3735J081927K7443q39952N7067O74064l69002r42197
56861F13813L02876J089746m0611q15009Q6283J18148j735254j704753K082225
56852b536M654551J511948l519540m010935p83039O78510m32144o33868L77435
56843b159618J384r40172O48742L432056L018596l29458k049035j104827p73008
$$ y = [-162469, 749276, 1341136, 190449, -1284003, -949353, 1162246, 2896496, 2652177, 1161734, 124408, -193169, -810976, -1840391, -2127608, -1378017, -848904, -1136959, -978316, 608916, 2502296, 3092160, 2385840, 1239660, -121036, -1465172, -1855913, -1049343, -244951, -93799, 437148, 1778533, 2323850, 1172746, 238579, 1257650, 2669049, 2220458, 860728, 924463, 2006390, 2033833, 1193881, 1250948, 1925012, 1556010, 613813, 916689, 2006435, 1965824, 1150815, 1237098, 1355246, -380008, -2084761, -2536, 4652015, 6163963, 2644423, -1366512, -2149551, -1471041, -1903185, -2537053, -2159618, -2158234, -3098406, -2449664, 982392, 4000988, 3671530, 1622495, 517668, -255340]
56834b55340j660701q79880J347446J218234j483072k408846j53382J661469J140852
56825a473220N66714P45606m33635k195817o28030L636383M601046M64941l091700
56816B192288k265954n20524r53508p77559J906052L090239K37453k025772K02480
56807A085195K748574O79123k815741k283625M09247L37058j152723J18503K158988
56798A284599L51739k777589r07237M446730N281638m942m270992l133903k50307
56789A9736O27634Q58568J655362Q12779k205608l934999k592774q10031l25034
56780e894367O55074K472630K099249r13580k092255Q82476L786612K333653j439591
56771A889901l162250k425786j142533N57952K610580K650352k40345k378683
$$ y = [-255340, -1916041, -2795921, -1448475, -230241, -1713313, -4122159, -4275541, -2614072, -1473220, -906506, -160900, -594535, -2790352, -3418382, 218001, 4819047, 5283988, 2192288, -73666, -594190, -1547698, -2325257, -419205, 2671034, 2908487, 882715, 1085195, 3833769, 4512892, 1697151, -586474, -177227, 159831, -992892, -874389, 1284599, 1636338, -1141251, -2048488, 2398242, 7679880, 7674938, 3403946, 270043, 19736, 647370, 1505938, 3161300, 3974079, 1768471, -2166528, -4759302, -5569333, -5894367, -5239293, -2766663, -667414, -1580994, -3673249, -2790773, 995839, 3329492, 1889901, -1272349, -3698135, -4840668, -4282716, -1672136, 978216, 737871, -1640812]
56763a640812m90047K744169K652986k16860j636632o66817o5258o69415l78413
56754c67099J186993J479525o74710l083387l478379k066784q0653J738068K531170
56745b815256J516299l86133j023069J45970J295623R11503l43922j058140q98482
56736b655607k77104N72157J352367J461651P67809l0527m04083o82746j094000
56727i90083q36465P38674K282740J377188j931911l972216j665410K808224M173721
56718A984462J153132j712574p94842J403486P69956j561595j400761J088470
56710I29734J557778j034991k632844j037513O16123k65520j207341N39963K681506
56701A46895J588681j495381k343910o5895K477489L295739K574285M42749k745511
$$ y = [-1640812, -2130859, 613310, 3266296, 3049436, 1412804, 745987, 680729, 11314, -367099, 819894, 2299419, 1624709, -1458678, -4937057, -7003841, -7084494, -5346426, -2815256, -1298957, -1685090, -2708159, -2562189, -1266566, -355063, -698985, -1757125, -2655607, -2932711, -2360554, -1008187, 453464, 1221273, 1190746, 786663, 103917, -990083, -1826548, -1087874, 1194866, 2572054, 640143, -3332073, -4997483, -2189259, 1984462, 3137594, 1425020, 630178, 2033664, 2803620, 1242025, -158736, 929734, 2487512, 1452521, -1180323, -2217836, -1601713, -1867233, -3074574, -2534611, 146895, 1735576, 240195, -2103715, -2169610, 307879, 3603618, 6177903, 6620652, 3875141]
56692C875141m538229k620784J070344J991501p91667l188502j749640J959661
56684c992175L951624K847547Q56608O14418K071271K589907K57955l142161l830627
56675B224367j089816J432661P58097j378702j716951n55051n17382j674223j543746
56666d060746M32450J869691J245987j29954n59493o2299N24880P07972K46940
56657B15428n95148q11006l6344N04325N7310J05557J781515K941664J003570
56648E166871k342612l040864q29857O09309j90890n44079J186696K660290J621682
56639D296546o74475k078728k427405j885554L86959L624554M556155J865444
56631G663496j013971m69705K125756K873173J083960p53484j381159j639518
$$ y = [3875141, -663088, -3283872, -2213528, -222027, -1013694, -4202196, -5951836, -3992175, -40551, 2806996, 3663604, 4278022, 6349293, 8939200, 9197155, 6054994, 2224367, 1134551, 2567212, 3325309, 1946607, 229656, -325395, -842777, -2517000, -4060746, -3628296, -1758605, -512618, -642572, -1202065, -1264364, -739484, -31512, 215428, -379720, -1190726, -1227070, -722745, -665435, -559878, 1221637, 4163301, 5166871, 2824259, -216605, -1046462, -437153, -628043, -1172122, 14574, 2674864, 4296546, 3622071, 1543343, -884062, -2769616, -2382657, 1241897, 5798052, 7663496, 6649525, 6179820, 8305576, 11178749, 12262709, 11509225, 10128066, 8488548]
56623H488548j542307P1933K652586L552309J524258j235518j629994O48701K757606
56614A5288122J913577j221171k819169l31285L840784M869722J711676j601200
56606B1651056j613236L44930J227683Q42574P36500O38460p27358k448825k299078
56597A8352706l59706J087282J054389N66837P5715j057567k362051k314576j060659
56588A3982370m46569o98950K05734K763445M189913K213187j420322l212809
56580A7575999k219694j85024J405352K339379K491321J682264N86467J84785
56572B3860849L48127K14804k50989l87268k48497m13529n70867R632O23423k21830
56562B2963855j945446k023523j4230J005249j065387l657710l149868n02765
$$ y = [8488548, 6946241, 7018174, 9670760, 13223069, 14747327, 13511809, 11881815, 12530516, 15288122, 17201699, 15980528, 13161359, 12830074, 16670858, 21540580, 23252256, 21651056, 20037820, 20382750, 21610433, 22453007, 23189507, 23827967, 23100609, 20651784, 18352706, 17993000, 19080282, 20134671, 20701508, 20777223, 19719656, 17357605, 15043029, 13982370, 13535801, 12836851, 13042585, 15806030, 19995943, 22209130, 20788808, 17575999, 15356305, 15171281, 16576633, 18916012, 21407333, 23089597, 23676064, 23860849, 24208976, 24423780, 24172791, 23785523, 23537026, 23123497, 22552630, 22562262, 23185685, 22963855, 21018409, 18994886, 18980656, 19985905, 18920518, 15262808, 12112940, 11610175]
56554A1610175L02179j366942k147283o72164K28055j145759k084780k71350J791483
56545F243614Q09863j688294k029625o05619o27532j886934j023188J965762K776989
56536C935036l01161l235421k245536Q43574J952906N33182q45990o50695M56145
56527D42040J259649Q80476p78906k206848j463764Q20254J716138L40055o72122
56518C36972M46284J622750N77733j305233j472783k21555O68940J154645J697845
56509C505598R53606j763433l513988j239794K944529M048738J148492j966614
56501D117134k739551k316148j882994o82310J297512K178242J127039k74996
56493H23928o55388l88907J86383J438846K566968J822970l83531j287310J64306
$$ y = [11610175, 11912354, 10545412, 8398129, 7725965, 7954020, 6808261, 4723481, 4452131, 6243614, 7053477, 5365183, 3335558, 2729939, 2102407, 215473, -807715, 1158047, 3935036, 3633875, 398454, -1847082, -1003508, 949398, 1482580, 636590, -14105, 442040, 1701689, 2582165, 1803259, -403589, -1867353, -1047099, 669039, 1009094, 336972, 783256, 2406006, 2983739, 1678506, 205723, -15832, 653108, 1807753, 3505598, 4459204, 2695771, -818217, -2058011, 886518, 4935256, 6083748, 4117134, 1377583, -938565, -2821559, -3503869, -2206357, -28115, 1098924, 823928, 168540, -220367, -33984, 1404862, 3971830, 5794800, 5411269, 4123959, 4288265]
56484D288265J620701R88372p17431j625317j718183j642169r85510M30406J337733
56475A976867Q11739k64240q95143j413251j907320j256858N92152J458643J08667
56466g88744j295056l49642J636638J676487j04436q71472K06608R24318J02988
56457A137689l76514J071109K707199J796159j295171l370799k477733p246J537055
56448G21748J438452O26743k56380j242844j907228j440879n0818J133810J835208
56439H57812K685539L148655J652305j162973k023992J12345J527275q27417l887304
56430B082245k762406J312252K625827J6339j639614J97669J847504K36577j876259
56421B040134j096920P02362M7290j955876j768122N05512J669994O89431o02745
$$ y = [4288265, 5908966, 6897338, 6179907, 4554590, 2836407, 1194238, 208728, 639134, 1976867, 2788606, 2524366, 1629223, 215972, -1691348, -2948206, -2356054, -897411, -788744, -2083800, -2433442, -796804, 879683, 775247, -96225, 110383, 1034701, 1137689, 761175, 1832284, 4539483, 6335642, 5040471, 1669672, -808061, -815307, 721748, 2160200, 2786943, 2530563, 1287719, -619509, -2060388, -2111206, -977396, 857812, 3543351, 6692006, 8344311, 7181338, 5157346, 5269691, 6796966, 5969549, 2082245, -680161, 632091, 3257918, 3274257, 1634643, 1832312, 3679816, 3916393, 2040134, 943214, 1645576, 1692866, -263010, -2031132, -1525620, 144374, 833805, 231060]
56412B31060j110052j281256j018036J66359J503432J956161J899665J739031
56404D086364N75861j413933j651392P39940K125964m28806l683835k752990J019649
56395a383178K323910N67635j5414J530457J441406j277242k578308n90979J008039
56386A026326l67758j775229l90072J356109L25440j755588j583130J57537P96990
56377b209375N68674J245330K009551Q66640j267187j689759j49021J235288J352746
56368A962887O80339m01179j389231j100989L70904Q96923j81120j80430K349617
56359C007721L955540J224337k976854l182364K05041J591687r70591l117715
56351b63198j318688K109218K979432O09962k658128m561228l966739j065023
$$ y = [231060, -878992, -2160248, -3178284, -3011925, -1508493, 447668, 2347333, 4086364, 4662225, 3248292, 1596900, 2336840, 4462804, 4033998, 350163, -2402827, -1383178, 940732, 1508367, 1492953, 3023410, 4464816, 3187574, 609266, 18287, 1026326, 658568, -1116661, -1506733, -150624, 174816, -1580772, -3163902, -3006365, -2209375, -1640701, -395371, 1614180, 2480820, 1213633, -476126, -625147, 610141, 1962887, 2643226, 2242047, 852816, -248173, 122731, 1019654, 838534, 658104, 3007721, 6963261, 8187598, 5210744, 2028380, 2233421, 3825108, 2854517, -263198, -1581886, 527332, 3506764, 4116726, 1458598, -3102630, -7069369, -8134392]
56343h134392K222638L684272L170033J987297M91849j384563k098629l47076
56335d08571J539223k28l871781n056363j857175J851890K683967J715627R30428
56326b472983Q6082q29944k18715J670200J879901j98820j073010Q09354J816475
56317A468540n05174k488841m68648K383874J120227k406480k552778O76651K085934
56308f86695K52813q58737N01307J266045j13694p46251J074793K485001J027595
56299D202177j216051j350992q3231L67520p1346l27761m83589q31973p19479
56290e14725j20497k23134r78294n71826J144032J555556m85264k284150j463966
56281c942268L45694O34446R7876N22155J047928N7239j165341l66913J503436
$$ y = [-8134392, -5911754, -2227482, 942551, 2929848, 3421697, 2037134, -61495, -408571, 1130652, 1130424, -2741357, -7797720, -9654895, -7803005, -5119038, -3403411, -2472983, -2386901, -3216845, -3435560, -1765360, 114541, -84279, -1157289, -347935, 1468540, 963366, -1525475, -1994123, 389751, 1509978, -896502, -3449280, -2772629, -686695, -433882, -1292619, -791312, 474733, 361039, -385212, 689581, 3174582, 4202177, 2986126, 1635134, 1551903, 1919423, 1848077, 1520316, 1036727, 204754, -514725, -635222, -858356, -1836650, -2408476, -1264444, 291112, -194152, -2478302, -3942268, -3596574, -2962128, -2864252, -2342097, -1294169, -1236930, -2402271, -2769184, -1265748]
56272a265748J721725K85408o59797r41249j976295k787070o87612L601367N569029
56263B859758K981630r24535j983762k78302J032230K08572j557541k211066j167090
56254a040106J99174K55545m89765K20682K594261L265165q344l904886l508780
56245b417054L31355K184893M30493q46910N00310Q75272k246883m874404k459102
56236h522030K467099L891846J178289j047312n33671M34744K26985J33633Q01042
56227i69375Q09623j36439m41775o6347r15812k556559j617092K490235N118514
56218A714973K606656k131905l641871j296067R55138P68120k94077k29003P40433
56209h07603J286219O83134q38129k129607j845228k02564Q94775O76756R08279
$$ y = [-1265748, 455977, 741385, 81588, -859661, -2835956, -5623026, -6310638, -2709271, 2859758, 5841388, 4916853, 2933091, 2654789, 3687019, 3895591, 2338050, 126984, -1040106, -840932, -585387, -1075152, -854470, 1739791, 5004956, 4996612, 1091726, -2417054, -2085699, 99194, 529687, -317223, 183087, 1058359, -1188524, -6062928, -8522030, -6054931, -2163085, -984796, -2032108, -2565779, -2131035, -1904050, -1770417, -969375, -159752, -296191, -737966, -804313, -1720125, -4276684, -5893776, -3403541, 1714973, 4321629, 2189724, -1452147, -2748214, -1793076, -1024956, -1319033, -1548036, -807603, 478616, 1161750, 323621, -1805986, -3651214, -3853778, -2959003, -2282247, -1373968]
56200a373968K714447L855353J829967j805000l417809k533155j560779j077894
56192c368838N02940K598083K238370q18411k884081j804688J64406P42470J006490
56183a623259J997143J790656p32813k483760n16256K641651K275928j458484
56175A890806l982037k946398n06473P36539N26754k77463p11764L43654K530910
56166b395472L032491K22123k738038j698822J932107K952960M01199j304345
56158D04203P4919J330833l3726j614177j032513m03408k033846l482296j395372
56149h185383K447154L557391J512779p6074N84159J649052J272472l55734k370629
56140C5187l694755k602626J200716M488551L600201m89359l122043j981532O70252
$$ y = [-1373968, 1340479, 5195832, 7025799, 5220799, 1802990, -730165, -2290944, -3368838, -2865898, -267815, 1970555, 1152144, -1731937, -3536625, -3372219, -2629749, -1623259, 373884, 2164540, 1431727, -1052033, -1568289, 1073362, 3349290, 1890806, -2091231, -5037629, -5544102, -4807563, -4280809, -4558272, -5270036, -4926382, -2395472, 637019, 859142, -1878896, -3577718, -1645611, 1307349, 1708548, 404203, 479122, 1809955, 1776229, 162052, -870461, -1273869, -3307715, -6790011, -8185383, -5738229, -2180838, -668059, -744133, -159974, 1489078, 2761550, 2405816, 35187, -3659568, -6262194, -5061478, -572927, 3027274, 2537915, -584128, -2565660, -1895408]
56131a895408J836797J001662p46467k040457j367080J426839L488829J709772
56123C414487k473715m157893j595176J575023J932725O56308L15556N46629k04612
56114I332j100474l84592J103120J136743m8482k30302Q57543J118153j26510
56105B334531q35903K90591J469966N54533j562935k202618p47246P42194P32582
56096G75695J44908K60618K92280j185606l113977k628957O38811L208326K189409
56087E81507p10139j758303m63503M84028q3010l73693O75514J392376L69735
56078A14512j098996j335937q96863q43282k34997K108037M465732L654591m16553
56069E516244l887745l297538N02536L366961K213876j804861m331539k404560
$$ y = [-1895408, -58611, 943051, 196584, -1843873, -3210953, -1784114, 1704715, 3414487, 940772, -3217121, -4812297, -3237274, -1304549, -648241, -332685, 213944, 9332, -1091142, -1475734, -372614, 764129, 715647, 485345, 1342888, 2461041, 2334531, 1498628, 1789219, 3259185, 3813718, 2250783, 48165, -699081, 43113, 775695, 920603, 1181221, 1473501, 287895, -2826082, -5455039, -4816228, -1607902, 581507, -128632, -1886935, -2350438, -1866410, -1949420, -2323113, -1647599, -255223, 114512, -984484, -2320421, -3217284, -4060566, -4295563, -2187526, 2278206, 5932797, 5516244, 1628499, -1669039, -1166503, 2200458, 4414334, 2609473, -1722066, -4126626]
56061d126626J958133L886824J607007j538974j927700k90648M90297K19369Q82614
56052A160296K274319J733861j354890l916311l238081m07633J616840J641305
56044d90294O47898j19057k42743o1383k12600o85065m09919J093024K116307
56035A636168P88209j524458j540996Q30900J941845J85986j155334P39765L248749
56026E150834K200965j545597l541312k440995r96866q80569q26228j99797k33309
56017c312874p51769L94896L116038L924700J034618k520315l133735j267311
56009b515752M40424J054511Q46477m65826k132044j505848K004905M463416K565352
56000D755615q97914j073992J265842J266131j712613l149927j133461P46431
$$ y = [-4126626, -2168493, 1718331, 3325338, 1786364, -141336, -431984, 58313, 277682, 1160296, 3434615, 5168476, 3813586, -102725, -3340806, -3748439, -2131599, -490294, 157604, 38547, -204196, -265579, -478179, -1163244, -1573163, -480139, 1636168, 2424377, 899919, -641077, 189823, 2131668, 2317654, 1162320, 1902085, 5150834, 7351799, 5806202, 2264890, -176105, -1172971, -2053540, -2879768, -3079565, -3312874, -4064643, -3669747, -553709, 3370991, 4405609, 1885294, -1248441, -2515752, -2075328, -1020817, -174340, -640166, -2772210, -4278058, -2273153, 2190263, 4755615, 3857701, 2783709, 4049551, 5315682, 3603069, 453142, -680319, 66112]
55992F6112n7486r90814M34858K122892J457119n144K78576J121129J39019j523934
55982C042327j249146J70214J6992j304291j107760M49843N68706r56068j160498
55973a529681P37037J674202m8639j691254n11862J678910J250520j772829l799836
55964d013432k513714O52057K789046K605691R81461n05210j074305r96788o50428
55955b725622J93423J663843K834603K524601J041362J0163J43665K19419j048070
55946D857387k824856k801909q8130L132954L496214K64270l364939l691062r29250
55937a949321J249292O51750r32866r63776K59888R11886P53420P09044N94686
55928A284003k92554j122279n17084Q99737J308348O81907N75188J156781R67144
$$ y = [66112, 8626, -982188, -547330, 1575562, 3032681, 3027537, 3306113, 4427242, 4566261, 3042327, 1793181, 1963395, 1980387, 676096, -431664, 18179, 586885, -369183, -1529681, -792644, 881558, 832919, -858335, -1370197, 308713, 1559233, -213596, -4013432, -6527146, -5875089, -3086043, -480352, 501109, -4101, -1078406, -2075194, -2725622, -2532199, -868356, 1966247, 4490848, 5532210, 5542373, 5686038, 5905457, 4857387, 2032531, -769378, -857508, 2275446, 5771660, 6035930, 2670991, -1020071, -1949321, -700029, -48279, -981145, -1944921, -1685033, -773147, -19727, 689317, 1284003, 991449, -130830, -647914, 251823, 1560171, 2242078, 2817266, 3974047, 4941191]
55919D941191k92715j178305r97497o21281m73699P7828R36425J023914K42744
55910C658605l32614n17638j165355k024733j745731l69468N20882M97716P02339
55901g75997J217501P30789o11859q36073N75850J789838J785759J495554J037736
55892F409098p67767l003621k587614N95043K328314K31943k459146k209366n64000
55883b027116n49511j138408J54763J867484R25774j354328r70894J833587K698146
55874A439497L53856j439337k44807J460498R84265k58537K58941J776942J726312
55865F057630j78205j916214k242697j664158q89069r3160M16004K13278l89488
55856f86079m75001J90175O94849K78492m31316k95398M40449M27762k55465L26135
$$ y = [4941191, 4648476, 3470171, 2472674, 1851393, 1377694, 1455522, 2391947, 3415861, 3658605, 3325991, 2808353, 1642998, -381735, -2127466, -2496934, -1976052, -1478336, -775997, 441504, 1172293, 560434, -275639, 300211, 2090049, 3875808, 5371362, 6409098, 5641331, 2637710, 50096, 645139, 2973453, 3205396, 746250, -1463116, -2027116, -2576627, -3715035, -3560272, -1692788, -767014, -2121342, -3092236, -1258649, 1439497, 1793353, 354016, 109209, 1569707, 2553972, 2295435, 2554376, 4331318, 6057630, 5879425, 3963211, 1720514, 56356, -832713, -925873, -509869, -296591, -686079, -1161080, -970905, -276056, 2436, -428880, -724278, -283829, 143933, -111532, 214603]
55846B14603K500695L104045k14604m344908m298923p99595N81287j588080k143487
55837f988967J808767N299124L105182j762949k818278N1917J767022Q91163N61989
55828A914970J457832O75680j843164k198669N31228J988782m26449l203138k351104
55819c454032P35733K247313J484027K26102p85557j645644j551935m6813J504505
55810a286301J859740J797192K182889J903230j53401k550508k906992j058763
55802b12914J056475J761785P13905j191203k037894n31368J744646J651936r92744
55793A962624k659382j206377R92606J018895k16305k36656P46814R98951P44564
$$ y = [214603, 2715298, 5819343, 5604739, 1259831, -3039092, -3838687, -3257400, -4845480, -6988967, -5180200, 118924, 3224106, 1461157, -1357121, -1305204, 461818, 1352981, 1914970, 3372802, 4048482, 2205318, 6649, 537877, 2526659, 2100210, -1102928, -3454032, -2718299, -470986, 1013041, 1239143, 453586, -1192058, -2743993, -2790806, -1286301, 573439, 2370631, 4553520, 6456750, 6303349, 3752841, 845849, -212914, 843561, 2605346, 3319251, 2128048, 90154, -441214, 1303432, 2955368, 1962624, -696758, -1903135, -910529, 108366, -107939, -344595, 402219, 1401170, 2145734]
$$ [...]
##END NTUPLES=NMR SPECTRUM
##END=
