##TITLE=31Pdec_SRAlA_Ac2O
 , 24 sc
 27.09.2021
##JCAMPDX= 6.0         $$ Bruker NMR JCAMP-DX V2.0
##DATA TYPE= NMR SPECTRUM
##DATA CLASS= NTUPLES
##ORIGIN= UXNMR, Bruker Analytische Messtechnik GmbH
##OWNER= root
$$ XWIN-NMR		Version 3.5
$$ Mon Sep 27 11:55:31 2021 Russian Standard Time (UT+4h)  she@DPX200
##.OBSERVE FREQUENCY= 81.013821
##.OBSERVE NUCLEUS= ^31P
##.ACQUISITION MODE= SIMULTANEOUS
##.ACQUISITION SCHEME= undefined
##.AVERAGES= 24
##.DIGITISER RES= 16
##SPECTROMETER/DATA SYSTEM= spect
##.PULSE SEQUENCE= zgpg30
##.SOLVENT NAME= CDCl3
##.SHIFT REFERENCE= (INTERNAL, CDCl3, 0, 248.564)
##AUDIT TRAIL= $$ (NUMBER, WHEN, WHO, WHERE, WHAT)
$$ ##TITLE= Audit trail, XWIN-NMR		Version 3.5
$$ ##JCAMPDX= 5.01
$$ ##ORIGIN= Bruker BioSpin GmbH
$$ ##OWNER= she
$$ F:/spectra/data/she/nmr/P31/1/pdata/1/auditp.txt
$$ ##AUDIT TRAIL=  $$ (NUMBER, WHEN, WHO, WHERE, WHAT)
(   1,<2021-09-27 11:54:14.10 +0400>,<she>,<DPX200>,
      <created by zg, POWCHK disabled, PULCHK disabled
       configuration hash MD5:
       00 E9 B6 7A A2 85 ED C7 34 08 36 98 17 FE 4E 26
       data hash MD5: 32K
       C3 B5 1F 1F A4 30 BF B1 39 7B 03 81 14 8E A5 00>)
(   2,<2021-09-27 11:54:16.90 +0400>,<she>,<DPX200>,
      <Start of raw data processing
       efp BC_mod = 2 LB = 1 FT_mod = 6 PKNL = 1 PHC0 = -8668.843 PHC1 = 875.0697 SI = 64K 
       data hash MD5: 64K
       E9 C4 7B 68 8C EB FD 52 0E 80 48 43 40 EC 41 D8>)
(   3,<2021-09-27 11:54:44.64 +0400>,<she>,<DPX200>,
      <pk PHC0 = 329.8447 PHC1 = -214.8 
       data hash MD5: 64K
       60 8D 47 C6 3F 40 D1 C3 9E 6A E5 69 F6 F8 53 0E>)
(   4,<2021-09-27 11:54:48.56 +0400>,<she>,<DPX200>,
      <abs ABSG = 5 
       data hash MD5: 64K
       C1 F5 6F 25 B9 57 47 25 65 F8 48 A3 75 F5 D6 D4>)
$$ ##END=
$$ 
$$ hash MD5
$$ D6 6E 48 B2 BB 72 DE C9 BD 6E 61 06 4F FE DB 7A
##$RELAX= 
##$RELAX= 
##$RELAX= 
##$RELAX= 
##$RELAX= 
##$RELAX= 
##$RELAX= 
##$RELAX= 
$$ Bruker specific parameters
$$ --------------------------
##$DU= <F:/spectra>
##$EXPNO= 1
##$NAME= <P31>
##$PROCNO= 1
##$TYPE= <nmr>
##$USER= <she>
##$AMP= (0..31)
100 100 100 100 100 100 100 100 100 100 100 100 100 100 100 100 100 100 
100 100 100 100 100 100 100 100 100 100 100 100 100 100 
##$AQSEQ= 0
##$AQ_mod= 1
##$AUNM= <au_zg>
##$AUTOPOS= <>
##$BF1= 81.014009
##$BF2= 200.13
##$BF3= 200.13
##$BF4= 200.13
##$BF5= 200.13
##$BF6= 200.13
##$BF7= 200.13
##$BF8= 200.13
##$BYTORDA= 1
##$CFDGTYP= 0
##$CFRGTYP= 5
##$CHEMSTR= <none>
##$CNST= (0..31)
1 1 145 1 1 1 1 1 1 1 1 1 1 1 1 1 1 1 1 1 1 1 1 1 1 1 1 1 1 1 1 1 
##$CPDPRG= <waltz16>
##$CPDPRG1= <>
##$CPDPRG2= <waltz16>
##$CPDPRG3= <>
##$CPDPRG4= <mlev>
##$CPDPRG5= <mlev>
##$CPDPRG6= <mlev>
##$CPDPRG7= <mlev>
##$CPDPRG8= <mlev>
##$CPDPRGB= <>
##$CPDPRGT= <>
##$D= (0..31)
0 1 0 0 0 0 0 0 0 0 0 0.03 2e-05 3e-06 0 0 0 0 0 0 0 0 0 0 0 0 0 0 0 0 
0 0 
##$DATE= 1632729253
##$DBL= (0..7)
120 120 120 11 120 120 24 19 
##$DBP= (0..7)
150 150 150 150 150 150 150 150 
##$DBP07= 0
##$DBPNAM0= <>
##$DBPNAM1= <>
##$DBPNAM2= <>
$$ [...]
##$SUBNAM3= <"">
##$SUBNAM4= <"">
##$SUBNAM5= <"">
##$SUBNAM6= <"">
##$SUBNAM7= <"">
##$SUBNAM8= <"">
##$SUBNAM9= <"">
##$SW= 501.771253377433
##$SWIBOX= (0..15)
0 1 3 0 0 0 0 0 0 0 0 0 0 0 0 0 
##$SW_h= 40650.406504065
##$TD= 32768
##$TD0= 1
##$TE= 0
##$TE2= 300
##$TE3= 300
##$TEG= 300
##$TL= (0..7)
0 120 53 12 22 120 120 120 
##$TP= (0..7)
150 150 150 150 150 150 150 150 
##$TP07= 0
##$TPNAME0= <>
##$TPNAME1= <>
##$TPNAME2= <>
##$TPNAME3= <>
##$TPNAME4= <>
##$TPNAME5= <>
##$TPNAME6= <>
##$TPNAME7= <>
##$TPOAL= (0..7)
0.5 0.5 0.5 0.5 0.5 0.5 0.5 0.5 
##$TPOFFS= (0..7)
0 0 0 0 0 0 0 0 
##$TUNHIN= 0
##$TUNHOUT= 0
##$TUNXOUT= 0
##$USERA1= <user>
##$USERA2= <user>
##$USERA3= <user>
##$USERA4= <user>
##$USERA5= <user>
##$V9= 5
##$VALIST= <valist>
##$VCLIST= <CCCCCCCCCCCCCCC>
##$VD= 0
##$VDLIST= <DDDDDDDDDDDDDDD>
##$VPLIST= <PPPPPPPPPPPPPPP>
##$VTLIST= <TTTTTTTTTTTTTTT>
##$WBST= 1024
##$WBSW= 4
##$XGAIN= (0..3)
0 0 0 0 
##$XL= 0
##$YL= 0
##$YMAX_a= 2417
##$YMIN_a= -3394
##$ZGOPTNS= <>
##$ZL1= 120
##$ZL2= 120
##$ZL3= 120
##$ZL4= 120
##$ABSF1= 248.5645
##$ABSF2= -253.2056
##$ABSG= 5
##$ABSL= 3
##$ALPHA= 0
##$AQORDER= 0
##$ASSFAC= 0
##$ASSFACI= 0
##$ASSFACX= 0
##$ASSWID= 0
##$AUNMP= <proc_1d>
##$AZFE= 0.1
##$AZFW= 0.5
##$BCFW= 0
##$BC_mod= 2
##$BYTORDP= 0
##$COROFFS= 0
##$CY= -3
##$DATMOD= 1
##$DC= 0
##$DFILT= <>
##$DTYPP= 0
##$F1P= 0
##$F2P= 0
##$FCOR= 1
##$FTSIZE= 65536
##$FT_mod= 6
##$GAMMA= 0
##$GB= 0
##$INTBC= 1
##$INTSCL= 5.30512e-09
##$ISEN= 30
##$LB= 1
##$LEV0= 0
##$LPBIN= 0
##$MAXI= 10000
##$MC2= 0
##$MEAN= 0
##$ME_mod= 0
##$MI= 50
##$NCOEF= 0
##$NC_proc= -8
##$NLEV= 6
##$NOISF1= 182.463
##$NOISF2= 159.3651
##$NSP= 0
##$NTH_PI= 0
##$NZP= 0
##$OFFSET= 248.5645
##$PC= 4
##$PHC0= -8338.998
##$PHC1= 660.2697
##$PH_mod= 1
##$PKNL= yes
##$PPARMOD= 0
##$PSCAL= 0
##$PSIGN= 0
##$REVERSE= no
##$SF= 81.014009
##$SI= 65536
##$SIGF1= 159.3651
##$SIGF2= -187.1042
##$SINO= 113.3802
##$SIOLD= 16384
##$SREGLST= <1H.CDCl3>
##$SSB= 0
##$STSI= 65536
##$STSR= 0
##$SW_p= 40650.406504065
##$SYMM= 0
##$S_DEV= 0
##$TDeff= 32768
##$TDoff= 0
##$TI= <>
##$TILT= no
##$TM1= 0
##$TM2= 0
##$TOPLEV= 0
##$USERP1= <user>
##$USERP2= <user>
##$USERP3= <user>
##$USERP4= <user>
##$USERP5= <user>
##$WDW= 1
##$XDIM= 65536
##$YMAX_p= 587353881
##$YMIN_p= -26385477
$$ End of Bruker specific parameters
$$ ---------------------------------
##NTUPLES= NMR SPECTRUM
##VAR_NAME=  FREQUENCY,     SPECTRUM/REAL,   SPECTRUM/IMAG
##SYMBOL=    X,             R,               I
##VAR_TYPE=  INDEPENDENT,   DEPENDENT,       DEPENDENT
##VAR_FORM=  AFFN,          ASDF,            ASDF
##VAR_DIM=   65536,         65536,           65536
##UNITS=     HZ,            ARBITRARY UNITS, ARBITRARY UNITS
##FACTOR=    0.620285442955139, 1,           1
##FIRST=     20137.2065510759, 0,            0
##LAST=      -20513.1999529892, 0,           0
##MIN=       -20513.1999529892, -26385477,   0
##MAX=       20137.2065510759, 587353881,    0
$$ Real data points
##PAGE= N=1
##DATA TABLE= (X++(R..R)), XYDATA
$$ [...]
##PAGE= N=2
##DATA TABLE= (X++(I..I)), XYDATA
15132 -272659 2658264 4299886 4196902 2630260 -690267 -5205367 -8433751 -8118636 -4923492
15123 -4923492 -1633688 -53660 -34049 -1125191 -3192998 -5094583 -4875619 -2389557 24890
15114 24890 761045 959820 1567865 660375 -3126120 -6141660 -3275716 3931612 7566902
15105 7566902 3581654 -2581899 -3791721 -975682 -395428 -3480267 -5337019 -3520098
15097 -3520098 -2320066 -5644074 -10178997 -9918100 -4908409 -702626 -17381 99105 2020759
15088 2020759 3215575 763344 -3327011 -4907801 -3622578 -2253005 -1566604 -23488
15080 -23488 1930053 1834100 8534 -111720 2216919 3357868 1579732 513320 2924523
15071 2924523 5128120 2325587 -3456470 -6201913 -4963472 -4374675 -6616447 -8631790
15063 -8631790 -8181669 -7341548 -7913591 -7775284 -4693560 -591236 1223498 1234254 3055875
15054 3055875 8120441 13322604 14457747 10949108 6276194 3583792 2033568 -686762
15046 -686762 -3019886 -581633 6235344 10313851 6964598 990789 -288082 2427552
15038 2427552 3121573 1002457 604567 2396235 1661081 -2502706 -5186149 -4434691 -4029039
15029 -4029039 -5026065 -2926778 2793446 4734314 -1137346 -7707677 -7089468 -2294860
15021 -2294860 -813707 -2207024 -1064141 1862849 1331560 -1740010 -1078613 3806000
15013 3806000 6370362 3859398 1032448 1138718 838294 -2784035 -6599368 -6610344 -3777083
15004 -3777083 -1015798 1542206 4633929 6445865 4925234 1741583 915670 4141949
14996 4141949 8929344 10726537 6758781 -776450 -5732826 -4437553 -411157 297362
14988 297362 -2474618 -3658460 -1833177 -1830977 -6684668 -12170120 -12545501 -7705982 -1289849
14979 -1289849 4627046 8990018 9183146 4027702 -2213590 -3672892 -429863 1815644
14971 1815644 -225685 -3503721 -3662265 -828859 1362756 659374 -1580472 -2342707 -290980
14962 -290980 2643002 3216065 989545 -469486 1943650 6139483 7186874 4251542
14954 4251542 1922301 3527573 6462263 6607499 4561053 3766996 4251545 2903549 -232555
14945 -232555 -895969 2687461 6336863 5634308 1662702 -1686230 -2859944 -1979290 1504652
14936 1504652 6271943 7353762 2188137 -3840922 -3878383 133173 607316 -3176028 -4038565
14927 -4038565 578399 4009860 1854567 -253132 3826590 10099336 10448435 4696629
14919 4696629 -549203 -1959451 -1414837 -95918 2435075 4295558 2748992 -701634
14911 -701634 -2125442 -1659448 -2898952 -6059040 -7092091 -3980166 899438 5155211
14903 5155211 8719511 11399510 12262453 11887783 11540940 10318038 7051185 4328644 5769562
14894 5769562 9683367 10872262 8890039 8589240 11501743 12954320 10034649 6569250
14886 6569250 6732910 8526063 7679959 4452837 2299856 2076098 1489141 -679909 -2759687
14877 -2759687 -2483963 246941 2734257 1780896 -2237513 -4551968 -1624745 3402882
14869 3402882 4281951 18228 -4442429 -5630573 -4825341 -3450657 -605471 3102967
14861 3102967 4419521 2789705 2375901 5649666 8831414 7124517 1480220 -3096312
14853 -3096312 -3698582 -1391131 949072 677624 -2496036 -5014758 -2822778 2691441
14845 2691441 5580815 3398348 166954 -394891 274882 159680 976917 4012965 6140097
14836 6140097 4539704 1638313 671123 -109726 -3594497 -7273229 -6405113 -1853535 943313
14827 943313 -69399 -1643802 -712271 2628085 7038332 10716526 10927893 6908730 2722655
14818 2722655 3112618 6816410 8024161 4363504 -543822 -2704318 -2140016 -976671
14810 -976671 -353174 -217488 -69912 535241 930881 -297340 -2292512 -1345926 3847925
14801 3847925 8529424 7363313 1966777 -1426527 -601058 1226176 1900352 2667947 3533661
14792 3533661 1863855 -2457272 -5032588 -2613429 2533231 5989008 6109934 3991871
14784 3991871 1403994 345075 1795162 3323345 929006 -4970846 -8645807 -6559938
14776 -6559938 -2575178 -2230383 -4360335 -2949037 3478473 9029306 8276376 3343249
14768 3343249 499880 1609739 2406680 -546192 -4459301 -4153924 559754 4666858
14760 4666858 4847883 3068662 2305521 2204321 1244364 275190 795320 1798887 1601337
14751 1601337 1146693 2111558 3206935 2108532 -150336 -845272 -705103 -2702193 -5964969
14742 -5964969 -6061780 -2156597 1220460 1235820 718872 2559610 4672028 4056378 2246333
14733 2246333 2599476 4684764 5513236 4660215 4069578 3747313 1749792 -1572750 -3041200
14724 -3041200 -1228273 1232545 1114982 -1551085 -4139732 -4493408 -2473750 365307
14716 365307 1920799 1365039 405925 1647599 5033426 7134974 5093876 284454 -3422980
14707 -3422980 -4368133 -4189748 -4407761 -4263334 -2768475 -730258 774375 2067063 3134844
14698 3134844 2202057 -1276686 -4029890 -3097671 -1265319 -3637571 -9120823 -10938073
14690 -10938073 -6734899 -2193498 -1956380 -2905957 -702841 2469612 2520435 1498197 4133692
14681 4133692 9101791 10859077 8584488 6183083 4364962 337770 -4405497 -3828050
14673 -3828050 3250389 10273363 11820889 9347210 5964444 2029541 -1112898 361100
14665 361100 6160353 9450759 5820654 -200161 -2341855 -1329180 -809797 685623
14657 685623 6522773 13716452 15533994 11336939 7058166 5978577 5250201 2342981
14649 2342981 -635094 -756093 1714915 4654102 6345393 5699138 3240638 2184159
14641 2184159 5216749 9924271 11045404 7865143 5447405 7198086 10031824 9229299
14633 9229299 5091616 1875432 1880395 3431406 4181008 4106399 4592411 5568729 4816558
14624 4816558 965844 -3436507 -4051587 -658083 1723042 -447815 -4139740 -4517513
14616 -4517513 -2197600 -1287412 -2112882 -1594238 -145414 -1589791 -5241854 -5012853 697226
14607 697226 4739734 1544462 -3738380 -2598797 4118246 7850260 4748689 -584398
14599 -584398 -3426730 -4114564 -3784360 -1423235 2178593 3004904 14189 -1567218 2628371
14590 2628371 9122956 11469847 9455657 7870404 7581341 4370344 -2585435 -7467016
14582 -7467016 -6080600 -2351919 -2214202 -4620865 -3993527 310351 2894175 795639
14574 795639 -2393789 -2558082 -679546 191596 14146 563145 1734947 2492640 3731908
14565 3731908 6701742 9677136 9696550 7116620 5117550 4793895 4021794 1522363 -1198596
14556 -1198596 -2806365 -3967341 -4864435 -3659823 533016 5100511 6565970 4773545
14548 4773545 2704945 2694005 4120202 4642248 3050145 942140 1225381 4277533 6601156
14539 6601156 5063130 1455009 -26807 745540 -180530 -3886452 -6168658 -4097441
14531 -4097441 -771405 -407337 -2233267 -2978864 -2420309 -2244413 -1936099 -466609 -31080
14522 -31080 -2943175 -6242429 -5022906 -471904 1356795 -1084161 -2968719 -1711134
14514 -1711134 -848171 -2645006 -3049726 1600535 7581131 8557900 4290152 -109653 -1336339
14505 -1336339 19571 2687539 5690193 7151670 5907461 3732414 3150658 4023435
14497 4023435 4673656 4605544 3550122 393536 -3551257 -3220374 3492101 10236639 9271293
14488 9271293 2439419 -1394099 779721 3003308 978953 -1591874 -158779 3460453
14480 3460453 5019761 4302334 3602125 3419476 3380758 4262203 5624100 4431407 -478136
14471 -478136 -5264334 -5804039 -2985049 -83978 2294833 4965976 6528100 5285168
14463 5285168 3033110 2934711 4942725 6715895 7390891 7032489 4400414 -752054 -4978693
14454 -4978693 -4975351 -2591131 -1845748 -2645408 -2049737 -161231 354304 -633738 -1325395
14445 -1325395 -2314410 -4490997 -4173338 2294737 9576815 7647922 -3278322 -10803663
14437 -10803663 -6919517 1491436 3899120 740084 -133545 3527585 6644695 5542168
14429 5542168 1624503 -2508781 -5219873 -5056451 -2373442 -607631 -1821963 -2564652
14421 -2564652 1412010 7890052 10530812 7487163 2908956 576153 727288 2641757
14413 2641757 5531675 7059917 5626933 3901038 5328281 7652548 5629653 304057
14405 304057 -1013530 4325559 9765947 8798565 3165183 -1573353 -3520788 -3537949 -1589419
14396 -1589419 1309384 1422613 -2423936 -5169005 -2256917 2974792 4328503 2471087
14388 2471087 2844879 5384515 4076737 -2495397 -7543665 -5727427 -534012 1537590
14380 1537590 -391243 -2585320 -2724601 -867036 2982074 8183833 11972864 12188336
14372 12188336 10241936 8349483 5546289 207942 -4887836 -4781747 278141 4175864
14364 4175864 2852861 -1012672 -3021731 -3077635 -3587731 -4464438 -3547114 -671166 2091013
14355 2091013 3790848 5168978 5945212 4699234 2197175 1834227 5009866 8313721
14347 8313721 7599932 3383286 -328024 -1605308 -2014717 -2579689 -1757434 1154537 3530317
14338 3530317 2941890 1245688 1883636 4014956 3107877 -2182391 -7422892 -8362324 -6306812
14329 -6306812 -4931327 -4291343 -1650494 3022911 6369024 6518708 5207067 4370312 3865645
14320 3865645 3770711 5793182 10199477 13658998 12833110 8959195 6571653 8222195 12156111
14311 12156111 14662578 13322893 8626234 3759428 2142874 3941027 5764402 4811460
14303 4811460 1962966 -533767 -2536195 -4846233 -6283051 -5175894 -2968253 -2776149
14295 -2776149 -4342224 -4043533 -805223 1353394 -1582055 -8449085 -14614443 -16874316
14287 -16874316 -15009716 -10434467 -5429914 -2438715 -2034377 -2202532 -1043759 652124
14279 652124 884138 -499272 -1879527 -2334500 -2288254 -1968459 -896122 774350 1561267
14270 1561267 -45428 -3795666 -7354363 -7994490 -5108073 -914921 1993663 3428540
14262 3428540 4681321 5339055 3439811 -558649 -2591370 277032 5596902 8245147
14254 8245147 6517838 3484236 2713122 4515723 6472608 6299838 3877376 1055192
14246 1055192 -482400 -1064512 -2014425 -3090373 -2710409 -937987 117528 -245257 -96795
14237 -96795 1451285 2274971 1127517 393579 1808340 2505643 -271105 -3058414 -468303
14228 -468303 5635984 7679653 3514931 -393673 1165468 5130229 6342640 5570586
14220 5570586 6774154 9991888 11898755 11310668 9598272 7001368 2810758 -1490948
14212 -1490948 -3263415 -2850401 -3274415 -5458868 -6631184 -4129177 1297112 6437846
14204 6437846 8396473 6560521 3251317 1957369 3596444 5474471 5265347 4150985
14196 4150985 3874556 3126740 474833 -1187919 1919099 7471986 9084657 5721943
14188 5721943 3237991 4850490 5997776 2097268 -3653716 -5047504 -1990847 313035
14180 313035 -699586 -2836005 -4070205 -4956364 -5983096 -6266346 -5519085 -4634497 -3905213
14171 -3905213 -2663303 -465780 3165294 9067199 15973858 19092514 14734029 5833788
14163 5833788 -805881 -2624377 -2926293 -4443617 -5634663 -4381018 -1280207 2303518
14155 2303518 5824969 7643726 5379716 251241 -2753829 -1664138 -828685 -4243706
14147 -4243706 -9022697 -9559065 -5577210 -1659511 -514127 -999848 -1663212 -2124476 -1723941
14138 -1723941 -609117 -1371562 -5681774 -10064526 -9387047 -4264550 -417242 -439248 -1019960
14129 -1019960 675116 2737485 2659662 1539966 1532815 2416098 3239431 4468019 5983067
14120 5983067 5724963 3037453 882806 1868812 4244122 4830472 4030399 4620328 6802230
14111 6802230 7721020 5495368 1211806 -2816814 -4927847 -4848090 -4132284 -4937336 -6973818
14102 -6973818 -7139032 -3770693 585747 2601964 2285608 1424088 385512 -566425 578651
14093 578651 4167973 6029969 2892846 -1281740 -237474 4428625 4961687 -291617
14085 -291617 -3713770 111259 6660270 9147530 7931630 7125435 6789210 4768638 2926425
14076 2926425 4739739 8256487 7898988 3040983 -986151 -967369 363557 -224766 -1834286
14067 -1834286 -2148395 -1100130 111416 814047 228858 -2128364 -4170931 -2534812 2216860
14058 2216860 4937259 2699859 -747841 -213231 3729068 6178617 5025780 3073465
14050 3073465 3426972 5655630 6838436 4666260 -433174 -5058163 -5502689 -2062365
14042 -2062365 484220 -1501421 -5680720 -6807142 -3488325 904615 3318498 3785466
14034 3785466 3192930 1642952 -155205 -675615 139152 745209 1132914 3553552 8592613
14025 8592613 12801071 12398955 8029061 3912832 3009805 4449795 5252409 3569286 569211
14016 569211 -548210 1922127 5845028 7803400 7618234 7913448 9102597 8207577 4104460
14007 4104460 531412 1089516 3791105 3975947 1064301 -1113806 20888 3102562
13999 3102562 5659816 6761126 6517248 5235463 3490030 1483990 -1481390 -5422441
13991 -5422441 -8316219 -8289610 -6411918 -5086264 -4386564 -2466786 997135 4352249 6297698
13982 6297698 6015627 2183633 -4391620 -8072151 -3373570 6690598 12239111 8275695
13974 8275695 359253 -3607122 -2628730 -525922 918976 2020624 1481220 -1987432
13966 -1987432 -5608015 -4982487 -394107 3422785 3999273 3908257 6109071 9699170 11577789
13957 11577789 10158065 6250713 1654019 -2323985 -5601429 -8483521 -9700386 -6898903
13949 -6898903 -762176 3310657 855848 -5263053 -7737640 -3897736 1914059 5418375
13941 5418375 7421255 9900778 11192705 8623959 3585271 279317 382847 2019208
13933 2019208 3485142 4997693 6554813 6727271 4586026 1235347 -1386963 -2167507
13925 -2167507 -957479 1556986 3486985 2579742 -1432760 -6036960 -8505056 -8757347
13917 -8757347 -8644968 -8813937 -7789333 -4605899 -1027255 165806 -1298610 -2823496
13909 -2823496 -2534076 -1918689 -3564957 -6876517 -7957860 -4376660 1512314 5303971
13901 5303971 5501378 3935242 1941857 -1204206 -5410783 -7910434 -6195612 -1301720
13893 -1301720 3746543 7505217 10093644 11040559 10032701 8871265 9205961 8752874 3950090
13884 3950090 -3302833 -6580470 -4306923 -2753760 -6184819 -9346507 -5487283 2234303
13876 2234303 4846163 1098098 -1379128 1234338 3507660 877534 -2239252 377757
13868 377757 6601923 9017140 5480999 1158730 937691 4146053 6857673 6488400 3824424
13859 3824424 2029736 3318623 6045243 6596662 4520210 2971157 3234383 2763646 731345
13850 731345 974013 5583896 9607312 7357097 1218668 -1568297 811935 3576146
13842 3576146 3564319 2580107 2320822 1795293 990379 1974742 4669593 5963328 4724716
13833 4724716 3502659 3506141 2213992 -1690334 -5029515 -4679459 -2133031 -678241 -985750
13824 -985750 -2345128 -5261392 -9314553 -10899171 -7135737 -705336 2912661 2263358
13816 2263358 572411 53124 -796649 -3494769 -6125374 -5333725 -598144 4685112 6251985
13807 6251985 3071660 -1337706 -2168424 1632972 6281105 7619307 5503574 2738618
13799 2738618 1079305 269185 252610 1714455 3904453 4180173 1272949 -2238435 -2613177
13790 -2613177 219560 2500017 1837921 452254 1336143 2819599 432252 -5654177
13782 -5654177 -9004609 -5050204 2109222 4480584 131130 -5288306 -6218816 -2661129
13774 -2661129 2041853 5192078 5616278 3684563 1770695 2392892 4980708 6637768
13766 6637768 6511814 6652995 7969011 8633338 7708466 6899211 6891585 5461706 1854437
13757 1854437 -235346 2369161 6804636 7676969 4657361 2374213 3190879 4295255
13749 4295255 2752574 -196395 -1809842 -2358560 -4352974 -8036149 -10084876 -7667023
13741 -7667023 -2487173 822496 156145 -2087257 -3068408 -3156461 -3584497 -2909993 593641
13732 593641 4580306 5307612 4098090 5653218 9378722 8830888 2308760 -2589018 281897
13723 281897 5909823 5579224 -70794 -2912650 72886 3988926 5213809 5440446 5453627
13714 5453627 2616009 -2415637 -3156841 3901474 12758766 15223313 11484719 8314341
13706 8314341 8894420 9801632 7645948 3863860 1805263 2450815 4543546 6661476 7619189
13697 7619189 6457714 3684123 1580430 1750321 2861168 2335921 107168 -1128953
13689 -1128953 58941 1548467 1076294 337038 2794936 7784041 10144918 6817652
13681 6817652 923236 -2553857 -2775217 -2452743 -3164349 -3974774 -3629669 -1748313 1270995
13672 1270995 3522972 2120428 -3103423 -7705207 -7282962 -3072745 -51585 -389398
13664 -389398 -1869431 -1958499 -29015 3794649 8249904 9809392 6060987 301425 -1425303
13655 -1425303 1781144 5092218 5642178 5632872 6497518 5742427 2472939 719656 3129635
13646 3129635 5774885 4104349 493854 339552 3126286 3440334 -90261 -2751160
13638 -2751160 -1104770 2615529 4779176 4955414 4501359 3799238 2977839 3139197 4806409
13629 4806409 6405401 5860225 3066909 -102054 -1743618 -1400799 -74354 927215
13621 927215 1289668 1683434 2514042 3535877 4800201 6511715 7492874 5837381 2196368
13612 2196368 67580 960124 1716667 -648827 -3776095 -3362405 -114722 1221295 -720124
13603 -720124 -2260294 -1134805 -30767 -1753844 -4607677 -5195041 -3122367 -242136
13595 -242136 2757156 6177686 8893859 8772737 5363937 501761 -3595620 -5578646
13587 -5578646 -4674074 -692985 5075497 9706075 10467174 7525296 4384133 4207042 5559580
13578 5559580 3942390 -1435996 -5215612 -2743452 3193241 6343967 5776866 5647354
13570 5647354 7022440 5983256 1032859 -3301281 -2834623 928247 4557563 7385991
13562 7385991 9234417 7857680 2877947 -1366921 -1605072 -1312361 -5558697 -12452279
13554 -12452279 -15221472 -11696000 -6469106 -3940941 -3956857 -4463462 -4160364 -2034950 2031903
13545 2031903 5736429 6473081 4784010 2720285 -76614 -4606187 -8007924 -6142037
13537 -6142037 -585406 2476119 981627 -1052489 -1489356 -3669902 -9302027 -13667838
13529 -13667838 -12210664 -7475775 -4940123 -5319335 -5517110 -4481387 -3494475 -2498346 -513901
13520 -513901 1342633 1011772 -1011143 -2289654 -1712133 368613 3970872 8771985 12734220
13511 12734220 13937685 12618151 9465675 4100658 -2203486 -5025843 -1850691 3401084
13503 3401084 4996643 2965916 1883454 3669641 6377065 8942486 11674998 12367400
13495 12367400 7885412 658572 -2004685 2814204 9675809 12260397 10418961 7262436
13487 7262436 3766211 84279 -1314515 1459337 5420282 5552007 1337010 -2970051
13479 -2970051 -4309929 -3928558 -4255353 -5483724 -6339452 -6282158 -5374472 -2912255 1995539
13470 1995539 8063128 11398280 9087221 3140763 -960261 -388018 2265420 3603396
13462 3603396 4322679 6685822 9080689 7372160 1460062 -3602511 -3877944 -617477
13454 -617477 2666416 3797680 1759300 -3227656 -7848727 -7715892 -3477303 -1332702
13446 -1332702 -4724544 -8983112 -7738974 -1674411 3264478 4125535 2830279 1153526
13438 1153526 -1321886 -4237041 -5592217 -4563797 -2180970 977546 4736762 7077484
13430 7077484 5615684 1910122 547109 2727708 4507267 3312519 2370472 5361136
13422 5361136 9664343 9460159 4333611 65626 333435 1838787 -322682 -5624929
13414 -5624929 -9368727 -9064481 -6277590 -2976814 324736 2407763 1039019 -3206371
13406 -3206371 -5620564 -2695011 2948412 5914281 5062049 3829830 4286636 4872074 4464519
13397 4464519 4596436 6003193 6553082 4994257 3781570 5281728 7516275 6907961 3607563
13388 3607563 883325 504561 1964908 5084466 9603028 12802297 11705978 7938529
13380 7938529 6322219 7805485 8073652 4900586 2328469 4148145 7012391 4944151
13372 4944151 -1409322 -5518590 -4483307 -2103914 -1223071 1280238 8203976 15049489
13364 15049489 14815551 8023024 2352901 2044721 2856920 -507115 -6362827 -8838250
13356 -8838250 -5929924 -975980 2516120 3890939 3708338 2540351 1842459 3263636
13348 3263636 6258765 8415831 8712283 8451725 8473310 7728318 5621225 3504020 2241272
13339 2241272 240151 -3785042 -7232655 -5646874 1279180 8029037 9178167 5885783
13331 5885783 4368909 7757774 11862865 10832149 5117371 503496 -48314 819540
13323 819540 1001309 2619447 6575921 8430579 4953292 981780 2901420 7527135
13315 7527135 5625507 -3514003 -9633773 -6000585 1715264 5352658 5803613 8361440
13307 8361440 12175296 12251241 8922841 7244715 7783518 5598889 -625205 -5165104 -3562816
13298 -3562816 829580 1968386 -957299 -4391187 -6583213 -8721026 -10855078 -10762218
13290 -10762218 -7703198 -4329308 -3109612 -2833700 -884580 2323434 4093207 4188596
13282 4188596 5166458 7057031 5811775 -209557 -5879208 -5704000 -1870859 -600429
13274 -600429 -2276927 -1640707 2489024 4785926 2343412 -737701 -887211 -1176789 -5368486
13265 -5368486 -10566046 -11143250 -7151293 -3924492 -4867580 -8384489 -10799960 -9686837
13257 -9686837 -5683998 -2675801 -4003648 -7533319 -7995116 -5115879 -4169190 -6559631
13249 -6559631 -6584992 -1446831 2665225 533268 -2659662 248200 6025513 6429393 2021355
13240 2021355 338228 2455523 2145550 -1805489 -3104483 550935 3237848 1098934
13232 1098934 -1686450 -987223 704755 50602 -1173426 -392706 708445 -312162 -2414229
13223 -2414229 -3887384 -5288894 -6462327 -4886234 -172988 3904044 4964735 5464559
13215 5464559 7516105 8690735 6651019 3835025 3381398 3891826 2447534 -174962
13207 -174962 -1416938 -1393798 -1430157 -590996 2243430 4904071 4617638 2592669 2071154
13198 2071154 3073146 2853449 796633 -726550 -269261 831153 805641 -257777 -766996
13189 -766996 556838 2863109 3168004 -257001 -4471093 -4522523 -223987 2953916 1258809
13180 1258809 -2469689 -3633817 -2346439 -1783823 -2425656 -1640843 1976471 6780804 10096666
13171 10096666 10139630 6792561 2203037 -270982 824834 3693693 5664738 5536758
13163 5536758 3285621 -254582 -2737814 -1981347 682344 1417665 -729836 -2421267
13155 -2421267 -1056573 2141173 5260657 7959028 8898771 5426753 -1526872 -6597479
13147 -6597479 -7262162 -7609978 -11017757 -13669316 -10673763 -4899960 -3336066 -6759543
13139 -6759543 -9355743 -7700752 -4171161 -1465185 702603 2568237 2764553 1340467
13131 1340467 737829 2261511 4308753 5268468 5785940 6880681 7529818 5458591 -87067
13122 -87067 -6711054 -10259124 -8797871 -5044112 -3006064 -2477291 -64052 4068518 5187915
13113 5187915 1609038 -1799491 -1163248 278907 -1673560 -4473788 -3323418 258017
13105 258017 1311210 317283 1625954 4382093 3028737 -2895098 -7008158 -5495541
13097 -5495541 -1653790 483658 727737 -688711 -4471029 -7785822 -5087913 3109012
13089 3109012 8484932 6196671 2127335 3616774 8119659 7759552 1729980 -3106226
13081 -3106226 -2615822 355840 2220472 3146732 4079829 4267801 3830805 4914718 7840895
13072 7840895 9076071 5787508 414557 -2138094 -763575 1141470 890181 -324621
13064 -324621 -194166 1054669 1480652 697784 375377 1678908 3757604 4919434 4128177
13055 4128177 1375523 -2011386 -3400489 -1090753 2787335 3425139 -1337849 -8095892
13047 -8095892 -11439938 -9333833 -3983210 1213329 4122252 4357215 2896304 969519
13039 969519 -1089324 -3064781 -3366449 -765049 2232943 1422771 -2248777 -2158371 4549408
13030 4549408 11132155 9721613 2492423 -1696547 45889 2389100 2004118 2337820
13022 2337820 5845424 8517268 6760516 4434637 7065860 12181702 11822134 3810300
13014 3810300 -5283384 -9042018 -7992616 -5810088 -3372366 17884 2626473 1930140
13006 1930140 -793157 -1601020 325873 1835311 1461730 1835297 4461598 6132751 4016711
12997 4016711 955510 1041440 2498220 803543 -2580123 -1639577 3666171 5871005 1513789
12988 1513789 -2960130 -1167367 3596000 4584106 2452392 2709298 5457066 5455291 1525165
12979 1525165 -1364291 -242329 1704002 953669 -1125200 -1219894 1102108 3750236 5143124
12970 5143124 5128648 4088707 2205334 -659017 -4043739 -5739170 -3432216 1492860
12962 1492860 4429832 3736838 3365661 6432645 9569668 7982610 3257675 808250
12954 808250 1529178 1786029 485614 -27464 256348 -1265162 -3776293 -3116908 611775
12945 611775 1653187 -2654164 -7188154 -6417207 -1932816 1144951 1701091 2407032 4186644
12936 4186644 4926009 3170822 402282 -643686 1050270 3427887 3238735 204800
12928 204800 -1554159 1777026 8304865 12251271 10777979 6382282 2922223 2130658
12920 2130658 3752729 6068683 6313886 3350815 -358434 -1962270 -2223292 -3186673 -3687421
12911 -3687421 -1645434 672218 -824322 -4926433 -6342039 -3903921 -1454343 -290927
12903 -290927 2439090 6527865 7046901 2598739 -1297785 -558899 1582085 997635 -369010
12894 -369010 1395655 5302147 7328157 6161108 3343313 462713 -750542 1482348
12886 1482348 5942567 8374998 6836074 3926378 1980988 203353 -1491417 -834749
12878 -834749 1845218 2253458 -974377 -3250402 -1509215 924774 1102421 1921393 5503107
12869 5503107 7313806 3633887 -715184 118884 2754144 663126 -3624768 -2626302
12861 -2626302 2258934 2151944 -4162245 -7502188 -2911823 2963011 3096203 178742
12853 178742 268778 3030052 4128680 2643019 599781 -1448174 -3476863 -3418634 -225069
12844 -225069 2607221 1080755 -3128292 -4746076 -2309738 507053 722350 -652643
12836 -652643 -1638388 -2089440 -2154453 -823823 2008536 4017185 3128841 460882 -1410731
12827 -1410731 -1901996 -1824987 -674535 1972677 2920469 -1952363 -10105137 -12551584 -5163036
12818 -5163036 4489221 6438016 1098579 -3266788 -3384043 -3641258 -6238830 -6912363 -3048515
12809 -3048515 796667 -398689 -4789788 -7170934 -6163744 -4077888 -2388416 -743141
12801 -743141 1448451 4635104 8382948 10131798 7772959 3913602 3143249 4384935
12793 4384935 1803190 -5004995 -8593942 -4739290 1001691 2445189 1768580 3380325
12785 3380325 5034253 2475503 -1868739 -2728494 -927135 -746554 -1444645 538021 3201002
12776 3201002 1183795 -4700786 -7990273 -6338879 -3631017 -2504380 -1644952 -662930
12768 -662930 -1083877 -2084905 -1307768 -85182 -1818756 -5086875 -4671326 116318 4336494
12759 4336494 5309178 5544774 6891938 7558521 6108415 3306743 -556095 -5060970 -6556727
12750 -6556727 -1628015 6243644 9753644 7735788 5552521 5494430 4288477 977069
12742 977069 -755479 12724 -448266 -2636224 -1883403 2775851 5637386 3719890 1396289
12733 1396289 1801174 1687971 -484414 189612 5511217 8004448 2161738 -5071325 -4086738
12724 -4086738 2557542 4901556 1398246 -347688 2989353 6296072 5768897 4057775
12716 4057775 3758965 2930683 -209566 -3498014 -4357042 -3173071 -1218863 1437057 4371054
12707 4371054 6020313 5758714 4540575 2998696 1283870 859689 3483982 7819268
12699 7819268 9901799 8050098 5054783 4390205 6051094 7264465 6074042 3235215
12691 3235215 1194706 1699807 4099210 5951340 5419263 2699972 -794298 -3700408
12683 -3700408 -5205678 -5643180 -6508824 -8186454 -8141765 -4259147 194039 -751479 -6737832
12674 -6737832 -9450249 -3247641 6513137 10145578 5808510 131288 -1549258 -288179
12666 -288179 786802 904033 651554 203862 -13168 669184 1481847 554204 -2278945
12657 -2278945 -4704824 -4685275 -2750761 -1104430 -1290265 -2805715 -3490679 -1802688 926400
12648 926400 1853596 910061 1469627 4970319 7335139 4003876 -2897242 -6264802 -2816680
12639 -2816680 3328325 6667939 6873502 7577791 10520938 13203497 12365379 8478297 5689619
12630 5689619 7025918 10694354 12609746 11923988 11472140 12466933 12048414 7890202 2420139
12621 2420139 -151874 1016759 3786402 6587978 8623538 8237781 4612373 250293
12613 250293 -1440426 -450640 938616 2747735 7033477 12907741 15624947 12176501
12605 12176501 5375361 703132 282017 1112548 -1019041 -6157027 -9078879 -4955525
12597 -4955525 3806033 9097492 6825484 1841117 590501 2471210 2910978 1995657
12589 1995657 3746180 7884127 9096518 5463042 1576620 1217176 2154567 938931
12581 938931 -1631009 -2895854 -2425047 -658339 3090625 8029240 10419871 8195143
12573 8195143 4360274 2456224 1509638 -672675 -2245017 -553005 1444241 -1815548
12565 -1815548 -9222342 -12694733 -7561285 1777344 8614927 11744392 13436850 13607792
12557 13607792 10563278 5722827 3115902 4170409 6238585 6707971 5938888 5444690
12549 5444690 5514533 5843929 6678113 7703455 7018080 3191629 -1924780 -4360976 -2675236
12540 -2675236 -37847 -282231 -2564703 -2052078 3356513 9019927 8594137 2292314 -3008821
12531 -3008821 -2625106 299842 388215 -1707202 -1016195 2944003 4514238 464302 -4495673
12522 -4495673 -3959879 1624720 6382706 6881291 4644995 2100926 260391 269129 3158856
12513 3158856 7079334 8026741 4734853 496987 -1057247 -55242 651506 -1115896
12505 -1115896 -5060946 -8360318 -7502053 -2413699 1648172 -392141 -6059311 -7680861
12497 -7680861 -2926595 2002644 1903765 -140034 793141 2534395 -363723 -6624989 -9145900
12488 -9145900 -5499809 -1038285 -447181 -2018924 -2502156 -2542098 -3909444 -5040715 -3248483
12479 -3248483 775315 4104423 5781376 6744250 6614438 3864929 -893961 -4649101
12471 -4649101 -5545746 -4526908 -2826616 -39833 3988378 7085797 6687098 3400379
12463 3400379 705802 591397 872123 -2014490 -8066940 -12767102 -11443241 -4190077
12455 -4190077 3826905 6957431 4075974 -831702 -3106028 -2156364 -1146143 -2282610
12447 -2282610 -4150648 -4537149 -3968378 -4305227 -5029341 -3802512 -572199 1779498 1501443
12438 1501443 40314 -989067 -2337756 -4964479 -7399645 -7300512 -4512497 -1183743
12430 -1183743 193018 -1694937 -5543882 -6994211 -2552991 4699940 6838524 981016
12422 981016 -6236163 -7724218 -5667865 -6610273 -9750766 -7905730 86134 6220664
12414 6220664 5279029 2611182 5148163 10436864 11148422 6828412 3707423 4074200 3364308
12405 3364308 -1005785 -4645890 -3303297 127480 258132 -2332633 -2397148 1545212 5106623
12396 5106623 4757915 2283803 888843 390152 -1059380 -2755168 -2042638 1709970 6173131
12387 6173131 8669129 7837869 3482994 -2809088 -7242319 -6780794 -3081025 -1145128
12379 -1145128 -3341691 -6895417 -7999235 -5936781 -1957685 3119812 7837155 8892236
12371 8892236 4393501 -2387532 -5581160 -3242474 1065502 3474494 4069523 4910079
12363 4910079 6078343 5863803 3923153 1920800 719078 -1127278 -4718944 -7791084
12355 -7791084 -6516793 -670037 4881944 5156785 522920 -4035256 -4214431 356740
12347 356740 7061552 12471556 14092146 11999560 8689046 5857735 2259935 -3118535
12339 -3118535 -7200927 -5941517 -960901 1536170 -376802 -1144376 4029837 11613531
12331 11613531 14144577 9759073 3450828 -991 -864142 -2264832 -5528942 -8183571
12323 -8183571 -6138202 1306515 8787678 9800738 4965600 1951603 5431836 10919821
12315 10919821 11579165 7543995 4242477 4138047 5014160 5034963 4824763 5018437 5590941
12306 5590941 7084459 9185926 9275673 6064218 3140586 4477311 7839395 7953458 5272516
12297 5272516 5293313 8894503 10204755 6095590 1298343 485206 845222 -2441586 -7279802
12288 -7279802 -7085800 -629286 5714208 5816327 337201 -5283552 -6847429 -4403572
12280 -4403572 -791577 1538212 2342418 2764497 3389405 3687644 3011849 1396724 -294723
12271 -294723 -451926 2097863 5953761 7445930 4684684 192804 -2132366 -1220975 1758068
12262 1758068 5796542 8949577 7537386 921712 -4917974 -4001844 728706 1305061
12254 1305061 -3069267 -5157475 -2027435 -29551 -3923259 -8502501 -6669144 -225891
12246 -225891 3798216 3686653 3359650 4603383 5305750 4483029 3674190 3475941 2880224
12237 2880224 1898056 1491080 1455062 1280635 1936115 3809401 4604913 2812570 1332933
12228 1332933 3313139 6043320 4248872 -1211772 -3599728 17178 4477162 3771651
12220 3771651 -1380486 -5303043 -3878718 2322608 9084854 11540135 8233382 2957456
12212 2957456 641589 1570391 2374233 2266451 4120667 8523167 11137183 8305962 2122093
12203 2122093 -2374735 -2532568 1080340 6115179 8589039 4950847 -2866478 -7297949
12195 -7297949 -3792372 2627652 3670073 -1024881 -3969463 -650336 5159224 8155900
12187 8155900 8486044 9003407 9497274 7902897 5096791 3952074 4321958 3399103 1433370
12178 1433370 2474257 7455836 10781937 7566684 1418939 168696 5019225 9216523
12170 9216523 7982422 4479377 3624010 4569343 3276091 -312073 -2080672 326745
12162 326745 4921134 8292986 8564859 6160728 3837677 4637849 7533421 7337607 2186630
12153 2186630 -1796767 1477805 7735844 7279791 -263882 -4742649 -1102895 2771882
12145 2771882 -935504 -7066978 -5723619 1907423 5662327 2170294 -1273403 770670
12137 770670 4431976 4482975 2351306 1839727 2471926 2234350 3035230 7885029 14574133
12128 14574133 17184156 13528061 7385209 3397398 2761902 4097213 5786211 6575930
12120 6575930 5620983 3042475 76707 -1517928 -398740 3010248 5947920 5757191
12112 5757191 3547393 3307896 6057616 7326377 2948718 -4520388 -8407315 -6077156
12104 -6077156 -1327724 1130812 512806 -1134754 -2104153 -2007077 -1329840 -885232 -692306
12095 -692306 581608 3767627 7201966 8404047 7429766 6432041 6044506 4671928 1697061
12086 1697061 -1082845 -2064848 -1897148 -2073798 -3064655 -4404016 -5181887 -4302996 -1900786
12077 -1900786 -276028 -1299990 -3205361 -2677572 51221 1566776 993356 1415282 4438536
12068 4438536 7328863 7541026 6379167 5614168 3902123 -269632 -4847919 -6745242
12060 -6745242 -5962078 -4222195 -1736317 1524219 3509546 2593544 750019 871341 2448690
12051 2448690 3159007 2972151 3007515 2000565 -1794601 -6208730 -7113968 -4496187 -2486451
12042 -2486451 -3316496 -5058965 -5521285 -4649049 -2685977 477372 3512969 4440890 3757504
12033 3757504 3794870 4677346 4103470 1554853 -508702 -246043 1756411 4610601 7880907
12024 7880907 9893817 8791634 5932558 4779309 5611666 4867725 711021 -4324198
12016 -4324198 -7374513 -8258032 -7124436 -3135636 2266069 4389049 658186 -5296532
12008 -5296532 -7482243 -4011548 1771225 4965989 3036294 -1894359 -4240943 -1038859
12000 -1038859 3290719 2105008 -3479181 -5203835 280838 6267298 6319497 3600278
11992 3600278 4424173 7598713 7421066 4252873 4096376 8214707 10676590 7598593 2576814
11983 2576814 523720 1258963 2354686 4052120 7116789 8552012 4510830 -2835406
11975 -2835406 -5895476 -968155 6082527 6569375 94161 -4844108 -1894297 5314771
11967 5314771 8767069 6250592 2026496 -509317 -1693910 -1770388 154886 2343525
11959 2343525 1024497 -3074690 -3757505 2002767 8809258 9962940 6185996 3166346
11951 3166346 3539005 5775325 8521018 11176439 11724782 8728456 4824193 4167902 6790763
11942 6790763 8924292 8298595 5791687 2588955 -797120 -3179181 -3661807 -3531316 -4261919
11933 -4261919 -4518212 -2308252 958458 2184029 1449964 1331326 2125947 1897982 702519
11924 702519 314960 50928 -2289175 -5141130 -4145171 559465 3362939 1500815 -752643
11915 -752643 919647 4341627 5134075 3777112 3821136 5504865 5935310 4572731 4096068
11906 4096068 5608231 6596572 4769491 1509256 95073 1655296 3974402 4054429 1436076
11897 1436076 -1185022 -943661 1749432 3600524 2410305 -473976 -2200204 -1720064
11889 -1720064 -117673 1404170 2547985 3271063 3319792 2673906 1858524 1506996 1724923
11880 1724923 1949079 1497484 425929 -182432 938371 3844210 6735793 6931681 3199307
11871 3199307 -2392534 -5700874 -4740889 -2205573 -2173836 -4626006 -5563133 -3000430 -62117
11862 -62117 -455139 -3133406 -3885682 -921675 3510211 6432551 7017829 6352158 5747865
11853 5747865 5273984 3622278 349298 -1853042 486965 6251569 9746508 7829394
11845 7829394 3947367 2663335 3475206 3511838 3172695 4381064 5500341 3390169 -555198
11836 -555198 -1792699 226192 1456438 27035 -1437158 -949034 295298 1555074
11828 1555074 3823609 5943677 4403447 -606018 -3438854 -379243 4900369 6542141
11820 6542141 4147167 1836426 2028448 3581591 4661229 4436074 2697798 31338
11812 31338 -2164568 -3208353 -3935079 -5227812 -7001403 -9056998 -11104250 -11576859 -8895115
11803 -8895115 -4600941 -2477976 -3518536 -4597854 -3320756 -1116368 -50885 251479
11795 251479 794571 1563496 3398145 7697364 12039536 10581428 2408763 -4724476 -3762511
11786 -3762511 1957265 3856004 319930 -2554469 -1089988 1846192 3315748 4716767
11778 4716767 7759484 10847806 11916169 11327630 9768840 6298003 731726 -4345089
11770 -4345089 -5950804 -3510795 1604071 7092567 9472000 5895716 -1885567 -7936189
11762 -7936189 -8630049 -6453559 -5192376 -4080325 -191250 5309203 7784315 5790252
11754 5790252 2958598 2283630 2224027 409896 -1884292 -1921218 -148854 833426 1143581
11745 1143581 3658103 8606483 11757416 10075031 6448867 5725916 7643317 7432756
11737 7432756 3272685 -716319 -329009 2981123 4703370 3592589 2310723 2530154
11729 2530154 2633024 951684 -1269684 -1778487 -752410 -531715 -2324729 -4571780 -4681488
11720 -4681488 -1583664 3351143 7124988 7069773 3233783 -953261 -1640978 1302849 4368270
11711 4368270 5217411 5553944 7577641 9506081 7744444 2814040 -561124 28848 1524355
11702 1524355 448373 -1845290 -1506898 2234797 6521710 8696235 8331789 6313459
11694 6313459 3973319 2511299 1738082 322236 -1518876 -1296891 2146259 6361716
11686 6361716 8635262 9162969 8319443 3908804 -4528032 -11118168 -9145081 -618412
11678 -618412 5084305 2653027 -3858332 -7815987 -7263841 -4263086 -1717102 -2568895 -7815986
11669 -7815986 -13375857 -13024505 -6471092 -348424 1027375 1212696 4672297 8799984
11661 8799984 7892432 2413384 -1046961 1397165 6131480 6682861 1005819 -6320550
11653 -6320550 -8495148 -3473260 3682502 6844949 6289755 7077090 10763695 13513699
11645 13513699 12906940 10985769 8835322 4308992 -1809213 -3901752 -555411 674779
11637 674779 -5987782 -14244628 -14035307 -6353976 -967483 -1485074 -2059950 1221735 4942276
11628 4942276 6105551 6923433 8669166 7902579 2973994 -1472154 -1031024 1930238 2752229
11619 2752229 1763729 2381502 4663860 5583421 4376131 3409259 4094815 5206424 5338416
11610 5338416 4646599 3915704 3510789 3441547 3577464 3888087 4736363 6225954 7159019
11601 7159019 5927665 2768342 -319814 -2291934 -4045381 -6178406 -7586418 -7117869
11593 -7117869 -4981826 -1748184 2308129 6048934 7545961 6395596 4296367 2459875
11585 2459875 464952 -1282288 -494488 3571930 7713268 8341544 6099631 4390123
11577 4390123 4306730 3821170 1730417 -337357 -486575 865267 1869741 1451499 -64535
11568 -64535 -1534504 -1587821 485836 3692953 5769008 5452026 4027250 3821489 5285362
11559 5285362 6565646 6240920 5183203 4537479 3039187 -1264234 -6778012 -8935172
11551 -8935172 -6326514 -3291348 -3830870 -5538166 -3508868 1341349 2998427 -445986
11543 -445986 -3703264 -2466942 179486 -698198 -3601052 -2983414 1730595 4975871 3361346
11534 3361346 447849 1189286 4984993 7158692 5532545 2570538 1469310 2607457
11526 2607457 4285516 5161602 5019342 4237767 3620985 4217592 6119326 7422572 5554061
11517 5554061 355323 -4814390 -6119013 -3393805 -329871 -191902 -2275650 -3427697
11509 -3427697 -2273437 -379377 702331 1536485 2871552 3388406 1598973 -932103
11501 -932103 -1156382 527101 99744 -3968749 -7477928 -5918088 -868324 2205086 1049288
11492 1049288 -1877303 -3912789 -4354270 -2656615 1201044 4190684 2497873 -2475109
11484 -2475109 -4552883 -970611 3941790 5421627 4419022 4046075 3898550 2105361
11476 2105361 85685 648968 3074269 4194202 3122725 1343579 -443128 -1953526
11468 -1953526 -1406163 2006043 5012386 3817188 -169164 -2298154 -1565716 -1160352 -2572227
11459 -2572227 -3613803 -2533330 -284192 1418309 1042857 -2931386 -9318446 -12615741
11451 -12615741 -8823917 -1814236 1400330 577330 999706 3175283 1939419 -3168896
11443 -3168896 -5436489 -2025249 832312 -1517281 -3808426 563247 8707605 13058978
11435 13058978 12490053 11422632 11183314 9451120 6302727 4265458 3614736 3133116 3854092
11426 3854092 6520052 7354820 2706482 -3622621 -4603647 -868052 -76920 -4871493 -8718402
11417 -8718402 -5820956 1144946 6053420 6867375 5068448 1968445 -1036087 -1829746
11409 -1829746 -253362 997698 246618 -897517 -683820 435579 2256816 6076436
11401 6076436 11198132 13716937 11759972 8785118 8277772 8150446 4684449 -205823
11393 -205823 -868442 3416945 6728142 4695607 413231 -194835 3624703 6940207 5746479
11384 5746479 1510920 -1465902 -1532380 -905057 -1687446 -2560379 -787283 3462337 6868380
11375 6868380 7245825 6193134 6495846 8275529 9145318 7586827 4827684 3270170 3848897
11366 3848897 5318933 5956687 5517556 5019145 4802979 4048447 2754362 2617759 4352995
11357 4352995 5423019 2879285 -2032062 -4819975 -3556405 -1054134 -386807 -829576
11349 -829576 92040 2527860 4449309 4813370 4499887 4294882 3558166 1415580 -1418588
11340 -1418588 -2819080 -1812029 -634923 -2604562 -7100083 -8749799 -3877222 3938046
11332 3938046 7974804 6861420 4863739 4302367 2988438 143123 -977065 711655
11324 711655 555533 -4748940 -10632475 -10554365 -5515141 -1921552 -1849989 -1606376 680606
11315 680606 2340622 1757596 885453 507420 -1728273 -6023126 -7881173 -4288825 1097474
11306 1097474 2627836 -25785 -2750613 -3115083 -1941201 -196786 1866235 2963891
11298 2963891 1614765 -1115268 -2501966 -1994755 -1509325 -1616293 -404375 2769929 5170894
11289 5170894 4338909 1935241 1512498 3501778 4975385 4171644 2719662 2672659 3445333
11280 3445333 3082452 1150808 -1180533 -2890151 -3255559 -1268858 2746795 5408182
11272 5408182 3188134 -2251084 -4711757 -1301042 3080647 2104141 -2941180 -4530392
11264 -4530392 661180 6761915 6159317 -680176 -5873739 -3937609 1907365 4350609
11256 4350609 1182144 -2430309 -951479 4677532 9158433 10156407 10111219 10868776 10597200
11247 10597200 7817026 4811849 3902936 3217827 135146 -3161284 -2283474 2194008
11239 2194008 5096829 4173106 2345894 1683598 163583 -3553139 -6632686 -6354020 -4492864
11230 -4492864 -4273825 -5560980 -6147303 -5660946 -5128626 -4442896 -3349093 -3522575 -6448704
11221 -6448704 -10056695 -10574747 -7582720 -4526109 -3888601 -4097700 -2103825 2366225 6338575
11212 6338575 7260264 6314305 6948252 9850836 11330278 8553657 4497978 4221516 7247361
11203 7247361 8139799 4734907 812518 -535863 -891804 -1648594 -577115 3179972 5518065
11194 5518065 3312710 66456 838942 4842725 7932412 9292861 10342810 9846703
11186 9846703 6047805 1634558 659396 2035618 1821696 378746 1104481 3398674 3592418
11177 3592418 2118875 2700075 4533904 2789089 -2241329 -4097215 -392991 2967208
11169 2967208 969712 -3155248 -3399572 961738 6028343 8078252 5418773 -543186
11161 -543186 -4414867 -1542829 4945152 6978405 2754265 -1035985 28352 2376264
11153 2376264 2559538 3208222 5963362 6033344 509691 -4276690 -1535125 4786848 5890433
11144 5890433 1595287 -646550 2014258 5112952 5744768 6298222 8552908 10347669
11136 10347669 9389349 5985284 1764334 -756319 1312849 6985050 9857321 5988336
11128 5988336 868457 2220867 8170784 10297336 6983607 4677907 5675484 4451911
11120 4451911 -1320631 -5492025 -3766359 -1279038 -3892235 -8322336 -7709186 -2482234
11112 -2482234 1111210 382705 -2060116 -3929653 -5007449 -4694803 -2951490 -2671761 -6341575
11103 -6341575 -11096442 -11783477 -8442976 -5937791 -6117731 -5395829 -1245404 3551111 5334238
11094 5334238 4655311 4429144 5684222 7549058 9221724 9569292 6876667 1772969 -1296829
11085 -1296829 1285754 7213590 10974731 10825180 9298327 7198862 2131034 -5415628
11077 -5415628 -9536325 -6223486 309140 3215825 2569304 4003441 8881284 11809519
11069 11809519 9026510 4047347 2498531 5147426 8710215 10606017 10300077 8360492
11061 8360492 6650093 7380779 9824414 10142523 6616844 2601486 1719026 2584301 1525184
11052 1525184 -1422328 -2931066 -1730154 -4019 275530 -488811 -1065760 -914863 -208699
11043 -208699 138088 -911851 -2522535 -1908929 1984715 6192822 7182877 5134140 2550286
11034 2550286 318249 -1955301 -3002329 -689052 4477277 9291404 11273898 10323869
11026 10323869 7634475 4913824 3915411 4835648 5906736 5935725 5744618 5678509 4120525
11017 4120525 781920 -1157384 677553 3749823 4195362 2209817 10678 -3080004
11009 -3080004 -8496631 -13088255 -11738749 -5139775 413029 1521448 1063062 2170436
11001 2170436 3754218 4029943 4452584 7268811 11428541 13388064 11161243 6400395
10993 6400395 2730730 1954043 1808858 -1047363 -5436353 -6099227 -1571626 2139426 -590184
10984 -590184 -6701753 -8733259 -4951927 -28346 2513326 2951144 1808114 -532038
10976 -532038 -1289675 2010308 6677811 8058285 6845227 7249711 8615454 5965107 -620932
10967 -620932 -4572601 -2663692 447441 135827 -1747776 -1471764 724918 2737095 4397672
10958 4397672 6127218 7024516 6465188 4745576 1285306 -4152821 -8104770 -6050109
10950 -6050109 619540 5163449 4250087 1370944 460201 1251072 2275315 3300864 3367366
10941 3367366 1334881 -717581 158783 1913541 310880 -2455752 91659 7156197
10933 7156197 10298436 6668710 2966238 2970370 1448250 -4452951 -7990028 -3969107 1928021
10924 1928021 2621472 186752 -931412 -2784856 -6961618 -7130618 623146 7282300
10916 7282300 2937266 -6447240 -7516144 -510172 2485969 -1903392 -4534028 -1121949
10908 -1121949 1189867 -1915274 -4278534 -1407783 1010616 -2171559 -5410958 -1228783
10900 -1228783 7151353 10111188 5108159 -1030609 -1582084 3438078 9166999 10779543
10892 10779543 7147828 1886939 -98110 1870571 3905909 3221004 1223745 -81638
10884 -81638 -1306494 -3184028 -3920977 -1930260 785546 923156 -1423696 -2877927 -1353411
10875 -1353411 1522201 3060709 3208272 4169942 6331098 6389299 1571390 -5217579 -7787362
10866 -7787362 -4681172 -1006178 -627313 -790088 2224591 6109400 6151483 3134402 1940803
10857 1940803 3625989 4668243 3791873 3736612 5438537 5904817 3715047 1926979 2971250
10848 2971250 4495164 3293904 524473 -238794 1589200 3247639 2995093 2111445 2198360
10839 2198360 2547864 1592135 155798 1299852 6108904 11248844 12690728 10839815
10831 10839815 9211026 8600914 6409267 2251274 -235329 821534 2107030 416028
10823 416028 -2332092 -2832896 -1678233 -769441 1427113 7022283 13172629 14659764 11117095
10814 11117095 7087100 5448173 4993687 4045918 2361731 -282349 -3545635 -4865801
10806 -4865801 -2177322 1939754 2717989 -161084 -2206765 -680820 2215034 3393585
10798 3393585 2682477 1468912 363917 -481527 -660944 -112441 675129 1191138 762932
10789 762932 -1348378 -4467686 -6207369 -5107777 -2400834 96069 2069804 3348795
10781 3348795 2924129 1272303 955044 2523206 2699296 -569321 -4284799 -4836930 -3118590
10772 -3118590 -1628665 83615 2753041 3643784 630467 -3034586 -3638569 -3647011 -6936298
10763 -6936298 -10182035 -6953245 902963 4534065 1205703 -2185455 -660424 1716373
10755 1716373 -40341 -3240908 -2247524 2433965 5019039 2463999 -2368760 -4815505
10747 -4815505 -3046894 1106923 4370896 5016859 4115163 3848304 5163864 7437128 9205021
10738 9205021 8628207 5198551 1991098 3483440 9345121 13477737 11749401 7428279
10730 7428279 5757197 6616334 6770148 6214885 7114159 8595924 7959932 5881606 5620073
10721 5620073 7806701 10030265 10643655 9590361 7070706 4585694 4899605 7649466
10713 7649466 8285426 5177736 3494200 6988271 10680634 8381373 3194379 2526610
10705 2526610 5964133 6976132 4542510 3764429 5673528 5629496 2381232 320847 1522091
10696 1522091 2980944 3004768 3504726 4829048 4787935 3831534 5109563 8585998 10825548
10687 10825548 10959223 11211382 11690221 10568879 9026021 9905352 12034739 11960981 10244774
10678 10244774 9662203 8893585 5250846 1797734 3603733 8477711 10009436 8296261
10670 8296261 8521430 10511091 9797758 7689720 9208474 11903939 8823595 2451225
10662 2451225 2435481 8300216 8590707 271975 -5408731 -1452511 4339061 4030106 1835976
10653 1835976 3568955 5409337 2616438 -202226 2775428 7907706 8586131 5919726
10645 5919726 4803766 5218986 4809893 4541363 5150633 3584345 -984934 -3562437 -1479135
10636 -1479135 436654 -1237832 -1642095 3395777 8463699 6647457 804226 -1243403
10628 -1243403 1924965 6240572 10067887 13896252 15904129 14804702 13880352 15843948
10620 15843948 16860861 11904912 3409231 -1260309 909029 6485732 10947366 12329328
10612 12329328 11247372 9989385 9989226 9452376 6387575 3456302 4849028 8877695 10112270
10603 10112270 8525230 8711395 10057958 7109927 833235 -868124 3654948 6725271
10595 6725271 4882707 4555793 9585588 13905653 12439802 9222120 8484330 7212891
10587 7212891 2914258 -357431 97372 754389 695761 5538495 16097123 22955240 19518651
10578 19518651 11425532 6337075 3765594 1519671 2052478 5199869 4818406 94449
10570 94449 -246249 7324889 13219338 10020779 4577623 5499631 9446582 9884442 9042358
10561 9042358 10607735 10376659 4962177 728720 3704363 9337478 11761231 13773704
10553 13773704 18221856 19742034 15031304 10955289 12437264 13159269 8479339 5808062
10545 5808062 10945751 16092103 13583197 9778555 12557868 16575677 14236049 10268052
10537 10268052 11978423 15528477 14812977 13528941 16289482 18704329 17523175 18397441
10529 18397441 22959015 22471651 15124643 13131304 20918163 24854440 17769501 13056753
10521 13056753 19342933 23477501 16147579 10873889 17747539 22765504 15266678 10332850
10513 10332850 19661962 27146180 20269416 17063631 31535560 42566674 31633640 20116008
10505 20116008 30468177 43024359 34966221 27791549 46028391 64308983 52974824
10498 52974824 39986561 61390858 87689186 76993334 63067180 96900190 138398957
10491 138398957 124456765 115453191 218787596 359269553 306183372 408 -309784086
10484 -309784086 -367743612 -225565354 -117073913 -125645735 -143165775 -101303634 -61478660
10477 -61478660 -70432189 -80595215 -53941647 -29538236 -40735723 -54404583 -38805853
10470 -38805853 -19906583 -26228239 -37259169 -28013257 -14923780 -19110384 -26473675 -19486879
10462 -19486879 -11934921 -19780101 -29593207 -25338268 -17996084 -21844775 -27203574 -21356519
10454 -21356519 -13138287 -14368804 -18232638 -15855330 -13922881 -18241286 -19991252 -14356392
10446 -14356392 -12469443 -19829580 -23705088 -16828007 -12305243 -19444671 -25817607 -19894414
10438 -19894414 -11591567 -13219695 -18458122 -17346510 -14968802 -18248066 -20091979 -13411177
10430 -13411177 -6485812 -8626689 -14016246 -14208803 -13083375 -15552758 -15415323 -8524266
10422 -8524266 -4267041 -9657097 -15332118 -11681828 -5848150 -8101750 -13875727 -14215766
10414 -14215766 -12223779 -14123677 -15157054 -9404521 -3201219 -3936481 -5574913 -342526
10406 -342526 4811992 -873547 -12805513 -18261791 -16037100 -14334228 -15131593 -14565204
10398 -14565204 -13567844 -15182517 -16205772 -13167761 -11037263 -14670256 -17944635 -13262034
10390 -13262034 -5484203 -3959445 -6719268 -5702233 -2375944 -4342630 -10164559 -11280406
10382 -11280406 -6946451 -4586116 -6347597 -6939012 -4584359 -3773477 -6675860 -10270172
10374 -10270172 -12089346 -11968942 -9173862 -4021928 -329559 -332692 -161628 3672743 7182318
10365 7182318 4879340 -1225533 -5550382 -7720561 -10207044 -11478425 -9314129 -7075974
10357 -7075974 -8664910 -10672629 -7571165 -1646971 156147 -3359595 -7855912 -11309160
10349 -11309160 -14268825 -14959947 -11523400 -6912291 -4891537 -3848219 -1043030 505255
10341 505255 -3196885 -8640636 -9101616 -5095309 -2816422 -3996884 -4833608 -3660306 -2658922
10332 -2658922 -2942023 -4033221 -6721121 -10699865 -11678901 -7011358 -1649813 -1803307 -5181605
10323 -5181605 -4909618 -1039314 31308 -3167418 -4751034 -1320692 2773108 2076188
10315 2076188 -3110352 -8500825 -11050897 -10976111 -10362040 -10061811 -7745368 -1234601 5968948
10306 5968948 7098865 1761273 -2578167 -1721323 -618156 -3385273 -4789853 845067
10298 845067 8306152 8286198 1604263 -2872965 -2250271 -2046156 -5233247 -7892641 -7083185
10289 -7083185 -5591691 -6538621 -8622795 -8974633 -7245069 -5434403 -5669633 -8141788 -10058997
10280 -10058997 -8395842 -4818336 -4431471 -7851709 -9357585 -5931091 -2526208 -3864355
10272 -3864355 -6693311 -6023017 -3776331 -4440758 -6735459 -6938003 -6368850 -7725661 -7737701
10263 -7737701 -2244306 4079411 2392404 -6899145 -14089112 -13573243 -9422910 -6941462
10255 -6941462 -5973412 -4299515 -1928440 -100839 204652 -1852133 -5620781 -8180226
10247 -8180226 -7722586 -6012938 -4811603 -2946046 -241457 -169167 -4002508 -6637304 -3645094
10238 -3645094 1662645 3933991 4091513 5643535 7366115 6794242 6387000 8366343 8031956
10229 8031956 1029660 -6977949 -7562820 -2780219 -970561 -2647849 -1747920 1483140
10221 1483140 888919 -3216077 -3967667 -419460 1362747 210844 1287414 4506886
10213 4506886 3460149 -1865583 -3177139 1879546 4970892 1054543 -3582933 -2632816
10205 -2632816 630406 1020035 38858 536772 356795 -2410709 -4409980 -3196847 -2534122
10196 -2534122 -5916587 -10159764 -10698166 -8416486 -6447756 -4792925 -2486199 -704297
10188 -704297 136495 1997207 4682443 4522480 707858 -2254078 -1634514 -636741 -2125254
10179 -2125254 -3842909 -3588851 -3583079 -5650844 -7315111 -6583440 -5407083 -4743486 -1952349
10170 -1952349 2903832 4430015 487109 -2667580 420301 5577147 5762652 1946308
10162 1946308 379810 2523186 4420110 3803604 1910865 -93859 -1603562 -1140506
10154 -1140506 1506026 3703422 3921174 4487443 7032190 8617462 6338564 2328990
10146 2328990 -3560 -1248208 -3112830 -3947771 -2178852 -932703 -3818230 -8737439
10138 -8737439 -11189429 -11281453 -12012444 -12770343 -10401773 -5555336 -2491010 -3031891 -5188547
10129 -5188547 -7097316 -8137652 -7002407 -2923075 1647356 3273478 1887847 -247501
10121 -247501 -2580853 -5561307 -7209665 -4825840 77379 2492459 122005 -3961512
10113 -3961512 -5308688 -2762490 915076 1704365 -1954474 -7261719 -9967251 -9564046
10105 -9564046 -9427963 -11296531 -12771789 -11477382 -8186143 -4292698 -87533 2613717
10097 2613717 670742 -4847004 -7864342 -5274099 -1310230 -686075 -2282618 -3447406
10089 -3447406 -5026754 -7219235 -6127696 -612061 2795062 -987045 -6547474 -6370892
10081 -6370892 -3731368 -7249707 -15541000 -18359726 -12410393 -5196522 -2182065 -645743
10073 -645743 1299321 -119204 -5725237 -8921027 -5651596 -1763224 -4074501 -9614059
10065 -9614059 -10487805 -5790278 -2097151 -3813676 -8445582 -10985856 -9182764 -4691847
10057 -4691847 -1510906 -2644797 -6546801 -8115768 -4930512 -853761 -1291886 -6185478
10049 -6185478 -10147027 -9172113 -5203964 -3516493 -6438987 -10585809 -10967757 -7313484
10041 -7313484 -4121528 -3780323 -2996091 1166517 5003979 2920772 -3316929 -6043337
10033 -6043337 -2374574 2517620 3944008 3583880 4374718 5004546 3405462 1605579 2563571
10024 2563571 4751693 4191457 407321 -3360953 -4983728 -5235170 -5269109 -5275557 -5799024
10015 -5799024 -7956900 -11451816 -13614143 -11452188 -4868430 2263365 5046761 2480512
10007 2480512 -1386059 -2607494 -2436766 -4660692 -8728171 -9582123 -5257063 -701518
9999 -701518 -1499872 -6425205 -9220605 -6383691 -343812 4647216 7124487 8004181 7231225
9990 7231225 3152371 -3811574 -8704293 -6590072 135172 3067199 -1403705 -6863245
9982 -6863245 -6325243 -2557024 -2683176 -5785114 -4495432 1824047 5069613 1603613 -1660725
9973 -1660725 1281016 5947423 5221254 368505 -2638873 -2898850 -3396473 -3644955 -1114046
9964 -1114046 2007305 776823 -4411585 -8028526 -7503290 -5337100 -3074628 1046217
9956 1046217 7327844 12417662 13613021 11905939 9582482 7682389 6506869 6009924
9948 6009924 5344011 4243843 4362292 6752251 9197412 9270031 8673189 10420943 12746876
9939 12746876 10795040 4371919 -961590 -1365347 1159849 3102552 3598827 3072610 1879133
9930 1879133 1678945 4106877 6611091 3931098 -4175478 -10792556 -10146135 -4567410 -345213
9921 -345213 124567 -1256865 -3036513 -5384741 -7619171 -7909870 -5640803 -2350726 -222071
9912 -222071 -153858 -851174 -47525 2198533 2311905 -2274636 -8146833 -9006424 -3854677
9903 -3854677 1841813 3977183 4613193 7170372 10693563 11716972 9324496 5819113
9895 5819113 3820101 4147001 5397087 5357640 4148226 4642994 7427171 8207538 4798167
9886 4798167 3134067 8986338 16953815 18054879 16058421 22379621 34648277 38427603
9878 38427603 35214402 46752392 76970573 90195231 52458271 -16623616 -61637314
9871 -61637314 -58647337 -37112549 -31325815 -38456637 -37638323 -26779402 -19647638 -20134312
9863 -20134312 -20252927 -17483775 -16676547 -17591819 -15199278 -11116153 -12027950 -17004476 -17835502
9854 -17835502 -12569312 -8235765 -8663023 -9296584 -6723227 -4768849 -7384902 -12149497
9846 -12149497 -14708350 -14632424 -13562338 -11772264 -9637953 -9157133 -11361570 -14625698 -16997449
9837 -16997449 -17645277 -15335038 -9014267 -1244263 2404527 -629175 -6879503 -11137876
9829 -11137876 -11405336 -8827865 -5685697 -4637265 -7000796 -10268990 -10013504 -5728992
9821 -5728992 -1998048 -2138200 -3609747 -2145307 2031351 5053635 4884333 3067327 1895625
9812 1895625 2331937 4187053 6117850 5838856 2526634 -1138001 -1549829 953633 2039671
9803 2039671 -948780 -5327766 -6672916 -4514161 -2118755 -1349496 -706219 886888 1336186
9794 1336186 -1364442 -5125197 -6044051 -3894591 -2179701 -2690819 -3206528 -1421148 1837771
9785 1837771 4718359 6894095 8073355 6495594 1606704 -3404947 -4531996 -1642888
9777 -1642888 1893153 3473935 3146695 2117131 1663043 3051353 6286797 8940633 8085994
9768 8085994 3680936 -1185325 -3435206 -2496864 -36242 1751641 1772496 673029 -291683
9759 -291683 -981862 -2023112 -2930564 -2437863 -1040330 -1067994 -3508033 -6925758 -10116147
9750 -10116147 -12965989 -13791843 -9603846 -1227330 5420214 6255242 4255386 4528535 7158185
9741 7158185 8830856 8849257 8875039 8566736 6328586 3399518 2697099 4164580 5264657
9732 5264657 5384289 5798616 6090889 4792509 2952097 2904347 4088645 4233938 3842444
9723 3842444 4918421 6139760 4583347 1828882 2595730 7066359 10417786 10572149 10099996
9714 10099996 9207006 3928382 -5694965 -12292357 -10651352 -5450321 -4453723 -7872563
9706 -7872563 -9806258 -7637474 -4672506 -4438564 -6565964 -8209413 -6988438 -3059426
9698 -3059426 171383 -1053628 -5775882 -8592012 -6928520 -4923802 -6967943 -10503491
9690 -10503491 -9925749 -5789518 -4500124 -8535052 -12231084 -9668548 -3073510 125378
9682 125378 -3053475 -8053752 -9416977 -7200036 -4977953 -3917601 -2262745 -7452
9674 -7452 -1218 -3171788 -6233969 -6443376 -5596175 -6503175 -8356913 -8966579 -8760758 -8491098
9664 -8491098 -5847447 367842 5119605 2738946 -3573572 -5022368 -17529 3830584
9656 3830584 1880136 -999166 915973 5779964 8539547 8201810 6395139 3291748
9648 3291748 -706447 -3119982 -3187686 -3803384 -6059038 -6049727 -1342682 3504101 2972580
9639 2972580 -1160466 -2926390 -1051779 555872 -437374 -2495464 -3727859 -3514395 -1367235
9630 -1367235 2347540 5435451 6474911 6940074 8087772 8011824 5086920 1917323 1867115
9621 1867115 3643404 3519683 1294841 -276618 -640436 -1517664 -2593633 -1545512 1645333
9612 1645333 4098387 3947863 2064537 180541 -265353 1686335 4953497 6246507 4001932
9603 4001932 821585 -712981 -2247425 -5980611 -9289293 -8051757 -3878839 -2479072
9595 -2479072 -5004242 -6371848 -3094235 1865312 3621332 1159335 -2973109 -5989320
9587 -5989320 -6542457 -5216072 -4207931 -4817608 -5141466 -2291737 3141049 7166992 7253437
9578 7253437 5093936 4045854 5236592 6590333 5080255 250923 -4400901 -4928223
9570 -4928223 -1845689 937917 2295990 5002667 9283859 10218279 4963877 -1832444
9562 -1832444 -4237805 -2898719 -2012420 -2193343 -1866355 -2328290 -5089541 -6967609 -4554109
9553 -4554109 -1103467 -1688868 -3770074 -1023680 4832001 5646133 569849 -1864679 2296935
9544 2296935 6108675 3577026 -826327 -203525 4332151 7743903 9980392 13762496
9536 13762496 17276940 16045492 10217077 4283327 683380 -1587042 -3064179 -3059418 -2481850
9527 -2481850 -3540869 -6304394 -8309311 -7934291 -6256561 -5372011 -6027078 -6800373 -5163053
9518 -5163053 -57558 6378306 10681025 11404639 9175702 4494903 -1633033 -5701972
9510 -5701972 -4529025 -427634 818431 -1864610 -3290884 -176509 4213072 6126935
9502 6126935 6809265 8026013 7007438 1362227 -4431923 -3827784 2059036 5607696 3325332
9493 3325332 -336441 -629151 1253330 1773515 787273 488918 1056697 715598 -773723
9484 -773723 -1699437 -1653802 -2567128 -5175209 -6476461 -3240636 2661903 5514531 3051902
9475 3051902 -434431 -28754 3426427 5442268 4096614 927613 -2485338 -5054133
9467 -5054133 -4793960 -1251667 1644289 -59991 -3636585 -2674865 3006452 6412749 3783275
9458 3783275 -102829 173971 3029265 4073014 3293275 3239723 3347288 1124343 -2784711
9449 -2784711 -5046621 -4202338 -1613782 1013287 2440392 1829843 504544 1895502 6773337
9440 6773337 10433810 8112941 1715090 -2716472 -3418334 -4622865 -9404765 -14589557
9432 -14589557 -14860921 -10026041 -5704447 -6419009 -9468438 -7742715 820919 9183245
9424 9183245 9323276 2516751 -2723979 -2106990 443450 820900 614527 2293927 4090797
9415 4090797 3816356 3435912 5209934 6629031 3905730 -1953433 -6679316 -7860841 -4902488
9406 -4902488 2553948 11313307 13390816 4640171 -7545503 -11966600 -7811023 -4097530
9398 -4097530 -5529277 -6905413 -3146303 2826926 5924020 6569554 7811813 8866974
9390 8866974 6590581 1351598 -2749367 -2835119 238349 3601938 4647658 2447317 -1358343
9381 -1358343 -3640349 -2826071 -207321 2154322 3338160 2829495 -56124 -4609586 -8206318
9372 -8206318 -8967915 -7835373 -6673565 -5570074 -3592060 -1112618 548262 1227355 1765691
9363 1765691 1969465 711099 -1541995 -2200651 216043 3563039 4450780 2641889 1189004
9354 1189004 1934968 2875635 1298879 -1944521 -3323133 -1217470 2294529 4163523 3245353
9345 3245353 600657 -1342373 -140957 4018444 7067117 5020157 -368412 -2763538
9337 -2763538 879581 6488675 8609127 7160362 5937684 6569114 7122847 5723095 2715726
9328 2715726 -500138 -2657862 -2800138 -980460 1347908 2935473 4330221 6560481
9320 6560481 8608875 7706858 2578465 -4199846 -7690789 -5229136 107887 2098995
9312 2098995 -1165332 -4231830 -1377679 5007508 7353796 3341715 -1798249 -3566706
9304 -3566706 -2915022 -1470556 1485452 4574185 3348175 -2161962 -4993269 -1316830
9296 -1316830 2921506 1402727 -2388154 -1998089 242120 -2079377 -6440793 -4072848
9288 -4072848 5040512 10716996 7737089 2543329 1729482 2977208 2132951 1438484 4512014
9279 4512014 8675077 8634939 4465813 683655 -229691 816977 2411004 3140672 1169407
9270 1169407 -3327892 -6890528 -6656245 -3900328 -1501651 68004 1920458 4020744
9262 4020744 5723008 7214240 8216445 7058022 3139800 -1371847 -4100171 -4921734
9254 -4921734 -4567494 -3261222 -2257213 -3620783 -6295479 -5731004 -496266 3850006 1502961
9245 1502961 -5142482 -8131022 -4007652 2681787 5568633 2765934 -2902631 -6985935
9237 -6985935 -6465985 -2063439 2252188 3598345 3530768 5379874 9148532 11424682 10084264
9228 10084264 6818197 4650953 4469797 4431615 2193361 -2157083 -5456725 -4922134 -2130626
9219 -2130626 -1256315 -2930675 -3102626 528859 4626505 5443865 4375525 4481520 4637928
9210 4637928 2102982 -1301710 -1276653 1622117 2467983 -204400 -2645880 -2612208 -2126076
9201 -2126076 -2034622 372462 5523306 8650926 6653194 3573376 4678319 8452098 9627668
9192 9627668 7881113 7812690 10915607 13017305 10757547 6362825 4023269 4264813 4010131
9183 4010131 998563 -3224478 -4576818 -923078 4317647 4594745 -2075965 -9592057
9175 -9592057 -10736975 -6154745 -2527784 -2833445 -3579111 -2153911 -974906 -1718477 -930504
9166 -930504 4118883 9372118 9359731 5988836 5876534 10122600 13032718 11276319 8143892
9157 8143892 6964697 5893373 2364346 -1647906 -2668295 -1092259 136725 87699 -341399
9148 -341399 -1424248 -3875223 -6161648 -5926187 -3715414 -2448592 -3362811 -4923494 -5475871
9139 -5475871 -4598829 -2168003 1312436 3458495 1756490 -2928324 -6838090 -7824324 -7181597
9130 -7181597 -6422901 -4753546 -1266393 2259543 2891688 271036 -2780246 -3381037 -1439751
9121 -1439751 680140 868297 -460505 -796120 1568957 5204686 6692779 4371881 492172
9112 492172 -967264 1265150 4082651 3529867 -220905 -2863663 -1512817 1572918 2510196
9103 2510196 1205268 261989 -295966 -2990358 -7380093 -9128051 -6132013 -1508975 1522576
9094 1522576 3462201 4568729 1901633 -5242079 -10995327 -9694977 -4186239 -1367997
9086 -1367997 -1709140 -121160 3926520 5100090 1855852 -385347 1540257 3061155
9078 3061155 -212914 -4828846 -5036145 -1841814 -673339 -2443053 -2830567 214635 3507271
9069 3507271 3888539 2358908 1409672 1161271 276438 -867202 -262483 2407659 4246816
9060 4246816 2318471 -2062283 -4050332 -1149050 3320437 4385149 1627762 -1364902
9052 -1364902 -2797963 -4353296 -6720600 -7116693 -3236412 2634018 5646308 3483946
9044 3483946 -1911478 -6744698 -8450880 -7192411 -5159259 -4117173 -3778649 -3233997 -3143832
9035 -3143832 -4882320 -7978815 -10162706 -9624542 -5861891 474490 6467940 7418115 1879534
9026 1879534 -4900372 -6535664 -3779547 -2861913 -6069299 -9321353 -9599449 -8899212 -8945560
9017 -8945560 -7675546 -4017983 -1192284 -1535927 -2240319 -238835 2240361 1248441 -2632677
9008 -2632677 -5825777 -7277547 -8410528 -9329178 -8820884 -6879320 -4266364 -1117301 1433810
8999 1433810 514220 -4419368 -8908394 -8414788 -4251244 -1290542 -1451705 -2903370 -4221978
8990 -4221978 -5705936 -7406052 -8796874 -9524619 -8391707 -3652075 3135970 6353775
8982 6353775 3161941 -1305593 -17509 6342725 10425511 7917414 1832395 -2421403
8974 -2421403 -2331449 1092411 4540770 4558681 1320335 -634795 1881666 5932268 6568977
8965 6568977 3695923 1074666 578323 1652718 4316906 7879324 8777605 5159335 1742360
8956 1742360 4035837 9232204 9537452 3581527 -2647094 -5659213 -7289988 -7418227 -2764818
8947 -2764818 4853172 7615828 2788235 -2621476 -2324358 1071809 2819468 4026561
8939 4026561 7165027 9606946 8286631 6242659 7809403 10767271 9801624 5158403
8931 5158403 1686308 1288986 2073626 3177395 4729467 4476343 195606 -5326351 -7058578
8922 -7058578 -4988442 -3751209 -5547783 -8287689 -10334056 -12009835 -12319327 -9226819
8914 -9226819 -3957958 -583203 -463789 -1140620 -1369095 -2937780 -6343002 -8816080 -8406884
8905 -8406884 -6665277 -5679530 -5458763 -5562388 -6253960 -6688554 -5068609 -2115629 -1244355
8896 -1244355 -3430630 -4942196 -2532517 1650606 2967480 214474 -3885015 -6686254
8888 -6686254 -7535853 -6339965 -2565587 3737988 10572873 14141555 11604769 5063958
8880 5063958 1330716 4604733 10041926 8893099 588473 -5356840 -1793130 6619741
8872 6619741 10360436 7374686 3208898 1542785 735214 -918191 -2362889 -3120373 -4710843
8863 -4710843 -7231434 -8196651 -6246304 -2925472 282429 3448166 5669422 4772671 1353111
8854 1353111 -498178 980884 1924656 -1501795 -6861993 -8561248 -5355032 -950201
8846 -950201 1726754 2980318 3465426 2654421 769832 -715686 -1311204 -1922898 -2465220
8837 -2465220 -1362022 1678655 4285516 3887338 460119 -3626489 -5574283 -4200451
8829 -4200451 -1317599 -561790 -3211988 -5998786 -5301304 -2490266 -1781797 -3314052 -2738068
8820 -2738068 1468060 4870408 3563599 -169968 -1920543 -1701202 -2489133 -4377677 -4605068
8811 -4605068 -2660681 -1211556 -1514954 -1310119 1469205 5222445 6595210 4913590 3352818
8802 3352818 5349491 10136078 12859214 10285691 5463832 4205816 7157471 8968795
8794 8968795 6408489 3183284 4000458 7505493 8942984 7024907 3914573 747280
8786 747280 -2088473 -2173377 1968327 6261253 5293483 777801 -332716 3480097 6173423
8777 6173423 4144762 1294145 1032289 211414 -3945857 -6863539 -3315663 3041196 4409854
8768 4409854 806076 -678457 1969029 2535356 -2483171 -7335293 -5718461 -405928
8760 -405928 1477475 -772836 -1816309 -22102 -94196 -4678164 -9202486 -8533941 -4653161
8751 -4653161 -3097673 -4248280 -3587822 43857 2312104 886997 -383660 2011671
8743 2011671 5097470 4328250 1316747 1095954 3572066 3814050 491589 -2082321 -1219588
8734 -1219588 696903 1871190 4377350 8648657 10093698 5839956 658370 679120 4085116
8725 4085116 4042601 -640808 -4063876 -2507775 805729 1832603 1369980 1631078 1158491
8716 1158491 -2646596 -7788231 -8740416 -3601851 2764198 4199183 466897 -2642551
8708 -2642551 -326340 5466982 8272342 4624370 -2084387 -5781725 -4559085 -2039122
8700 -2039122 -2297113 -4924593 -5949533 -3145057 748210 1006779 -3126812 -7001675 -6007766
8691 -6007766 -1099988 2947157 3761458 3092339 2525350 948865 -2327764 -4846866 -3794494
8682 -3794494 131367 3811589 5595341 6358555 7608177 9899129 12106980 11359157 5548713
8673 5548713 -2695856 -6876809 -3802413 2032381 3927019 1100344 -1731345 -1276272
8665 -1276272 1636134 5276169 8519135 9040056 4540936 -2765652 -6641561 -3917389
8657 -3917389 1692041 4931637 5519434 6618346 8807300 9068280 5501666 183091 -3436080
8648 -3436080 -4134467 -2952511 -999779 1179126 2490067 1533917 -1035949 -1929820 878635
8639 878635 4292577 3014956 -3041728 -7329652 -4582557 2406329 6652445 5553491
8631 5553491 2115334 -993211 -4243302 -7883369 -9866504 -8835475 -6542521 -5533494
8623 -5533494 -6026818 -6348694 -5279204 -3136899 -1404744 -1465940 -2824978 -3120951 -1288863
8614 -1288863 283729 -1096490 -4127023 -5165026 -3350867 -706592 2128619 5898593
8606 5898593 8518906 6098064 -442877 -4873522 -4124639 -2373699 -3575027 -4898007
8598 -4898007 -2221191 1962233 1967853 -2227022 -5534561 -6002131 -6699300 -9330510 -11257244
8589 -11257244 -10011799 -6687349 -3663244 -2293004 -3603399 -7798345 -11995919 -11806694
8581 -11806694 -6727807 -1347025 127639 -1856119 -4328018 -5360718 -4050736 254435
8573 254435 6451151 11245689 12365524 11072870 9958701 9446394 7963726 4517885 -366795
8564 -366795 -5548305 -9905516 -12537678 -13076541 -11535018 -8011166 -3522820 -670616 -1507805
8555 -1507805 -4576955 -6122167 -4674113 -2313639 -956753 -16365 1251266 1862876 1257412
8546 1257412 853332 1441393 1270925 -909188 -2869135 -1704587 1708450 3766928 2863339
8537 2863339 755007 -149985 1049225 3547878 5139680 3818006 658855 -561629
8529 -561629 1416890 2721654 -149723 -4435525 -4792157 -1379780 605572 -873883 -2146123
8520 -2146123 -402696 2056384 2187837 751059 -25732 35830 522828 2340993 5117878
8511 5117878 5376115 999829 -4188080 -4216267 1226488 6209060 5899682 1534307 -2542753
8502 -2542753 -4181335 -4365730 -4467382 -4342212 -3090900 -785481 1192909 1745196 1508252
8493 1508252 1836278 2495015 1778231 -679992 -2835249 -3063671 -2649601 -3808186 -6153457
8484 -6153457 -7135879 -5809801 -4132529 -3807045 -3464220 -663218 3780073 5574654 2254522
8475 2254522 -2758580 -3800666 -355667 2306955 809197 -1650973 -936794 1182450
8467 1182450 370748 -2405517 -2204547 1307036 2887359 325798 -2111078 -1038612 1072718
8458 1072718 1500600 2305803 5361458 7159035 4013499 -1083113 -2515390 -488028 153922
8449 153922 -2140325 -4166835 -3402669 -308139 3705055 6526638 5396205 1135175 -38820
8440 -38820 5712821 12646424 12391573 6084107 2127769 3212717 4178047 2741079 2785232
8431 2785232 5018787 4014618 -1406390 -3736200 1556933 7531057 5821800 -883414
8423 -883414 -3908185 -1487413 1234610 1968391 3084772 4933411 4485083 844390 -3273032
8414 -3273032 -5786878 -6727854 -5868637 -3024925 -358588 -517793 -2740813 -4078611 -3777161
8405 -3777161 -3303764 -3163148 -2969257 -3250152 -3714542 -1561496 4403627 9865662 10011601
8396 10011601 6868515 6245285 8477209 8324021 3956649 -366081 -1708004 -2484320 -4958490
8387 -4958490 -7051995 -6494312 -4833884 -4299617 -4089239 -2576703 -359897 1381588 3044870
8378 3044870 4919537 5685457 4584677 2953903 1964806 1090373 259673 971752 3529068
8369 3529068 5561695 5096189 2956714 657855 -1715187 -4066733 -5301014 -5344154 -5536918
8360 -5536918 -5573501 -3255221 828523 2146883 -1240579 -4568063 -2868329 1239782 1223413
8351 1223413 -3513148 -6781671 -4534722 269827 2825369 2333105 691234 -1457737
8343 -1457737 -4503400 -7233677 -7175840 -3655975 1000841 3797815 3959454 3117981 2933879
8334 2933879 3159447 2334315 -161959 -3459707 -6250780 -7626854 -7150951 -5121403 -2623484
8325 -2623484 -481881 1263264 1879040 -545285 -5783093 -9082628 -5909981 1094228
8317 1094228 4220804 760510 -3400359 -2276706 2383655 4934919 3857874 1890090
8309 1890090 768973 264026 835007 2917493 4404111 2861979 -136487 -646688 1808338
8300 1808338 3641301 2671094 747024 213154 735935 631346 -921065 -3646894 -6172983
8291 -6172983 -6055285 -2048807 3373786 5989882 4655390 2213363 1669472 3688710 7503096
8282 7503096 11283711 11582977 6048136 -2229459 -6447393 -3941130 510444 1189667 -1416367
8273 -1416367 -2582071 -359423 2726704 4346956 5475951 7804785 10033682 8820667
8265 8820667 3534989 -1686267 -2496390 -360651 -1009834 -5941871 -9186961 -5544549 1434161
8256 1434161 4625712 3898383 4727784 7206385 4890637 -3253365 -8173514 -3216374 5337727
8247 5337727 7102806 2220776 -708685 1456253 3101849 233648 -3731854 -4303152
8239 -4303152 -1774891 1606605 5189875 8085717 8270075 6269033 5846565 8277726 9707282
8230 9707282 7264572 4017717 3923538 5193896 3610541 109004 -655091 1514896 1560597
8221 1560597 -2553868 -6273804 -5567810 -2965499 -2832283 -4123647 -2642811 1273932 2646583
8212 2646583 -360658 -3434827 -2700944 -244464 -55099 -1536403 -1094462 1442503 2437066
8203 2437066 313125 -2345317 -3358879 -3742327 -4374714 -3603332 -796815 755651 -2042020
8194 -2042020 -6985579 -9123986 -7371028 -5235957 -5514768 -7442739 -9023405 -9239985 -7745735
8185 -7745735 -5008940 -3107877 -3980769 -6499670 -7421240 -5471279 -2450891 -335443 511988
8176 511988 416111 134183 1318987 4596916 7491211 7215008 5109746 4829355 6561818
8167 6561818 7322225 6822173 7821607 9940797 8965800 4171466 418663 247639 -46635
8158 -46635 -2873861 -4358387 -1971490 -783250 -5160455 -9693505 -7026337 -865242 -1341552
8149 -1341552 -9082994 -14040963 -10685153 -4723146 -2442795 -2182423 -187782 2514697
8141 2514697 3796779 5060438 7359325 7654066 3722728 -983635 -1912924 213746 1646917
8132 1646917 1388068 665692 -957833 -4696682 -9029490 -10622813 -8325927 -4142204 -954822
8123 -954822 -435911 -1863031 -2429055 -658286 654246 -1900390 -6116165 -6410104 -2694352
8114 -2694352 -1000864 -3578429 -5035223 -1428530 3649946 6341669 8812295 12525477
8106 12525477 12312178 5030806 -1794958 513398 7794700 8756834 2087565 -2869515
8098 -2869515 -1633007 291048 -1026616 -1905506 192498 1240725 -1421248 -3392514
8090 -3392514 -607940 3547994 3467527 -1083572 -6753977 -11465427 -13569444 -10664853 -3571498
8081 -3571498 2265512 3360293 2810490 4807740 8200377 9410981 8332089 7160679
8073 7160679 6228709 4892088 3883683 3186526 560987 -3972502 -5415905 -196754 7374824
8064 7374824 10076824 7267284 4357739 4208955 4305971 2144855 -1322200 -4012286 -4787188
8055 -4787188 -3044476 515378 2843256 1468529 -1689552 -2543117 -574124 923544
8047 923544 150965 -1170889 -1404041 -1246283 -1578716 -1942717 -2099956 -2695801 -3551266 -3461212
8037 -3461212 -2381965 -1768317 -2108638 -2099437 -869025 903090 2652777 4688807 6459916
8028 6459916 5996738 2322625 -2898999 -7154874 -9381523 -9578001 -7414576 -2803131 2507168
8019 2507168 5363868 3899887 -563318 -4739507 -6449451 -6094375 -5173660 -4330744 -3508359
8010 -3508359 -2994982 -2997710 -2897791 -2392866 -2513383 -3663747 -3860126 -1720068 -97726 -2728174
8000 -2728174 -7547407 -8256212 -3508245 613599 -584335 -4187691 -5370373 -4385241 -3707701
7991 -3707701 -2693516 -266784 764815 -2045969 -5073176 -3487627 199592 -618552
7983 -618552 -5646432 -7077563 -910774 7356632 10255907 6657646 726223 -3152509
7975 -3152509 -2608039 1688950 5319536 3566155 -2859201 -8125199 -8092901 -4032696 719540
7966 719540 4332870 6068698 5792463 4834861 4459380 3350166 -92750 -3477140 -2897219
7957 -2897219 495029 1693982 41560 198525 3511138 4925732 1427752 -2571964
7949 -2571964 -2359986 -150243 -467175 -2657276 -3028428 -1044694 1421044 4037308 6561954
7940 6561954 6288377 1836949 -2867505 -3285310 -938448 -671044 -3202825 -5426362 -6426760
7931 -6426760 -7706558 -8321799 -5457739 -147525 2469828 -435595 -6231245 -10414700
7923 -10414700 -10385691 -6274943 -1440135 -1104760 -6417080 -10890907 -7507788 1438043 7032183
7914 7032183 5898932 3306757 3393029 3373806 304650 -2766236 -1770605 1969679 4771722
7905 4771722 6220761 7374252 6809220 3315363 -135634 -647 2347793 3482586 4149818
7896 4149818 7238934 11131437 11253593 7841667 5803738 6290346 4992571 538747 -2252461
7887 -2252461 -869912 -350901 -4857596 -9527191 -7567771 -1657198 -309629 -4634884
7879 -4634884 -7073897 -3650075 678971 1120915 24315 924215 2007164 586108 -946558
7870 -946558 611655 2802592 1315850 -2393709 -3325311 -924101 1134419 1847632 3369771
7861 3369771 5180513 4137185 665726 -1266228 -1245697 -3364482 -8556969 -12035667 -10653152
7852 -10653152 -7135877 -4305275 -798494 3950330 5943639 2449120 -2690186 -4240489
7844 -4240489 -2526386 -806807 727379 3426016 5621572 4749769 1953622 -3382
7836 -3382 -1344945 -3371332 -4256695 -1724226 1889720 2282600 -449982 -2831437 -3929684
7827 -3929684 -5321184 -6454497 -5310733 -2918970 -2198585 -2960619 -2835298 -2152751 -2790865
7818 -2790865 -3388614 -1461829 852378 -299613 -2625336 -189666 6113109 8768439
7810 8768439 5694966 3517683 5858263 6940745 1872088 -4150827 -3460122 2658658
7802 2658658 6896426 6508813 4662388 3890900 4003349 4716582 5473396 4207565 400974
7793 400974 -2530701 -1708442 767974 1812549 2789930 6001266 8552290 5927696 217480
7784 217480 -1652662 2199195 6343628 6203568 3095472 72600 -2121976 -3124599 -1502362
7775 -1502362 2212496 4390280 2712030 -750763 -2901467 -3749246 -4991731 -6347056
7767 -6347056 -5805772 -2795670 849285 3012532 3244352 2495715 1571911 313908 -1506662
7758 -1506662 -2956939 -2760954 -1522467 -1597040 -3927636 -6479799 -6893859 -5211001 -2847639
7749 -2847639 -662592 557109 -174138 -1881681 -1428625 2053178 4749680 3247662 -28452
7740 -28452 -151766 3217736 6301341 7559193 8746981 9862872 8094884 2868477 -2362300
7731 -2362300 -4931050 -5977779 -7053934 -7033624 -4428533 -256477 3256092 4972609 4695436
7722 4695436 2719982 510543 -181637 373579 539968 693800 3231698 8243469 11865590
7713 11865590 10552571 5264059 308711 -744473 2060103 4737582 2757408 -2929769
7705 -2929769 -4994670 1157778 9153456 8655648 184809 -4715517 113100 7089113
7697 7089113 7205720 2909183 1869190 4012550 3386868 -641572 -3118228 -3145201 -5200473
7688 -5200473 -10292368 -13429336 -11633114 -7971080 -5378166 -2264895 2929104 7813760
7680 7813760 9827076 9783341 8655845 4882583 -1576430 -6151980 -4976972 -785783 834202
7671 834202 -728299 -1575710 -556852 -1021742 -4657997 -7996910 -7214316 -3535765 -1377142
7662 -1377142 -2665704 -5152801 -5498120 -2277862 3399730 8536706 9903092 6843350
7654 6843350 2400727 18607 -734342 -3001056 -7066800 -9078984 -6983147 -4628672
7646 -4628672 -6575292 -10757704 -10669844 -4479470 2384669 4539951 2560492 39272 -1563085
7637 -1563085 -2730201 -3487722 -3962484 -5268563 -7384873 -8039968 -6002448 -3458629 -2578693
7628 -2578693 -1712716 1998509 7699383 11514637 11228780 7823846 3472434 263868 -435163
7619 -435163 467247 523825 -117196 1800741 6349815 7550610 1498586 -6134067 -7068950
7610 -7068950 -2563850 -1144412 -5097540 -7513267 -3990191 877455 1957097 1450901
7602 1450901 3592233 6837804 6730882 3185663 80028 -398191 678456 1449317 725359
7593 725359 -1196191 -1462221 2885020 9743538 12791773 9723633 5816105 6515832 10408863
7584 10408863 12835551 12470698 10429857 6814041 2703759 1868990 5355506 7773403
7576 7773403 4604177 -69695 367318 4136072 3924738 -934526 -3699030 -1786021 -414633
7567 -414633 -2601883 -3681390 212198 4914183 4639116 747511 -1239533 43157 1718109
7558 1718109 2605704 4044973 5622587 4683586 624870 -3512501 -4676611 -3163598 -1672039
7549 -1672039 -2116245 -3885846 -4944850 -4536314 -4291690 -5738654 -7347075 -6137889 -2382547
7540 -2382547 -172280 -2133922 -5748356 -6691305 -4256772 -1441247 -576440 -979492 -873754
7531 -873754 36062 601601 105678 -836062 -1530901 -2532815 -4298917 -4769441 -885688
7522 -885688 6147988 9878297 5854233 -1959815 -5652653 -3180925 258759 113363 -2790960
7513 -2790960 -5727895 -7575919 -7562606 -5007168 -2288036 -3827864 -9575050 -13469053 -11489590
7504 -11489590 -7534968 -7547510 -11036871 -12911934 -11340532 -8820222 -6666970 -3494157
7496 -3494157 622987 2763981 1184388 -2083782 -3782720 -2834673 -705003 264347 -1209587
7487 -1209587 -4096258 -6186705 -7035496 -8077465 -8813084 -5881589 1303500 6956739 5446095
7478 5446095 -352464 -2512774 690937 2849187 -243042 -4253912 -3422472 709489
7470 709489 2162857 -597545 -3326889 -2658258 -74672 1199643 425014 -580115 -110894
7461 -110894 1471379 2005517 -94295 -3353342 -4075048 -646684 4055636 6059528 5104681
7452 5104681 3983716 3788440 2779967 481463 -315004 2266243 5312332 4538219 578244
7443 578244 -1518603 696750 3827187 3711676 944542 -905006 -539037 422529 1009981
7434 1009981 2244791 4918361 8151154 10314143 9969738 6457074 1256173 -2103375
7426 -2103375 -1727616 -102692 -577016 -2150045 -1178452 2540393 5662593 6993997 8207181
7417 8207181 8379007 3947225 -3630049 -6459297 -679083 6942291 8156884 4566832
7409 4566832 3568807 6391976 7495947 4395525 838580 49007 1127996 2929927 5724440
7400 5724440 7825564 6094041 1626265 729 3634759 8171002 8704921 5661381
7392 5661381 2195923 -397033 -1989285 -1730974 201192 1644785 1838784 3186447 7022124
7383 7022124 10153731 8722817 3767131 -34371 -174237 1499245 1821921 -83068 -1834904
7374 -1834904 54465 5943844 11172923 10763839 6066046 3438625 5597839 8127311
7366 8127311 6245849 1122779 -3061970 -4759524 -4733243 -3391315 -1922723 -3227727 -7869809
7357 -7869809 -11403095 -9619738 -4522211 -1222176 -755766 -170202 1735036 3306796 3969775
7348 3969775 4886039 5730479 4676416 1897012 -140290 -70160 1376956 3385052 5196435
7339 5196435 4942935 1659551 -1996332 -2436507 -154500 1417731 1492802 2314405 4170240
7330 4170240 4565755 3015827 2238760 3324504 3843572 2455772 1599888 3459129 6382324
7321 6382324 7426535 5879283 2606454 -1460243 -4706801 -5520176 -5066245 -6432253 -9585621
7312 -9585621 -10706659 -8460185 -6919528 -9146994 -11593136 -9185143 -3313649 205747
7304 205747 -205819 -374414 2310873 4719796 2882303 -2134891 -5819913 -6309403 -6421824
7295 -6421824 -9252039 -13380631 -14267074 -10390965 -5701135 -4334520 -5091954 -4255276 -2117494
7286 -2117494 -1999859 -3342389 -1670319 3340498 6011685 3761551 1872317 4641893
7278 4641893 7648043 5237937 833379 1576715 5832746 5463139 -266684 -2976701 910599
7269 910599 4079267 498460 -4325287 -1680592 7238718 13559865 12975437 9216213 6739970
7260 6739970 5814769 4796620 2609897 -1521847 -7176839 -11137121 -9917194 -4540618
7252 -4540618 -75413 321808 -1435411 -1914456 -688923 -15833 -1305936 -3306834 -3761781
7243 -3761781 -2464362 -2106762 -5026858 -9185627 -9559033 -4665372 760382 1925549 498957
7234 498957 1425767 4886784 6271367 4132795 2878306 5547420 8490993 6807448 1997070
7225 1997070 -65766 2581486 5714467 4765425 -273554 -6065022 -9303643 -8355664 -4053415
7216 -4053415 141506 752119 -1809691 -3451056 -1373752 2776682 5766690 7003321
7208 7003321 8181567 9925229 10838016 9565837 6216148 1882185 -1940408 -3700483
7200 -3700483 -2981983 -1408641 -1145810 -2358279 -3165437 -2175887 -131990 911835 -792536
7191 -792536 -5396548 -10456011 -11772370 -7264790 -132560 3823834 2475225 -850247
7183 -850247 -2101043 -663251 1922858 4654111 6760848 6958399 5118582 3103774 2178882
7174 2178882 1324373 -230511 -1157266 -978933 -2148548 -5837050 -8154930 -5043009 750157
7165 750157 2703077 -243464 -2986070 -2820398 -2657144 -4340133 -4891492 -2320312 272181
7156 272181 294596 657793 4399447 8144414 6524043 678604 -3382780 -3619494 -3493209
7147 -3493209 -4886654 -5014369 -1665525 2865572 5089762 4582922 3105619 1584960 -322995
7138 -322995 -2723085 -4519611 -3735039 660545 6548070 9752927 8845195 7004045 6895606
7129 6895606 6050542 975223 -6023181 -8926345 -6251455 -2248585 162764 2327034
7121 2327034 4748514 4619364 973367 -2276351 -1572715 1602384 4192597 6176567 8320986
7112 8320986 8544594 4773320 -458915 -2351322 -75547 2461852 1759518 -1629005 -4220084
7103 -4220084 -2974884 1600031 4972790 3019288 -2369925 -4962903 -2632018 -337921
7095 -337921 -2428706 -6196136 -6797525 -4738388 -3687518 -3997593 -3810982 -4048732 -6264051
7086 -6264051 -7480423 -3963317 843094 -434079 -7519893 -11712068 -8496022 -3658278
7078 -3658278 -3592304 -6155303 -5754541 -2158321 1028319 2634985 3360697 2110357 -1667075
7069 -1667075 -4239169 -1600295 4135729 7390318 7134318 6989904 7666538 5087530 -2338866
7060 -2338866 -9394978 -10052917 -5038387 -420500 35958 -1488894 -831148 2440158 4599688
7051 4599688 3004383 205851 876818 5070241 7612627 5314589 1462684 587460 1815551
7042 1815551 1351255 -580744 -167711 3358994 6466917 7052952 6864556 7294188 7138171
7033 7138171 5926602 5227966 4839215 1967181 -3386525 -6486268 -4519204 -1304571 -1536808
7024 -1536808 -3915037 -4563895 -4080450 -5559804 -7821582 -6980086 -3936751 -3721908 -6813703
7015 -6813703 -7530155 -2965465 2285110 3242881 1409099 947482 2185500 3011234 3471669
7006 3471669 4628044 5209206 3681062 1889078 2482242 4076489 3226397 389792 -360193
6997 -360193 2479502 5802443 6424423 4354092 1127825 -2033399 -3826734 -3408115 -2047446
6988 -2047446 -2053377 -3732174 -5350805 -5815527 -5267752 -3887212 -2701317 -4204275 -8665151
6979 -8665151 -11354545 -8080584 -2239238 -614322 -2909698 -2601668 1358397 2276116 -2064993
6970 -2064993 -3804128 2789681 11147002 11875753 6521270 3508449 4803421 5822765
6962 5822765 5819328 8471543 12693722 12355519 6531935 1804551 2095472 3406920 1417178
6953 1417178 -2149300 -3955480 -4241029 -4115116 -2365519 1653959 5774755 8247125 9418207
6944 9418207 8352290 2698761 -5526808 -9387347 -5922562 -759045 189189 -1297256
6936 -1297256 -955883 -355173 -3367098 -7658230 -7212789 -2206416 698269 -1655856 -4859775
6927 -4859775 -4509443 -2676157 -3994672 -8496798 -11266194 -8161888 -425613 6046032
6919 6046032 6039469 362836 -4807920 -4867863 -1714031 -166086 -1244361 -1798334 164043
6910 164043 2964268 4191124 3679995 3084969 4003817 6507685 8444762 7039297 2551103
6901 2551103 -971439 -485263 1934883 2193918 10925 -1448963 -1036425 -1286806 -4294124
6892 -4294124 -8637167 -11151363 -10046988 -6089978 -2117411 -1033047 -2803740 -4098636
6884 -4098636 -2317659 1261654 3982386 5473626 6339265 5456971 2265301 -42334 1880112
6875 1880112 5745063 6352806 3708940 2953407 5525790 6244697 1565561 -4330769 -5318937
6866 -5318937 -1625798 1444630 732608 -2278345 -4570447 -4126839 -461086 4622978 7328555
6857 7328555 5119045 -423501 -5188952 -6451185 -4396203 -909645 1928750 2980744
6849 2980744 2731505 2303445 1588650 -324092 -2664695 -3007221 -749085 1399135 797433
6840 797433 -1862830 -4074996 -4716032 -4170975 -2801906 -1270924 -1295787 -3862832 -7017770
6831 -7017770 -7355841 -3929525 649370 3296337 3600397 3311295 3267132 1844492 -2850063
6822 -2850063 -9516330 -13613474 -11588942 -4570315 2770055 6317590 5091617 1267804
6814 1267804 -1185537 545974 4824528 6545524 3172504 -1832720 -3709785 -2537091
6806 -2537091 -1774870 -2610506 -3465224 -3680690 -3612137 -2222358 1017820 2991638 808179
6797 808179 -2098015 223612 6504630 9165545 5911494 3108355 5211510 8146033
6789 8146033 7133280 4462570 4367062 5661740 5063860 3385111 2831049 1912152 -1433268
6780 -1433268 -4862198 -5013539 -2933994 -1359330 77034 2074225 2008095 -1414446 -3905359
6771 -3905359 -2262502 -1005658 -4895191 -9050788 -5832803 1484693 2742925 -2501554
6763 -2501554 -4000114 2328051 8117335 6790335 3467181 4949747 8698212 8777906 5961889
6754 5961889 4637238 4764556 3849095 2782828 2995701 1308162 -5311462 -12226450 -11572552
6745 -11572552 -3562689 2929779 1532416 -4914386 -9627977 -9698132 -7209474 -5301805
6737 -5301805 -4689656 -3496015 -567624 1511183 -685870 -5012352 -4573678 2442772 8430712
6728 8430712 6520498 1049989 1427411 8108313 12445386 10073628 6246896 5812923 5428075
6719 5428075 156215 -7698488 -11725943 -9995440 -5478254 -340585 4907339 7842563
6711 7842563 5355667 -755975 -3942048 -600909 5384945 7805302 5532902 2592173
6703 2592173 2350373 3973234 4253062 1415676 -2769827 -4128873 -397614 4932010 5215153
6694 5215153 -922504 -5999262 -2068365 8618881 15908134 14530909 9209365 5733203
6686 5733203 3274630 -446505 -2180274 1807788 7076231 5446901 -2588055 -7811237
6678 -7811237 -5898034 -3480659 -7250873 -13560796 -14140053 -7824898 -944178 1487450
6670 1487450 -216989 -3691713 -6905606 -7746841 -5416648 -2355550 -1506788 -1922781 -515193
6661 -515193 2076265 1543231 -3163834 -6923759 -4819139 1307859 5434971 4729668 1367561
6652 1367561 -1972999 -4747460 -6058448 -3311129 3644236 9171179 6984206 -1249815
6644 -1249815 -6663973 -4085262 1948971 4837964 5139534 7076761 9403499 7254288
6636 7254288 2062225 1204810 6089243 8698336 3821606 -2613742 -3018939 314072 336830
6627 336830 -2789063 -3350063 -1225763 -2371609 -8005852 -11420987 -7696818 -264960 4901441
6618 4901441 6628006 7195365 7601292 7134663 5153681 1310558 -3865880 -7596286 -6635670
6609 -6635670 -1369104 4321023 7597273 8207450 5828567 231041 -5406746 -6388240 -3289413
6600 -3289413 -1824017 -3794629 -3847378 1137649 5209420 1768100 -5408923 -6797483 -828741
6591 -828741 4375290 3000362 -1526918 -3322060 -1990649 -751598 -831143 -1344360 -2131534
6582 -2131534 -3213333 -2896317 386488 4871524 6784931 5054516 2689067 2930072 5565154
6573 5565154 7921070 8447015 8032804 7980173 7913812 6401680 3086696 -693526 -3317104
6564 -3317104 -4044081 -2741400 330359 3756850 5152523 3586903 1394409 1844249 4727143
6555 4727143 6017006 3064703 -1292962 -1848206 2250487 6361744 6539541 4307674 3475157
6546 3475157 4476609 5013434 4975620 6490900 8792812 7536745 1299898 -4900401 -5551233
6537 -5551233 -1412342 2680577 4245521 3918110 2203635 -188339 -414337 3345990 7670792
6528 7670792 7549219 3634240 846951 255071 -1680616 -5360617 -6347417 -3475503 -1991807
6519 -1991807 -5000680 -7686510 -4714393 1520598 5131811 5052190 3787569 1693731 -1559630
6510 -1559630 -3003902 -350640 2383211 -58541 -5241819 -6335596 -3265812 -2694848
6502 -2694848 -6542639 -8686075 -5206760 -400443 865818 279100 1400128 3461948
6494 3461948 4479353 5689020 7864609 7569160 2804382 -1281462 1016390 6076089
6486 6076089 5007265 -3030716 -9031910 -7073850 -2227787 -2182194 -6301860 -7871349 -4131179
6477 -4131179 1101203 3853948 4422272 4717043 4814345 3984162 2939285 2797392 2732584
6468 2732584 832710 -2601706 -4367387 -1847470 3702549 8222218 8777402 5872874
6460 5872874 2377336 835598 1464525 2177054 862650 -2104319 -4400344 -5018535 -5343778
6451 -5343778 -5943015 -4533509 263638 4937293 4858137 1571139 1555496 6472824 9575388
6442 9575388 5155791 -2365597 -3810034 2252875 7893071 6772808 1519405 -1588789
6434 -1588789 -928472 636877 1207157 1054085 -306502 -3931229 -7834225 -7360732 -1284743
6425 -1284743 4949364 4925554 -898449 -5874313 -5445600 -1813842 386038 128652 -399269
6416 -399269 -256423 -829038 -2820625 -4710534 -4865958 -3644394 -2683185 -2987568 -4216706
6407 -4216706 -5376469 -5942231 -6244004 -6373124 -5164798 -1923685 821957 -812332 -6043108
6398 -6043108 -8625007 -5090329 -596460 -1907829 -6942880 -7483683 -1488786 4237669
6390 4237669 4583794 2242760 832400 -988640 -4200453 -4637448 408250 5672620 4808876
6381 4808876 183544 -1400956 33533 -1192723 -5263033 -5671791 -195363 5079571
6373 5079571 5335247 3518607 3537834 3180457 -1136012 -6998515 -8879701 -5920208 -2128706
6364 -2128706 -316246 166810 555522 924480 949039 96307 -2202949 -4707216 -4069905
6355 -4069905 1251252 7859344 10572044 8092295 3733697 1400027 2535955 5860476
6347 5860476 8179946 6626397 2095584 -748576 993420 4288615 4085375 199559
6339 199559 -2734251 -1583015 2111891 5222767 6348292 5624711 3834605 2458320 2620216
6330 2620216 3480060 3473155 3221150 4862803 8070200 9386063 6742594 2351390 -592232
6321 -592232 -2190030 -4575702 -7492154 -7938201 -4814388 -1835952 -3775651 -9962421 -13636209
6312 -13636209 -9508559 -916058 3417680 205709 -4066624 -1765637 5715423 9979179
6304 9979179 6320579 -1634829 -7575292 -8664060 -5560120 -374109 3790762 4549143
6296 4549143 3372796 4321798 8008755 9829163 6372476 649949 -1905965 -199566
6288 -199566 2857082 5164775 6285519 5249701 1722155 -1494846 -1323074 495247 -565432
6279 -565432 -4378090 -5316534 -277045 6618083 9636960 8234383 5448805 2661354 -377480
6270 -377480 -2463624 -2093719 -895603 -1948597 -4559713 -4373577 273789 5210836 5547635
6261 5547635 1996890 -9460 3216634 9548958 13375713 11408988 6236416 3832226
6253 3832226 6885730 11308231 10972035 5367063 -31912 -1202527 -93037 -340229 -2001824
6244 -2001824 -3446542 -5394787 -8635254 -9587695 -3776038 6010068 10476328 4763463
6236 4763463 -5676674 -12520014 -13726482 -12087668 -8857679 -3947597 88483 157673
6228 157673 -1893114 -1287157 1972916 2775765 -508886 -2543150 1095968 7132974 9588006
6219 9588006 8150219 7029450 7623876 7287380 4800614 2450841 1953077 2003437 1257417
6210 1257417 936967 2752004 5962983 7909981 6439156 1314766 -5255209 -8993250
6202 -8993250 -6494198 749250 6523717 5590757 -1273139 -8529063 -11171131 -8206168
6194 -8206168 -2442948 1768412 1751704 -793667 -941833 3954146 10422448 12457445 8828407
6185 8828407 4601274 4631722 7567685 8053779 3765723 -2029661 -5156358 -5774111 -7355680
6176 -7355680 -11064887 -13212318 -9586616 -1499381 4464246 3521448 -1852778 -5127280
6168 -5127280 -3643917 -1038093 -1360821 -3518941 -3808331 -2163784 -2238666 -5146316 -6899715
6159 -6899715 -4047395 1086027 3900456 4304867 6011145 9745527 11757037 10064204
6151 10064204 7706707 7257478 6046557 942883 -4775303 -4560409 1998586 7876177
6143 7876177 7476877 2452241 -2712695 -6470107 -8752659 -7553268 -1442657 6063338
6135 6063338 8939050 5568065 252819 -2333798 -1527301 758915 2960019 4138716
6127 4138716 3533716 1567284 151971 528606 1430663 579857 -2306593 -4963912 -5076102
6118 -5076102 -2772993 -410844 51526 -794306 -725579 1041524 2625041 1929297 -610117
6109 -610117 -2820381 -3603019 -3617823 -3717489 -4226956 -5399658 -6949181 -7416342 -5785723
6100 -5785723 -3466191 -2616297 -2740702 -1494259 1099042 2365468 1614543 1552128 3436703
6091 3436703 4338556 1874756 -1419779 -1885440 -423420 -430645 -1934094 -2268942 -1501969
6082 -1501969 -2300423 -4528524 -4913098 -2869525 -1856039 -3333708 -3983217 -1388521 1742944
6073 1742944 2370664 2525344 5695978 10240683 11035474 6728711 1219302 -1896474 -2703720
6064 -2703720 -2569007 -1807073 -742263 -367431 -538109 616908 4126608 8260330 10342563
6055 10342563 9737992 8132255 7209547 6701582 4893347 1073988 -2812463 -3719191 -779063
6046 -779063 3911081 7838584 9936365 9694638 6700189 2250534 -764561 -1309659 -1529899
6037 -1529899 -2822248 -3012107 -70313 3694348 4562835 2713759 996058 161927 -532934
6028 -532934 322640 4206769 7886818 6508534 1455327 -893734 1046175 2012168 -611106
6019 -611106 -2125108 1192957 5429350 5449820 2806506 1881015 2443945 1841399 1026987
6010 1026987 2186717 3078776 271182 -3855561 -4128536 -1669844 -2923108 -9096712 -13242059
6001 -13242059 -9874599 -2187983 2917533 3059793 1121559 584540 2218454 3803677
5993 3803677 2413026 -1573148 -3504510 -94056 5177901 6070432 2179047 -1013988
5985 -1013988 -514845 728869 -572632 -3811240 -6958268 -8715563 -7093134 -747725
5977 -747725 6657477 8398658 3174550 -2912336 -4869821 -4381228 -4548431 -4568547 -3091969
5968 -3091969 -1793622 -1592893 -22921 3388176 3909358 -1194925 -6672687 -6183742 -1443281
5959 -1443281 1446366 1299534 954117 87291 -3705905 -8338009 -9005918 -5890881 -3538221
5950 -3538221 -3234053 -2585769 -1948625 -3881748 -6141176 -3120446 4354015 8366762 5458744
5941 5458744 1573272 2251017 4809457 4596543 2885175 3224706 4679583 4265129 2712415
5932 2712415 2637400 3567497 3477485 3053726 3977716 4847798 3138472 -219709 -2259406
5923 -2259406 -2753635 -3636663 -4565740 -3066666 969749 4336405 4545453 2503848 862035
5914 862035 1255457 3122896 4348893 3717179 2989792 4708038 7657770 7771683 4723024
5905 4723024 3404069 6161317 7996177 3868790 -2959437 -5421253 -2757605 79468
5897 79468 1295410 3424645 5979085 4524751 -1058397 -4155648 -613766 4999279 6293205
5888 6293205 3890578 2782167 3951646 3789508 720165 -2160081 -1565357 1848040 4745784
5879 4745784 4907498 3114828 1964481 3007003 5028030 5612427 4069380 1582681 -1098849
5870 -1098849 -3941407 -5615674 -4197464 -850361 374420 -1687478 -2881370 62450
5862 62450 3798679 2980539 -1279113 -2614616 1209962 5289032 5153971 2528608 933210
5853 933210 -246373 -3266040 -6462489 -6131021 -2924528 -1524431 -3658840 -5988426 -6073313
5844 -6073313 -5818465 -6532005 -5020175 1027860 6790787 5020764 -3826493 -11388203 -11783319
5835 -11783319 -7553193 -4191564 -3443863 -4207639 -5845682 -7332429 -6172127 -1599949
5827 -1599949 3292011 5566741 6384493 8012893 9459380 8823330 7762701 9124408 11563148
5818 11563148 11269767 8292232 6249332 5936383 4326844 587076 -1977475 -1517380 -621768
5809 -621768 -1719089 -3608695 -4746013 -5917983 -6982953 -4933284 1230172 6920417
5801 6920417 7283078 3792857 1576920 1970179 1935598 -148408 -2436936 -3419271 -4063990
5792 -4063990 -5364739 -6543595 -6687667 -6123296 -5259299 -3604966 -776641 2476712 4766599
5783 4766599 5079948 3406203 954186 -527368 -137531 1902569 5376760 9975807 13450882
5774 13450882 12036724 4832388 -3397162 -6137105 -1754633 5175755 8847556 7406661
5766 7406661 3749746 2290547 4503152 7135116 5834047 787958 -3227734 -3024067
5758 -3024067 -367788 2136929 4776194 7468228 6763634 1097498 -3720776 -636207
5750 -636207 7876040 11757069 6850176 59992 -1094043 1962911 3420695 2134855
5742 2134855 1079318 1016392 149109 -1258187 -679842 2383011 5467844 6455957 4960824
5733 4960824 991728 -4417946 -7521647 -4797268 1431606 4002954 -385030 -6417879
5725 -6417879 -6889641 -1999171 1710043 794279 -982735 851129 4619185 5244757 1821860
$$ [...]
##END NTUPLES=NMR SPECTRUM
##END=
