##TITLE=31Pdec_SR9-rm
 , 24 sc
 17.11.2020
##JCAMPDX= 6.0         $$ Bruker NMR JCAMP-DX V2.0
##DATA TYPE= NMR SPECTRUM
##DATA CLASS= NTUPLES
##ORIGIN= UXNMR, Bruker Analytische Messtechnik GmbH
##OWNER= root
$$ XWIN-NMR		Version 3.5
$$ Tue Nov 17 13:39:23 2020 Russian Standard Time (UT+4h)  she@DPX200
##.OBSERVE FREQUENCY= 81.013821
##.OBSERVE NUCLEUS= ^31P
##.ACQUISITION MODE= SIMULTANEOUS
##.ACQUISITION SCHEME= undefined
##.AVERAGES= 24
##.DIGITISER RES= 17
##SPECTROMETER/DATA SYSTEM= spect
##.PULSE SEQUENCE= zgpg30
##.SOLVENT NAME= D2O
##.SHIFT REFERENCE= (INTERNAL, D2O, 0, 182.463)
##AUDIT TRAIL= $$ (NUMBER, WHEN, WHO, WHERE, WHAT)
$$ ##TITLE= Audit trail, XWIN-NMR		Version 3.5
$$ ##JCAMPDX= 5.01
$$ ##ORIGIN= Bruker BioSpin GmbH
$$ ##OWNER= she
$$ F:/spectra/data/she/nmr/P31/1/pdata/1/auditp.txt
$$ ##AUDIT TRAIL=  $$ (NUMBER, WHEN, WHO, WHERE, WHAT)
(   1,<2020-11-17 13:38:11.95 +0400>,<she>,<DPX200>,
      <created by zg, POWCHK disabled, PULCHK disabled
       configuration hash MD5:
       00 E9 B6 7A A2 85 ED C7 34 08 36 98 17 FE 4E 26
       data hash MD5: 32K
       03 A2 4B 1A DA CC 91 5C AB FF 92 89 60 2A 76 DF>)
(   2,<2020-11-17 13:38:16.07 +0400>,<she>,<DPX200>,
      <Start of raw data processing
       efp BC_mod = 2 LB = 1 FT_mod = 6 PKNL = 1 PHC0 = -2423.858 PHC1 = 139.2008 SI = 64K 
       data hash MD5: 64K
       94 6A EF 55 E3 0F 32 63 EE F2 F6 F4 51 53 E5 66>)
(   3,<2020-11-17 13:38:34.62 +0400>,<she>,<DPX200>,
      <pk PHC0 = 15.98036 PHC1 = 0 
       data hash MD5: 64K
       CA 26 C2 0E EC 52 2B D9 8D 27 A0 C8 79 0F 7A BA>)
(   4,<2020-11-17 13:38:45.82 +0400>,<she>,<DPX200>,
      <abs ABSG = 5 
       data hash MD5: 64K
       3E 19 0D 6F 15 3F 9D 07 CD 5E 96 23 37 1F EE E5>)
$$ ##END=
$$ 
$$ hash MD5
$$ C7 64 27 49 FB 48 02 9C 83 E8 7B 0B 02 59 42 30
##$RELAX= 
##$RELAX= 
##$RELAX= 
##$RELAX= 
##$RELAX= 
##$RELAX= 
##$RELAX= 
##$RELAX= 
$$ Bruker specific parameters
$$ --------------------------
##$DU= <F:/spectra>
##$EXPNO= 1
##$NAME= <P31>
##$PROCNO= 1
##$TYPE= <nmr>
##$USER= <she>
##$AMP= (0..31)
100 100 100 100 100 100 100 100 100 100 100 100 100 100 100 100 100 100 
100 100 100 100 100 100 100 100 100 100 100 100 100 100 
##$AQSEQ= 0
##$AQ_mod= 1
##$AUNM= <au_zg>
##$AUTOPOS= <>
##$BF1= 81.014009
##$BF2= 200.13
##$BF3= 200.13
##$BF4= 200.13
##$BF5= 200.13
##$BF6= 200.13
##$BF7= 200.13
##$BF8= 200.13
##$BYTORDA= 1
##$CFDGTYP= 0
##$CFRGTYP= 5
##$CHEMSTR= <none>
##$CNST= (0..31)
1 1 145 1 1 1 1 1 1 1 1 1 1 1 1 1 1 1 1 1 1 1 1 1 1 1 1 1 1 1 1 1 
##$CPDPRG= <waltz16>
##$CPDPRG1= <>
##$CPDPRG2= <waltz16>
##$CPDPRG3= <>
##$CPDPRG4= <mlev>
##$CPDPRG5= <mlev>
##$CPDPRG6= <mlev>
##$CPDPRG7= <mlev>
##$CPDPRG8= <mlev>
##$CPDPRGB= <>
##$CPDPRGT= <>
##$D= (0..31)
0 1 0 0 0 0 0 0 0 0 0 0.03 2e-05 3e-06 0 0 0 0 0 0 0 0 0 0 0 0 0 0 0 0 
0 0 
##$DATE= 1605605891
##$DBL= (0..7)
120 120 120 11 120 120 24 19 
##$DBP= (0..7)
150 150 150 150 150 150 150 150 
##$DBP07= 0
##$DBPNAM0= <>
##$DBPNAM1= <>
##$DBPNAM2= <>
##$DBPNAM3= <>
$$ [...]
##$SUBNAM3= <"">
##$SUBNAM4= <"">
##$SUBNAM5= <"">
##$SUBNAM6= <"">
##$SUBNAM7= <"">
##$SUBNAM8= <"">
##$SUBNAM9= <"">
##$SW= 369.568048894756
##$SWIBOX= (0..15)
0 1 3 0 0 0 0 0 0 0 0 0 0 0 0 0 
##$SW_h= 29940.119760479
##$TD= 32768
##$TD0= 1
##$TE= 0
##$TE2= 300
##$TE3= 300
##$TEG= 300
##$TL= (0..7)
0 120 53 12 22 120 120 120 
##$TP= (0..7)
150 150 150 150 150 150 150 150 
##$TP07= 0
##$TPNAME0= <>
##$TPNAME1= <>
##$TPNAME2= <>
##$TPNAME3= <>
##$TPNAME4= <>
##$TPNAME5= <>
##$TPNAME6= <>
##$TPNAME7= <>
##$TPOAL= (0..7)
0.5 0.5 0.5 0.5 0.5 0.5 0.5 0.5 
##$TPOFFS= (0..7)
0 0 0 0 0 0 0 0 
##$TUNHIN= 0
##$TUNHOUT= 0
##$TUNXOUT= 0
##$USERA1= <user>
##$USERA2= <user>
##$USERA3= <user>
##$USERA4= <user>
##$USERA5= <user>
##$V9= 5
##$VALIST= <valist>
##$VCLIST= <CCCCCCCCCCCCCCC>
##$VD= 0
##$VDLIST= <DDDDDDDDDDDDDDD>
##$VPLIST= <PPPPPPPPPPPPPPP>
##$VTLIST= <TTTTTTTTTTTTTTT>
##$WBST= 1024
##$WBSW= 4
##$XGAIN= (0..3)
0 0 0 0 
##$XL= 0
##$YL= 0
##$YMAX_a= 22213
##$YMIN_a= -12936
##$ZGOPTNS= <>
##$ZL1= 120
##$ZL2= 120
##$ZL3= 120
##$ZL4= 120
##$ABSF1= 182.463
##$ABSF2= -187.1042
##$ABSG= 5
##$ABSL= 3
##$ALPHA= 0
##$AQORDER= 0
##$ASSFAC= 0
##$ASSFACI= 0
##$ASSFACX= 0
##$ASSWID= 0
##$AUNMP= <proc_1d>
##$AZFE= 0.1
##$AZFW= 0.5
##$BCFW= 0
##$BC_mod= 2
##$BYTORDP= 0
##$COROFFS= 0
##$CY= -3
##$DATMOD= 1
##$DC= 0
##$DFILT= <>
##$DTYPP= 0
##$F1P= 0
##$F2P= 0
##$FCOR= 1
##$FTSIZE= 65536
##$FT_mod= 6
##$GAMMA= 0
##$GB= 0
##$INTBC= 1
##$INTSCL= 5.30512e-09
##$ISEN= 30
##$LB= 1
##$LEV0= 0
##$LPBIN= 0
##$MAXI= 10000
##$MC2= 0
##$MEAN= 0
##$ME_mod= 0
##$MI= 50
##$NCOEF= 0
##$NC_proc= -7
##$NLEV= 6
##$NOISF1= 182.463
##$NOISF2= 159.3651
##$NSP= 0
##$NTH_PI= 0
##$NZP= 0
##$OFFSET= 182.463
##$PC= 4
##$PHC0= -2407.877
##$PHC1= 139.2008
##$PH_mod= 1
##$PKNL= yes
##$PPARMOD= 0
##$PSCAL= 0
##$PSIGN= 0
##$REVERSE= no
##$SF= 81.014009
##$SI= 65536
##$SIGF1= 159.3651
##$SIGF2= -187.1042
##$SINO= 113.3802
##$SIOLD= 16384
##$SREGLST= <1H.CDCl3>
##$SSB= 0
##$STSI= 65536
##$STSR= 0
##$SW_p= 29940.119760479
##$SYMM= 0
##$S_DEV= 0
##$TDeff= 32768
##$TDoff= 0
##$TI= <>
##$TILT= no
##$TM1= 0
##$TM2= 0
##$TOPLEV= 0
##$USERP1= <user>
##$USERP2= <user>
##$USERP3= <user>
##$USERP4= <user>
##$USERP5= <user>
##$WDW= 1
##$XDIM= 65536
##$YMAX_p= 528531913
##$YMIN_p= -53694640
$$ End of Bruker specific parameters
$$ ---------------------------------
##NTUPLES= NMR SPECTRUM
##VAR_NAME=  FREQUENCY,     SPECTRUM/REAL,   SPECTRUM/IMAG
##SYMBOL=    X,             R,               I
##VAR_TYPE=  INDEPENDENT,   DEPENDENT,       DEPENDENT
##VAR_FORM=  AFFN,          ASDF,            ASDF
##VAR_DIM=   65536,         65536,           65536
##UNITS=     HZ,            ARBITRARY UNITS, ARBITRARY UNITS
##FACTOR=    0.456856943014862, 1,           1
##FIRST=     14782.0589164895, 0,            0
##LAST=      -15158.0608439895, 0,           0
##MIN=       -15158.0608439895, -53694640,   0
##MAX=       14782.0589164895, 528531913,    0
$$ Real data points
##PAGE= N=1
##DATA TABLE= (X++(R..R)), XYDATA
$$ [...]
44237c881051o9785N02600n38853m92618J168554K066083L81660k173746k528996
44228e566152p26412K67053p12766j428502k28465J373564J616523J172847J076508
44219c155802P19339m430N94181K671452L185742N86057j797574p65147J189533
44210C223351q7261l178081l361983o34411O09871m80543k6919K913760L921624
44201B899408P63094k497960k293855j221041k589558l828698q56928M046301
44193e579237M923590J403597p42638J475479M273890L495497L78931j462999
44185H166110j253633l78380Q24303K377240K540982j25361l303079l019978M80567
44176F308771K319258j94831l281337j858099K942570N001557J639203k854348
$$ plain form
44237 -3881051 -3950836 -3448236 -3987089 -4479707 -3311153 -1245070 -863410 -3037156 -5566152
44228 -5566152 -6292564 -6025511 -6738277 -8166779 -8395244 -7021680 -5405157 -4232310 -3155802
44219 -3155802 -2436463 -2440893 -1846712 824740 4010482 4596539 2798965 2033818 3223351
44210 3223351 3136090 -41991 -3403974 -4038385 -3428514 -3909057 -3935976 -1022216 2899408
44201 2899408 3662502 1164542 -1129313 -2350354 -4939912 -8768610 -9625538 -5579237
44193 -5579237 -655647 747950 5312 1480791 5754681 9250178 9629109 8166110
44185 8166110 6912477 6534097 7358400 9735640 12276622 12151261 8848182 5828204 6308771
44176 6308771 8628029 8433198 5151861 3293762 6236332 11237889 12877092 10022744
44168A0022744l323606k46197K219598K314529J509381N03530j713963m528548
44160F757468n068443k389771N52136J053016M00646J099706K401988J720213
44152F526959o58623j759227p27097q8312j391082k616241j560377O17167J400025
44143b56808P55206M68542O29502m51242k784238l715527j404079K427070M481423
44134A49849L570900J105811j259994k958538l704046k939564p20712J753066
44126e003228L231586L526649K929431J194886j741472m317933m232263j385010
44118e797354J444924J987400J318128J619725K191973M73225k973601l893802
44110c629382m12147L283838K315822j786571l189038k42920K397535R32388k364970
$$ plain form
44168 10022744 6699138 6452941 8672539 10987068 12496449 12999979 11286016 6757468
44160 6757468 1689025 -700746 -148610 904406 1305052 2404758 4806746 6526959
44152 6526959 5868336 4109109 3382012 3293700 1902618 -713623 -2274000 -1656833 -256808
44143 -256808 498398 966940 1596442 1145200 -1639038 -5354565 -6758644 -4331574 149849
44134 149849 3720749 4826560 3566566 608028 -3096018 -6035582 -6756294 -5003228
44126 -5003228 -1771642 1755007 4684438 5879324 4137852 -180081 -4412344 -5797354
44118 -5797354 -4352430 -2365030 -1046902 572823 2764796 3238021 264420 -3629382
44110 -3629382 -4041529 -757691 1558131 -228440 -3417478 -3660398 -1262863 -330475 -2695445
44101b695445l243028j517850P9384Q64908K306251M072433L663176M00241l016957
44092I13113l812317k031096M53094J978397J589349n66580k523241k022723K72258
44083e749746J001049j143996k913032q91835L168805M392893J694922o15516
44075a056456Q98134L788377L294537p44863l637376k439821K19004L95975j405293
44066f87782j448203J220999L190909J727513j393708k729797j782829o37410
44058b540308l81481k91014J25893O16282J433249K882899L675413J973492j592046
44049E902379m007566l495156j256390P69473J897991J879898K43309k393543
44041d59605l988283l201557p14954K080077M172958M382361J906831j676781
$$ plain form
44101 -2695445 -5938473 -7456323 -7376939 -6512031 -4205780 -133347 3529829 3930070 913113
44092 913113 -2899204 -4930300 -4477206 -2498809 -909460 -1476040 -3999281 -6022004 -5749746
44083 -5749746 -4748697 -5892693 -8805725 -9697560 -6528755 -2135862 -440940 -1056456
44075 -1056456 -158322 3630055 6924592 6179729 2542353 102532 321536 717511 -687782
44066 -687782 -2135985 -914986 2275923 4003436 2609728 -120069 -1902898 -2540308
44058 -2540308 -2921789 -3212803 -3086910 -2470628 -1037379 1845520 5520933 7494425 5902379
44049 5902379 1894813 -1600343 -2856733 -2087260 -189269 1690629 1933938 -459605
44041 -459605 -4447888 -7649445 -8364399 -6284322 -2111364 2270997 4177828 2501047
44033B501047l147311j571596N41863J145253J255681K080224K229166K48056
44025E282383k249222k762359j560383m57463M44166J820784K387546M93760k357350
44016A041862k919260p83473J425198K040670J584115M70689j247530k041013
44008d28742k32451K633505L082824P45364j230386j236080j059153j820908j879547
43999a425574m15452M03504r32574k323352j148109J884237M109325M257816K657736
43990G067557L0132k196725k271987m63652P85511L07115l58248r5796L4806l31666
43980B507047M59189K450037K658573O9143j653451o1252J177802j912591o095399
43971d00902n222305j26791K380686j08678k825611k100423k6954R45515K090457
$$ plain form
44033 2501047 -646264 -2217860 -1675997 -530744 724937 2805161 5034327 5282383
44025 5282383 3033161 270802 -1289581 -1747044 -1302878 517906 2905452 3399212 1041862
44016 1041862 -1877398 -2660871 -1235673 804997 2389112 2859801 1612271 -428742
44008 -428742 -661193 1972312 5055136 5800500 4570114 3334034 2274881 453973 -1425574
43999 -1425574 -1841026 -1437522 -2370096 -4693448 -5841557 -3957320 152005 4409821 7067557
43990 7067557 7097689 4900964 2628977 2165325 2950836 3257951 2899703 2803907 2838713 2507047
43980 2507047 2966236 5416273 8074846 8143989 6490538 6429286 7607088 5694497 -400902
43971 -400902 -5623207 -5749998 -3369312 -3477990 -6303601 -8404024 -8430978 -7485463 -5395006
43962e395006M129540M069993K27780l479532k470112J890054M475002L300280
43954F747999P01079r68044j443966j133992m46689k47560r81432j807152j970405
43945a550162j924886j756594k31631K728093M473120K924137j11686j453716
43937C096675r39969o24651j022443j212645j468219k385457k321387N68146M234071
43928b075879M642885J755912m83315m58969o88916k271059k365316M32024K655573
43919A142940J376241n91081Q55696M048839L814811l87517l453805k050804J099290
43910E854610J676653n89789k657429k719319j967258k153002k740500j409836
43902f705870K282273M822979K466696k932404m928022q43891M139016M105009
$$ plain form
43962 -5395006 -1265466 2804527 3032307 -447225 -2917337 -1027283 3447719 6747999
43954 6747999 7449078 6481034 5037068 3903076 3456387 3208827 2227395 420243 -1550162
43945 -1550162 -3475048 -5231642 -5463273 -2735180 1737940 4662077 4550391 3096675
43937 3096675 2156706 1532055 509612 -703033 -2171252 -4556709 -6878096 -6309950 -2075879
43928 -2075879 2567006 4322918 3839603 3380634 2691718 420659 -1944657 -1512633 1142940
43919 1142940 2519181 1928100 2783796 6832635 10647446 10259929 6806124 4755320 5854610
43910 5854610 7531263 6941474 4284045 1564726 -402532 -2555534 -5296034 -6705870
43902 -6705870 -4423597 399382 2866078 -66326 -4994348 -5838239 -1699223 2405786
43894B405786N35642r03275O71806J121012r40927k190342j041550j94557j015536
43885a551941q80200J333083K353244M61470o82339J581951L362537M43606l768646
43876B652765k968403J895685M146586J899658j10352N63773N35264k201045m066405
43867B347526k248706L0991j206991m012781l612446K00122L096000K505907K25585
43858b674793j008254p19219j34409j68709m47412J30112J659506K354791O85596
43849c22791j872626k338627n72475N41221j94622n28909J015710K427083J771731
43840g4305N07770O71991J336527P01341m92359n58043R3923L66343Q77547J923198
43830E353933J316893k032952m494986k137215K654457L881455N86898k318141
$$ plain form
43894 2405786 2941428 2038153 2709959 3830971 2890044 699702 -341848 -536405 -1551941
43885 -1551941 -2432141 -1099058 1254186 1715656 1033317 2615268 5977805 6421411 2652765
43876 2652765 -315638 1580047 5726633 7626291 7515939 8079712 8614976 6413931 2347526
43867 2347526 98820 129811 -1077180 -5089961 -8702407 -8502285 -5406285 -2900378 -2674793
43858 -2674793 -3683047 -4402266 -4536675 -4705384 -5152796 -5022684 -3363178 -1008387 -322791
43849 -322791 -2195417 -4534044 -5106519 -4565298 -4759920 -5288829 -4273119 -1846036 -74305
43840 -74305 433465 1105456 2441983 3143324 2650965 2092922 2186845 2553188 3430735 5353933
43830 5353933 6670826 4637874 142888 -1994327 660130 4541585 5128483 2810342
43822B810342j983844j037982j829744k308462j22887L087113M350402L479523
43814F444461J966052J67437j901311k948644k047593m94976k3952m31328o14213
43805A15933m67075p2134J332846L551802M123800J272944k804593m159194k240815
43796F53514m35778j288728l377362l757476j871608K97161J178943J276638J713792
43787e610904K271871J874157O12097p0005M51649R43028K55508r26151j378406
43778a577156j115201m56224J255690L969459N248349K980277r66133k695205
43770F643856j501987p4908K48287P59056J504923J93704l479519o016416m827589
43761f550593j797323J44913J172050K557206L099763R84165k345901l548474
$$ plain form
43822 2810342 826498 -211484 -2041228 -4349690 -4472577 -1385464 2964938 6444461
43814 6444461 8410513 8577950 6676639 3727995 1680402 1185426 1161474 730146 115933
43805 115933 -351142 -423276 909570 4461372 8585172 9858116 7053523 2894329 653514
43796 653514 217736 -1070992 -4448354 -8205830 -10077438 -9780277 -8601334 -7324696 -5610904
43787 -5610904 -3339033 -1464876 -852779 -922784 -471135 471893 727401 -198750 -1577156
43778 -1577156 -2692357 -3148581 -1892891 2076568 7324917 10305194 9339061 6643856
43770 6643856 5141869 5066961 5315248 6074304 7579227 7772931 4293412 -1723004 -6550593
43761 -6550593 -8347916 -8203003 -7030953 -4473747 -1373984 -389819 -2735720 -6284194
43753f284194j911844L00579J522071K239903K859955K711180J571366L50303
43745C359319k49844n18159q51736j028158p04495j60978k44788j359853k364073
43736d122765j276747J936776M278585L265249O75609M9952J010096k19436m183182
43727A414137o263504l160232K316880N281705M557434K096792l59723j452752
43719D430737K2753K622472K296213k043351n758939m592561p44659R16013R5622
43710b755700J55409J925824L029721K274086O63306j105108k696336k825107
43702a333905j025929Q02733J422555K283976L476118J547039m078114o905914
43694c811441k067475M651080M380447j270971l426081o91812n9412l194938l319541
$$ plain form
43753 -6284194 -8196038 -7895459 -6373388 -4133485 -1273530 1437650 3009016 3359319
43745 3359319 3109475 2591316 1739580 711422 6927 -154051 -398839 -1758692 -4122765
43736 -4122765 -5399512 -3462736 815849 4081098 4756707 4806659 5816755 5597319 1414137
43727 1414137 -4849367 -8009599 -5692719 -411014 4146420 6243212 5883489 4430737
43719 4430737 4453490 7075962 9372175 7328824 1569885 -3022676 -3767335 -2851322 -2755700
43710 -2755700 -2600291 -674467 2355254 4629340 5292646 4187538 1491202 -1333905
43702 -1333905 -2359834 -1557101 -134546 2149430 5625548 7172587 3094473 -3811441
43694 -3811441 -5878916 -1227836 3152611 1881640 -1544441 -2236253 -2295665 -5490603 -8810144
43685h810144J871986N260378K532203p79113Q6036R74096j975567l752397O40104
43676c952418N946070M476227j246607k954902K08802K158361P57070o05313p18126
43667D069164j587733k589263j045888J848921K465570J384877J951810L136092
43659I633550J032865l045865l625653m91510O50949j990471l456506j030782
43651b323423J255994N7229j915390j425054J10980N77082J115077K448358K093157
43642A994010q36462k464141M8353L462826L476355J191167J21643j3622j577940
43633E402189l564444l002340l92995J013674N76827N36696J331190Q36121j422912
43624A314006k953028k009141J58569J530127J524763M10932j386643k706745
$$ plain form
43685 -8810144 -6938158 -1677780 854423 75310 161346 1135442 -840125 -4592522 -3952418
43676 -3952418 1993652 6469879 5223272 2268370 2477172 4635533 5392603 4787290 4069164
43667 4069164 2481431 -107832 -1153720 695201 3160771 4545648 6497458 9633550
43659 9633550 10666415 7620550 3994897 3503387 4154336 2163865 -1292641 -2323423
43651 -2323423 -1067429 -1010200 -2925590 -4350644 -4239664 -3662582 -2547505 -99147 1994010
43642 1994010 1157548 -1306593 -1258240 2204586 5680941 6872108 6993751 6980129 5402189
43633 5402189 1837745 -1164595 -1557590 -543916 32911 569607 1900797 2736918 1314006
43624 1314006 -1639022 -3648163 -3489594 -1959467 -434704 -23772 -1410415 -4117160
43616d117160k206815l18209P75668r1367j470767j328168J98503J183023Q11642
43607f563650O41772K143070L793013K555612j291055l182579j63813M155760
43599B088130L820859j219111n026249l986075r33201L27531L58525J316099K332059
43590i21433J203977j416638k833468k012950P7542K389803L663776K166461j612683
43581G04387l651392r82084L638550M909140J858047j780168l190874k807486
43573a301880j468651P43740K456432J616627q28495j250074J308019L181903
43565D457621J275849k437556l780572j824883P59240J632910J006450L68063
43557A457122N06913Q96200M93680q03088j730981j327000m89193o24388j270770
$$ plain form
43616 -4117160 -6323975 -6642184 -5866516 -5957883 -7428650 -8756818 -8558315 -7375292 -6563650
43607 -6563650 -5921878 -3778808 14205 2569817 1278762 -1903817 -2067630 2088130
43599 2088130 5908989 4689878 -336371 -4322446 -5255647 -4928116 -4569591 -3253492 -921433
43590 -921433 282544 -1134094 -3967562 -5980512 -5902970 -3513167 150609 2317070 704387
43581 704387 -2947005 -3929089 -290539 4618601 6476648 4696480 1505606 -1301880
43573 -1301880 -2770531 -2026791 429641 2046268 1217773 -32301 1275718 4457621
43565 4457621 5733470 3295914 -484658 -2309541 -1550301 82609 1089059 1457122
43557 1457122 1964035 2860235 3353915 2550827 819846 -507154 -996347 -1620735 -2891505
43548b891505q56118N08180J182139Q76612Q61429J093831R3339j593099j149207
43539a874399J711752L116359P46955j936139o95425K777191L550514J283217
43531H680025K07823J450668R23854l334269o715324m538000M80994J859432j197439
43522b182236k895281L16692M508675M027919n76815l597058j885875J713945
43514e70034K965835J524297N0273k37591o96227k095944k656777n72736K730134
43505D41230L715775J101859k424502l460588j740505J92806L75413p49295j583091
43496d130898j179584L09244J876040K104097M94608j294832q65603J571560K797326
43487A681958Q81050j612599r14562K414076M159388K605796O46428O26978N63110
$$ plain form
43548 -2891505 -3747623 -3239443 -2057304 -1180692 -319263 774568 867907 -725192 -1874399
43539 -1874399 -162647 2953712 3700667 1764528 1069103 3846294 7396808 8680025
43531 8680025 8887848 10338516 11262370 7928101 1212777 -3325223 -2844229 -984797 -2182236
43522 -2182236 -5077517 -4760825 -252150 3775769 3198954 -398104 -2283979 -570034
43514 -570034 2395801 3920098 3970371 3732780 3036553 940609 -1716168 -2288904 441230
43505 441230 4157005 5258864 2834362 -626226 -2366731 -2173925 -1798512 -2547807 -4130898
43496 -4130898 -5310482 -5001238 -3125198 -1021101 -526493 -1821325 -2686928 -1115368 1681958
43487 1681958 2563008 950409 35847 2449923 6609311 9215107 9861535 10488513 11051623
43478A1051623j822986m122410k454654J595415K126932k291720n630613k685319
43470d233732L305666N128757J429351k456834k820654j871360k524904l258079
43462g301789j162723K576195L857923J313904k235814l649165k335655M36120
43454h501004K683584K384232m03854k174256L27451M818077N417968Q81956l027811
43445B406343j602897K176988K573221m46671k267806j279814l27896r38800j088344
43436g95676M59158J867248J676492R61585N84908l83392j912377j926600J09919
43427F41265J568344P67699k12055O78106J656781J83191k423857k842432p29905
43418g12863J366828J974709J551365L55240j474359k388648j001473J204138
$$ plain form
43478 11051623 9228637 5106227 2651573 4246988 6373920 4082200 -1548413 -4233732
43470 -4233732 -928066 4200691 5630042 3173208 352554 -1518806 -4043710 -7301789
43462 -7301789 -8464512 -5888317 -2030394 -716490 -2952304 -6601469 -8937124 -8501004
43454 -8501004 -5817420 -3433188 -3837042 -6011298 -5683847 -865770 4552198 5434154 2406343
43445 2406343 803446 2980434 5553655 5106984 2839178 1559364 1231468 292668 -795676
43436 -795676 -336518 1530730 3207222 4168807 4753715 4370323 2457946 531346 641265
43427 641265 2209609 2977308 2765253 3443359 5100140 5283331 2859474 17042 -712863
43418 -712863 653965 2628674 4180039 4535279 3060920 672272 -329201 874937
43410H74937J593330M53627L75885J668912J612791j045253l710011l372754m92682
43401b041218J854536J596348m27780j636974o20700R40425K10910k412976k858485
43392e395914R61426N264919N129622J332274j326546j352875j619423l232841
43384b39358l376793o35553K023001J881766M68476L39553R39675N15736l38397
43375A578106o9831P59959O98207K58223P39534J305848Q8655k374835l457140
43366d73274k106717n883J019198Q49741R7717j009733k118394k273149q43054
43357f863548J371908K520604J481401p56100j982012j325137j21328M12407J069581
43348d192224K739079L989980K975508O90533o91648j838922m643028o944551
$$ plain form
43410 874937 2468267 2921894 3297779 4966691 6579482 5534229 1824218 -1548536 -2041218
43401 -2041218 -186682 1409666 981886 -655088 -1275788 -335363 -124453 -2537429 -5395914
43392 -5395914 -4434488 830431 5960053 7292327 5965781 4612906 2993483 -239358
43384 -239358 -3616151 -4251704 -2228703 -346937 121539 461092 1400767 1916503 1578106
43375 1578106 1508275 2268234 2966441 3224664 3964198 5270046 5358701 2983866 -473274
43366 -473274 -2579991 -2585874 -1566676 -716935 -619218 -1628951 -3747345 -6020494 -6863548
43357 -6863548 -5491640 -2971036 -1489635 -2245735 -4227747 -5552884 -5674212 -5261805 -4192224
43348 -4192224 -1453145 2536835 5512343 6202876 5511228 3672306 -970722 -7915273
43340g915273m056582L212722P473698M492093q85614k301395p44923p88934j910807
43331c425015j76477L483621L774951j90190l025223j274486J952648K548822
43323C668651J009371p514J5492K57411P16852R93935o00695m115977o165947
43314d228421l775980J273017M325573L214779j99400l013086l814286k683272
43306h901076n70063J044220R94567n87394k344559k706680j001427J825608L661052
43297h585752L207515J497189N55997P76664Q54922J64204m55259m88819n90937
43288c064276j020272p71062Q68017L007132M099052L322580Q29394k177121l510201
43279A583243j776670J488849L050170J777001m08479j702820k404028k986332
$$ plain form
43340 -7915273 -11971855 -8759133 -1285435 3206658 2321044 19649 -725274 -1514208 -3425015
43331 -3425015 -3601492 -117871 3657080 3466890 441667 -832819 1119829 3668651
43323 3668651 4678022 4670508 4686000 4943411 5660263 6654198 6053503 1937526 -4228421
43314 -4228421 -8004401 -6731384 -2405811 808968 609568 -2403518 -6217804 -8901076
43306 -8901076 -9471139 -8426919 -7432352 -8019746 -10364305 -13070985 -14072412 -12246804 -8585752
43297 -8585752 -5378237 -3881048 -3325051 -2548387 -1693465 -1529261 -1984520 -2473339 -3064276
43288 -3064276 -4084548 -4855610 -3987593 -980461 3118591 6441171 7270565 5093444 1583243
43279 1583243 -193427 1295422 4345592 6122593 5714114 4011294 1607266 -1379066
43271a379066k541888n73050J563756K521888K638193K449363J460514p4552k98001
43262E767157J263566J930857l36455l229497l228254r25549L59160K22028J198679
43253C021692L279800L068443k89947k679875j063977J573568P67201k471536
43245E205369l299478l44957K907328L888631L798396L639975J636544k762413
43237A4669395n684920l604722O28914J099183k388859l787669q8113L910198
43229D753407K977172p37981j770701j38706l41284k892224l223446K03102K734932
43220A564271R37599j954328j504602J168339K288230J770114J943385K337809
43212H550817Q46252j407849j606432q17422k539542n778124n544253j331199
$$ plain form
43271 -1379066 -3920954 -4494004 -2930248 -408360 2229833 4679196 6139710 6065158 5767157
43262 5767157 7030723 8961580 8625125 5395628 2167374 1241825 1600985 1823013 3021692
43253 3021692 6301492 9369935 9079988 6400113 5336136 6909704 7676905 5205369
43245 5205369 1905891 1560934 4468262 8356893 12155289 15795264 17431808 14669395
43237 14669395 8984475 5379753 6008667 7107850 4718991 931322 843209 4753407
43229 4753407 7730579 6992598 5221897 5083191 4741907 1849683 -1373763 -1170661 1564271
43220 1564271 2501870 547542 -957060 211279 2499509 4269623 6213008 8550817
43212 8550817 9397069 7989220 6382788 5565366 3025824 -2752300 -8296553 -9627752
43204i627752J081214j198948l144359j9546M566761M369221M43161j167056N32167
43195d165137Q62825j541333k370945K50850K010191q0914k164812n6806L252293
43186d003788K265251j768813k580752J169328L932260K020505j259107j397609
43178a622725Q26558J666880J34005j729700k308062j406788P10926K896498L063064
43169B230656P69706j455819j485312p09987j332577k240001q61990J937582K570190
43160e77552J67554k231227k330081j119629o8395R91278J939113J268355j313942
43151c274526l354149k462998P74479L792023M586899K786666q1816j176578O14935
43142B204935K240749O7566m043212m321635K85628L832772K022861j614356j774271
$$ plain form
43204 -9627752 -8546538 -9745486 -12889845 -12909391 -8342630 -3973409 -3530248 -4697304 -4165137
43195 -4165137 -3302312 -4843645 -7214590 -6963740 -4953549 -5034463 -7199275 -7256081 -4003788
43186 -4003788 -1738537 -3507350 -6088102 -4918774 -986514 1033991 -225116 -1622725
43178 -1622725 -796167 870713 1004718 -724982 -3033044 -4439832 -3728906 -832408 2230656
43169 2230656 3000362 1544543 59231 -650756 -1983333 -4223334 -5085324 -3147742 -577552
43160 -577552 -409998 -2641225 -4971306 -6090935 -6159330 -5168052 -3228939 -1960584 -3274526
43151 -3274526 -6628675 -9091673 -8317194 -4525171 61728 2848394 2766578 1590000 2204935
43142 2204935 4445684 4513250 470038 -3851597 -3565969 266803 2289664 675308 -1098963
43133a098963O66186J394545j8472p82358m16827k59846O44716L591473N615195
43124I335649K854078k252407l401534k5963K039806K12426j368129K4285Q85278
43115H303489j715990m386470k962573O94678K111502R23255k40383o39287q90532
43106A197689j25697K064648L066191P89711k207344k250073k45747M26748j70641
43097B545485M63416J755829P82876j966172k659179k66510J989564K010764J392089
43088F048162J639987J703277N58049r45373j869641k099810j118661J147287
43080E063277K374261L93549k432521j802879J395564J874054j164104k071522
43072C629679J727534M506184R94299m843244n581360j260323J734019N85170
$$ plain form
43133 -1098963 -432777 961768 943296 160938 -255889 -515735 128981 3720454 9335649
43124 9335649 12189727 9937320 6535786 6509823 8549629 8762055 7393926 7418211 8303489
43115 8303489 6587499 2201029 -761544 -66866 2044636 2967891 2727508 2088221 1197689
43106 1197689 1071992 3136640 6202831 6992542 4785198 2535125 2289378 2716126 2545485
43097 2545485 3008901 4764730 5547606 3581434 922255 655745 2645309 4656073 6048162
43088 6048162 7688149 9391426 9949475 9004102 7134461 5034651 3915990 5063277
43080 5063277 7437538 7831087 5398566 3595687 4991251 6865305 5701201 3629679
43072 3629679 5357213 9863397 10857696 6014452 433092 -827231 906788 1491958
43064A491958j443109j694872j454761k002516k143218r37619N89855J455396
43056f138886J691572R56555j119266l076136k861385r15168O90859J769595L443638
43047e558622M579426K884426l00665q16517J747496K872754K37709k474499j511826
43038A659682J301066K207557J301295P52927J49513j872499l290610r33669L548863
43029D824125M615097L26882m818187n639923k004743K267322L809378J878403
43021E258354j843398m290985l241670L76881L230406L138086J011828q73521
43013B765981j256193k23596J449629K620330K378520Q99294q75797k394555l450597
43004A913016l227682q90426K560123M458548L243743J60886k268552k622330
$$ plain form
43064 1491958 48849 -1646023 -3100784 -5103300 -7246518 -8184137 -7594282 -6138886
43056 -6138886 -4447314 -3490759 -4610025 -7686161 -10547546 -11462714 -10771855 -9002260 -5558622
43047 -5558622 -979196 1905230 1604565 788048 2535544 5408298 5646007 3171508 1659682
43038 1659682 2960748 5168305 6469600 7222527 7372040 5499541 2208931 1275262 4824125
43029 4824125 9439222 9766104 4947917 -692006 -2696749 -429427 3379951 5258354
43021 5258354 3414956 -876029 -4117699 -3740818 -510412 2627674 3639502 2765981
43013 2765981 1509788 1286192 2735821 5356151 7734671 8633965 7758168 5363613 1913016
43004 1913016 -1314666 -2205092 355031 4813579 8057322 8218208 5949656 3327326
42996C327326j154343R09104K135156J851173Q24424K67547J07436o29393j664859
42987E973571j424844K12696R91352n31218k454934k170313m24507k45773k057015
42978b130985k666659j10456K936679K688258k80782j832588k56922J510011O84704
42969E41260j088746o38427J427945J657360n58124j873980l27922J642171J299382
42960B080919k13979l68710L89780p0514j414473j370968K61777J388512J211438
42951A893782R93594J129616M50570j123433k075548k010758k107563k251381
42943e101121p83391J877344K650391N98494p78565J414264M633007M204009o5377
42934H649055l736767l628277j114537N84079L03677n39880k72604Q24596P42125
$$ plain form
42996 3327326 2172983 3082087 5217243 7068416 7892840 8160387 8267823 7638430 5973571
42987 5973571 4548727 4761423 5752775 5221557 2766623 596310 171803 -73970 -2130985
42978 -2130985 -4797644 -4908100 -1971421 716837 436055 -1396533 -1653455 -143444 541260
42969 541260 -547486 -1185913 242032 1899392 1341268 -532712 -860634 781537 2080919
42960 2080919 1866940 1498230 1888010 1817496 403023 -967945 -706168 682344 1893782
42951 1893782 2887376 4016992 4467562 3344129 1268581 -742177 -2849740 -5101121
42943 -5101121 -5884512 -4007168 -1356777 -758283 -1536848 -122584 4510423 8714432 8649055
42934 8649055 4912288 1284011 169474 753553 1057230 517350 244746 1069342 1811467
42925A811467j502748l849268l337637j41289K492994K630917J708384J494965
42917A307785J519374Q45246O7211j26934l55971r33601q97335j15585n1037q93332
42907C65821o58539J030374J449995n26075j720177J52796K128506R26489j127429
42898B021761j28042K369143K182878J47226L85356K371042J809939j051572j543804
42889H563927M91181j55996m171262n146089l80737L530471J056110l160475k073144
42880a446014K330409K936964p64647k800230q47395J298236J208255R48876J755150
42871D619604J497317o78706j964459m12227J797702J791126j51264k065026l100250
42862A333817k998756j047992K299236M364635K977860n19665k733627k286651
$$ plain form
42925 1811467 308719 -3540549 -6878186 -7019475 -4526481 -1895564 -187180 1307785
42917 1307785 2827159 3672405 3739616 3612682 3256711 2323110 1425775 1310190 1259153 365821
42907 365821 -292718 737656 2187651 1661576 -58601 94195 2222701 3149190 2021761
42898 2021761 1893719 4262862 6445740 6592966 6978322 9349364 11159303 10107731 8563927
42889 8563927 9055108 8899112 4727850 -418239 -798976 2731495 3787605 627130 -1446014
42880 -1446014 884395 3821359 3056712 256482 -590913 707323 1915578 2864454 4619604
42871 4619604 6116921 5438215 3473756 3061529 4859231 6650357 6499093 4434067 1333817
42862 1333817 -1664939 -2712931 -413695 3950940 6928800 6409135 3675508 1388857
42854A388857j004948j042018k014138j737551M92460K381602J287868k031251
42846b279119l854106k081430J193278K685623K008330J218044J360369J380612
42838A631601K24591j462880j939397j39831K831995L953932J293958k895120
42830C498849l938754m81975L575811M152229J708951q19778k259086k781875
42822B654372j673623J069782K635096O22356k734916l313231j172697Q0791o13126
42813b445196p46492N99568J177366J27598j96398J417020K674673J734656J46009
42804D488804l10680o14815j894161k537862p00240K260444L435590K081801l33605
42795E875276k370290l079549j769535P89642K254816J495198J39034j42781j80040
$$ plain form
42854 1388857 383909 -658109 -2672247 -4409798 -3917338 -1535736 -247868 -2279119
42846 -2279119 -6133225 -8214655 -7021377 -4335754 -2327424 -1109380 250989 1631601
42838 1631601 1856192 393312 -1546085 -1685916 1146079 5100011 6393969 3498849
42830 3498849 -439905 -921880 2653931 6806160 8515111 7695333 5436247 2654372
42822 2654372 980749 2050531 4685627 5307983 2573067 -740164 -1912861 -1832070 -2445196
42813 -2445196 -3191688 -2592120 -1414754 -1287156 -1483554 -66534 2608139 4342795 4488804
42804 4488804 4178124 3563309 1669148 -868714 -1568954 691490 4127080 6208881 5875276
42795 5875276 3504986 425437 -1344098 -554456 1700360 3195558 3334592 3191811 3011771
42786C011771j305249k478644j615189J288808M188666N201266L505457m22868
42778A1374018m067629m348692j681919l90723k747399m976660k427486L251560
42770f014930O132561M138142Q72602n10112r59972k147335l197157k563162n67229
42761d816592J514568K960346L143893J595112m92682r24445K57993M31611j388934
42752B280870k412448k29384K938784K935924m77038l355921k944143o32354R47158
42743i48552J380427J700847J871122R86463o04056j276923n11541K41780j48776
42734B690791o20539L33874J928701J969373K58448r79764n23595J52461k92632
42725D917118o44536N66350J989082J195620j322955k546032j255037M29595L47775
$$ plain form
42786 3011771 1706522 -772122 -2387311 -1098503 3090163 8291429 11796886 11374018
42778 11374018 7306389 2957697 1275778 885055 -1862344 -6839004 -9266490 -6014930
42770 -6014930 117631 4255773 5128375 4618263 3658291 1510956 -1686201 -4249363 -4816592
42761 -4816592 -3302024 -341678 2802215 4397327 3904645 2980200 3238193 3669804 2280870
42752 2280870 -131578 -360962 2577822 5513746 5036708 1680787 -1263356 -1895710 -948552
42743 -948552 431875 2132722 4003844 4990307 4386251 3109328 2597787 2839567 2690791
42734 2690791 2070252 2404126 4332827 6302200 6560648 5580884 5057289 5209750 4917118
42725 4917118 4272582 4838932 6828014 8023634 6700679 4154647 2899610 3329205 3676980
42716C676980q38218r65621P08240K670656K640036j33139l423762l567570K95341
42707A062943M290799L952855k86386l898434m070893k102561j71776J134776
42699h8677J503457L34322j258432q69208J226308J503581j407891l771266j971320
42690d799126J903313L132352J147646m92579J58942J469706J701517J098292
42682E320063L66988j16299M23654K004734K276254q02673m767878m832433q81896
42673a009486J659096m74459l648922k973708M47405J564425j031926l384645
42665h852220j853224K463819N613848N170216J981252j312757k775348k477122
42657b041536j625367q66958j64934J07755m42334p29399Q15546L173211L125273
$$ plain form
42716 3676980 2838762 1873141 2581381 5252037 7892073 7758934 4335172 767602 1062943
42707 1062943 5353742 9306597 9020211 5121777 1050884 -1051677 -1223453 -88677
42699 -88677 1414780 1749102 490670 -378538 847770 2351351 943460 -2827806 -4799126
42690 -4799126 -2895813 236539 1384185 891606 1050548 2520254 4221771 5320063
42682 5320063 5687051 5570752 5994406 7999140 10275394 9472721 4704843 -127590 -1009486
42673 -1009486 649610 175151 -3473771 -6447479 -6000074 -4435649 -5467575 -8852220
42665 -8852220 -10705444 -8241625 -2627777 2542439 4523691 3210934 435586 -2041536
42657 -2041536 -3666903 -4533861 -4698795 -4591040 -5033374 -5762773 -4947227 -1774016 1351257
42648A351257L0406k353814r99313J739526J586385j186746k319985j0665K715555
42639E52606K471571m65279l295019l749303j547839J364166J933886p33891l398499
42630f867601k218543J943376M429023K993342O6466j485481j417582j01639K746270
42621H7631N615795N123254Q89004k646161k112363K2327j30357j539794o31790
42612D677546J960305J984384j597130m976141n111041k984438n39530J853129
42604d732916L654482L354737J182704j61427P12412J755356Q85733p96075j244591
42595D610415q65677j299720k365978k715605k458620k622906k617840p69103
42587a1105034K629766N020031M738937K767152R35489l2131k19804J49157L06109
$$ plain form
42648 1351257 1381663 -972151 -1971464 -231938 1354447 167701 -2152284 -2162949 552606
42639 552606 3024177 2558898 -736121 -4485424 -6033263 -4669097 -2735211 -3469102 -6867601
42630 -6867601 -9086144 -7142768 -2713745 279597 346063 -1139418 -2557000 -2658639 87631
42621 87631 5703426 10826680 11715684 9069523 6957160 6979487 6849130 5309336 4677546
42612 4677546 6637851 8622235 7025105 2048964 -3062077 -6046515 -6586045 -4732916
42604 -4732916 -1078434 2276303 3459007 3297580 4009992 5765348 6651081 5855006 4610415
42595 4610415 3744738 2445018 79040 -2636565 -5095185 -7718091 -10335931 -11105034
42587 -11105034 -8475268 -3455237 1283700 4050852 4986341 4954210 4734406 4883563 5189672
42578E189672p28816k383444k365179L67193L454000L735288J483223n2642O06364
42569I305659J278310j0420j600096p78849J758104K749793J050140j282265k499642
42560I970734k929629k790754j239798J201485K012092J92061j883329j909320
42552B623542o65536L64965J828124M245198N246487K495266k136884m713328
42544I287834m372657l055081j464158Q58724K480580J408571r48124j406218
42536B789471l00550o20068k073786j315690J428816J840329q73468j926798Q51881
42527a99863K894295Q51638j160323J361246M909360L284718k056192m160937
42519E723942j360487J228767O02595n54773m7522L60553l79923Q8517K709779
$$ plain form
42578 5189672 4460856 2077412 -287767 79426 3533426 7268714 8751937 8699295 9305659
42569 9305659 10583969 10573549 8973453 8194604 9952708 12702501 13752641 12470376 9970734
42560 9970734 7041105 4250351 3010553 4212038 6224130 6416191 4532862 2623542
42552 2623542 1958006 2322971 4151095 8396293 13642780 16138046 14001162 9287834
42544 9287834 4915177 1860096 395938 1254662 3735242 5143813 4195689 2789471
42536 2789471 2488921 1868853 -204933 -1520623 -91807 1748522 875054 -1051744 -199863
42527 -199863 2694432 3546070 2385747 3746993 8656353 11941071 9884879 5723942
42519 5723942 4363455 5592222 6194817 5640044 5592522 5953075 5573152 5661669 8371448
42510H371448L931622R10444l384758l946079o80817J887172J046684j058835
42502G076881j108073R71876K528495K217553J843411L341397M986263K871944
42494B4729747l330709q567893q186951l649974j46601p8864j709300k984145
42486c924690l287562k019426R22091L197203K164465n70572m20098L366455N893753
42477E321619L487633j027095k587223p87152P07982K3145j093576r48904l68677
42468B727752o59532j104718O5375K840484M800278L699546J36861l052207l848137
42459E605702k525326k35740K155163L325398J807092j532580l461841k771177
42451B366691k359836m289448n396845j943047L418795M682564J668657J48184
$$ plain form
42510 8371448 12303070 13213514 9828756 5882677 5201860 7089032 8135716 7076881
42502 7076881 5968808 6940684 9469179 11686732 13530143 16871540 21857803 24729747
42494 24729747 21399038 12831145 4644194 994220 847619 768755 -940545 -3924690
42486 -3924690 -7212252 -9231678 -8309587 -5112384 -2947919 -3518491 -3938589 -572134 5321619
42477 5321619 8809252 7782157 5194934 4407782 5115764 5138909 4045333 3096429 2727752
42468 2727752 2068220 963502 1028877 3869361 8669639 12369185 12506046 9453839 5605702
42459 5605702 3080376 2844636 4999799 8325197 10132289 8599709 5137868 2366691
42451 2366691 6855 -4282593 -9679438 -11622485 -8203690 -3521126 -1852469 -1704285
42443a704285K286470L367924K40092l115861k296588L51908K35285j605407p59469
42434b999931K615164L859926J260420j588604j389983Q29203K247049J787761
42426F621005J28352j537311j869468l04101J739204K023720K87716j442459j617953
42417D028705r46378r54131j808871k249039j315310L23431J079457N98249M49424
42408g94463J704970K699295J176349j797830k818793j263796k21810j319304
42400b635382k108647n41335J363647J107636n3330J44382O15228o72300j986133
42391d766234j35052L600568M601892J886681n33153Q0166J662375J395147k31624
42382G560766j231671j340634j462369j635905j220003j47527R52538J277706
$$ plain form
42443 -1704285 582185 3950109 4190201 1074340 -1222248 -870340 -635055 -2240462 -2999931
42434 -2999931 -384767 3475159 4735579 3146975 1756992 2586195 4833244 6621005
42426 6621005 6749357 5212046 3342578 3038477 4777681 6801401 7089117 5646658 4028705
42417 4028705 3082327 2128196 319325 -1929714 -3245024 -2921593 -1842136 -1243887 -794463
42408 -794463 910507 3609802 4786151 2988321 169528 -1094268 -1316078 -2635382
42400 -2635382 -4744029 -5285364 -3921717 -2814081 -2867411 -2723029 -2107801 -2780101 -4766234
42391 -4766234 -4901286 -1300718 3301174 5187855 4654702 4734868 6397243 7792390 7560766
42382 7560766 6329095 4988461 3526092 1890187 670184 522657 1475195 2752901
42374B752901M29630p60378o32483Q36002J145862j138863l305713j975333J399401
42365a248974K352329L52657n54752J247099K097695o38780l713584k833228P50185
42356b189353K445269J261810M61456J825682L043910J623156j267677k395554
42348D808699p02766J429666J112970j582027l701509k980533m24724J429100
42340f11124J804051J677790J297997L6795j384553j139537O36749J504918M15973
42331D239059o82401k61178K23989q72354k159321j319779R19339J599203k24353
42322A462204k351281k518035q20745J098236J952198J618283Q03977J08804n75055
42313G78586j234556p22710J771630M181337L015984j491653m350997k123681
$$ plain form
42374 2752901 3182531 2422153 1789670 2625672 3771534 2632671 -673042 -2648375 -1248974
42365 -1248974 1103355 1456012 901260 2148359 4246054 3607274 -106310 -2939538 -2189353
42356 -2189353 255916 1517726 1979182 3804864 6848774 8471930 7204253 4808699
42348 4808699 4105933 5535599 6648569 5066542 1365033 -1615500 -2040224 -611124
42340 -611124 1192927 2870717 4168714 4205509 2820956 1681419 2318168 3823086 4239059
42331 4239059 3556658 3295480 3519469 2647115 487794 -831985 87354 1686557 1462204
42322 1462204 -889077 -3407112 -4227857 -3129621 -1177423 440860 1244837 1353641 778586
42313 778586 -455970 -1178680 592950 4774287 7790271 6298618 1947621 -176060
42305a76060K024179K585869o64045k975543j747630O68525J565784J338502J031220
42296C650801m5266k011580k504430M1545K968875K399669j137773l216303j728782
42287a583244M30636L5102j696334j258646J567880L124765J067307k251274k949168
42278c512976o46376J610217J803715J051058Q61460N49210j014140k552141j645568
42269c495541J437496L462955K409009N9591o96512L64344J294740J115107M63363
42260F414552l53918j707819k904479k372222l61377O93736k09850p54778J033150
42251e23005L119328K258119p11761j756296K86396J970664M72149k461520l363974
42242g09900j541577J002394K352292J844066J0029j334510n65614J135841P33520
$$ plain form
42305 -176060 1848119 4433988 3769943 794400 -953230 -284705 1281079 2619581 3650801
42296 3650801 3605535 1593955 -910475 -868930 2099945 4499614 3361841 145538 -1583244
42287 -1583244 -1152608 -1117506 -2813840 -4072486 -2504606 620159 1687466 -563808 -3512976
42278 -3512976 -4159352 -2549135 -745420 305638 1167098 1716308 702168 -1849973 -3495541
42269 -3495541 -2058045 1404910 3813919 3873510 3176998 3541342 4836082 5951189 6414552
42260 6414552 6060634 4352815 1448336 -923886 -1285263 -591527 -801377 -1556155 -523005
42251 -523005 2596323 4854442 4142681 2386385 2672781 4643445 5115594 2654074 -709900
42242 -709900 -2251477 -1249083 1103209 2947275 2957304 1622794 1057180 2193021 2926541
42233B926541j915913k973393j97594L265618L423136J078312m79924r59389j979649
42224B187745k401028J77960L973450M280188N38351k691513k672827j672305
42216A720021j774337j325422R21885K328560M89992k198867j811541J173718
42208d75991K721647J048729j523784k346275j577544r96370j149722o30787J821553
42199c108544M956937N828664L549167P26341k75081o32701k180972l323525j724564
42190C815722N00180n66641l381058k353526K758830N402420K395988r65582K68685
42181G875018K796273J180305k997599m257338k126481o10650q18554j30497K270380
42172C180857M275352M657424L617051N97299m000048o278454l114794J936100
$$ plain form
42233 2926541 1010628 -1962765 -2160359 1105259 4528395 5606707 5126783 4167394 2187745
42224 2187745 -213283 -35323 3938127 8218315 8756666 6065153 3392326 1720021
42216 1720021 -54316 -1379738 -457853 1870707 2360699 161832 -1649709 -475991
42208 -475991 2245656 3294385 1770601 -575674 -2153218 -3149588 -4299310 -4930097 -3108544
42199 -3108544 1848393 7677057 11226224 11952565 11677484 11044783 8863811 5540286 3815722
42190 3815722 4315902 3749261 368203 -1985323 773507 6175927 8571915 7606333 7875018
42181 7875018 10671291 11851596 8853997 4596659 2470178 1859528 1040974 910477 3180857
42172 3180857 7456209 12113633 15730684 16327983 12327935 6049481 2934687 4870787
42164D870787K382280j897376m587721k415808R44263J555656M13110o8314j15788
42155A081089o11524p14951M8663K88651n31937o07413R99978K287999J542452
42146C783007K75014O79874K029548J916218p2791j902045j796846j16085J307520
42137F103414J215613L90228O02386J727477J378539j289892l364603k178786
42129D584376L05970M36928j312190j527574J17866P15249k21966K1285J867002
42120D986946K215332L2859j723915j582025k045503m136247m272907r2261M675336
42111a942385N172072K148287k21472o60510q79195j313974q34226L71960J005628
42102B846185R81644R04577L07016j123949j872724o67507J122743J665827J710479
$$ plain form
42164 4870787 7253067 5355691 767970 -1647838 -703575 852081 1265191 1196877 1081089
42155 1081089 469565 -245386 -196723 91928 -440009 -1047422 -47444 2240555 3783007
42146 3783007 4058021 4737895 6767443 8683661 8610870 6708825 4911979 4795894 6103414
42137 6103414 7319027 7709255 8311641 10039118 11417657 10127765 6763162 4584376
42129 4584376 4890346 5327274 4015084 2487510 2605376 3320625 3098659 3119944 4986946
42120 4986946 7202278 7235137 5511222 3929197 1883694 -2252553 -6525460 -6617721 -1942385
42111 -1942385 3229687 5377974 5156502 4495992 3616797 2302823 1468597 1840557 2846185
42102 2846185 3827829 4732406 5039422 3915473 2042749 1375242 2497985 4163812 5874291
42093E874291K691123L357960J591587j474720k609362j320486k56337p69415
42085G084641j184472n0303J532855J891046J262747J153464K071824K699634
42077A6461436J316175j838839l956062k595973P55979J944629m99980l463129
42069H124236l709504j803094l1229J025686J672619J184334o71326k099446j859893
42060A832383j512524k427714k693342k85737K632090K501765R0951p73587O09935
42051b5780J301378K49724j45872J229976K017819M40339j778393k352822j725819
42042g89450j613889k149588k094690p05185J629846L677725L967502K260080
42034D182351M05670L40833J419593J397780j57931j379284r82392K63921J044280
$$ plain form
42093 5874291 8565414 11923374 13514961 12040241 9430879 8110393 7854056 7084641
42085 7084641 5900169 5849866 7382721 9273767 10536514 11689978 13761802 16461436
42077 16461436 17777611 15938772 11982710 9386737 10142716 12087345 11587365 8124236
42069 8124236 4414732 2611638 2580409 3606095 5278714 6463048 5791722 3692276 1832383
42060 1832383 319859 -2107855 -4801197 -5086934 -2454844 46921 137872 -635715 -25780
42051 -25780 1275598 1525322 1379450 2609426 4627245 5067584 3289191 936369 -789450
42042 -789450 -2403339 -4552927 -6647617 -7352802 -5722956 -2045231 1922271 4182351
42034 4182351 4588021 4928854 6348447 7746227 7588296 6209012 5226620 5490541 6534821
42025F534821Q03646l22428j326341o54976J504852K306410Q449k537617j407224
42016D909592K261023L587415J195197j209659j046135r9555j31336K62322J976219
42007A1705083K535382J26160k543097j923306R40829K082518L73483j519962
41999A1777090j253289O71076K154310J492006j361852m215713m239153j282548
41991C741927J662761K355067J814124J618570J104189m97069j405000J27988
41983A0522557K170776J471652j402972k705985j002505J220268J562503K93174
41975A2129468j446884l035868l254541p35513L200416M752796K334135j067028
41967A2876981j943422p30820j43534p34407p67943L10190J027714N53216j79528
$$ plain form
42025 6534821 7338467 7016039 5689698 5034722 6539574 8845984 8854433 6316816 4909592
42016 4909592 7170615 10758030 11953227 10743568 9697433 9597878 9466542 9728864 11705083
42007 11705083 14240465 14366625 11823528 9900222 10841051 12923569 13297052 11777090
41999 11777090 10523801 11194877 13349187 14841193 13479341 9263628 5024475 3741927
41991 3741927 5404688 7759755 9573879 11192449 12296638 11799569 10394569 10522557
41983 10522557 12693333 14164985 12762013 10056028 9053523 10273791 11836294 12129468
41975 12129468 10682584 7646716 4392175 3656662 6857078 11609874 13944009 12876981
41967 12876981 10933559 10202739 10059205 9324798 8556855 8867045 9894759 10447975 10268447
41958A0268447n48544j330907k721880l103524j343263R41205J279950j25988
41950C315496p57441M19632J560499R83107k81397l27292O06215P89777L1899
41941F340495L8896J553005K860380K011495n24775k407114k119517l01825J378455
41932H829495J896395J280934l560j463799k398556j985831j61638J785246K223993
41923A0002679R76039m05855l45788J150045K623902K480961L61345k181870k767521
41914A1893937r29525P52102k23010k540597k714087l05132J481829J031621O51234
41905I098372J964799K530173j136l297391l651505j709637q31251j318191p04637
41896B079596J121797J752612J027683J317222K595076J874171j265647l024708
$$ plain form
41958 10268447 9719903 8388996 5667116 2563592 1220329 2161534 3441484 3315496
41950 3315496 2558055 2977687 4538186 5521293 5239896 4912604 5518819 6308596 6340495
41941 6340495 6379391 7932396 10792776 12804271 12279496 9872382 7752865 7451040 8829495
41932 8829495 10725890 12006824 12003264 10539465 8140909 6155078 5993440 7778686 10002679
41923 10002679 10978718 10572863 10227075 11377120 14001022 16481983 16843328 14661458 11893937
41914 11893937 10964412 11716514 11493504 8952907 6238820 5933688 7415517 8447138 9098372
41905 9098372 11063171 13593344 13592208 10294817 6643312 4933675 4102424 2784233 2079596
41896 2079596 3201393 4954005 5981688 7298910 9893986 11768157 10502510 7477802
41888G477802j194564J253224Q36675j340827j892833k68270J061286K31715k023894
41879D140314l194794j206950K899101M798255J743209k868006l249062N63160
41871C625227K714636M73021j998423p92866J987803K754405J981398J420864
41863A2166065R6737k509133l230088j92725K478036N01656l055243k360769J515731
41854E410267K565448J24352m86897K182062L002471n73756l712339k033368J543862
41845H022102K082289K49310p1568J426017J917966P49294k67765q65234k423666
41836A0818745m255173l678070n39609J643809N98101j218248k95116K357439
41828E431878K318019j538310m457777j822674M157988O752117L289979j747497
$$ plain form
41888 7477802 6283238 7536462 8373137 7032310 5139477 4871207 5932493 6164208 4140314
41879 4140314 945520 -261430 2637671 7435926 9179135 6311129 3062067 3625227
41871 3625227 6339863 6812884 4814461 4021595 6009398 8763803 10745201 12166065
41863 12166065 12262802 9753669 6523581 6330856 8808892 9310548 6255305 3894536 5410267
41854 5410267 7975715 8100067 7613170 9795232 12797703 12223947 8511608 6478240 8022102
41845 8022102 10104391 10353701 10282133 11708150 13626116 14375410 14107645 13242411 10818745
41836 10818745 6563572 2885502 2345893 3989702 4587803 3369555 3074439 5431878
41828 5431878 7749897 6211587 1753810 -68864 4089124 10841241 14131220 12383723
41820A2383723l047554q28655J031359P31114l68123r49794j172055j356892j404565
41811E018558j223006l76174J697770L825682L340923J81275j578424O99002L392565
41802A4978171J516817l242017m477242n44437L320651L073731Q14079p6587K803
41793A5365969o98578j587068j365438n62147J7259Q17700J526578M48246j979003
41784A1983518k257448R09332L655228K528029m9813P1223J821641J081077j797514
41775A7945273k167114J224326L973036K802079K06300O0810J955186K750508
41767B8750404J644503O87714J080267J503657L48322k021333l824019l924472
41759B4245043k777313j479814l70809R62270K375520K784617J730845N78367
$$ plain form
41820 12383723 9336169 8507514 9538873 10269987 9901864 8952070 7780015 6423123 5018558
41811 5018558 3795552 3419378 5117148 8942830 12283753 12465028 10886604 11585606 14978171
41802 14978171 16494988 13252971 8775729 8231292 11551943 14625674 15439753 15363166 15365969
41793 15365969 14667391 13080323 11714885 11152738 11169997 11987697 13514275 13962521 11983518
41784 11983518 9726070 10635402 14290630 16818659 16768846 16840069 18661710 19742787 17945273
41775 17945273 15778159 17002485 20975521 23777600 23983900 24044710 25999896 28750404
41767 28750404 30394907 31082621 32162888 33666545 34014867 31993534 28169515 24245043
41759 24245043 21467730 19987916 19617107 20579377 22954897 25739514 27470359 28048726
41751B8048726J054653K980491M669036N429636O291026Q016945R838567J0948415
41743G7277495J2248607J5542651K1148883K6548996K6965793J7801009j239487
41736A96293947k3125275l6598656l5273495k3741162j2739698q508656r004435
41729D7302570r738241r139337p066210k701721K672858M379959L24418m242655
41721B1791641l078822J724962K788280j061048l440394j372131J32821k489330
41713A4995979m648784j515641L271508L294059m34421j868169J52451J332380
41705A4579362q8172j355192r43891m62851m98359M46142K353096L255646K713342
41696A9999123K133733J853984J189347M60811k51877k443171n521803m795578
$$ plain form
41751 28048726 29103379 32083870 36752906 42182542 48473568 56490513 66329080 77277495
41743 77277495 89526102 105068753 126217636 152766632 179732425 197533434 196293947
41736 196293947 173168672 136570016 101296521 77555359 64815661 56307005 47302570
41729 47302570 37564329 28424992 21358782 18657061 21329919 25709878 26034296 21791641
41721 21791641 18712819 20437781 23226061 22165013 18724619 17352488 17485309 14995979
41713 14995979 10347195 8831554 12103062 15397121 14962700 13094531 13246982 14579362
41705 14579362 14491190 13135998 12192107 11729256 11230897 11677039 14030135 17285781 19999123
41696 19999123 22132856 23986840 25176187 25636998 25385121 22941950 17420147 12624569
41688A2624569J755708P891443O814554J558307L3022K348155K201843q64744
41680C4362857j105179J819952K024394o53913O25450O603253R320685O338079
41672E9335578N504453J0445267J3809268J2101416J4495673K6413811L5070116
41665A77175582K4463958j585233k3249868k7565460j8014120n255841L011656
41658A28980674N953538R542550J9116007L0227578L6191262M5371676P1670106
41651C47053391R9164305Q1537172P77045r1690238j24545577q9443158m2341398
41644A80511542k5854178k7151455j9029870m176933J834789K494350Q685008
41637A17313253J3212951K800877j5402903k2442548j5964131r726891r518645
$$ plain form
41688 12624569 14380277 22271720 29086274 30644581 30677603 33025758 35227601 34362857
41680 34362857 33257678 35077630 37102024 36448111 37073561 43676814 52997499 59335578
41672 59335578 64840031 75285298 89094566 101195982 115691655 142105466 177175582
41665 177175582 201639540 200054307 176804439 149238979 131224859 125969018 128980674
41658 128980674 134934212 144476762 163592769 193820347 230011609 275383285 347053391
41651 347053391 446217696 527754868 528531913 436841675 312296098 222852940 180511542
41644 180511542 154657364 127505909 108476039 104299106 106133895 108628245 117313253
41637 117313253 130526204 133327081 117924178 95481630 79517499 69790608 60271963
41630F0271963q566187m412265k685066m163216l231793O4723m04261m469350
41622C2404548m826194M88727N674693P815199R292418Q952848J992623r298021
41614E2496841j5035453j1167729m655134k204061j999252j56211J981543J353275
41606B0613819j320628l253032l176065j262038J178183J393717j599128l893175
41598H681653j339431L487954M420295J071771j117724k5083O55629j175675k512694
41589A2146695p32715K657457N087708N416356L169361l74559j195335K492140
41581B8667108N972174M470680J362329K736560O563341O339999L221277L775666
41573F3109134P182450P095808N818429J2208961K4139318K9580173K9137684
$$ plain form
41630 60271963 51705776 47293511 44608445 40445229 37213436 37278159 36873898 32404548
41622 32404548 27578354 28067081 33741774 41556973 50849391 59802239 61794862 52496841
41614 52496841 37461388 26293659 21638525 19434464 17435212 17279001 19260544 20613819
41606 20613819 19293191 16040159 12864094 11602056 12780239 14173956 12574828 8681653
41598 8681653 7342222 10830176 15250471 16322242 15204518 15179435 15835064 14659389 12146695
41589 12146695 11413980 14071437 19159145 24575501 27744862 27370303 26174968 28667108
41581 28667108 34639282 39109962 40472291 43208851 49772192 56112191 59333468 63109134
41573 63109134 70291584 77387392 83205821 95414782 119554100 149134273 178271957
41566A78271957L8142860N6490421N6157622J6899376l9101230o9445355o1431713
41559A75983938l9431098k6489867k0934129j3497087o237573m490071m555780
41552F0348333q87203L391441L171364K122495P038024J5071022J5624636M432207
41544A10312319j0791275j9476265j8652546j3308285r273353p550126n275168
41537B5985301j188099J695406K57518l602432n086862l060400r35376r45127
41529A3119929j427468p94381l67030j284978j798047k24409J754589J599323
41521A0577528J71489M87689K768679L747440J714278k32180J694691N597056
41513B6526670N036936k092902r063161q305007j902692J207383j806066m104052
$$ plain form
41566 178271957 216414817 272905238 329062860 345962236 306861006 237415651 175983938
41559 175983938 136552840 110062973 89128844 75631757 69394184 64904113 60348333
41552 60348333 59461130 62852571 66023935 68146430 75184454 90255476 105880112 110312319
41544 110312319 99521044 80044779 61392233 48083948 38810595 31260469 25985301
41537 25985301 24797202 26492608 26750126 23147694 18060832 15000432 14065056 13119929
41529 13119929 11692461 10898080 10531050 9246072 7448025 7223616 8978205 10577528
41521 10577528 10749017 11236706 14005385 17752825 19467103 19234923 20929614 26526670
41513 26526670 31563606 29470704 20407543 12102536 10199844 11407227 9601161 5497109
41505E497109o52415L679846K424127j828500k030301J805938L523875J441462
41497A3861141P9627J431057K167775P93454N51846K963563M732558M008438M117235
41488C4706694P416998J0111205P348269K08928o151427q856493q628984o975255
41480B9179935n089609m033237l655849k566400n41729P79748N91550J8342l85782
41471A4296969j454137k677216j896435P84429K117707N66485j249534r26900
41463I561368K98910O88858J023434J929120J691265l68805j720551q55999j87769
41454A2059831j436383j961488K91784K105432K71858j971939J68257M419694
41446A3947046M561903O96141r15077J705353L232671J12110l863366l982998
$$ plain form
41505 5497109 4844694 8524540 10948667 9120167 7089866 8895804 12419679 13861141
41497 13861141 13940768 15371825 17539600 18333054 18884900 21848463 26581021 30589459 34706694
41488 34706694 42123692 52234897 59583166 59792094 53640667 44784174 36155190 29179935
41480 29179935 24090326 20057089 16401240 13834840 13293111 14072859 14664409 14682751 14296969
41471 14296969 12842832 10165616 8269181 9053610 11171317 11737802 10488268 9561368
41463 9561368 9860278 10549136 11572570 13501690 15192955 14824150 13103599 12247600 12059831
41454 12059831 10623448 8661960 8953744 11059176 11331034 9359095 9527352 13947046
41446 13947046 18508949 19205090 18290013 19995366 23228037 23340147 19476781 15493783
41438A5493783j414393m5997m94725r66410j249203k188274k936442j985816k2521
41429D190002Q73114L85476J68410J040969J803248J240442L7721k23564M31507
41420I947325J35043j787852k720682J26478M746679N593806R65650m075076m419886
41411H511485j491113J23212k29200P1847J134761O04089j261363j696145n92654
41402E174919n28399j325249p699K750911J979324l373667p078673m196214J541405
41393e063342L372459R62707p80647J02645J025844N16868L73983J633552K446118
41384D590187J290017n43687j097368m20312J98455K84739J87405j54758j150033
41375C184645k309555k167378k01329J753754J415506n54249j026949Q25378J730560
$$ plain form
41438 15493783 14079390 14033393 13538668 12572258 11323055 9134781 6198339 4212523 4190002
41429 4190002 5063116 5448592 5617002 6657971 8461219 9701661 9739382 9515818 9947325
41420 9947325 10082368 8294516 5573834 5700312 10446991 16040797 17006447 12931371 8511485
41411 8511485 7020372 7143584 6914384 6986231 8120992 8725081 7463718 5767573 5174919
41402 5174919 4646520 3321271 3313572 6064483 8043807 4670140 -2408533 -6604747 -5063342
41393 -5063342 -1690883 -728176 -1508823 -1406178 -380334 136534 510517 2144069 4590187
41384 4590187 5880204 5336517 4239149 3818837 4017292 4302031 4489436 4334678 3184645
41375 3184645 875090 -1292288 -1493617 260137 1675643 1121394 94445 919823 2650383
41366B650383n37211k789077r33333L037607L546918J64430j918903o60654j16391
41357B443769k526752l773344n96678L126966K404373q54849j474766N58213J268238
41348E75170J11883K04751K222505L589088L214922K176954L93834k515824l964505
41339F008778j341267K439594K162551j216796j792144J227699J971555j726474
41331G733496l970833n92407L530707K310606j872311k739505m46345k71780l003844
41322F77784l723643k04398L574343L655889J152361p39112j122856p96108n6471
41313B417789O98366J28574k090859l624161j926328J962751L990083K054074
41305C610289j022489r59127K138911L665585R86639k525433k332139M55568J031322
$$ plain form
41366 2650383 2113172 -675905 -1609238 1428369 4975287 5139717 3220814 2560160 2443769
41357 2443769 -82983 -3856327 -4453005 -1326039 1078334 223485 -1251281 -693068 575170
41348 575170 687053 891804 3114309 6703397 9918319 12095273 12489107 9973283 6008778
41339 6008778 4667511 7107105 9269656 8052860 6260716 7488415 9459970 7733496
41331 7733496 3762663 3170256 6700963 9011569 7139258 4399753 3953408 3681628 677784
41322 677784 -3045859 -3250257 324086 3979975 5132336 4393224 3270368 2474260 2417789
41313 2417789 3116155 3244729 1153870 -2470291 -4396619 -2433868 1556215 3610289
41305 3610289 2587800 1628673 3767584 7433169 8419808 5894375 3562236 4017804 5049126
41296E049126j182963j551032J880916M611501K542867j737351l340398k245275
41288D027391j570729j390951M98043L162634L266716P89812j004521j300442
41280F477953k354149l919392k505759K179355N256793L743326R44998N76541
41272A0399666Q85876j099808l192067j375279K638955L092328j011218m314152
41264F024301l192581m31306K03121k52432J146320L553263L537466P64589j374852
41255I977889j015451l87959j786794l487657k140810J830978M027374J806472
41247H824042k004721k741438J11937K749647K409660L92359r11469j548078k715507
41238D566432l635372k358873O58333K305110Q21171j748187k154003J66901K862213
$$ plain form
41296 5049126 3866163 2315131 4196047 8807548 11350415 9613064 6272666 4027391
41288 4027391 2456662 1065711 1563754 4726388 7993104 8782916 7778395 6477953
41280 6477953 4123804 204412 -2301347 -121992 5134801 8878127 9823125 10399666
41272 10399666 11285542 10185734 6993667 5618388 8257343 11349671 10338453 6024301
41264 6024301 2831720 2400414 2603535 2351103 3497423 7050686 10588152 11352741 9977889
41255 9977889 8962438 8574479 6787685 3300028 1159218 2990196 7017570 8824042
41247 8824042 6819321 4077883 4189820 6939467 9349127 9741486 8830017 7281939 4566432
41238 4566432 931060 -1427813 -769480 1535630 2356801 608614 -1545389 -1378488 1483725
41229A483725L542708J868850p30514k376354j895907M33512K985901L987792
41221I299713K865727M76936j759990k829364k523557j284539K53695J571811
41213F070432K180783J678257M09353k50994P48258K360954K114590q06940m047906
41204A0456787m623844k424965r5232L00696o89235j272155o81697M03807R66171
41195B340333N98316k54871n99520K60857J838680K647922J617017p07005k534775
41186E206954k512187j105429j98714r72001k293999j986742J86068J976601J747188
41177D7739O83186N53154P16519l36978j494298k64937K544794L038018J56823
41168E644020k260586j453966k27661k083898m764457l318531J757568M538328
$$ plain form
41229 1483725 5026433 6895283 6164769 3788415 1892508 2326020 5311921 9299713
41221 9299713 12165440 12642376 10882386 8053022 5529465 4244926 4498621 6070432
41213 6070432 8251215 9929472 10338825 10087831 10836089 13197043 15311633 14504693 10456787
41204 10456787 5832943 3407978 3312746 3613442 2924207 1652052 970355 1374162 2340333
41195 2340333 2938649 2683778 2084258 2345115 4183795 6831717 8448734 7741729 5206954
41186 5206954 2694767 1589338 1390624 418623 -1875376 -3862118 -3676050 -1699449 47739
41177 47739 730925 1284079 2000598 1663620 169322 -95615 2449179 5487197 5644020
41168 5644020 3383434 1929468 1701807 -382091 -5146548 -8465079 -6707511 -2169183
41160b169183K092072j720896k186116M61569L085518M112654L499104R88908
41152H163630k668134m600532k834826O14897K148283J210513J76491L60887P64631
41143C335840P05753J169342K744452L898891K447234j743936o024911p044555
41135e11890l973780L43240K365816J984370K008531L227648K727422j105369
41127G065988m651938l403530J422886M366666L081116L33704j217558k025443
41119D971891k550172j349685J629757L244627J314890j907103l076111k392438
41111a14344k073068k119873r52795R75445J733804J538703K293323L485681K242101
41102G008977j578101l851131j735637K019582K943353J045232j7284R82784J175914
$$ plain form
41160 -2169183 -77111 -1798007 -3984123 -3522554 -437036 3675618 7174722 8163630
41152 8163630 5495496 894964 -1939862 -1324965 823318 2033831 2210322 2571209 3335840
41143 3335840 4041593 5210935 7955387 11854278 14301512 12557576 6532665 -511890
41135 -511890 -4485670 -4142430 -1776614 207756 2216287 5443935 8171357 7065988
41127 7065988 2414050 -989480 433406 4800072 7881188 8214892 6997334 4971891
41119 4971891 2421719 1072034 2701791 5946418 7261308 5354205 2278094 -114344
41111 -114344 -2187412 -4307285 -5260080 -4284635 -2550831 -1012128 1281195 4766876 7008977
41102 7008977 5430876 1579745 -155892 1863690 4807043 5852275 5834991 6817775 7993689
41093G993689j383401m129085l393068L79424L193316K663521L81495j006863
41085D699028r75068m53865K49590J235736J711280P60425q63507j383616m87934
41076D492069L17047j5405r51632j762150k316531k026026J2832K773793L221667
41067C745664K36928k998936k740434L36075K326029J559484J40004J01216Q14738
41058C520768R01591L17826n18961j670658k584822j894879L48409J887065J185580
41049A491919l02385l83206P20392J242742O84062k46584j418955k719498k556851
41040c488364L29350L816203M066468P24540k259623j935272P7694P68728J37536
41031B237260K24286J306096J597088K85942j199965j167456L40605J710431J376576
$$ plain form
41093 7993689 6610288 2481203 -911865 -532441 2660875 5324396 5705891 4699028
41085 4699028 3723960 3270095 3519685 4755421 6466701 7227126 6363619 4980003 4492069
41076 4492069 4809116 4793711 3842079 2079929 -236602 -2262628 -2249796 523997 3745664
41067 3745664 3982592 983656 -1756778 -1420703 905326 2464810 2604814 2706030 3520768
41058 3520768 4422359 4740185 4221224 2550566 -34256 -1929135 -1580726 306339 1491919
41049 1491919 1189534 806328 1526720 2769462 3453524 3206940 1787985 -931513 -3488364
41040 -3488364 -3159014 657189 4723657 5448197 3188574 1253302 1330996 2099724 2237260
41031 2237260 2461546 3767642 5364730 5650672 4450707 3283251 3623856 5334287 6710863
41022F710863m72006j615866k11787K197181J815918k150803n384875l760345
41014b871720P84073K597801j37448l378401k978274M26528L199738L056134N32671
41005A231102k074945k313523K90348L054929K818481J61719j276922j52662R33286
40996B671813L11345J92947K183561L197270j01262m898822n064641J69684M945337
40987C607232M748752J505202o49198r49614j077876j479246j421661j172099
40979C111492j593904k341247k360035j594305o64325M75270K020597L060391
40971A13934K453494O82185n96250o42879K2457J044203K369791K976288J320363
40962I743586k206874m735022l965353r25805J353320J292565j15878j086419
$$ plain form
41022 6710863 6238857 4622991 4411204 6608385 8424303 6273500 888625 -2871720
41014 -2871720 -2087647 510154 372706 -3005695 -5983969 -5557441 -2357703 698431 1231102
41005 1231102 -843843 -3157366 -2867018 187911 3006392 3168111 1891189 1738527 2671813
40996 2671813 2983158 3176105 5359666 8556936 8455674 3556852 -1507789 -1338105 3607232
40987 3607232 8355984 9861186 9211988 8262374 7184498 5705252 4283591 3111492
40979 3111492 1517588 -823659 -3183694 -4777999 -5442324 -4967054 -2946457 113934
40971 113934 2567428 3249613 2653363 2010484 2032941 3077144 5446935 8423223 9743586
40962 9743586 7536712 2801690 -1163663 -2089468 -736148 556417 440539 -645880
40954f45880p25392P67901K244817J985069n73216l192125k634964J051820L828574
40945B106604K735174j210k62986J780654K021045j170895m357351m001911j025226
40936b176102J408092K142212J864801Q35572n91885q13387Q12315J794042l95609
40927D880051l779417l702296P28164N000533M677256K81302l883644m048000
40919A53949J3714M509927M432625j064334o577142o347986j607570J483056Q57140
40910d146621O96834L497077N394398K687702j505796j944139L31402j23926m026439
40901H60492n855577k317777K590832L376063M97918j131156O30178K745027J877334
40892C273334r28021j938432M1236K152785J576240o00404j160267N62315J981559
$$ plain form
40954 -645880 -1371272 -603371 1641446 3626515 3053299 -138826 -2773790 -1721970 2106604
40945 2106604 4841778 4840568 4577582 6358236 8379281 7208386 2851035 -1150876 -2176102
40936 -2176102 -768010 1374202 3239003 4074575 3482690 2669303 3481618 5275660 4880051
40927 4880051 1100634 -2601662 -1873498 3127035 7804291 8085593 4201949 153949
40919 153949 167663 4677590 9110215 8045881 1468739 -4879247 -6486817 -5003761 -4146621
40910 -4146621 -3449787 47290 5441688 8129390 6623594 4679455 5010857 4886931 860492
40901 860492 -4995085 -7312862 -4722030 -1345967 -848049 -1979205 -1349027 1396000 3273334
40892 3273334 2345313 406881 448117 2600902 4177142 3576738 2416471 2978786 4960345
40883D960345J204414o13073j549681j448465r55812J18433J835016K872871K012268
40874H436316O9071j091434q00048K76144J344489J661991M63426j946227l790811
40865D622917l727591k437484j314665n30372M64544J464064J750888J110122
40857A402423j68699j344175r51904J692668M145431K618342k470766n620058
40849f96738l209129J433881K955439J375364O48467J799707K173007P45571m87878
40840F737691o21669j076639k036583j552908O47779J923873P22944j099602j397652
40831B247234n89955p247K97212P19909J063128J385790K015932K035583J8905
40822I186491k946841l555304q37140J977060J652577j078508l254511l450882
$$ plain form
40883 4960345 6164759 5551686 4002005 2553540 1597728 1716161 3551177 6424048 8436316
40874 8436316 8505387 7413953 6613905 6890049 8234538 9896529 10359955 8413728 4622917
40865 4622917 895326 -1542158 -2856823 -3387195 -2922651 -1458587 292301 1402423
40857 1402423 1233724 -110451 -1062355 630313 4775744 7394086 4923320 -696738
40849 -696738 -3905867 -2471986 483453 1858817 2507284 4306991 6479998 7225569 6737691
40840 6737691 6116022 5039383 3002800 1449892 2097671 4021544 4744488 3644886 2247234
40831 2247234 1657279 1650032 1947244 2667153 3730281 5116071 7132003 9167586 9186491
40822 9186491 6239650 2684346 1847206 3824266 5476843 4398335 1143824 -2307058
40814b307058k188136k50658J685661K841888K991593K481588J185481j129183
40806E311176l176050k975821q61766N92710L75547L05115J538083K492309J706628
40797E307931K34620n39712j112199k024179k100097o04328Q74107P94472K7065
40788H57680j63084m30583j411637j607985J16369J825608J302985k6135P28597
40779A191815K914944L062589L04855k307024k318752p99163J60473N41224J563204
40770D314165L078977L311536J162148j943022l186154j642489L68023K96543
40762E759727j159674j577172j025230j697530l358301k901756N24868L639723
40754a795345L780705J934991m68496l481035n377646k740632K928552M360111
$$ plain form
40814 -2307058 -4495194 -4745852 -3060191 -218303 2773290 5254878 6440359 5311176
40806 5311176 2135126 -840695 -1702461 -1109751 -734204 -429089 1108994 3601303 5307931
40797 5307931 5542551 5002839 3890640 1866461 -233636 -837964 36143 830615 857680
40788 857680 694596 264013 -1147624 -2755609 -2639240 -813632 489353 463218 1191815
40779 1191815 4106759 7169348 7474203 5167179 2848427 2049264 2209737 2750961 4314165
40770 4314165 7393142 10704678 11866826 9923804 6737650 5095161 5463184 5759727
40762 5759727 4600053 3022881 1997651 300121 -3058180 -5959936 -5435068 -1795345
40754 -1795345 1985360 3920351 3451855 -29180 -5406826 -8147458 -5218906 -858795
40746h58795r41432n076527j207244M890472L537273k847710l487129K745141
40738c245951N375004p8926m789885j634257L373805J970612k726973k444388
40730d200959K415435M599695K126650l82435o81887r87266j740873q36963P54060
40721A065457m25435l323471k656140K252104N234175K373145k323020l495077
40713a298262j679892k26797O25383K020446K272573l94916l037152j360074K952334
40704a26357L704132n89115m106939k144451K367920L795069J818465M83581J147541
40695F349846R81054j435235l159857j290329K399832L620700J109491k147629
40687F427873k890856j072475Q45737R08196n62487j723686j279207L06534J590743
$$ plain form
40746 -858795 -1800227 -6876754 -8083998 -3193526 343747 -2503963 -5991092 -3245951
40738 -3245951 2129053 2050127 -2739758 -4374015 -1000210 970402 -1756571 -4200959
40730 -4200959 -1785524 2814171 4940821 4558386 3876499 2889233 1148360 311397 1065457
40721 1065457 640022 -2683449 -5339589 -3087485 2146690 4519835 2196815 -1298262
40713 -1298262 -2978154 -3204951 -2579568 -559122 1713451 1318535 -1718617 -3078691 -126357
40704 -126357 3577775 2988660 -1118279 -3262730 -894810 2900259 4718724 5202305 6349846
40695 6349846 7330900 5895665 2735808 1445479 3845311 7466011 8575502 6427873
40687 6427873 3537017 2464542 3310279 4218475 3655988 1932302 653095 959629 2550372
40678B550372J757204J018892j38651j199380j353926k52465R43953O64461p52761
40669C237699j479981j195333j475277k423712j592353J887127M589148L037071
40661D584389j074618l110406j855544k37742k50559q51553j160001k015799l164517
40652i136350k210009J626258N182009N125423K436291P78011J285449J348371
40644F435453j211672m558096m686994n41001L989165M227359L76523k706822
40636A323915j636199J793498M027850M332690L853109K457937m12515l331888
40628A2408397m485391m411905m159839k511721J242532L819079K115228p92528
40620C223852K89319L729327L218324j267626k813536N49177K013687k324501
$$ plain form
40678 2550372 4307576 5326468 5187817 3988437 2634511 2382046 3325999 3990460 3237699
40669 3237699 1757718 562385 -912892 -3336604 -4928957 -3041830 1547318 4584389
40661 4584389 3509771 399365 -1456179 -1693921 -1944480 -2796033 -3956034 -5971833 -9136350
40652 -9136350 -11346359 -9720101 -4538092 587331 3023622 3801633 5087082 6435453
40644 6435453 5223781 665685 -4021309 -4562310 -573145 3654214 4030737 1323915
40636 1323915 -312284 1481214 5509064 9841754 13694863 16152800 15740285 12408397
40628 12408397 7923006 3511101 -648738 -3160459 -1917927 1901152 4016380 3223852
40620 3223852 3513171 7242498 10460822 9193196 6379660 6928837 8942524 6618023
40612F618023o418959m396094q7754M94937m99106J761750M505781K113803k653716
40603A438665k440736J757604K020647k446902l452190K186685O924031M533464
40595A0521268q74756k768680j732765j470245j380715O51825K611055J649526
40587G206513k54386L69247K128872J217700j869041l417687k790037k404448
40579A86733k437858q36849J629808J536574j272796k627576l65105K330937K006694
40570A50562J8600j66948J514138J985533k1915k024706j285839J458194K946668
40561D574287J516205j037363k180814k024877k430851l302805k211380J540925
40553e556673M842447M538722J588760o45118r72356q11262r01055l93828P40272
$$ plain form
40612 6618023 199064 -4197030 -4284784 -3789847 -4288953 -2527203 1978578 4092381 1438665
40603 1438665 -1002071 755533 2776180 329278 -3122912 -936227 5987804 10521268
40595 10521268 9646512 6877832 5145067 3674822 2294107 2945932 5556987 7206513
40587 7206513 6952127 7321374 9450246 10667946 8798905 5381218 2591181 186733
40579 186733 -2251125 -3087974 -1458166 78408 -1194388 -3821964 -4187069 -1856132 150562
40570 150562 169162 2214 1516352 3501885 3479970 1455264 169425 1627619 4574287
40561 4574287 6090492 5053129 2872315 847438 -1583413 -4886218 -7097598 -5556673
40553 -5556673 -714226 3824496 5413256 4768138 3795782 2984520 2083465 1689637 2429909
40544B429909J041535O0456n47729M37352J616561O30115k609292n280140m334460
40535f555693J33597M180722L603526j015987m135776j742464L260468M771457
40527B499850J787773p02302M57095K155949P01338j841890j006810K613218M063864
40518A0728085J743238l25693R47294L017480J943808j671886m005503l499530
40510H877293k004632j288298j180121j003372n13970O45332K404856L147655
40502I084743J192631k408607m643798m421794l442291k731346j081785J740199
40494f712048L076749J122785j505140j022856J876329K954259P43295j427934
40486h94561n28092J950533K556165O96276j180513j231991n6124R18667J155480
$$ plain form
40544 2429909 3471444 3531900 2984171 3421523 5038084 5668199 3058907 -2221233 -6555693
40535 -6555693 -6422096 -2241374 1362152 346165 -3789611 -5532075 -2271607 2499850
40527 2499850 4287623 3585321 4042416 6198365 6899703 5057813 4051003 6664221 10728085
40518 10728085 12471323 12145630 13092924 16110404 18054212 16382326 12376823 8877293
40510 8877293 6872661 5584363 4404242 3400870 2886900 3532232 5937088 9084743
40502 9084743 10277374 7868767 3224969 -1196825 -4639116 -7370462 -8452247 -6712048
40494 -6712048 -3635299 -2512514 -4017654 -5040510 -3164181 -209922 533373 -894561
40486 -894561 -1422653 527880 3084045 3780321 2599808 1367817 1311693 2230360 3385840
40477C385840O92774n42911k084679k368348l41262K342650K473624m21218k639455
40468D97015j081362J970585J902209j106572k186758K62600J564113j561848
40460B59982m858497k785290K362922L630795J35422k037214J26951K423887J350017
40451F08975k17116R41157K001227r69623n354744n288919q48492K020745N64466
40442f542324j339165K6415K804885L354579J824921Q16171P20276k34999k164663
40433g33904k835555j090041J378907K553537K643298K796708K552558N63304
40425G828812k457512l721695k071326J48532L48947o81302m50602R97161J178589
40416A119604o74257k290446j775695N6113J617491K519370K564167J143008r26439
$$ plain form
40477 3385840 4078614 3535703 1451024 -917324 -1258586 1084064 3557688 3136470 497015
40468 497015 -584347 1386238 3288447 2181875 -4883 257717 1821830 259982
40460 259982 -4598515 -7383805 -5020883 -1390088 -1254666 -3291880 -3164929 -741042 608975
40451 608975 391859 1333016 3334243 2364620 -2990124 -8279043 -9127535 -7106790 -6542324
40442 -6542324 -7881489 -7855074 -5050189 -1695610 129311 945482 1665758 1430759 -733904
40433 -733904 -3569459 -4659500 -3280593 -727056 1916242 4712950 7265508 7828812
40425 7828812 5371300 1649605 -421721 -273189 75758 -605544 -1056146 -58985 1119604
40416 1119604 445347 -1845099 -3620794 -3564681 -1947190 572180 3136347 4279355 3352916
40407C352916j308918K77930P33643j847482m501602l361467M35449K433260J436264
40398b350007M01476R07225R39865p72612k049279r16334R66701J033779j11009
40389a950195M2492J893310L510343L734049L185710K404594J043285q51756k354646
40380A0657186k825388k432390j418019l2403P66895K3989j430430j449366L58836
40371B218910J490079j93901l194161m115896k070060N96216J785563J702392
40363a780858J035674n12637k512141k665934L49481M004692M336111J007951
40355C262339k204694k150637M04342K593486K735091J122101q89623j677670
40347C194735m53477J551628J938213j11110k745553l599220k171431K42823J905352
$$ plain form
40407 3352916 2043998 2321928 3055571 1208089 -3293513 -6654980 -6219531 -3786271 -2350007
40398 -2350007 -1948531 -1041306 -101441 -874053 -2923332 -3839666 -2872965 -1839186 -1950195
40389 -1950195 -1907703 -14393 3495950 7229999 10415709 12820303 13863588 13011832 10657186
40380 10657186 7831798 5399408 3981389 3948986 4715881 4739870 3309440 1860074 2218910
40371 2218910 3708989 3515088 320927 -3794969 -5865029 -5268813 -3483250 -1780858
40363 -1780858 -745184 -1257821 -3769962 -6435896 -6086415 -2081723 2254388 3262339
40355 3262339 1057645 -1092992 -688650 1904836 4639927 5762028 4872405 3194735
40347 3194735 2741258 4292886 6231099 6119989 3374436 -224784 -2396215 -2153392 -248040
40338b48040J578017o13998k725600k575009k83800J860522K227953J054420j095262
40329h20797l708440m726861j645594M144960P034172L852118j412540k704104
40321A2914K5769J570973n61294l072162k294114R06354L136657K781214O10344
40312C116655j963014l445092k479517N84093L029419K401856l69849j935996
40304a061445p63877J021916Q11174p53559r39277O75237J465528K29891l97341
40295B88247J624205L341642Q47620l594213l714996J034324L692052J16436m421051
40286g85734l271984J491789K840639k45478k194440k67928J944325J224757o86371
40277D9575r75702K31507J711099L288366M250498K955864m6854j588028n02025
$$ plain form
40338 -248040 1329977 715979 -2009621 -4584630 -4868430 -3007908 -779955 274465 -820797
40329 -820797 -4529237 -9256098 -10901692 -6756732 277440 4129558 2717018 12914
40321 12914 38683 1609656 1048362 -2023800 -4317914 -3411560 -274903 2506311 3116655
40312 3116655 1153641 -2291451 -4770968 -4186875 -1157456 1244400 874551 -1061445
40304 -1061445 -1825322 -803406 7768 -745791 -1685068 -1009831 455697 685588 288247
40295 288247 1912452 5254094 6101714 2507501 -1207495 -173171 3518881 3635317 -785734
40286 -785734 -4057718 -2565929 274710 29232 -2165208 -2433136 -488811 735946 49575
40277 49575 -926127 -694620 1016479 4304845 8555343 11511207 11464353 9876325 9374300
40268I374300L05226j474141l758845l548708j630908q13135j331467j154286
40260d031964K52447J400231J524786J361363J319941R79559M83942O66474J407454
40251E364233J189632j049142m178752n520392l416741P55175L545227K961551
40243c49209O04409n60553O4187N74409l10823j788888k587518k276257r02049
40234g532292R49926J745991N63365r61024l80618J813762K594012P92723j406090
40225a820245j761552k32414K306239M704945M687754R34480l358275l128054
40217B332878J088918K951226l16313l398880j302703K545678J822717k665902
40209C057619m645387k096489R15014J503263J106114R18134l14707k486073k813456
$$ plain form
40268 9374300 9679526 8205385 4446540 897832 -733076 -1546211 -2877678 -4031964
40260 -4031964 -3779517 -2379286 -854500 506863 1826804 2806363 3290305 3956779 5364233
40251 5364233 6553865 5504723 1325971 -4194421 -7611162 -6855987 -3310760 -349209
40243 -349209 255200 -305353 -241166 333243 22420 -1766468 -4353986 -6630243 -7532292
40234 -7532292 -6582366 -4836375 -4273010 -5234034 -5614652 -3800890 -1206878 -414155 -1820245
40225 -1820245 -3581797 -3814211 -1507972 3196973 7884727 8819207 5460932 2332878
40217 2332878 3421796 6373022 6056709 2657829 1355126 3900804 5723521 3057619
40209 3057619 -1587768 -3684257 -2769243 -1265980 -159866 758268 443561 -2042512 -4855968
40200d855968m08943J588339O98694j120101o97053J775364L723988L946498L148697
40191G799515J959844M33286j092655k121631k630816k690363k007138o05216
40183i55174O25938Q10145J19393n73923o85994j97801N96900J161100Q20231
40174A720815o57235k404715k693569n20890K687198L822558J653436j050266
40166B557332o80087K295709L860257J965794j217108l188393m081259m321281
40158b809036k724892N91590K437165Q57796j286643n65687J473733J083789j165398
40149b107583j345291J189643K861372J635132n54078j634893j869588j893099
40141c718385j628115j509665j680534l29556L394943N524290J474353n729808
$$ plain form
40200 -4855968 -5264911 -3676572 -2977878 -4097979 -4795032 -3019668 704320 4650818 7799515
40191 7799515 9759359 10192645 9099990 6978359 4347543 1657180 -349958 -955174
40183 -955174 -329236 480909 600302 26379 -659615 -857416 -260516 900584 1720815
40174 1720815 1063580 -1341135 -4034704 -4555594 -1868396 1954162 3607598 2557332
40166 2557332 1877245 4172954 8033211 9999005 8781897 5593504 1512245 -2809036
40158 -2809036 -5533928 -4942338 -2505173 -1647377 -2934020 -3499707 -2025974 -942185 -2107583
40149 -2107583 -3452874 -2263231 598141 2233273 1679195 44302 -1825286 -3718385
40141 -3718385 -5346500 -6856165 -8536699 -8866255 -5471312 52978 1527331 -4202477
40133d202477p457926j340416M900249M418526L17534n54650J995653K893111
40125I69604M53087k125419k507665j480964o8746J449782J959026N14521j329404
40116b166178j280439J35310Q12682J034410K611850M540848L607022j82320k692442
40107F420743j525653N85909J87275j832391k078972J29201K000877J259565j108176
40098D038378k359438j148770J224963K342421J218066p52067j517469p53186
40090B292898L8238l18278j207186j263373l42597K11834o41033k090379k356475
40081e676351j114670j02252o71504j670596j041550J090071K626730K603726
40073c956396K166539K213153K028508R17544n57725j683453k274346j755180
$$ plain form
40133 -4202477 -11660403 -13000819 -8100570 -3682044 -3364510 -3919160 -1923507 969604
40125 969604 1422691 -702728 -3210393 -4691357 -4760103 -3310321 -1351295 -836774 -2166178
40116 -2166178 -3446617 -3311307 -2498625 -1464215 1147635 5688483 9295505 9113185 6420743
40107 6420743 4895090 5480999 5668274 3835883 1756911 1886112 3886989 5146554 4038378
40098 4038378 1678940 530170 1755133 4097554 5315620 4563553 3046084 2292898
40090 2292898 2331136 2012858 805672 -457701 -800298 -588464 -1229497 -3319876 -5676351
40081 -5676351 -6791021 -6893273 -7564777 -9235373 -10276923 -9186852 -6560122 -3956396
40073 -3956396 -1789857 423296 2451804 3369348 2811623 1128170 -1146176 -2901356
40065b901356L44470K320915J367791j956061l168152Q1530M044207L848432K58956
40056D240732j995151j103789M69712Q03414P36836J043423Q74112j68547j159144
40047C741598j737425k397938k508663q08264J587704J777942l22011j229890
40039a896947O31244K085457M35581j538023L11993M268563M277560j340153p008713
40030B26562p136842k855043P26534J487201J504852K503104L355985K479932
40022B292285K56836j879728l073871k858481r42390J662657K773354J682523
40014h6815L04832J46252j79510k098305l428675j117326L131529M169188Q16682
40005A657852k295534j743493N7960l04334j720129j374101J63436Q03875J305648
$$ plain form
40065 -2901356 -2556886 -235971 1131820 -824241 -3992393 -3910863 133344 3981776 4240732
40056 4240732 2245581 1141792 1611504 2414918 3151754 4195177 5069289 4900742 3741598
40047 3741598 2004173 -393765 -2902428 -3710692 -2122988 -345046 -667057 -1896947
40039 -1896947 -1265703 819754 1255335 -282688 29305 4297868 8575428 7235275 226562
40030 226562 -6910280 -9765323 -9038789 -7551588 -6046736 -3543632 -187647 2292285
40022 2292285 2549121 669393 -2404478 -5262959 -6205349 -4542692 -1769338 -86815
40014 -86815 218017 364269 184759 -1913546 -5342221 -6459547 -3328018 841170 1657852
40005 1657852 -637682 -2381175 -2323215 -2627549 -4347678 -5721779 -5558343 -4754468 -3448820
39996c448820L120597L907645N98202m068425l961641J167401M635899K506485
39988D457343j256210j856982o59182j173274k309631p50770K455954L031801
39980A939049L32333j765028j073158L9301r24358k803923l160247j870115m05793
39971i691939O92021J679978K107507J316223q6376p65493m15395K37016R08234
39962d018224J897245K741808K183525P5704j777210j645196j49604M61363q58547
39953a089136k640086k513904K26033L596951M361378J097994l759758n815426
39945f535954l415770M90723K247612J892451J763570K075869J082869p00924
39937a099554k95686K691166M428136K277081j227119k279550r71679K71289Q84817
$$ plain form
39996 -3448820 -328223 3579422 4177624 109199 -3852442 -2685041 1950858 4457343
39988 4457343 3201133 1344151 684969 -488305 -2797936 -3548706 -1092752 1939049
39980 1939049 2271382 506354 -566804 -527503 -1451861 -4255784 -7416031 -9286146 -9691939
39971 -9691939 -8999918 -7319940 -5212433 -3896210 -3982586 -4748079 -5163474 -4926458 -4018224
39962 -4018224 -2120979 620829 2804354 2880058 1102848 -542348 -691952 -230589 -1089136
39953 -1089136 -3729222 -6243126 -6017093 -2420142 1941236 3039230 -720528 -6535954
39945 -6535954 -9951724 -9461001 -7213389 -5320938 -3557368 -1481499 -398630 -1099554
39937 -1099554 -1395240 1295926 5724062 8001143 6774024 4494474 3522795 3794084 4678901
39928D678901J402231O59011k246941m671004l374010N1257J099121n91711p90042
39919c783187K124059M230345K135975j982102l867723k777221j021337m4087
39911d985278N37589J166129J545936J166645q5154j242956o03737J727404K546300
39902A772878m80777m282564l611380J214154M297550K765342L82838N76516J096037
39893C730594p87906k442189k18796L596376L651554m03266l798351l662765j540888
39884a875637N32012J984459J861697o25014l260569k511986J157506L288216
39876E50684J766096k82314N41824L031663L500507P88726k764616m261323k922433
39867e1186n39936K68358j040825k077659p56347J404775J353112o93709j424164
$$ plain form
39928 4678901 6081132 6740143 4493202 -177802 -3551812 -3500555 -2401434 -2993145 -3783187
39919 -3783187 -1659128 2571217 4707192 2725090 -1142633 -3919854 -4941191 -4985278
39911 -4985278 -4447689 -3281560 -1735624 -568979 -654133 -1897089 -2500826 -773422 1772878
39902 1772878 1292101 -2990463 -6601843 -5387689 -1090139 1675203 2058041 2634557 3730594
39893 3730594 2942688 500499 281703 3878079 7529633 7126367 3328016 -334749 -1875637
39884 -1875637 -1343625 640834 2502531 1877517 -1383052 -3895038 -2737532 550684
39876 550684 2316780 2034466 2576290 5607953 9108460 9897186 7132570 2871247 -51186
39867 -51186 -591122 -322764 -1363589 -3441248 -4197595 -2792820 -1439708 -2133417 -3557581
39858c557581L55777J829417O47339j521888j809126l93000L01690o42213j843954
39849f633539j974651j036147N51291K542920M200496M211270K197934j9482K14546
39840D254638L055403M945854K309827l536301p146460n419588j221724R40433
39832a817918O29764L56014O11584l61109k407758k792487l98437K308480K619732
39823a252135P43281j348027k430692k472024j953606j484945j171281k84338
39815a1653767J496706L005351K991395J824560M51678r63201j626087M25709
39807d047656M548710N733464J053052m249222k921788L267560N616257J640861
39799A0641238j773475k27873J558901q82742l559742j398596K394308J760970
$$ plain form
39858 -3557581 -3201804 -1372387 -725048 -2246936 -4056062 -4449062 -4147372 -4789585 -6633539
39849 -6633539 -8608190 -9644337 -9093046 -6550126 -2349630 1861640 4059574 4040092 4254638
39840 4254638 7310041 12255895 14565722 11029421 3882961 -1536627 -2758351 -1817918
39832 -1817918 -1188154 -832140 -220556 -581665 -2989423 -5781910 -6180347 -3871867 -1252135
39823 -1252135 -508854 -1856881 -4287573 -6759597 -8713203 -10198148 -11369429 -11653767
39815 -11653767 -10157061 -7151710 -4160315 -2335755 -1884077 -2847278 -4473365 -4047656
39807 -4047656 501054 6234518 7287570 3038348 116560 3384120 9000377 10641238
39799 10641238 8867763 8639890 10198791 9316049 5756307 4357711 6752019 8512989
39791H512989j928609k834270p80366m38130k156286j619908J654513K970263
39783C380196M64839j988093j269429J058712K590343K898058J516665j998222
39775F653069n023178l803902N28435K806202J562260M77471J038005P1058l205515
39766A103905m248183q68293K190483Q51825j521459k27396K604182K031983j068992
39757H48055j902291k810P95627n31091j110920J10217R34521M34569K44652Q95404
39747G15933R52715K30684J36141M98315l73128k168112k535196q54359J100577
39738b296430K233105K642657J528877j584472l857909j798399K863941M578948
39730D310318J905547p62223m68217M56353k65458q18639M57231J345663j55840
$$ plain form
39791 8512989 6584380 3750110 2969744 2531614 375328 -1244580 409933 3380196
39783 3380196 3845035 1856942 587513 1646225 4236568 7134626 8651291 6653069
39775 6653069 1629891 -2174011 -1645576 1160626 2722886 3200357 4238362 4309420 1103905
39766 1103905 -3144278 -4012571 -1822088 -970263 -2491722 -2719118 -114936 1917047 848055
39757 848055 -1054236 -1057046 -261419 -792510 -1903430 -1793213 -858692 -424123 -179471 715933
39747 715933 1668648 1899332 2035473 2533788 2160660 -7452 -2542648 -3397007 -2296430
39738 -2296430 -63325 2579332 4108209 2523737 -1334172 -3132571 -268630 4310318
39730 4310318 6215865 5453642 4985425 5441778 5176320 4357681 4814912 6160575 6004735
39721F004735j832104j114079K67962o61388l099029m195435l443628j911712
39713i984678M27611L127543L695492J377763k37288J412002K841595n9341m356634
39704a755935m033097K30287K185845K26750q90656R22232J841660r2799j122370
39695b488083J003212K377253j28710k763976q76174L314965M393144J993078
39687F824709p0514n30930j116609j870166j244719r811l30124j560289j369201
39678a277654l64217r74435k262868r48954K294210K929089r2822k362269j178853
39669d238773M41484m04560j455743K38490K737477K528519N82734M12706J930870
39660B773204J962639p6786j606902j716313k093043k734674j241520K234531
$$ plain form
39721 6004735 4172631 3058552 3326514 2665126 -433903 -4629338 -8072966 -9984678
39713 -9984678 -9557067 -6429524 -2734032 -1356269 -1593557 -181555 2660040 2600699 -1755935
39704 -1755935 -5789032 -5558745 -3372900 -3146150 -4036806 -3114574 -1272914 -1365713 -2488083
39695 -2488083 -1484871 892382 763672 -2000304 -2876478 438487 4831631 6824709
39687 6824709 6754195 6223265 5106656 3236490 1991771 1981960 1651836 91547 -1277654
39678 -1277654 -1641871 -2616306 -4879174 -5828128 -3533918 -604829 -697651 -3059920 -4238773
39669 -4238773 -3797289 -4201849 -5657592 -5419102 -2681625 -153106 429628 842334 2773204
39660 2773204 4735843 4659057 3052155 1335842 -757201 -3491875 -4733395 -2498864
39652b498864L564765O07861k867520k407149N98114J404634o72333j675091L61826
39643c583757K554322K287059J413650K647330M397254K843636j859538n165040
39635E534916m299778j653870p30967j422416j437900m67480j03870m84000L2312
39626e033053J629809K177331O88732n26489R66263L676049L592820l86459m426384
39617B358619m167886o4066L203754K499359k31006j138835K00438Q46131l81692
39608C124816p72345J742772M387072K857068k242503n678612m464420j228178
39600b274330K87194K9377K1473N04728M28275J45716N95685O41195j592368m745610
39590e958665m787634n69274L814043L905497K87768k777436k748056o81462J462979
$$ plain form
39652 -2498864 1065901 1673762 -1193758 -3600907 -3002793 -1598159 -2270492 -3945583 -3583757
39643 -3583757 -1029435 1257624 2671274 5318604 9715858 12559494 10699956 5534916
39635 5534916 1235138 -418732 -1149699 -2572115 -4010015 -4477495 -4581365 -5065365 -5033053
39626 -5033053 -3403244 -1225913 -537181 -1063670 -97407 3578642 7171462 6785003 2358619
39617 2358619 -1809267 -1873333 1330421 3829780 3598774 2459939 2660377 3506508 3124816
39608 3124816 2352471 4095243 8482315 11339383 9096880 3418268 -1046152 -2274330
39600 -2274330 -1987136 -1957759 -1936286 -1431558 -1003283 -857567 -261882 379313 -1213055 -5958665
39590 -5958665 -10746299 -11315573 -7501530 -3596033 -3308265 -6085701 -8833757 -9515219 -8052240
39581h052240K846207K878697P88269k614271m379874k506164J116517K699912
39573g222947J359074j1491Q89402K573745K339856L74500r72829j151450j849942
39564c672082l266777k871678O04250M241083M327941J337976j040991j130556
39556a470834o88073j066076j020778L92539J370971N2663k067794k108720l25408
39547f931510K98582r74233j178408J624461M863175M908883K131786j90319q48660
39538C703757j451002k530983k383319n94320N02988m07326j189884J54637J908451
39529b287001J506692j4929Q3747J299655Q45098j041526j112692J195618K486394
39520B961056J032654o02193n05874o80378k466860k836232N89912M143350K889511
$$ plain form
39581 -8052240 -5206033 -2327336 -1539067 -4153338 -8533212 -11039376 -9922859 -7222947
39573 -7222947 -5863873 -5875364 -4985962 -2412217 -72361 302139 -670690 -1822140 -3672082
39564 -3672082 -6938859 -9810537 -9206287 -4965204 -637263 700713 -340278 -1470834
39556 -1470834 -2158907 -3224983 -4245761 -3853222 -2482251 -2429588 -4497382 -6606102 -6931510
39547 -6931510 -6632928 -7607161 -8785569 -7161108 -2297933 2610950 4742736 4552417 3703757
39538 3703757 2252755 -278228 -2661547 -3255867 -2752879 -3160205 -4350089 -4195452 -2287001
39529 -2287001 -780309 -795238 -711491 588164 1433262 391736 -720956 474662 2961056
39520 2961056 3993710 3391517 2885643 2205265 -261595 -3097827 -2507915 1635435 4524946
39511D524946j352812k486131L17254J661393r13686k904970l26945L858188M323904
39502F701141Q41357k542579l347818k198828l18452J212338R81554r58156j919005
39493a548448p823K494982K227638j4330p35058M46469O59601o82124q95672N03517
39483B448752J97957k855032m275115p11829M179000M614500J012733j428347
39475C182619r28536n63912j813814k177097m13461Q24341j66957r43072N53449
39466b446440J984302O98133j284107o08025J368679O95657k174365k602220Q96353
39457c472033M301393M198271K022302M67544n65086k038055k922564k152502
39449a60730j188310j734302k497391j036578K195108M243753L509062J095171
$$ plain form
39511 4524946 3172134 686003 1003257 2664650 1750964 -1154006 -1480951 2377237 6701141
39502 6701141 7542498 4999919 1652101 -546727 -865179 347159 1328713 370557 -1548448
39493 -1548448 -1556271 938711 3166349 3152019 2416961 2863430 3523031 2840907 1945235 2448752
39483 2448752 2646709 -208323 -4483438 -5195267 -1016267 3598233 4610966 3182619
39475 3182619 2254083 1690171 -123643 -2300740 -2714201 -1889860 -2056817 -2999889 -2446440
39466 -2446440 -462138 235995 -1048112 -1656137 -287458 408199 -1766166 -4368386 -3472033
39457 -3472033 829360 5027631 7049933 7517477 6952391 4914336 1991772 -160730
39449 -160730 -1349040 -3083342 -5580733 -6617311 -4422203 -178450 3330612 4425783
39441D425783j143412k044927j247370L31489O89503q94098k337642j291157J523310
39432a988521L273825K632198O70582j066580j541556j94902J971408K219674
39424E976128o63294l831776l715500r95188P37487M29682O0718J86948p02599
39415b517394k002061p23011L185511N507230L788888Q25312k06217k13686r02313
39406F742259q83911J101209K383711K96812k676242k594311q44348j662112m062485
39397b199418k608971L234609O784958L484959k565173m681809k271232K55432
39389e66645L41597r05737k022519k490543j500186J251019L686031L138970K49345
39380A181332j364064J84218K717188L085008Q97511j699034k693326j734137
$$ plain form
39441 4425783 3282371 1237444 -9926 321563 1011066 116968 -2220674 -3511831 -1988521
39432 -1988521 1285304 3917502 4588084 3521504 1979948 1785046 3756454 5976128
39424 5976128 5312834 1481058 -2234442 -3229630 -2492143 -2062461 -2001743 -1814795 -2517394
39415 -2517394 -4519455 -5242466 -2056955 3450275 7239163 8064475 7858258 7644572 6742259
39406 6742259 5858348 6959557 9343268 9640080 6963838 4369527 3525179 1863067 -2199418
39397 -2199418 -4808389 -1573780 5211178 8696137 6130964 1449155 -822077 -566645
39389 -566645 -225048 -1130785 -3153304 -5643847 -7144033 -5893014 -2206983 931987 1181332
39380 1181332 -182732 1486 2718674 5803682 6701193 5002159 2308833 574696
39372E74696J34624J396508J176763l3664j057757j470626j669500j518483j79042
39363b646481K071179L107247J423481j334707k011900j41479J280805K9524j933447
39354a55778j018668K721727N068116K899532j763972m255666k730597M45244
39346A209938K289829K298674J512936K51421j711905l443412l166469p32797
39338a491785J538415J503045r2154q03935K88N31978k46079q27896J39818J104187
39328A355882j51755k501124k642379k57700J205561q5226j397544L3125K371906
39319b069254K263572M68144L80747J869573J190202k388454m390885j679522
39311d355877K456489K895082j19529k021220q86426M74867n07020k432865k394614
$$ plain form
39372 574696 709320 2105828 3282591 3248927 2191170 720544 -948956 -2467439 -2646481
39363 -2646481 -575302 2531945 3955426 2620719 608819 467340 1748145 1777669 -155778
39354 -155778 -1174446 1547281 6615397 9514929 7750957 3495291 764694 1209938
39346 1209938 3499767 5798441 7311377 7562798 5850893 2407481 -758988 -1491785
39338 -1491785 46630 1549675 1457521 653586 653874 1185852 939773 111877 251695 1355882
39328 1355882 1204127 -1296997 -3939376 -4197076 -2991515 -3076741 -4474285 -4441160 -2069254
39319 -2069254 194318 662462 1043209 2912782 4102984 1714530 -2676355 -4355877
39311 -4355877 -1899388 995694 876165 -1145055 -2031481 -1556614 -2063634 -4496499 -6891113
39302f891113L5680K694671L409055J627495j450311l417431k343816R69023L188149
39293b178598K094046n72525j300009N03486J824317M91388j578720j180787J277760
39284f19642K080057m11396l093599k347247Q30515K319841P76514q35557j32129
39275a432643J080372n2756k631999l040312j62062L037113L492794J490850o71511
39266A109846j716378j828053j311330l38239M98593O81550O18140R78276J406109
39257I8514J001273L9908k4397J322428K591467K086307P2504j703497k270294
39248C214213k242544k360088k151543o62047J833640L542952K877025K51200
39240D302808k198853k787390j837963q20576l67357J02887R04523J344908J005666
$$ plain form
39302 -6891113 -6855433 -4160762 -751707 875788 -574523 -3991954 -6335770 -5366747 -2178598
39293 -2178598 -84552 -657077 -1957086 -1453600 370717 862105 -716615 -1897402 -619642
39284 -619642 1460415 1049019 -2044580 -4391827 -3561312 -1241471 -464957 -1300514 -1432643
39275 -1432643 -352271 -405027 -3037026 -6077338 -6239400 -3202287 290507 1781357 1109846
39266 1109846 -606532 -2434585 -3745915 -4084154 -3585561 -2904011 -2285871 -1307595 98514
39257 98514 1099787 1139695 1115298 2437726 5029193 7115500 7188004 5484507 3214213
39248 3214213 971669 -1388419 -3539962 -4202009 -2368369 1174583 4051608 4302808
39240 4302808 2103955 -683435 -2521398 -3341974 -3709331 -3606444 -2701921 -1357013 -351347
39231c51347P86621J602410K607442K076384J1625j490754r35045O07949R64343
39222E879628m41915k134626k442781j208069J53498K7189j615449k797850j685436
39213f265811P85444J724334K53431r68688N18206L234306L817050J822697j13393
39204D807576o03703j048808k221141k259577J54569K837443K699479L8900k113095
39195B291643k228202j522967j196278p87009K54844J331287J871446K244056
39187B258820K593405K041798J35850j854298k231986r37093N78468J039587J36669
39178C761220j737410l542499l884865k382607m42196M09257N90286J472544K600071
39169c156199J906665p59232k432330q62164K022705K588703N33145j061126n93935
$$ plain form
39231 -351347 435274 2037684 4645126 6721510 6733135 5242381 4307336 4915285 5879628
39222 5879628 5437713 3303087 860306 -347763 -194265 -167076 -1782525 -4580375 -6265811
39213 -6265811 -5480367 -3756033 -3502602 -4471290 -3953084 -718778 3098272 4920969 4807576
39204 4807576 4203873 3155065 933924 -1325653 -1171084 1666359 4365838 4404738 2291643
39195 2291643 63441 -1459526 -2655804 -3442813 -3187969 -1856682 14764 2258820
39187 2258820 4852225 6894023 7029873 5175575 2943589 2006496 2584964 3624551 3761220
39178 3761220 2023810 -1518689 -5403554 -7786161 -8228357 -7819100 -7228814 -5756270 -3156199
39169 -3156199 -1249534 -2008766 -4441096 -5303260 -3280555 -691852 -158707 -1219833 -1813768
39160a813768q5710j422422k966248k072465N60410J765165O71474j75002J007678
39151d530888K499353K013254M03849K22715J654492K424131J534321M87697J96064
39142F904988p33969l066128m499764k693779N93300J397362p89182k411429j347801
39133f646402K90962K97500J06544J769613L679027K811768j64624j774750j136603
39124g66965o03724r01878K04305L144484M395918J487181k890046m524403l076075
39115c531203r85350Q82495L105706M609078L404302J78962j960183j529869k0662
39106D153276Q03686O23663l79728j792823k188333m34384J961646K067530n60139
39097D254394l200653l398687j130044K228256M708919L900647o12301m875955
$$ plain form
39160 -1813768 -1899478 -3321900 -6288148 -8360613 -7800203 -6035038 -5363564 -5538566 -4530888
39151 -4530888 -2031535 -18281 385568 608283 2262775 4686906 6221227 6708924 6904988
39142 6904988 6171019 3104891 -1394873 -4088652 -3495352 -2097990 -2887172 -5298601 -6646402
39133 -6646402 -6355440 -6057940 -5951396 -4181783 -502756 2309012 2144388 369638 -766965
39124 -766965 -1370689 -2272567 -2068262 1076222 5472140 6959321 4069275 -455128 -3531203
39115 -3531203 -4516553 -3634058 -528352 4080726 7485028 7663990 5703807 4173938 4153276
39106 4153276 4956962 5580625 5200897 3408074 1219741 785357 2747003 4814533 4254394
39097 4254394 1053741 -2344946 -3474990 -1246734 3462185 7362832 6750531 1874576
39089A874576m126237O44229L310242Q47468k941965l564371j579737L01018J819812
39080c414965L308615K694986j177518m662513l512054M71331J718680q17340
39072e390778k349985M11873M753274N925915K644759k426479n501181m482390
39064f414992q24282J472172M67161j043442K26224K753400K809070R83751J126840
$$ plain form
39089 1874576 -2251661 -1607432 1702810 2550278 -391687 -3956058 -5535795 -5234777 -3414965
39080 -3414965 -106350 2588636 1411118 -3251395 -6763449 -6292118 -4573438 -5390778
39072 -5390778 -7740763 -7328890 -2575616 3350299 5995058 3568579 -1932602 -6414992
39064 -6414992 -7239274 -5767102 -5299941 -6343383 -6117159 -3363759 -554689 429062 1555902
$$ [...]
##END NTUPLES=NMR SPECTRUM
##END=
