##TITLE=31Pdec_SR9_k
 d6, 24 sc
 27.11.2020
##JCAMPDX= 6.0         $$ Bruker NMR JCAMP-DX V2.0
##DATA TYPE= NMR SPECTRUM
##DATA CLASS= NTUPLES
##ORIGIN= UXNMR, Bruker Analytische Messtechnik GmbH
##OWNER= root
$$ XWIN-NMR		Version 3.5
$$ Fri Nov 27 13:30:13 2020 Russian Standard Time (UT+4h)  she@DPX200
##.OBSERVE FREQUENCY= 81.013821
##.OBSERVE NUCLEUS= ^31P
##.ACQUISITION MODE= SIMULTANEOUS
##.ACQUISITION SCHEME= undefined
##.AVERAGES= 24
##.DIGITISER RES= 17
##SPECTROMETER/DATA SYSTEM= spect
##.PULSE SEQUENCE= zgpg30
##.SOLVENT NAME= CDCl3
##.SHIFT REFERENCE= (INTERNAL, CDCl3, 0, 182.463)
##AUDIT TRAIL= $$ (NUMBER, WHEN, WHO, WHERE, WHAT)
$$ ##TITLE= Audit trail, XWIN-NMR		Version 3.5
$$ ##JCAMPDX= 5.01
$$ ##ORIGIN= Bruker BioSpin GmbH
$$ ##OWNER= she
$$ F:/spectra/data/she/nmr/P31/1/pdata/1/auditp.txt
$$ ##AUDIT TRAIL=  $$ (NUMBER, WHEN, WHO, WHERE, WHAT)
(   1,<2020-11-27 13:27:48.65 +0400>,<she>,<DPX200>,
      <created by zg, POWCHK disabled, PULCHK disabled
       configuration hash MD5:
       00 E9 B6 7A A2 85 ED C7 34 08 36 98 17 FE 4E 26
       data hash MD5: 32K
       DF C7 CA F0 B3 2C FE FA 74 85 CA 91 2F FE F5 D3>)
(   2,<2020-11-27 13:28:28.01 +0400>,<she>,<DPX200>,
      <Start of raw data processing
       efp BC_mod = 2 LB = 1 FT_mod = 6 PKNL = 1 PHC0 = -2426.81 PHC1 = 189.8008 SI = 64K 
       data hash MD5: 64K
       FB 9F 82 49 3E 59 D2 7A 78 BE E9 66 81 58 89 D8>)
(   3,<2020-11-27 13:28:48.48 +0400>,<she>,<DPX200>,
      <pk PHC0 = -16.02013 PHC1 = 0 
       data hash MD5: 64K
       CE E8 28 4C 66 FE 09 F7 19 3C 51 20 3A BD C1 01>)
(   4,<2020-11-27 13:29:29.78 +0400>,<she>,<DPX200>,
      <pk PHC0 = 44.4229 PHC1 = -129.6001 
       data hash MD5: 64K
       5F C7 DE 21 C7 AF 85 1B 40 FA C5 9F 3D F7 21 8D>)
(   5,<2020-11-27 13:29:32.82 +0400>,<she>,<DPX200>,
      <abs ABSG = 5 
       data hash MD5: 64K
       E7 40 D2 4A 02 EE 40 B1 64 B7 33 8C 49 29 98 E7>)
$$ ##END=
$$ 
$$ hash MD5
$$ 90 B0 98 4E 78 3E CE 5D ED 66 CB 2C A1 1A 2D 25
##$RELAX= 
##$RELAX= 
##$RELAX= 
##$RELAX= 
##$RELAX= 
##$RELAX= 
##$RELAX= 
##$RELAX= 
$$ Bruker specific parameters
$$ --------------------------
##$DU= <F:/spectra>
##$EXPNO= 1
##$NAME= <P31>
##$PROCNO= 1
##$TYPE= <nmr>
##$USER= <she>
##$AMP= (0..31)
100 100 100 100 100 100 100 100 100 100 100 100 100 100 100 100 100 100 
100 100 100 100 100 100 100 100 100 100 100 100 100 100 
##$AQSEQ= 0
##$AQ_mod= 1
##$AUNM= <au_zg>
##$AUTOPOS= <>
##$BF1= 81.014009
##$BF2= 200.13
##$BF3= 200.13
##$BF4= 200.13
##$BF5= 200.13
##$BF6= 200.13
##$BF7= 200.13
##$BF8= 200.13
##$BYTORDA= 1
##$CFDGTYP= 0
##$CFRGTYP= 5
##$CHEMSTR= <none>
##$CNST= (0..31)
1 1 145 1 1 1 1 1 1 1 1 1 1 1 1 1 1 1 1 1 1 1 1 1 1 1 1 1 1 1 1 1 
##$CPDPRG= <waltz16>
##$CPDPRG1= <>
##$CPDPRG2= <waltz16>
##$CPDPRG3= <>
##$CPDPRG4= <mlev>
##$CPDPRG5= <mlev>
##$CPDPRG6= <mlev>
##$CPDPRG7= <mlev>
##$CPDPRG8= <mlev>
##$CPDPRGB= <>
##$CPDPRGT= <>
##$D= (0..31)
0 1 0 0 0 0 0 0 0 0 0 0.03 2e-05 3e-06 0 0 0 0 0 0 0 0 0 0 0 0 0 0 0 0 
0 0 
$$ [...]
##$SUBNAM3= <"">
##$SUBNAM4= <"">
##$SUBNAM5= <"">
##$SUBNAM6= <"">
##$SUBNAM7= <"">
##$SUBNAM8= <"">
##$SUBNAM9= <"">
##$SW= 369.568048894756
##$SWIBOX= (0..15)
0 1 3 0 0 0 0 0 0 0 0 0 0 0 0 0 
##$SW_h= 29940.119760479
##$TD= 32768
##$TD0= 1
##$TE= 0
##$TE2= 300
##$TE3= 300
##$TEG= 300
##$TL= (0..7)
0 120 53 12 22 120 120 120 
##$TP= (0..7)
150 150 150 150 150 150 150 150 
##$TP07= 0
##$TPNAME0= <>
##$TPNAME1= <>
##$TPNAME2= <>
##$TPNAME3= <>
##$TPNAME4= <>
##$TPNAME5= <>
##$TPNAME6= <>
##$TPNAME7= <>
##$TPOAL= (0..7)
0.5 0.5 0.5 0.5 0.5 0.5 0.5 0.5 
##$TPOFFS= (0..7)
0 0 0 0 0 0 0 0 
##$TUNHIN= 0
##$TUNHOUT= 0
##$TUNXOUT= 0
##$USERA1= <user>
##$USERA2= <user>
##$USERA3= <user>
##$USERA4= <user>
##$USERA5= <user>
##$V9= 5
##$VALIST= <valist>
##$VCLIST= <CCCCCCCCCCCCCCC>
##$VD= 0
##$VDLIST= <DDDDDDDDDDDDDDD>
##$VPLIST= <PPPPPPPPPPPPPPP>
##$VTLIST= <TTTTTTTTTTTTTTT>
##$WBST= 1024
##$WBSW= 4
##$XGAIN= (0..3)
0 0 0 0 
##$XL= 0
##$YL= 0
##$YMAX_a= 18118
##$YMIN_a= -9141
##$ZGOPTNS= <>
##$ZL1= 120
##$ZL2= 120
##$ZL3= 120
##$ZL4= 120
##$ABSF1= 182.463
##$ABSF2= -187.1042
##$ABSG= 5
##$ABSL= 3
##$ALPHA= 0
##$AQORDER= 0
##$ASSFAC= 0
##$ASSFACI= 0
##$ASSFACX= 0
##$ASSWID= 0
##$AUNMP= <proc_1d>
##$AZFE= 0.1
##$AZFW= 0.5
##$BCFW= 0
##$BC_mod= 2
##$BYTORDP= 0
##$COROFFS= 0
##$CY= -3
##$DATMOD= 1
##$DC= 0
##$DFILT= <>
##$DTYPP= 0
##$F1P= 0
##$F2P= 0
##$FCOR= 1
##$FTSIZE= 65536
##$FT_mod= 6
##$GAMMA= 0
##$GB= 0
##$INTBC= 1
##$INTSCL= 5.30512e-09
##$ISEN= 30
##$LB= 1
##$LEV0= 0
##$LPBIN= 0
##$MAXI= 10000
##$MC2= 0
##$MEAN= 0
##$ME_mod= 0
##$MI= 50
##$NCOEF= 0
##$NC_proc= -8
##$NLEV= 6
##$NOISF1= 182.463
##$NOISF2= 159.3651
##$NSP= 0
##$NTH_PI= 0
##$NZP= 0
##$OFFSET= 182.463
##$PC= 4
##$PHC0= -2398.407
##$PHC1= 60.2007
##$PH_mod= 1
##$PKNL= yes
##$PPARMOD= 0
##$PSCAL= 0
##$PSIGN= 0
##$REVERSE= no
##$SF= 81.014009
##$SI= 65536
##$SIGF1= 159.3651
##$SIGF2= -187.1042
##$SINO= 113.3802
##$SIOLD= 16384
##$SREGLST= <1H.CDCl3>
##$SSB= 0
##$STSI= 65536
##$STSR= 0
##$SW_p= 29940.119760479
##$SYMM= 0
##$S_DEV= 0
##$TDeff= 32768
##$TDoff= 0
##$TI= <>
##$TILT= no
##$TM1= 0
##$TM2= 0
##$TOPLEV= 0
##$USERP1= <user>
##$USERP2= <user>
##$USERP3= <user>
##$USERP4= <user>
##$USERP5= <user>
##$WDW= 1
##$XDIM= 65536
##$YMAX_p= 262980681
##$YMIN_p= -35979872
$$ End of Bruker specific parameters
$$ ---------------------------------
##NTUPLES= NMR SPECTRUM
##VAR_NAME=  FREQUENCY,     SPECTRUM/REAL,   SPECTRUM/IMAG
##SYMBOL=    X,             R,               I
##VAR_TYPE=  INDEPENDENT,   DEPENDENT,       DEPENDENT
##VAR_FORM=  AFFN,          ASDF,            ASDF
##VAR_DIM=   65536,         65536,           65536
##UNITS=     HZ,            ARBITRARY UNITS, ARBITRARY UNITS
##FACTOR=    0.456856943014862, 1,           1
##FIRST=     14782.0589164895, 0,            0
##LAST=      -15158.0608439895, 0,           0
##MIN=       -15158.0608439895, -35979872,   0
##MAX=       14782.0589164895, 262980681,    0
$$ Real data points
##PAGE= N=1
##DATA TABLE= (X++(R..R)), XYDATA
$$ [...]
$$ plain form
45342 -10480325 -11033678 -12466326 -10336910 -4406703 1269410 4710765 6958958 7551663
45334 7551663 5055396 2071527 3294376 7555547 8328844 4107118 1451912 4350855
45326 4350855 7313398 4330458 -985342 -1081250 3370920 4456500 -1091515 -7751385
45318 -7751385 -9511402 -6901002 -4056016 -2528623 -428875 3587457 7156923 6009348
45310 6009348 -209697 -5307040 -3185027 3116116 4123299 -2788383 -8733760 -5594486
45302 -5594486 2664824 6368844 3188088 -1631354 -4487311 -5658042 -4710823 -1174602
45294 -1174602 1396584 -732775 -4140289 -1835645 5916140 11405744 10426412 6382354
45286 6382354 2878797 -405883 -3125305 -2948707 -927791 -1290315 -3914564 -4214813 -2416514
$$ packed form
45342a0480325n53353j432648K129416N930207N676113L441355K248193N92705
45334G551663k496267k983869J222849M261171P73297m221726k655206K898943
45326D350855K962543k982940n315800r5908M452170J085580n548015o659870
45318g751385j760017K610400K844986J527393K099748M016332L569466j147575
45310F009348o219045n097343K122013O301143J007183o911682n945377L139274
45302e594486Q259310L704020l180756m819442k855957j170731R47219L536221
45294a174602K571186k129359l407514K304644P751785N489604r79332m044058
45286F382354l503557l284680k719422J76598K020916l62524k624249l00249J798299
$$ plain form
45277 -2416514 -4355406 -9767124 -9329379 814199 10500592 9444427 2302095 609557
45269 609557 5457951 8503847 6411137 3415594 1131069 -3480989 -9471787 -11070969
45261 -11070969 -7735878 -6716499 -12300073 -19015442 -18943229 -10847429 419175 8862977
45253 8862977 9712228 2003317 -8469477 -13141674 -10100915 -5601907 -4503436 -4206025
45245 -4206025 -735005 4199474 5943203 2742769 -4490505 -14232285 -22644164 -24090141
45237 -24090141 -17781271 -10401001 -7771446 -7524272 -4824510 -1373504 -2290765 -6824066
45229 -6824066 -9316514 -8110925 -6556860 -5841994 -4021573 -2294122 -4550754 -9064582
45221 -9064582 -8083347 1224563 11839262 16414026 15804374 14165825 11501014 6369480
$$ packed form
45277b416514j938892n411718M37745J0143578R686393j056165p142332j692538
45269F09557M848394L045896k092710k995543k284525m612058n990798j599182
45261a1070969L335091J019379n583574o715369P2213Q095800J1266604Q443802
45253H862977Q49251p708911j0472794m672197L040759M499008J098471K97411
45245d206025L471020M934479J743729l200434p233274r741780q411879j445977
45237b4090141O308870P380270K629555K47174K699762L451006r17261m533301
45229f824066k492448J205589J554065P14866J820421J727451k256632m513828
45221i064582R81235R307910J0614699M574764o09652j638549k664811n131534
$$ plain form
45213 6369480 1156043 -1269959 -2615285 -5454901 -7795937 -6615807 -3174032 782049
45205 782049 7472270 16333006 17753339 4333625 -14051609 -19058206 -8529879 625506
45197 625506 -2196541 -6488934 1068624 15332011 21334172 16325944 10269525 8612375
45189 8612375 7545499 5194696 5164736 7395556 6212431 649410 -2292484 1397118
45181 1397118 6220181 5976572 2469841 737803 1320418 2241322 3795943 6166622 6237126
45172 6237126 1872256 -3871465 -7369228 -9764600 -12777358 -12929663 -6362039 3023680
45164 3023680 7292735 5582524 4661145 7996991 11072481 9683075 6785251 7132990
45156 7132990 9330816 8084025 2513223 -2230174 -1730797 2493434 5646494 5634959 4758815
$$ packed form
45213F369480n213437k426002j345326k839616k341036J180130L441775L956081
45205G82049O690221Q860736J420333j3419714j8385234n006597J0528327R155385
45197F25506k822047m292393P557558J4263387O002161n008228o056419j657150
45189H612375j066876k350803k9960K230820j183125n563021k941894L689602
45181A397118M823063k43609l506731j732038N82615R20904J554621K370679P0504
45172F237126m364870n743721l497763k395372l012758j52305O567624R385719
45164C023680M269055j710211r21379L335846L075490j389406k897824L47739
45156G132990K197826j246791n570802m743397M99377M224231L153060j1535q76144
$$ plain form
45147 4758815 5803848 8004122 8167289 5644809 4468998 8944644 17402073 22099326
45139 22099326 16683599 3649227 -6827959 -6675482 1666389 8175209 6862340 1933033
45131 1933033 685534 3485316 5051065 3596244 2358717 1781368 -2654032 -11619400
45123 -11619400 -17237884 -12508213 -1231287 7065054 8872164 7450671 4657148 -643091
45115 -643091 -6724849 -8910763 -6695621 -5078048 -6940833 -9164372 -8353715 -5740118
45107 -5740118 -3961549 -3192403 -3165073 -5138704 -8727935 -10155158 -7157206 -2955224 -1792563
45098 -1792563 -2783925 -2137949 -51269 -1088706 -7428707 -14870180 -16671839 -10138081
45090 -10138081 623373 7574249 5298604 -3569399 -9919521 -6806522 3641107 12983820
$$ packed form
45147D758815J045033K200274J63167k522480j175811M475646Q457429M697253
45139B2099326n415727j3034372j0477186J52477Q341871O508820j312869m929307
45131A933033j247499K799782J565749j454821j237527n77349m435400q965368
45123a1619400n618484M729671J1276926Q296341J807110j421493k793523n300239
45115f43091o081758k185914K215142J617573j862785k223539Q10657K613597
45107e740118J778569P69146K7330j973631l589231j427223K997952M201982J162661
45098a792563r91362O45976K086680j037437o340001p441473j801659O533758
45090a0138081J0761454O950876k275645q868003o350122L112999J0447629R342713
$$ plain form
45082 12983820 15165956 10669920 3070900 -5111123 -11881934 -13921894 -8693524 1411068
45074 1411068 9590761 11010286 7587023 4779362 4580432 4244940 1638619 -1810377
45066 -1810377 -4746428 -8465573 -12722738 -12440283 -3609058 9249715 17011531 16982492
45058 16982492 14563305 13609647 11387445 5251984 -1630340 -5053997 -5511138 -4814044
45050 -4814044 -1298169 6114431 12373723 11466989 5720525 3219081 5773795 6120125
45042 6120125 -908892 -10423286 -14552978 -13168545 -12547007 -15513266 -18181983 -16685555
45034 -16685555 -12695696 -10129769 -8968845 -5400429 2085840 9101717 9460826 2594481
45026 2594481 -4635605 -4880281 1190874 5204187 1090991 -6916270 -9096642 -2597879
$$ packed form
45082A2983820K182136m496036p599020q182023o770811k039960N228370J0104592
45074A411068Q179693J419525l423263k807661j98930l35492k606321l448996
45066a810377k936051l719145m257165K82455Q831225J2858773P761816k9039
45058A6982492k419187r53658k222202o135461o882324l423657m57141O97094
45050d814044L515875P412600O259292r06734n746464k501444K554714L46330
45042F120125p029017r514394m129692J384433O21538k966259k668717J496428
45034a6685555L989859K565927J160924L568416P486269P015877L59109o866345
45026B594481p230086k44676O071155M013313m113196q007261k180372O498763
$$ plain form
45018 -2597879 4888694 5340521 318241 -2938495 -2031140 -376611 601442 2979273 5280026
45009 5280026 1724721 -7910542 -14502448 -10924918 -1744720 4139045 5259618 5224283
45001 5224283 3993870 505869 -157430 6902855 15005349 12697463 1922722 -3130443
44993 -3130443 2628096 8109076 4984970 567430 3685843 9193048 7419432 710056
44985 710056 -1151395 3519777 8370708 10480406 11285354 9468196 3508262 -1124092
44977 -1124092 2064191 8910634 9441723 3832991 2859360 11449588 21716413 24482649
44969 24482649 19164570 10028911 598562 -5728527 -6471955 -3812990 -2012742 -868899
44961 -868899 1873999 2925896 -2681894 -10585371 -10771886 -3559173 -251451 -4852827
$$ packed form
45018b597879P486573M51827n022280l256736R07355J654529R78053K377831K300753
45009E280026l555305r635263o591906L577530R180198N883765J120573l5335
45001E224283j230413l488001o63299P060285Q102494k307886j0774741n053165
44993c130443N758539N480980l124106m417540L118413N507205j773616o709376
44985G10056j861451M671172M850931K109698Q04948j817158n959934m632354
44977a124092L188283O846443N31089n608732r73631Q590228J0266825K766236
44969B4482649n318079r135659r430349o327089p43428K658965J800248J143843
44961h68899K742898J051897n607790p903477j86515P212713L307722m601376
$$ plain form
44953 -4852827 -7459361 -1208091 6449227 7373195 6625374 12465475 21031539 22351276
44945 22351276 15870119 9119866 4964184 483497 -4093819 -5013289 -2421683 -363544
44937 -363544 -433588 -1709754 -4699103 -8947735 -9692870 -3994890 2658534 3358636 583958
44928 583958 1924726 7447036 10139613 7556847 4168558 2665307 1393640 146503
44920 146503 54414 -2176919 -11026021 -22448505 -26279706 -19966118 -11692440 -8164739
44912 -8164739 -7651443 -7289083 -8495912 -11484600 -12215409 -9082344 -6046707 -5295240 -3244300
44903 -3244300 2124718 6072868 3562682 -4211539 -13089075 -20280962 -22657233 -17374850
44895 -17374850 -7967930 -3011389 -4374174 -3916915 2940837 8094494 2530468 -9384251
$$ packed form
44953d852827k606534O251270P657318R23968p47821N840101Q566064J319737
44945B2351276o481157o750253m155682m480687m577316r19470K591606K058139
44937c63544p0044j276166k989349m248632p45135N697980O653424P00102k774678
44928E83958J340768N522310K692577k582766l388289j503251j271667j247137
44920A46503r2089k231333q849102j1422484l831201O313588Q273678L527701
44912h164739N13296L62360j206829k988688p30809L133065L035637P51467K050940
44903c244300N369018L948150k510186p774221q877536p191887k376271N282383
44895a7374850R406920M956541j362785M57259O857752N153657n564026j1914719
$$ plain form
44887 -9384251 -16276320 -15778344 -14764141 -16271821 -15630034 -9466545 -910080 5156244
44879 5156244 6632170 3723462 -1596310 -5886678 -7641758 -9186270 -11926655 -12520793
44871 -12520793 -8259249 -3105165 -2638563 -5639016 -7004702 -6589338 -7898161 -9855061
44863 -9855061 -8205175 -4709891 -6217482 -13292519 -18123633 -16381202 -13367285 -14417601
44855 -14417601 -16137840 -12653959 -5469017 -957127 -981969 -1819880 -1286211 -1821027 -5726690
44846 -5726690 -10719682 -12124335 -8596497 -4209066 -3961518 -7603663 -9833489 -7372276
44838 -7372276 -3278750 -2224761 -4244770 -6415586 -8117812 -10133174 -10480169 -6637197
44830 -6637197 -1139850 674777 -1381393 -2086469 1008108 4687929 6484742 8401953
$$ packed form
44887i384251o892069M97976J014203j507680O41787O163489Q556465O066324
44879E156244J475926k908708n319772m290368j755080j544512k740385n94138
44871a2520793M261544N154084M66602l000453j365686M15364j308823j956900
44863i855061J649886L495284j507591p075037m831114J742431L013917j050316
44855a4417601j720239L483881P184942M511890k4842q37911N33669n34816l905663
44846e726690m992992j404653L527838M387431K47548l642145k229826K461213
44838g372276M093526J053989k020009k170816j702226k015362l46995L842972
44830f637197N497347J814627k056170p05076L094577L679821J796813J917211
$$ plain form
44822 8401953 12160806 15529148 15833814 13354540 9325275 3999254 -1932646 -7200351
44814 -7200351 -11618330 -14402329 -11949062 -2857889 5859638 5269238 -2316326 -5261777
44806 -5261777 538917 6258496 5057996 2200225 4274558 8053256 8419129 9026296
44798 9026296 14845024 20329622 16228962 4557977 -3823564 -4452144 -2408101 -1877005
44790 -1877005 -2060958 -2681499 -4490038 -4435719 1363322 9954730 14606910 14695196 14352106
44781 14352106 12729317 5607864 -3637737 -5861686 -567099 2451798 -1187899 -3865239
44773 -3865239 734667 8093152 12145643 14436050 17336048 16779614 9371460 -352023
44765 -352023 -7050932 -12276480 -17853916 -18762258 -11284353 -1934266 1390450 1875961 7065200
$$ packed form
44822H401953L758853L368342L04666k479274m029265n326021n931900n267705
44814g200351m417979k783999K453267R091173Q717527n90400p585564k945451
44806e261777N800694N719579j200500k857771K074333L778698L65873O07167
44798I026296N818728N484598m100660j1670985q381541o28580K044043N31096
44790a877005j83953o20541j808539N4319N799041Q591408M652180Q8286l43090
44781A4352106j622789p121453r245601k223949N294587L018897l639697k677340
44773c865239M599906P358485M052491K290407K899998n56434p408154r723483
44765c52023o698909n225548n577436r08342P477905R350087L324716M85511N189239
$$ plain form
44756 7065200 14142965 13735377 6121156 1411308 3351866 4534278 -127578 -5783639
44748 -5783639 -7265915 -7011401 -8316907 -8395406 -4175732 796897 1622022 260577 2301758
44739 2301758 7724379 10539270 7161501 735404 -3467298 -3940284 -2992536 -2451767 -1109166
44730 -1109166 2733000 6974289 6671092 901170 -3854539 -603040 9157740 17052776
44722 17052776 17759166 13315623 7893918 3204898 266233 980711 5077392 8422655
44714 8422655 7229798 2474249 -1677457 -2641198 -1408940 -606329 -986639 515538 7809397
44705 7809397 19172861 26308136 23543229 15820199 12361213 13942591 13257833 7721899
44697 7721899 3541305 4444364 4582530 -1989792 -11178062 -14791268 -12010674 -7909248
$$ packed form
44756G065200P077765m07588p614221m709848J940558J182412m661856n656061
44748e783639j482276K54514j305506p8499M219674M972629Q25125j361445K041181
44739B301758N422621K814891l377769o426097m202702m72986R47748N40769J342601
44730a109166L842166M241289l03197n769922m755709L251499R760780P895036
44722A7052776P06390m443543n421705m689020k938665P14478M096681L345263
44714H422655j192857m755549m151706r63741J232258Q02611l80310J502177P293859
44705G809397J1363464P135275k764907p723030l458986J581378o84758n535934
44697G721899m180594R03059J38166o572322r188270l613206K780594M101426
$$ plain form
44689 -7909248 -3865697 2804577 10995816 15183984 13416916 9875268 8160096 7346542
44681 7346542 6563485 8455344 14637413 20846054 20491562 12220281 1346431 -6240536
44673 -6240536 -9900261 -13402352 -19144534 -24567855 -25200708 -20430195 -14209862 -9812212
44665 -9812212 -6344099 -1778872 2901673 4917631 3608328 803142 -1772252 -3214179
44657 -3214179 -2275792 1976984 7898927 11230455 8406240 323169 -7003228 -6905999 768536
44648 768536 8011284 7456993 2119358 1520478 7999952 13582723 12804462 10837861 13236141
44639 13236141 14857429 8062780 -2642395 -5023480 2994243 10459843 9596961 4794420
44631 4794420 2305570 604318 -3300515 -5727863 -1993257 4738000 7712482 6679109
$$ packed form
44689g909248M043551O670274Q191239M188168j767068l541648j715172q13554
44681G346542p83057J891859O182069O208641l54492q271281j0873850p586967
44673f240536l659725l502091n742182n423321o32853M770513O220333M397650
44665i812212L468113M565227M680545K015958j309303k805186k575394j441927
44657c214179R38387M252776N921943L331528k824215q083071p326397R7229P674535
44648G68536P242748n54291n337635n98880O479474N582771p78261j966601K398280
44639A3236141J621288o794649j0705175k381085Q017723P465600q62882m802541
44631D794420k488850j701252l904833k427348L734606O731257K974482j033373
$$ plain form
44623 6679109 6701095 8715210 8447252 4868373 3192036 7192583 13030321 13776777 7814050
44614 7814050 192049 -3408369 -2193450 127231 21127 -2206093 -3337202 -1293294
44606 -1293294 2359676 3982733 1563405 -3073155 -5597258 -3356953 1490376 4260098
44598 4260098 3636896 3025259 4588918 5238325 2121907 -899723 1951489 8413927 9929350
44589 9929350 4118360 -1450446 -426750 4068584 6315399 6826696 8490561 8894289
44581 8894289 3973633 -3197207 -4885425 173917 4558608 2160601 -4694961 -9659019
44573 -9659019 -9716913 -6244558 -1906714 1285690 2437857 1696993 -710054 -4686004 -8203591
44564 -8203591 -6890817 934790 9666205 11136037 4671683 -1476885 -337881 5702601
$$ packed form
44623F679109K1986K014115k67958l578879j676337M000547N837738P46456n962727
44614G814050p622001l600418J214919K320681j06104k227220j131109K043908
44606a293294L652970J623057k419328m636560k524103K240305M847329K769722
44598D260098o23202o11637J563659O49407l116418l021630K851212O462438J515423
44589I929350n810990n568806J023696M495334K246815N11297J663865M03728
44581H894289m920656p170840j688218N059342M384691k398007o855562m964058
44573i659019n7894L472355M337844L192404J152167p40864k407047l975950l517587
44564h203591J312774P825607Q731415J469832o464354o148568J139004O040482
$$ plain form
44556 5702601 9556672 9280190 9452679 13625614 19172578 20778648 16559950 8730260
44548 8730260 -213539 -8797961 -14059713 -11875924 -2841316 4990072 4000543 -3253077
44540 -3253077 -7318283 -4905038 -2528036 -5324796 -9044983 -7672763 -3275346 -1881987
44532 -1881987 -3501637 -3361363 -727699 835605 989827 3167447 7496682 10094978
44524 10094978 10377173 12393911 17006743 18967449 14684575 7801295 4010772 4525577
44516 4525577 7284254 10455068 12035288 10020480 5935155 4576758 7427996 9876572
44508 9876572 7824620 3495899 1656511 3572546 7884085 13786476 19419925 20253812
44500 20253812 13557820 2685416 -6521700 -11666882 -13337947 -11668143 -7233816 -3087789
$$ packed form
44556E702601L854071k76482J72489M172935N546964J606070m218698p829690
44548H730260q943799q584422n261752K183789R034608P831388r89529p253620
44540c253077m065206K413245K377002k796760l720187J372220M397417J393359
44532a881987j619650J40274K633664J563304J54222K177620M329235K598296
44524A0094978K82195K016738M612832J960706m282874o883280l790523N14805
44516D525577K758677L170814J580220k014808m085325j358397K851238K448576
44508I876572k051952m328721j839388J916035M311539N902391N633449Q33887
44500B0253812o695992j0872404r207116n145182j671065J669804M434327M146027
$$ plain form
44492 -3087789 -1839279 -2122782 -1048033 1701559 4862240 7899090 9411260 6918094
44484 6918094 2064975 1738800 8642854 14913691 12037202 3733082 647189 4353099
44476 4353099 6283118 2591839 -104586 3369364 8085370 6905246 197603 -6961969
44468 -6961969 -11308510 -10520842 -2024264 11242729 18793167 13442408 1441351 -4676146
44460 -4676146 -1460122 3431881 3247782 -534874 -3462813 -4721793 -6092023 -7974026
44452 -7974026 -8942759 -7657303 -4125835 -105276 1982167 1957854 2778613 6386699 9900744
44443 9900744 9203838 5717806 5466195 10473277 15008599 12804267 5335825 -174523
44435 -174523 238737 3477538 4782013 3981653 4244618 6040190 5712138 1071550 -4705414
$$ packed form
44492c087789J248510k83503J074749K749592L160681L036850J512170k493166
44484F918094m853119l26175O904054O270837k876489q304120l085893L705910
44476D353099J930019l691279k696425L473950M716006j180124o707643p159572
44468f961969m346541P87668Q496578J3266993P550438n350759j2001057o117497
44460d676146L216024M892003j84099l782656k927939j258980j370230j882003
44452g974026r68733J285456L531468M020559K087443k4313Q20759L608086L514045
44443I900744o96906l486032k51611N007082M535322k204332p468442n510348
44435a74523M13260L238801J304475q00360K62965J795572l28052m640588n776964
$$ plain form
44426 -4705414 -7842741 -10457146 -17267903 -25988782 -27268694 -17186758 -4463108 -201400
44418 -201400 -4251769 -7832757 -7056543 -6360473 -8888723 -11360492 -10812348 -9799185 -11018290
44409 -11018290 -11866280 -9041063 -5042342 -5111829 -9477199 -12880818 -11065347 -4691801
44401 -4691801 2287843 5617551 3300550 -2312664 -6160463 -6255216 -5913505 -7828681 -8805390
44392 -8805390 -4575031 2288319 4719707 1074126 -2558621 -843524 4422432 7704114
44384 7704114 5664457 -1470466 -10525556 -15816662 -13058306 -5214477 -1013382 -5113013
44376 -5113013 -12857014 -17190125 -17115352 -15877614 -14254732 -10473905 -4833642 453688
44368 453688 5172563 10463677 14771329 14909162 11474782 9033251 9964712 11767774 11626732
$$ packed form
44426d705414l137327k614405o810757q720879j279912J0081936J2723650M261708
44418b01400m050369l580988P76214O96070k528250k471769N48144J013163j219105
44409a1018290q47990K825217L998721o9487m365370l403619J815471O373546
44401d691801O979644L329708k317001n613214l847799r4753L41711j915176r76709
44392h805390M230359O863350K431388l645581l632747J715097N265956L281682
44384G704114k039657p134923r055090n291106K758356P843829M201095m099631
44376e113013p744001m333111P4773J237738J622882L780827N640263N287330
44368D53688M718875N291114M307652J37833l434380k441531R31461J803062j41042
$$ plain form
44359 11626732 10143675 8869319 7362094 5078897 3737205 5002842 7174831 6806767
44351 6806767 3313922 5659 161964 3044302 4396631 1165726 -4310166 -5938408
44343 -5938408 -819713 6499259 8651403 3601251 -4206973 -10168151 -13540485 -14864107
44335 -14864107 -13465379 -9672186 -6394078 -5601149 -5199768 -2230261 2182695 3893844
44327 3893844 1186465 -3134505 -4951008 -2657415 1702710 3898000 1094080 -4543778
44319 -4543778 -6951036 -2674113 4711454 8682584 7314172 4281413 2839434 1852652
44311 1852652 -1176904 -5314848 -6460454 -2315331 3941654 5877694 361186 -8450232
44303 -8450232 -12814171 -8996558 244806 10248947 18521095 23540764 23412969 18661003
$$ packed form
44359A1626732j483057j274356j507225k283197j341692J265637K171989l68064
44351F806767l492845l308263J56305K882338J352329l230905n475892j628242
44343e938408N118695P318972K152144n050152p808224n961178l372334j323622
44335a4864107J398728L793193L278108P92929M01381K969507M412956J711149
44327C893844k707379m320970j816503K293593M360125K195290k803920n637858
44319d543778k407258M276923P385567L971130j368412l032759j441979r86782
44311A852652l029556m137944j145606M145123O256985J936040n516508q811418
44303h450232m363939L817613R241364J0004141Q272148N019669j27795m751966
$$ plain form
44295 18661003 13742114 12256858 12282763 9837023 5394202 2964590 3580000 3967887 1685321
44286 1685321 -2364336 -6721962 -10702162 -12536259 -10509289 -7000665 -6958538 -10588632
44278 -10588632 -12076344 -8319191 -4543811 -7084438 -13890414 -17303144 -14525478 -10089276
44270 -10089276 -8225110 -7825829 -6231035 -3915419 -3070033 -4065806 -5640614 -7011551
44262 -7011551 -7716435 -6435112 -2117271 3963014 8960260 11389517 12073259 12079379 11115318
44253 11115318 8678068 5873770 5131330 8252957 14888364 22204181 25903641 23147140
44245 23147140 15793320 9631658 8679454 11015492 12010129 10447030 8567079 6881053
44237 6881053 3063941 -3301205 -8955738 -11591284 -12474099 -12432123 -9383842 -3030252 1950717
$$ packed form
44295A8661003m918889j485256K5905k445740m442821k429612O15410L87887k282566
44286A685321m049657m357626l980200j834097K026970L508624M2127l630094
44278a0588632j487712L757153L775380k540627o805976l412730K777666M436202
44270a0089276J864166L99281J594794K315616Q45386r95773j574808j370937
44262g011551p04884J281323M317841O080285M997246K429257O83742O120r64061
44253A1115318k437250k804298p42440L121627O635407P315817L699460k756501
44245B3147140p353820o161662r52204K336038R94637j563099j879951j686026
44237F881053l817112o365146n654533k635546q82815M1976L048281O353590M980969
$$ plain form
44228 1950717 1711865 -871609 -784497 1435176 1860389 623306 1016876 2570273 1616028
44219 1616028 -1601813 -2885968 -1311060 64200 1146486 5291440 11565396 14160876
44211 14160876 11887828 10340005 11209871 8135166 -1084774 -6608577 300458 12233957
44203 12233957 14116358 3861131 -5730064 -5370396 25055 1038483 -3946155 -9852210
44195 -9852210 -12545360 -11175350 -6516366 -683731 3525752 5613452 8213267 13102831
44187 13102831 17743764 17560989 11084305 1792383 -4907336 -6285645 -4286192 -2996683
44179 -2996683 -4209171 -6245143 -7024928 -6486862 -5457785 -4387396 -4360693 -7023283 -11881311
44170 -11881311 -15835999 -16948961 -16304020 -14794397 -11378677 -6565400 -3795570 -4361880
$$ packed form
44228A950717k38852k583474Q7112K219673M25213j237083L93570J553397r54245
44219A616028l217841j284155J574908J375260J082286M144954O273956K595480
44211A4160876k273048j547823Q69866l074705r219940n523803O909035J1933499
44203A2233957J882401j0255227r591195L59668N395451J013428m984638n906055
44195i852210k693150J370010M658984N832635M209483K087700K599815M889564
44187A3102831M640933j82775o476684r291922o699719j378309J999453J289509
44179b996683j212488k035972p79785N38066J029077J070389K6703k662590m858028
44170a1881311l954688j112962O44941J509623L415720M813277K769830n66310
$$ plain form
44162 -4361880 -4747453 -2555466 -1005942 -3056948 -5166074 -2570622 2742754 5678390
44154 5678390 6471284 8316134 9270042 4937715 -2079534 -4318592 -1122985 608412
44146 608412 -1695943 -2693636 268778 1918732 -1575845 -5853810 -5894644 -3652592 -2860616
44137 -2860616 -1915179 2319203 7915781 10433641 8857341 4941477 193852 -2864466
44129 -2864466 -759864 5263429 7760951 2152371 -6153165 -8381658 -2974914 4881552
44121 4881552 10843878 13584574 12548309 8910649 6537072 7293476 7795297 5186073
44113 5186073 2873553 5070066 8663380 7051145 329456 -4738409 -4010090 590298
44105 590298 5968995 10243024 10810985 6166862 -169766 -3033827 -2953459 -4613599 -8289059
$$ packed form
44162d361880l85573K191987J549524k051006k109126K595452N313376K935636
44154E678390P92894J844850R53908m332327p017249k239058L195607J731397
44146F08412k304355r97693K962414J649954l494577m277965m0834K242052P91976
44137b860616R45437M234382N596578K517860j576300l915864m747625l058318
44129b864466K104602O023293K497522n608580q305536k228493N406744P856466
44121D881552N962326K740696j036265l637660k373577P56404N01821k609224
44113E186073k312520K196513L593314j612235o721689n067865P28319M600388
44105E90298N378697M274029N67961m644123o336628k864061Q0368j660140l675460
$$ plain form
44096 -8289059 -9400162 -7349700 -7644544 -12601435 -16250309 -12380114 -2945449 5419430
44088 5419430 9414295 9830595 7817329 4746911 3410042 4975833 6074370 2838578
44080 2838578 -2883801 -5159302 -1832622 2865530 4550448 4214782 5274919 7515790
44072 7515790 7610979 5171364 4238393 7167745 10476452 9890679 6939086 6221453 7666496
44063 7666496 6790961 2547333 -601786 577778 4555074 9307323 14097369 15505911
44055 15505911 9341105 -95025 -1115419 9122440 17862901 14476077 6930513 9148328
44047 9148328 18147385 18472087 7208823 -1334958 1636968 6840857 3288292 -5111405
44039 -5111405 -8078232 -5124519 -3628378 -6460497 -10330421 -12881681 -13898741 -12047471
$$ packed form
44096h289059j111103K050462k94844m956891l648874L870195R434665Q364879
44088E419430L994865M16300k013266l070418j336869J565791J098537l235792
44080B838578n722379k275501L326680M698152J684918l35666J060137K240871
44072G515790R5189k439615r32971K929352L308707n85773k951593p17633J445043
44063G666496q75535m243628l149119J179564L977296M752249M790046J408542
44055A5505911o164806r436130j020394J0237859Q740461l386824p545564K217815
44047I148328Q999057L24702j1263264q543781K971926N203889l552565q399697
44039e111405k966827K953713J496141k832119l869924k551260j017060J851270
$$ plain form
44031 -12047471 -7009988 -2821824 -3177834 -5166172 -3236103 2054691 4856221 2939393
44023 2939393 347846 398907 446840 -4206865 -13089728 -19255503 -16084635 -5688184 1349927
44014 1349927 -2512889 -11940086 -15157688 -9619765 -4401490 -5602311 -7842651 -5275458
44006 -5275458 -3138537 -9652344 -21069342 -24804980 -16584594 -5640749 -1566099 -3336331
43998 -3336331 -4072636 -1011027 2934838 4130295 1518281 -3175200 -6342880 -4927990
43990 -4927990 365234 5026722 4955707 318144 -5272974 -8958790 -11332380 -14550686
43982 -14550686 -18187335 -18801502 -14843478 -9744825 -7189016 -5421401 -1080766 2681241
43974 2681241 -1082916 -11282427 -17394034 -13476843 -6435030 -4856517 -6018531 -1561170
$$ packed form
44031a2047471N037483M188164l56010j988338J930069N290794K801530j916828
44023B939393k591547N1061M7933m653705q882863o165775L170868J0396451P038111
44014A349927l862816r427197l217602N537923N218275j200821k240340K567193
44006e275458K136921o513807j1416998l735638Q220386J0943845M074650j770232
43998c336331p36305L061609L945865J195457k612014m693481l167680J414890
43990d927990N293224M661488p1015m637563n591118l685816k373590l218306
43982a4550686l636649o14167L958024N098653K555809J767615M340635L762007
43974B681241l764157j0199511o111607L917191P041813J578513j162014M457361
$$ plain form
43966 -1561170 8270237 14648963 12765951 6760959 2369976 1182731 2465851 4933626
43958 4933626 5952895 3588781 -173794 -2116616 -3027800 -5739146 -8569446 -5937166
43950 -5937166 3894005 15830266 23179171 22682882 15172073 5207364 -642525 610438
43942 610438 4796560 5905875 3460432 842858 -1113205 -3582967 -5164845 -4010100
43934 -4010100 -2558168 -3452166 -2808906 4486071 14257929 16928993 11545148 6164528
43926 6164528 3796276 -998393 -9076377 -12084063 -6238984 -209959 -2003017 -6856239
43918 -6856239 -6378277 -2109645 -696315 -1475902 1040048 5832332 6226436 755634 -4907710
43909 -4907710 -6494152 -5199096 -3713343 -3589393 -5661647 -8314942 -6957270 -123326
$$ packed form
43966a561170R831407O378726j883012o004992m390983j187245J283120K467775
43958D933626J019269k364114l762575j942822r11184k711346k830300K632280
43950e937166R831171J1936261P348905m96289p510809r964709n849889J252963
43942F10438M186122J109315k445443k617574j956063k469762j581878J154745
43934d010100J451932q93998O43260P294977R771858K671064n383845n380620
43926F164528k368252m794669q077984l007686N845079O029025j793058m853222
43918f856239M77962M268632J413330p79587K515950M792284L94104n470802n663344
43909d907710j586442J295056J485753J23950k072254k653295J357672O833944
$$ plain form
43901 -123326 5942571 4248002 -3262475 -8674755 -8986215 -7772156 -7234555 -5490112 -2055639
43892 -2055639 188734 -259288 -1597498 -2279663 -2256279 -535416 3963179 8858206 10033252
43883 10033252 7184449 3466294 -124780 -5087516 -10069739 -10751664 -6409179 -1740774
43875 -1740774 -402341 -806300 82731 2525476 4982069 5955501 4156643 504794 49930
43866 49930 6874961 16209963 17480625 7663045 -3873830 -7327495 -4273921 -2943590
43858 -2943590 -5738571 -7330882 -3565671 3095678 7343304 6750288 3114864 80567
43850 80567 -282456 711756 764453 1055694 5729242 15214998 22794347 21032500 10323656
43841 10323656 -1846847 -9086761 -10561955 -8277754 -3970512 318376 1851333 -202643
$$ packed form
43901a23326O065897j694569p510477n412280l11460J214059N37601J744443L434473
43892b055639K244373m48022j338210o82165K3384J720863M498595M895027J175046
43883A0033252k848803l718155l591074m962736m982223o81925M342485M668405
43875a740774J338433m03959Q89031K442745K456593R73432j798858l651849m54864
43866D9930O825031R335002J270662r817580j1536875l453665L053574J330331
43858b943590k794981j592311L765211O661349M247626n93016l635424l034297
43850H0567l63023R94212N2697K91241M673548R485756P579349j761847j0708844
43841A0323656j2170503p239914j475194K284201M307242M288888J532957k053976
$$ plain form
43833 -202643 -2995273 -2740638 1060297 5416742 7782256 8879427 11001414 14552430
43825 14552430 17652851 18869711 18610773 17367580 14463425 9904888 5965675 4951631
43817 4951631 6104356 6421231 3961965 -994691 -6847270 -10893142 -10278967 -5536819
43809 -5536819 -1855191 -3277439 -6464204 -4500597 3105973 9082432 8297184 4210591
43801 4210591 2921761 5109363 7590409 9442556 11745462 13019602 10167588 4342435
43793 4342435 1557964 5443778 11891215 13401191 8021671 1717227 1132179 5713953
43785 5713953 9282157 8852173 8079026 10017212 10549115 4010304 -6818627 -12865613
43777 -12865613 -11094939 -7992140 -8782775 -9923538 -6414386 -754457 1159768 -992011
$$ packed form
43833b02643k792630K54635L800935M356445K365514J097171K121987L551016
43825A4552430L100421J216860k58938j243193k904155m558537l939213j014044
43817D951631J152725L16875k459266m956656n852579m045872O14175M742148
43809e536819L681628j422248l186765J963607P606570N976459p85248m086593
43801D210591j288830K187602K481046J852147K302906J274140k852014n825153
43793D342435k784471L885814O447437J509976n379520o304444n85048M581774
43785E713953L568204m29984p73147J938186N31903o538811j0828931o046986
43777a2865613J770674L102799p90635j140763L509152N659929J914225k151779
$$ plain form
43769 -992011 -3120025 -3750452 -3571946 -554698 7174592 14800165 14921762 8542379 4363131
43760 4363131 5719975 6169034 1223022 -3524207 -1797928 2216655 -87700 -8194000
43752 -8194000 -13132548 -10485505 -4997159 -1677230 376578 2902570 3721207 1411242
43744 1411242 179834 4626033 11748744 13301401 5869152 -5352733 -13130585 -15097779
43736 -15097779 -13268242 -9863648 -5690215 -1055101 3563068 7333282 8971046 7768599
43728 7768599 5261999 4669464 7794376 13242432 18068412 20054617 18179751 12837822
43720 12837822 6696492 3454656 3997843 5127031 3856442 1646453 2160948 5697596
43712 5697596 8376073 6992684 2940335 1017047 5140243 14647079 23929954 26811777
$$ packed form
43769i92011k128014o30427J78506L017248P729290P625573J21597o379383m179248
43760D363131J356844M49059m946012m747229J726279M014583k304355q106300
43752h194000m938548K647043N488346L319929K053808K525992Q18637k309965
43744A411242j231408M446199P122711J552657p432249j1221885p777852j967194
43736a5097779J829537L404594M173433M635114M618169L770214J637764j202447
43728G768599k506600n92535L124912N448056M825980J986205j874866n341929
43720A2837822o141330l241836N43187J129188j270589k209989N14495L536648
43712E697596K678477j383389m052349j923288M123196R506836R282875K881823
$$ plain form
43704 26811777 22452410 15716350 10967147 8160503 6661479 8682959 14514872 17898877
43696 17898877 12932496 4167605 2165651 8287060 11753247 4695984 -7169131 -13619307
43688 -13619307 -13481793 -12726948 -13309364 -11412374 -5465024 639147 2920478 1447016
43680 1447016 -1484384 -3914674 -4560754 -3185042 -824233 1869886 5366634 8643624
43672 8643624 8184440 2581145 -4022470 -6765186 -6516938 -7471798 -10093814 -11326031 -10711386
43663 -10711386 -10877962 -11970064 -10913181 -7015738 -3434480 -1867374 -300302 2517059
43655 2517059 4613515 4531140 3687895 3353936 2884125 2430330 3682916 6440175 8229215
43646 8229215 8535609 8981764 8124266 1912126 -8033403 -12883634 -7819119 773430 4715614
$$ packed form
43704B6811777m359367o736060m749203k806644j499024K021480N831913L384005
43696A7898877m966381q764891k001954O121409L466187p057263j1865115o450176
43688a3619307J37514P54845n82416J896990N947350O104171K281331j473462
43680A447016k931400k430290o46080J375712K360809K694119L496748L276990
43672H643624m59184n603295o603615k742716K48248r54860k622016j232217O14645
43663a0711386j66576j092102J056883L897443L581258J567106J567072K817361
43655B517059K096456q2375q43245l33959m69811m53795J252586K757259J789040
43646H229215L06394M46155q57498o212140r945529m850231N064515Q592549L942184
$$ plain form
43637 4715614 5282490 8046313 11102760 7705973 -1081091 -5863350 -1986874 5006544
43629 5006544 8939211 10460217 11887870 11542348 7748285 3138893 200330 -3057931
43621 -3057931 -8129801 -10891270 -7296797 -1074110 805998 -1464993 -1579609 1936320
43613 1936320 3278717 -493008 -3941897 -1764527 2813072 3692459 2354287 5975476
43605 5975476 15708446 22910048 19106070 6083972 -6314336 -10484464 -7260737 -3090235
43597 -3090235 -2702360 -4431918 -2554910 5156832 12957650 12527818 3193720 -6103109
43589 -6103109 -6766615 -142119 5229282 4005834 -1508235 -6199855 -7646269 -6585428
43581 -6585428 -5368859 -6848226 -11613928 -15091363 -10915656 377744 9282944 7646307
$$ packed form
43637D715614N66876K763823L056447l396787q787064m782259L876476O993418
43629E006544L932667J521006J427653l45522l794063m609392k938563l258261
43621c057931n071870k761469L594473O222687J880108k270991j14616L515929
43613A936320J342397l771725l448889K177370M577599Q79387j338172L621189
43605E975476R732970P201602l803978j3022098j2398308m170128L223727M170502
43597c090235L87875j729558J877008P711742P800818m29832r334098r296829
43589f103109o63506O624496N371401j223448n514069m691620j446414J060841
43581f585428J216569j479367m765702l477435M175707J1293400Q905200j636637
$$ plain form
43573 7646307 -1236932 -7381271 -7527404 -7918731 -13011637 -17978910 -16536340 -11465805
43565 -11465805 -10990943 -16228886 -18700299 -11582575 1552179 11738444 14687618 12763839
43557 12763839 9574157 6468464 3638341 1496361 581416 1590470 4899941 8605797
43549 8605797 8594416 3316537 -2442675 -1855886 5904264 14807444 18908384 16717369 8976508
43540 8976508 -2667947 -12903505 -14082875 -4865973 5787461 8351278 4510175 3840389
43532 3840389 9662233 14486891 11088922 2514950 -2656510 -1462165 1559574 2079210
43524 2079210 1013452 1356209 3579140 6084415 8101615 9736072 10018565 7512786
43516 7512786 3330481 1322557 3739341 8071446 10063626 8906763 7113707 5860744
$$ packed form
43573G646307q883239o144339j46133l91327n092906m967273J442570N070535
43565a1465805M74862n237943k471413P117724J3134754J0186265K949174j923779
43557A2763839l189682l105693k830123k141980r14945J009054L309471L705856
43549H605797j1381n277879n759212N86789P760150Q903180M100940k191015p740861
43540H976508j1644455j0235558j179370R216902J0653434K563817l841103o69786
43532C840389N821844M824658l397969q573972n171460J194345L021739N19636
43524B079210j065758L42757K222931K505275K017200J634457K82493k505779
43516G512786m182305k007924K416784M332105J992180j156863j793056j252963
$$ plain form
43508 5860744 3792480 1253669 2086769 8346503 15377588 15906137 8853426 928809
43500 928809 -1426677 836330 2161035 774011 1294255 7940234 17246643 20530893
43492 20530893 13828631 2486048 -5578692 -8209040 -7900761 -5570994 -497309 5097256
43484 5097256 7486831 7573859 9437519 12005761 9312994 1300979 -3599113 -1195932
43476 -1195932 971407 -4290432 -11182856 -9422451 -385672 5664221 5576647 5380224 7122315
43467 7122315 5276298 -1602396 -6178861 -3474143 1844198 3960711 4350586 6724045
43459 6724045 9946771 11364074 11833932 12101336 8837184 -10571 -9276300 -11325294
43451 -11325294 -4877884 4431417 10177304 9439160 3975771 -757468 -1015674 -234101
$$ packed form
43508E860744k068264k538811Q33100O259734P031085N28549p052711p924617
43500I28809k355486K263007J324705j387024N20244O645979R306409L284250
43492B0530893o702262j1342583q064740k630348L08279K329767N073685N594565
43484E097256K389575Q7028J863660K568242k692767q012015m900092K403181
43476a195932K167339n261839o892424J760405R036779O049893q7574j96423J742091
43467G122315j846017o878694m576465K704718N318341K116513L89875K373459
43459F724045L222726J417303M69858K67404l264152q847755r265729k048994
43451a1325294O447410R309301N745887p38144n463389m733239k58206P81573
$$ plain form
43443 -234101 -4296501 -10762744 -10455008 -2372024 2127456 -4432555 -14043307 -15603762
43435 -15603762 -10844854 -8040637 -6671776 -446657 8605948 12023477 9465314 9041170
43427 9041170 12913607 14611557 12409495 13423592 20372149 24887418 19720594 9158238
43419 9158238 1443031 -1997350 -3930752 -4437125 -2957199 -1982468 -2598414 -885103 5284167
43410 5284167 10207413 7765678 1523158 389068 6172833 12290135 13934366 12748471
43402 12748471 10822549 6344211 -2201488 -11490623 -15786562 -12121628 -1958401 10259036
43394 10259036 19205740 21538103 18536835 15017136 14257493 14405130 10885607 2159911
43386 2159911 -7954659 -14074997 -14519129 -11823937 -8612405 -4932590 -375556 3234638
$$ packed form
43443b34101m062400o466243L07736Q082984M499480o560011r610752j560455
43435a5603762M758908K804217J368861O225119R052605L417529k558163m24144
43427I041170L872437J697950k202062J014097O948557M515269n166824j0562356
43419I158238p715207l440381j933402n06373J479926R74731o15946J713311O169270
43410E284167M923246k441735o242520j134090N783765O117302J644231j185895
43402A2748471j925922m478338q545699r289135m295939L664934J0163227J2217437
43394A0259036Q946704K332363l001268l519699p59643J47637l519523q725696
43386B159911j0114570o120338m44132K695192L211532L679815M557034L610194
$$ plain form
43378 3234638 3352466 190356 -3067458 -3423461 -725308 1951523 83260 -8159482
43370 -8159482 -18300847 -22431553 -17528915 -8444776 -800937 5182606 10405998 11245510
43362 11245510 4630611 -4169778 -6453659 -1814390 2464791 3410828 5527721 10760833
43354 10760833 13799374 10723667 5138650 1721926 37383 -1047011 891417 6412095
43346 6412095 9949982 6825986 423094 -2999249 -2707207 -1284370 1776519 7505133
43338 7505133 11450443 7855840 -846551 -5439327 -1658283 4623435 5335352 -404504
43330 -404504 -6508677 -7508051 -4639127 -4422805 -10733674 -19147884 -21805361 -17262307 -11038325
43321 -11038325 -6269466 -199311 8058174 13554948 13482137 12192762 12876452 11185268
$$ packed form
43378C234638J17828l162110l257814l56003K698153K676831j868263q242742
43370h159482j0141365m130706M902638R084139P643839N983543N223392Q39512
43362A1245510o614899q800389k283881M639269M279181R46037K116893N233112
43354A0760833L038541l075707n585017l416724j684543j084394J938428N520678
43346F412095L537887l123996o402892l422343K92042J422837L060889N728614
43338G505133L945310l594603q702391m592776L781044O281718P11917n739856
43330d04504o104173r99374K868924K16322o310869q414210k657477M543054O223982
43321a1038325M768859O070155Q257485N496774p2811j289375O83690j691184
$$ plain form
43313 11185268 4033866 -2234857 -1446267 809354 -3861717 -10846495 -8693076 1081327
43305 1081327 4593068 -2739541 -8992476 -4519054 4483205 7834992 6334745 6425551
43297 6425551 7844930 6025263 1958435 757816 2802527 3759431 2280605 1581335
43289 1581335 3743468 7277616 10356807 12811480 14709948 15363788 13814130 9393022
43281 9393022 2848662 -2905128 -5563903 -7058077 -10678714 -14142893 -10909857 -575715
43273 -575715 7931879 7702580 3247823 3203116 8005118 11485020 11725910 12623458 15386162
43264 15386162 16045876 12919062 10340936 12185707 16176991 17801574 16712278 15942726
43256 15942726 16655470 16868026 14830067 11119951 7078420 2994068 -1191184 -4430694
$$ packed form
43313A1185268p151402o268723P88590K255621m671071o984778K153419R774403
43305A081327L511741p332609o252935M473422R002259L351787j500247R0806
43297F425551J419379j819667m066828j200619K044711R56904j478826o99270
43289A581335K162133L534148L079191K454673J898468O53840j549658m421108
43281I393022o544360n753790k658775j494174l620637l464179L233036J0334142
43273e75715Q507594k29299m454757m4707M802002L479902K40890Q97548K762704
43264A5386162O59714l126814k578126J844771L991284J624583j089296p69552
43256A5942726P12744K12556k037959l710116m041531m084352m185252l239510
$$ plain form
43248 -4430694 -5294355 -4050686 -2524591 -1371322 709536 3674320 4175443 -79852
43240 -79852 -5241762 -4777553 1481724 5828503 2061371 -6855802 -12906422 -12274393 -7783814
43231 -7783814 -3849108 -1937993 -736232 1080223 2672458 1712996 -2067374 -4973738
43223 -4973738 -3371158 924642 2654358 578800 -1219996 -406309 58903 -2220388
43215 -2220388 -4232068 -2109185 3070269 7711931 10667251 11938299 9907875 4848762
43207 4848762 2460774 7859195 16982832 19853908 13022368 3948737 1609824 6547136
43199 6547136 12195709 13478278 11650791 11165659 13287493 14180329 10276764 4203558
43191 4203558 2258074 6105476 11061164 13382296 14072681 13406721 8081838 -1571793
$$ packed form
43248d430694q63661J243669J526095J153269K080858K964784N01123m255295
43240g9852n161910M64209O259277M346779l767132q917173o050620O32029M490579
43231g783814L934706J911115J201761J816455J592235r59462l780370k906364
43223d973738J602580M295800J729716k075558j798796Q13687M65212k279291
43215b220388k011680K122883N179454M641662K955320J271048k030424n059113
43207D848762k387988N398421R123637K871076o831540r073631k338913M937312
43199F547136N648573J282569j827487m85132K121834Q92836l903565o073206
43191D203558j945484L847402M955688K321132O90385o65960n324883r653631
$$ plain form
43183 -1571793 -7573166 -4301945 2075856 2206185 -1840202 69194 9582225 16829466
43175 16829466 15265654 10297442 9814538 13700945 16907467 16945499 13994380 8179883
43167 8179883 773682 -5186473 -8125484 -8612118 -5781968 1932445 10978898 13847572
43159 13847572 9154658 4480921 5243208 7096682 4827120 2608251 7589721 17172508
43151 17172508 21313202 16370479 9064325 6355049 7873218 9558803 9305812 7084891
43143 7084891 3616265 907252 1163539 3648409 4855613 2762885 -941453 -3249529
43135 -3249529 -2606383 754571 5305061 8945563 10785833 11951814 13483391 14711685
43127 14711685 15300478 16750311 19163035 18878387 13468626 7414079 7624220 13703314
$$ packed form
43183a571793o001373L271221O377801J30329m046387J909396R513031P247241
43175A6829466j563812m968212m82904L886407L206522L8032k951119n814497
43167H179883p406201n960155k939011m86634K830150P714413R046453K868674
43159A3847572m692914m673737P62287J853474k269562k218869M981470R582787
43151A7172508M140694m942723p306154k709276J518169J685585k52991k220921
43143G084891l468626k709013K56287K484870J207204k092728l704338k308076
43135c249529O43146L360954M550490L640502J840270J165981J531577J228294
43127A4711685N88793J449833K412724k84648n409761o054547K10141O079094
$$ plain form
43119 13703314 18133739 16855923 14076059 14543083 16427136 15528930 12477848 11188726
43111 11188726 12538589 14005317 14399768 14799294 14897545 12164832 5830264 -644187 -2667551
43102 -2667551 604572 5258232 6340176 2526814 -2839416 -5477951 -4437395 -1781119
43094 -1781119 1144781 4787743 8542791 9794004 7519434 4664828 4827205 8206505
43086 8206505 12690927 16814222 19089017 16880581 10126039 4790273 7500437 16521166
43078 16521166 23189733 23628767 23575892 28484173 34040311 32120031 23134339 15755445
43070 15755445 14800136 15885708 13942684 11408995 13916651 21121432 26597778 26163419
43062 26163419 22474061 20588161 21629726 22505931 20646999 16981872 13793592 11210226
$$ packed form
43119A3703314M430425j277816k779864M67024J884053q98206l051082j289122
43111A1188726J349863J466728L94451L99526R8251k732713o334568o474451k023364
43102b667551L272123M653660J081944l813362n366230k638535J040556K656276
43094a781119K925900L642962L755048J251213k274570k854606J62377L379300
43086H206505M484422M123295K274795k208436o754542n335766K710164R020729
43078A6521166O668567M39034n2875M908281N556138j920280q985692p378894
43070A5755445r55309J085572j943024k533689K507656P204781N476346m34359
43062B6163419l689358j885900J041565Q76205j858932l665127l188280k583366
$$ plain form
43054 11210226 7769416 4172385 3642568 7071665 10637017 11387465 12863836 20252938
43046 20252938 30874226 35683303 31534650 25718806 25203471 27328711 26156874 22876157
43038 22876157 22954131 26189337 27367889 25580650 25131204 26856363 26111386 21298128 17637445
43029 17637445 19452077 24294595 27909343 29838954 30583031 28235992 22436414 17638839
43021 17638839 17824615 21188379 24243214 27469831 31843151 33456592 28366839 20843522
43013 20843522 19597596 25857710 31824016 32104247 30543564 33184183 39463974 43998952
43005 43998952 43956296 41178389 38692391 37988326 39084304 41251985 43556589 45338735
42997 45338735 46140077 45574488 44055763 42907719 42428084 40770007 36619397 32074738
$$ packed form
43054A1210226l440810l597031n29817L429097L565352P50448J476371P389102
43046B0252938J0621288M809077m148653n815844n15335K125240j171837l280717
43038B2876157P7974L235206J178552j787239m49446J725159p44977m813258l660683
43029A7637445J814632M842518L614748J929611P44077k347039n799578m797575
43021A7638839J85776L363764L054835L226617M373320J613441n089753p523317
43013B0843522j245926O260114N966306K80231j560683K640619O279791M534978
43005D3998952m2656k777907k485998p04065J095978K167681K304604J782146
42997D5338735Q01342n65589j518725j148044m79635j658077m150610m544659
$$ plain form
42989 32074738 30532861 32522610 36352649 42011308 50740027 60798253 67772929 70203749
42981 70203749 71305343 73717034 76136822 77060055 78142339 80827748 82742514 81588787
42973 81588787 81023055 88056882 103977858 121229522 131258850 134000281 137502676 147963109
42965 147963109 161939212 170670577 171904811 173703066 183637246 197255327 202858089 197237534
42957 197237534 190178907 190927155 195805995 193782571 180729058 163239759 150315225 145730471
42949 145730471 147196121 148638698 144081576 133426394 124014516 122754412 127508922 130565518
42941 130565518 129719422 130083984 134294408 137528190 135481358 131946700 133739799 141501034
42933 141501034 150251416 156646937 160953930 163782039 166237568 172415174 185816820 202524377
$$ packed form
42989C2074738j541877J989749L830039N658659Q728719J0058226O974676K430820
42981G0203749J101594K411691K419788R23233J082284K685409J914766j153727
42973H1588787n65732P033827J5920976J7251664J0029328K741431L502395J0460433
42965A47963109J3976103Q731365J234234J798255R934180J3618081N602762n620555
42957A97237534p058627P48248M878840k023424j3053513j7489299j2924534m584754
42949A45730471J465650J442577m557122j0655182r411878j260104M754510L056596
42941A30565518q46096L64562M210424L233782k046832l534658J793099P761235
42933A41501034Q750382O395521M306993K828109K455529O177606J3401646J6707557
$$ plain form
42925 202524377 213429447 215084060 213122891 212111332 207565499 193523067 174307854
42918 174307854 161524884 159846371 162275146 160597108 154372164 146861563 137908962 126161450
42910 126161450 114837457 108966693 107722401 105234734 99858710 97530605 103433297 114042552
42902 114042552 120966914 121002716 119331391 123303999 135267645 151078533 163527730 167355233
42894 167355233 163343314 158537789 160773176 171404998 184237255 193045385 199204970 209246821
42886 209246821 224736922 238431181 243358289 242607962 244677400 250074477 249848473 240151825
42878 240151825 231148710 234803179 248132143 257024180 255409899 251725831 254712831 261268959
42870 261268959 262980681 258242216 251608703 244983273 235954121 223322041 208767473 193472095
$$ packed form
42925B02524377J0905070J654613j961169j011559m545833j4042432j9215213
42918A74307854j2782970j678513K428775j678038o224944p510601q952601j1747512
42910A26161450j1323993n870764j244292k487667n376024k328105N902692J0609255
42902A14042552O924362L5802j671325L972608J1963646J5810888J2449197L827503
42894A67355233m011919m805525K235387J0631822J2832257Q808130O159585J0041851
42886B09246821J5490101J3694259M927108p50327K069438N397077k26004r696648
42878B40151825r003115L654469J3328964Q892037j614281l684068K987000O556128
42870B61268959J711722m738465o633513o625430r029152j2632080j4554568j5295378
$$ plain form
42862 193472095 177562687 162774368 151654819 143782208 136063420 127186061 119087545
42855 119087545 113992079 112715339 115787407 123053339 131444659 135894325 133880067 127841442
42847 127841442 122716215 121973325 125308659 128750482 128290176 125529198 128006519 140604275
42839 140604275 158040020 170286947 174914972 178985492 188145281 199430638 207207965
42832 207207965 211181309 214570191 217765839 218098733 214078920 206328667 195658208 183213642
42824 183213642 171162291 160348569 148752693 135380756 124007640 118873183 117400809
42817 117400809 112078256 100540673 89220600 84424261 83384847 78198611 66894037
42810 66894037 55872328 50775920 49311857 45966909 40633212 37610401 36984019 33353308
$$ packed form
42862A93472095j5909408j4788319j1119549p872611p718788q877359q098516
42855A19087545n095466j276740L072068P265932Q391320M449666k014258o038625
42847A27841442n125227p42890L335334L441823m60306k760978K477321J2597756
42839A40604275J7435745J2246927M628025M070520R159789J1285357P777327
42832B07207965L973344L388882L195648L32894m019813p750253j0670459j2444566
42824A83213642j2051351j0813722j1595876j3371937j1373116n134457j472374
42817A17400809n322553j1537583j1320073m796339j039414n186236j1304574
42810F6894037j1021709n096408j464063l344948n333697l022811o26382l630711
$$ plain form
42802 33353308 25588291 21834294 28999247 41181300 46378584 43202264 41733284 46504171
42794 46504171 48783749 40949902 29334125 24155632 23659538 19492541 13742801 17101906
42786 17101906 29576776 36575605 29297622 17771030 15684215 20923829 21148419 13125154
42778 13125154 5584493 5045478 9182405 14513065 21199244 27985337 30479927 27990003
42770 27990003 25619946 26105739 25749493 22455701 21266148 25928934 30506968 27194347
42762 27194347 18984850 15846879 19660898 22108839 18539914 14974089 17723939 23666641
42754 23666641 26379287 26369383 28624713 33217058 34762176 29983596 20822271 11122971
42746 11122971 4660016 4931526 11710244 18490822 18536750 13301096 9984086 11343036
$$ packed form
42802C3353308p765017l753997P164953J2182053N197284l176320j468980M770887
42794D6504171K279578p833847j1615777n178493m96094m166997n749740L359105
42786A7101906J2474870O998829p277983j1526592k086815N239614K24590q023265
42778A3125154p540661n39015M136927N330660O686179O786093K494590k489924
42770B7990003k370057M85793l56246l293792j189553M662786M578034l312621
42762B7194347q209497l137971L814019K447941l568925l565825K749850N942702
42754B3666641K712646r904K255330M592345J545118m778580r161325r699300
42746A1122971o462955K71510O778718O780578M5928n235654l317010J358950
$$ plain form
42738 11343036 13861286 15808267 19476997 23531586 21406509 12163842 5934673 11528502
42730 11528502 23234643 27559859 20510852 10745440 6772072 8420046 11384032 13337374
42722 13337374 13474422 11241196 8076768 6895912 8172995 9594484 10398640 12478798
42714 12478798 16342481 19881948 22230372 24639324 26033791 22291893 12615512 2742414
42706 2742414 -1329353 96101 2694243 3792433 2930836 12121 -3566045 -4508163
42698 -4508163 -1965870 -203280 -3445133 -9850673 -13833913 -12557567 -7122076 239635
42690 239635 6367690 7004251 1193790 -5461585 -6436135 -2162465 1844204 3085431 3192269
42681 3192269 2407937 -564066 -3181325 -409573 6786138 10518179 6472185 192621
$$ packed form
42738A1343036K518250J946981L668730M054589k125077r242667o229169N593829
42730A1528502J1706141M325216p049007r765412l973368J647974K963986J953342
42722A3337374J37048k233226l164428j180856J277083J421489Q04156K080158
42714A2478798L863683L539467K348424K408952J394467l741898r676381r873098
42706B742414m071767J425454K598142J098190q61597k918715l578166r42118
42698d508163K542293J762590l241853o405540l983240J276346N435491P361711
42690B39635O128055O36561n810461o655375r74550M273670M006669J241227J06838
42681C192269p84332k972003k617259K771752P195711L732041m045994o279564
$$ plain form
42673 192621 -431897 5317601 12254732 16069825 15305660 10206357 3675550 764675 3463397
42664 3463397 7949934 9684732 8407230 5330327 -636085 -9475149 -16464671 -17573348
42656 -17573348 -15942566 -17070111 -19626957 -17980026 -12783751 -11019726 -14415803 -15887892
42648 -15887892 -10854042 -5042395 -5915666 -11703049 -15043603 -13786811 -11447671 -8945135
42640 -8945135 -3089358 6289788 14000027 16417533 16052750 16484387 16535124 12996842 6560482
42631 6560482 963223 -2688016 -6689039 -11518637 -13548027 -9866668 -3111195 942211
42623 942211 -225502 -3773383 -5411316 -3775667 -977298 -238050 -3135035 -7968568
42615 -7968568 -10691187 -8636915 -3575238 10107 -228150 -2587403 -4145357 -3639770
$$ packed form
42673A92621o24518N749498O937131L815093p64165n099303o530807k910875K698722
42664C463397M486537J734798j277502l076903n966412q839064o989522j108677
42656a7573348J630782j127545k556846J646931N196275J764025l396077j472089
42648a5887892N033850N811647q73271n787383l340554J256792K339140K502536
42640h945135N855777R379146P710239K417506l64783M31637N0737l538282o436360
42631F560482n597259l651239m001023m829598k029390L681359O755473M053406
42623I42211j167713l547881j637933J635649K798369P39248k896985m833533
42615g968568k722619K054272N061677L585345k38257k359253j557954N05587
$$ plain form
42607 -3639770 -1175816 2600060 5657280 4875758 -690559 -7725401 -11492269 -10183877
42599 -10183877 -5460373 -33808 3711533 4122112 1572581 -1316775 -2661977 -3693182
42591 -3693182 -6187069 -8721220 -8399335 -5814058 -4961961 -7580206 -10352815 -8935506
42583 -8935506 -2794840 4883383 10255856 10813657 6129467 -1768985 -9357011 -13893135
42575 -13893135 -14954564 -14370423 -15247436 -19774510 -26373897 -30199355 -28574611 -24733994
42567 -24733994 -23481359 -24383205 -22847442 -17147778 -10049445 -3545838 3120509 9211010
42559 9211010 11217822 7962431 2912945 -608506 -2598876 -3074994 -536024 3573075
42551 3573075 4011011 -805111 -5217079 -4555342 -2201432 -3196087 -5493210 -4100496 139695
$$ packed form
42607c639770K463954L775876L057220p81522n566317p034842l766868J308392
42599a0183877M723504N426565L745341M10579k549531k889356j345202j031205
42591c693182k493887k534151L21885K585277Q52097k618245k772609J417309
42583h935506O140666P678223N372473N57801m684190p898452p588026m536124
42575a3893135j061429N84141q77013m527074o599387l825458J624744L840617
42567b4733994J252635r01846J535763N699664P098333O503607O666347O090501
42559I211010K006812l255391n049486l521451j990370m76118K538970M109099
42551C573075M37936m816122m411968O61737K353910r94655k297123J392714M240191
$$ plain form
42542 139695 3464935 7386120 14970249 21203593 17666623 7112729 2454542 8319080
42534 8319080 13934879 9531524 485683 -2355030 952780 2168044 -350431 370428
42526 370428 7740772 15905317 18086658 14765606 11094312 10044299 10577927 10440220 8791460
42517 8791460 6716200 5761158 5867436 5443841 3850203 2315496 1549593 254344 -2828443
42508 -2828443 -7270889 -12309889 -17208845 -19086664 -14134167 -3617546 4956517 6278796
42500 6278796 3732210 3620870 6385447 8591891 10373655 14151788 17641808 15440714
42492 15440714 7586839 -165820 -5005008 -9045934 -11736978 -8239648 1471895 9207542
42484 9207542 9099816 5736424 6391902 10076303 10495541 6251726 1497300 -1330830 -3014592
$$ packed form
42542A39695L325240L921185P584129O233344l536970j0553894m658187N864538
42534H319080N615799m403355r045841k840713L307810J215264k518475P20859
42526C70428P370344Q164545K181341l321052l671294j050013N33628j37707j648760
42517H791460k075260r55042J06278m23595j593638j534707p65903j295249l082787
42508b828443m442446n039000m898956j877819M952497J0516621Q574063J322279
42500F278796k546586j11340K764577K206444J781764L778133L490020k201094
42492A5440714p853875p752659m839188m040926k691044L497330R711543P735647
42484I207542j07726l363392O55478L684401M19238m243815m754426k828130j683762
$$ plain form
42475 -3014592 -3063626 -34571 3777832 3758962 -159202 -3057380 -2497215 -1710843 -3726061
42466 -3726061 -6655687 -7229680 -5569402 -3723852 -1975974 654500 3853680 6309194
42458 6309194 7458609 7058794 4027053 -2330175 -10303303 -16464919 -18358502 -15834783
42450 -15834783 -10243903 -3263288 3623224 9309462 13189120 15213415 15690669 14511816
42442 14511816 10565191 3054811 -6000456 -12018852 -12009387 -7460309 -1821632 3253298
42434 3253298 7091190 7433067 2532239 -4603674 -7996214 -5501232 -796991 1893753
42426 1893753 1732807 -619864 -4719188 -8620461 -9608120 -9047504 -12374759 -20750417 -26591918
42417 -26591918 -22481834 -12087196 -6311285 -9075038 -12700977 -8849279 698592 7043615
$$ packed form
42475c014592m9034L029055L812403j8870l918164k898178N60165P86372k015218
42466c726061k929626n73993J660278J845550J747878K630474L199180K455514
42458F309194J149415l99815l031741o357228p973128o161616j893583K523719
42450a5834783N590880O980615O886512N686238L879658K024295M77254j178853
42442A4511816l946625p510380r055267o018396R465M549078N638677N074930
42434C253298L837892L41877m900828p135913l392540K494982M704241K690744
42426A893753j60946k352671m099324l901273r87659N60616l327255q375658n841501
42417b6591918M110084J0394638N775911k763753l625939L851698R547871O345023
$$ plain form
42409 7043615 5114033 -1579399 -6247047 -6360210 -5150961 -6383819 -8898921 -7846324
42401 -7846324 -1644996 4383238 3484330 -4245316 -11390955 -11253245 -4685829 1595644
42393 1595644 2537900 -5379 360613 6774504 14642901 16886375 13031907 9491523
42385 9491523 10127085 11249635 8649761 4708011 3688794 3938789 1265425 -2296803
42377 -2296803 -477277 7001390 13464830 15354036 16295913 19376734 22114392 21981012
42369 21981012 20774852 19876194 16621052 9475700 2004601 -2456367 -5355604 -7709357
42361 -7709357 -5476968 3703214 13148126 13777362 6223252 -476938 -1329412 156090
42353 156090 36349 -388342 672085 294599 -5585357 -15370655 -21801167 -19333272 -10680903
$$ packed form
42409G043615j929582o693432m667648j13163J209249j232858k515102J052597
42401g846324O201328O028234q98908p729646p145639J37710O567416O281473
42393A595644R42256k543279L65992O413891P868397K243474l854468l540384
42385I491523O35562J122550k599874l941750j019217K49995k673364l562228
42377b296803J819526P478667O463440J889206R41877L080821K737658j33380
42369B1981012j206160q98658l255142p145352p471099m460968k899237k353753
42361g709357K232389R180182R444912O29236p554110o700190q52474J485502
42353A56090j19741m24691J060427l77486n879956r785298o430512K467895Q652369
$$ plain form
42344 -10680903 -4713327 -6543650 -10975777 -9193857 -1295391 3650607 1452976 -741417
42336 -741417 3445891 8329820 5045189 -3503860 -6711429 -2837455 -714088 -4641470
42328 -4641470 -8054847 -5028715 905367 3619038 2803431 973582 -1879418 -5737632
42320 -5737632 -7279977 -3805140 2673598 8271590 10886879 9250251 3135245 -3157004
42312 -3157004 -3078415 3020437 6416166 1522156 -6670446 -11138259 -12824253 -15971274
42304 -15971274 -18898084 -17378431 -13713170 -13801127 -16518531 -14371511 -5343383 3177120
42296 3177120 4328659 60863 -3000063 -1872807 1191414 2895276 2468916 1911824
42288 1911824 3226979 5133734 4024967 -454247 -3195950 117968 6503114 9011707
$$ packed form
42344a0680903N967576j830323m432127J781920P898466M945998k197631k194393
42336g41417M187308M883929l284631q549049l207569L873974K123367l927382
42328d641470l413377L026132N934082K713671q15607j829849k853000l858214
42320e737632j542345L474837O478738N597992K615289j636628o115006o292249
42312c157004P8589O098852L395729m894010q192602m467813j685994l147021
42304a5971274k926810J519653L665261q7957k717404K147020R028128Q520503
42296C177120J151539m267796l060926J127256L064221J703862m26360n57092
42288A911824J315155J906755j108767m479214k741703L313918O385146K508593
$$ plain form
42280 9011707 5343773 -506160 -4299189 -5520330 -5691457 -6168301 -7639511 -9186792
42272 -9186792 -8322833 -4347904 -513670 -181072 -2411759 -4463706 -6629408 -10548677
42264 -10548677 -14535380 -15453981 -14122783 -13717404 -13491162 -9664180 -2643815 2395140
42256 2395140 3137459 2865595 3975627 4118662 1435651 -1027438 278864 3716356 4714393
42247 4714393 2070287 -724504 186019 4782474 8937960 8408814 3680248 -381856
42239 -381856 -977546 -892763 -2711737 -2874201 2991150 10988693 12408482 6185257 650759
42230 650759 1599081 5800934 8698179 11104482 14077503 13686881 6706794 -2786419 -7962541
42221 -7962541 -7387179 -4265816 -852703 1701915 941983 -4121867 -9475585 -10040013 -6256666
$$ packed form
42280I011707l667934n849933l793029j221141j71127m76844j471210j547281
42272i186792Q63959L974929L834234L32598k230687k051947k165702l919269
42264a0548677l986703r18601J331198M05379K26242L826982P020365N038955
42256B395140P42319k71864J110032J43035k683011k463089J306302L437492R98037
42247D714393k644106k794791R10523M596455M155486n29146m728566m062104
42239c81856n95690Q4783j818974j62464N865351P997543J419789o223225n534498
42230F50759R48322M201853K897245K406303K973021l90622o980087r493213n176122
42221g962541N75362L121363L413113K554618p59932n063850n353718n64428L783347
$$ plain form
42212 -6256666 -3084112 -3486244 -6125427 -8237862 -7707485 -3666627 1837081 3967750
42204 3967750 -121087 -7421231 -12108504 -11250219 -5981026 747818 5667219 7078032
42196 7078032 7408748 10966866 17063161 19427375 15546983 11788320 14308309 19198952
42188 19198952 18165213 10977853 4925187 3359079 2406180 -769044 -3685951 -4187658
42180 -4187658 -4213715 -5441738 -6005367 -4242549 -1957189 -1411080 -1954681 -1824190 -1066043
42171 -1066043 -985314 -2343255 -4967438 -7569023 -7872167 -4926825 -1080541 569388 91103
42162 91103 -458162 -954416 -2364260 -2944561 161361 5606791 8882911 9164252 10091169
42153 10091169 12608107 12530871 7806072 3155919 3678493 7609497 9631686 8582703
$$ packed form
42212f256666L172554m02132k639183k112435N30377M040858N503708K130669
42204C967750m088837p300144m687273Q58285N269193O728844M919401J410813
42196G078032L30716L558118O096295K364214l880392l758663K519989M890643
42188A9198952j033739p187360o052666j566108r52899l175224k916907n01707
42180d187658k6057j228023n63629J762818K285360N46109n43601J30491P58147
42171a066043Q0729j357941k624183k601585l03144K945342L846284J649929m78285
42162I1103n49265m96254j409844n80301L105922N445430L276120K81341R26917
42153A0091169K516938p7236m724799m650153N22574L931004K022189j048983
$$ plain form
42145 8582703 7438030 7363208 6362768 3670766 1704027 2630832 5247030 6441855 4805850
42136 4805850 1944430 224380 -403892 -2303092 -6060012 -7996509 -4331174 2723628
42128 2723628 6457665 4016250 -203988 -1359885 -1090863 -4341931 -11200803 -15961292
42120 -15961292 -14482673 -9256722 -5758695 -5804893 -6600916 -5576062 -3596600 -2456356
42112 -2456356 -1487151 611807 1783013 -1334881 -6610033 -6510870 1793624 10520352 10587574
42103 10587574 4264843 2182791 8357116 15033348 14170649 7933053 3955942 4345836
42095 4345836 4123964 -958159 -8921608 -14077419 -13134042 -8354179 -4887884 -4893994 -5374349
42086 -5374349 -3123513 -53884 -507133 -4314750 -6532694 -4059150 1430268 7259363
$$ packed form
42145H582703j144673p4822j000440k692002j966739R26805K616198J194825j636005
42136D805850k861420j720050o28272j899200l756920j936497L665335P054802
42128B723628L734037k441415m220238j155897K69022l251068o858872m760489
42120a5961292J478619N225951L498027m6198p96023J024854J979462J140244
42112b456356R69205K098958J171206l117894n275152R9163Q304494Q726728O7222
42103A0587574o322731k082052O174325O676232q62699o237596l977111L89894
42095D345836k21872n082123p963449n155811R43377M779863L466295o110m80355
42086e374349K250836L069629m53249l807617k217944K473544N489418N829095
$$ plain form
42078 7259363 11971110 13242393 8921655 2137606 308589 5938468 12547516 13096579
42070 13096579 8680958 5171240 4712489 4960240 4203460 2586593 -386615 -5314737
42062 -5314737 -10292863 -12155740 -10289443 -6996668 -4446840 -2949036 -1669521 90465
42054 90465 1617023 745148 -3005161 -5756564 -3429297 1309198 1319170 -4522894 -9203134
42045 -9203134 -8722310 -8432953 -12991867 -16617120 -11482650 -1488882 1866372 -4023380
42037 -4023380 -9620414 -7212126 -80907 4508383 4820549 3955325 4403058 6280802 7800764
42028 7800764 5819192 -944945 -8436532 -10913347 -9009555 -9573538 -15538230 -20509787
42020 -20509787 -16771453 -5512071 4563843 7213463 4275593 2000461 3927189 7682163
$$ packed form
42078G259363M711747J271283m320738o784049j829017N629879O609048N49063
42070A3096579m415621l509718m58751K47751p56780j616867k973208m928122
42062e314737m978126j862877J866297L292775K549828J497804J279515J759986
42054I0465J526558q71875l750309k751403K327267M738495R972n842064m680240
42045i203134M80824K89357m558914l625253N134470R993768L355254n889752
42037d023380n597034K408288P131219M589290L12166q65224M47733J877744J519962
42028G800764j981572o764137p491587k476815J903792n63983n964692m971557
42020b0509787L738334J1259382J0075914K649620k937870k275132J926728L754974
$$ plain form
42012 7682163 8376234 5022733 2269146 4358490 9151082 11165582 9321257 7481412
42004 7481412 7381615 5689909 -333652 -7999514 -12226602 -10998919 -6219219 -1219530
41996 -1219530 1536348 2401548 4804316 11131523 18107625 19432352 13550591 5271500
41988 5271500 -1017416 -5457765 -8584070 -7952662 -2176989 5260977 9790012 10721960
41980 10721960 9470551 5832988 -215206 -5557025 -7050382 -6029851 -5697600 -5480873
41972 -5480873 -2511331 1962131 2634532 -2400646 -8316872 -9533206 -6243665 -3122347
41964 -3122347 -3511483 -6668068 -9472773 -9401932 -6690249 -4571819 -6414782 -11606260 -15293987
41955 -15293987 -13521826 -7856916 -3354902 -2406164 -2686725 -1641890 -748568 -3440577
$$ packed form
42012G682163O94071l353501k753587K089344M792592K014500j844325j839845
42004G481412r9797j691706o023561p665862m227088J227683M779700M999689
41996a219530K755878Q65200K402768O327207O976102J324727n881761q279091
41988E271500o288916m440349l126305O31408N775673P437966M529035R31948
41980A0721960j251409l637563o048194n341819j493357J020531L32251K16727
41972e480873K969542M473462O72401n035178n916226j216334L289541L121318
41964c122347l89136l156585k804705P0841K711683K118430j842963n191478l687727
41955a5293987J772161N664910M502014R48738k80561J044835Q93322k692009
$$ plain form
41947 -3440577 -9877243 -15914244 -17169102 -12548820 -4135599 4403852 9490837 10271320
41939 10271320 9952650 11909579 14154356 11290083 3193518 -2598607 -177443 6702482
41931 6702482 9635277 5527998 -2496127 -10818051 -16624117 -16384674 -9829866 -4040081
41923 -4040081 -6261279 -12740795 -12281110 -2062604 7815774 8249808 2150144 -2578772
41915 -2578772 -4256565 -5714980 -6476173 -3709345 1265778 3509326 977883 -3604134
41907 -3604134 -6855882 -7777979 -7642065 -9060892 -13510887 -17896014 -16288575 -7663884
41899 -7663884 1080196 3065790 -387369 -3011022 -2125672 179782 1765471 1629449
41891 1629449 -1560050 -7158598 -10406012 -7918989 -4244504 -7091615 -16007807 -21758759
$$ packed form
41947c440577o436666o037001j254858M620282Q413221Q539451N086985P80483
41939A0271320l18670J956929K244777k864273q096565n792125K421164O879925
41931F702482K932795m107279q024125q321924n806066K39443O554808N789785
41923d040081k221198o479516M59685J0218506R878378M34034o099664m728916
41915b578772j677793j458415p61193K766828M975123K243548k531443m582017
41907c604134l251748r22097J35914j418827m449995m385127J607439Q624691
41899g663884Q744080J985594l453159k623653Q85350K305454J585689j36022
41891A629449l189499n598548l247414K487023L674485k847111q916192n750952
$$ plain form
41883 -21758759 -18391777 -10484828 -5682892 -4434409 -1170308 6571459 14361870 16437120
41875 16437120 12507520 7695062 6457135 8113241 9072721 8005158 6533143 5422070
41867 5422070 3418886 542627 -1095623 -1500464 -4195736 -10571112 -15886150 -14567245
41859 -14567245 -7611027 -1430292 -696667 -4869077 -10051867 -11863726 -8592929 -3964687
41851 -3964687 -4275229 -10301528 -15259037 -13758408 -8971547 -7031341 -8341972 -9272360
41843 -9272360 -8543348 -6302268 -719763 7815686 12486619 7538239 -2579444 -9154973
41835 -9154973 -11545159 -14878701 -18080126 -15038698 -7294871 -4138045 -8216204 -11708989
41827 -11708989 -9686255 -6872179 -7190555 -6775611 -2692916 673600 -88842 -1321454
$$ packed form
41883b1758759L366982P906949M801936J248483L264101P741767P790411K075250
41875A6437120l929600m812458j237927J656106R59480j067563j472015j111073
41867E422070k003184k876259j638250m04841k695272o375376n315038J318905
41859a4567245O956218O180735P33625m172410n182790j811859L270797M628242
41851c964687l10542o026299m957509J500629M786861J940206j310631r30388
41843i272360P29012K241080N582505Q535449M670933m948380j0117683o575529
41835i154973k390186l333542l201425L041428P743827L156826m078159l492785
41827a1708989K022734K814076l18376M14944M082695L366516p62442j232612
$$ plain form
41819 -1321454 -634768 -2584341 -8733020 -10713078 -2399173 8183684 9323588 2432559
41811 2432559 -2228208 -2383177 -4873009 -11812597 -16627491 -14597310 -8758627 -4336910
41803 -4336910 -4009369 -8500369 -15293253 -17560615 -11377170 -3052663 -1750026 -5755355
41795 -5755355 -4802077 3798790 10828326 9004627 2204482 -2682174 -5114538 -7405773
41787 -7405773 -8473811 -6573808 -3713332 -2526093 -2187883 -1205745 -772488 -1718588 -1461037
41778 -1461037 2198303 6792454 8067839 5160410 529404 -2890849 -2473970 3076718
41770 3076718 10881122 14869361 12424771 7736321 6102629 7281100 6887669 2043110
41762 2043110 -6697628 -16589098 -23399764 -23224070 -16317698 -7632469 -1874879 109880
$$ packed form
41819a321454O86686j949573o148679j980058Q313905J0582857J139904o891029
41811B432559m660767j54969k489832o939588m814894K030181N838683M421717
41803d336910L27541m491000o792884k267362O183445Q324507J302637m005329
41795e755355R53278Q600867P029536j823699o800145m886656k432364k291235
41787g405773j068038J900003K860476J187239L38210R82138M33257r46100K57551
41778a461037L659340M594151J275385k907429m631006l420253M16879N550688
41770C076718P804404L988239k444590m688450j633692J178471l93431m844559
41762B043110q740738r891470o810666J75694O906372Q685229N757590J984759
$$ plain form
41754 109880 -633318 -3117860 -4724387 -1765580 5326944 10970484 11558791 9883854 9293942
41745 9293942 7971792 3586677 -699458 -901709 317647 -2465022 -8125375 -10479396
41737 -10479396 -7991068 -4933568 -3026087 764545 6796770 10005482 7215233 1727428
41729 1727428 -2058563 -3703158 -3732008 -511846 6228588 12501985 14297704 11988130
41721 11988130 7935184 3059434 -1353491 -2201170 1108531 3905543 2264213 -500582
41713 -500582 1906126 9323337 14824925 13825614 9312889 7112986 9068908 12220159
41705 12220159 12847998 10069562 5857365 1827160 -3124331 -9995890 -14948631 -11681333
41697 -11681333 -545892 9058439 9248791 3128360 -782823 -67450 1558271 2748356
$$ packed form
41754A09880p43198k484542j606527K958807P092524N643540N88307j674937n89912
41745I293942j322150m385115m286135k02251J219356k782669n660353k354021
41737a0479396K488328L057500J907481L790632O032225L208712k790249n487805
41729A727428l785991j644595k8850L220162O740434O273397J795719k309574
41721A1988130m052946m875750m412925q47679L309701K797012j641330k764795
41713e00582K406708P417211N501588r99311m512725k199903J955922L151251
41705A2220159O27839k778436m212197m030205m951491o871559m952741L267298
41697a1681333J1135441R604331J90352o120431l911183P15373J625721J190085
$$ plain form
41689 2748356 5245155 7024844 3117905 -5486764 -11412470 -11422215 -9882521 -9096594 -4611644
41680 -4611644 4966344 11611420 8778579 2558181 3369213 10688228 15117535 13190282
41672 13190282 10705484 11810658 13786013 13981482 14012943 14725466 13645640 10007299 6533205
41663 6533205 3998939 -32151 -4555568 -3648460 4426839 12351389 12940160 8810567
41655 8810567 7739591 11780680 16167602 16673373 13382612 8942232 7001571 10375162
41647 10375162 16942987 19658941 14744632 7530243 5566636 8267093 8961654 5688495
41639 5688495 3463823 5526411 8326740 7051514 1705627 -4248466 -7996887 -8603547
41631 -8603547 -6894889 -5195723 -4877111 -4035632 -412099 3777069 3856410 -283033 -3640138
$$ packed form
41689B748356K496799J779689l906939q604669n925706r745J539694P85927M484950
41680d611644R577988O645076k832841o220398Q11032P319015M429307j927253
41672A3190282k484798J105174J975355J95469L1461P12523j079826l638341l474094
41663F533205k534266m031090m523417R07108Q075299P924550N88771m129593
41655H810567j070976M041089M386922N05771l290761m440380j940661L373591
41647A0375162O567825K715954m914309p214389j963607K700457O94561l273159
41639E688495k224672K062588K800329j275226n345887n954093l748421o06660
41631h603547J708658J699166L18612Q41479L623533M189168P9341m139443l357105
$$ plain form
41622 -3640138 -3470344 -2412114 -2580680 -1719477 1590052 3617846 990568 -3017221 -3137067
41613 -3137067 -795502 -1880757 -6189341 -5790211 3579235 14775335 17460290 11122802
41605 11122802 4575909 3327039 3496686 355116 -2787631 302396 7838975 11328895
41597 11328895 7871288 3984001 4845918 6743588 4856849 2188214 3725888 6517496
41589 6517496 4349662 -517320 -418239 3389436 541265 -11478400 -20689353 -16778491
41581 -16778491 -5426160 1009612 455901 -140733 1415511 185028 -5465777 -10218123
41573 -10218123 -10365556 -9078474 -10279682 -12288005 -10976877 -6392043 -3143183 -5003712
41565 -5003712 -10590587 -14472535 -12900535 -8570693 -7950158 -12955939 -18007431 -17452019
$$ packed form
41622c640138J69794J058230j68566Q61203L309529K027794k627278m007789j19846
41613c137067K341565j085255m308584L99130R369446J1196100K684955o337488
41605A1122802o546893j248870J69647l141570l142747L090027P536579L489920
41597A1328895l457607l887287Q61917J897670j886739k668635J537674K791608
41589F517496k167834m866982R9081L807675k848171j2019665r210953L910862
41581a6778491J1352331O435772n53711n96634J556244j230483n650805m752346
41573a0218123j47433J287082j201208k008323J311128M584834L248860j860529
41565e003712n586875l881948J572000M329842O20535n005781n051492N55412
$$ plain form
41557 -17452019 -12773183 -8916542 -6468969 -2586765 2157478 3905845 2431128 2250169
41549 2250169 5675674 9494727 9992361 7059224 1923255 -4788311 -10636827 -11175691
41541 -11175691 -5232769 2358068 5965134 4999500 2561987 626252 -1049114 -2920793
41533 -2920793 -4801035 -6184085 -6531099 -6458318 -8540600 -14269566 -19940155 -19225261 -11255030
41524 -11255030 -2611180 595336 -859383 -2873921 -3880705 -3861293 -1461848 3191095
41516 3191095 5531669 1716313 -4642156 -6097468 -1358318 3180390 2227404 -2605576
41508 -2605576 -6817381 -8658812 -8791321 -7454660 -4493157 -758215 2120488 2685783
41500 2685783 236990 -4132054 -7315883 -7149396 -5556187 -6269346 -9282217 -10613253
$$ packed form
41557a7452019M678836L856641K447573L882204M744243J748367j474717j80959
41549B250169L425505L819053M97634k933137n135969o711566n848516n38864
41541a1175691N942922P590837L607066r65634k437513j935735j675366j871679
41533b920793j880242j383050l47014P2781k082282n728966n670589P14894P970231
41524a1255030Q643850L206516j454719k014538j006784J9412K399445M652943
41516C191095K340574l815356o358469j455312M739150M538708r52986m832980
41508b605576m211805j841431j32509J336661K961503L734942K878703N65295
41500B685783k448793m369044l183829J66487J593209p13159l012871j331036
$$ plain form
41492 -10613253 -8350901 -5575781 -5563714 -7226389 -7859677 -7728973 -8528601 -9082414 -6603187
41483 -6603187 -1854140 786868 -743965 -3322599 -3217865 -1108132 -423127 -2302140
41475 -2302140 -4728767 -6101505 -7063978 -8236160 -8376001 -6473689 -4433341 -5387312 -9181556
41466 -9181556 -11513599 -8776603 -2684335 1385882 213650 -4566550 -9394711 -12348584
41458 -12348584 -12752995 -9213510 -1001033 8365873 11919152 6193998 -3618778 -8277473
41450 -8277473 -4470524 2470608 6541951 8107403 10130839 10808353 5810843 -2568192
41442 -2568192 -5101746 2596462 12899752 15209831 8894362 2075874 -392981 -1550327
41434 -1550327 -4805040 -7983287 -7684442 -5436627 -5705742 -9467442 -12706071 -10886331
$$ packed form
41492a0613253K262352K775120J2067j662675o33288J30704p99628n53813K479227
41483f603187M749047K641008j530833k578634J04734K109733O85005j879013
41475b302140k426627j372738r62473j172182j39841J902312K040348r53971l794244
41466i181556k332043K736996O092268M070217j172232m780200m828161k953873
41458a2348584m04411L539485Q212477R366906L553279n725154r812776m658695
41450h277473L806949O941132M071343J565452K023436O77514m997510q379035
41442b568192k533554P698208J0303290K310079o315469o818488k468855j157346
41434a550327l254713l178247K98845K247815k69115l761700l238629J819740
$$ plain form
41426 -10886331 -3472306 5337952 9620693 6726230 159643 -3770906 -2762235 -303466
41418 -303466 -162693 -1700465 -2312185 -2034497 -2890323 -4862620 -5336698 -2577928 1864951
41409 1864951 4251003 1582946 -5531782 -12332377 -13926612 -10886386 -8764259 -10739369
41401 -10739369 -13474618 -12452555 -8398062 -5045116 -3206964 -1324238 263253 595271
41393 595271 1966599 6627794 10494744 7164979 -1018148 -3467399 4094194 12464491
41385 12464491 11126201 2070985 -4320650 -3138954 1634440 4898925 5119167 2376956
41377 2376956 -2253605 -5410797 -4519135 -2245207 -3368308 -7298871 -8458416 -4348910
41369 -4348910 1573184 5563160 7012191 5257953 -1327771 -10664832 -16502964 -15884406
$$ packed form
41426a0886331P414025Q810258M282741k894463o566587l930549J008671K458769
41418c03466J40773j537772o11720K77688q55826j972297m74078K758770M442879
41409A864951K386052k668057p114728o800595j594235L040226K122127j975110
41401a0739369k735249J022063M054493L352946J838152J882726J587491L32018
41393E95271J371328M661195L866950l329765q183127k449251P561593Q370297
41385A2464491j338290r055216o391635J181696M773394L264485K20242k742211
41377B376956m630561l157192Q91662K273928j123101l930563j159545M109506
41369d348910N922094L989976J449031j754238o585724r337061n838132O18558
$$ plain form
41361 -15884406 -12754642 -10830271 -7547196 162062 8148095 9560421 5181788 2610487
41353 2610487 5141743 7737384 5759868 2197442 2702257 7110833 10184025 9182207
41345 9182207 6630314 5485902 4975249 2710345 -1237562 -4560575 -6078504 -6533095
41337 -6533095 -6033983 -3378513 779412 2613020 -233970 -4252734 -4014088 -40643
41329 -40643 1658691 -1095979 -2547307 2776402 11584416 16094878 14486672 11839738
41321 11839738 11301017 9991909 5393489 1012581 1886833 6791386 9110493 5510231
41313 5510231 446982 346631 5113077 8132038 4906328 -1009387 -2861925 143843
41305 143843 2132907 -704209 -4463365 -2845113 4544558 12135448 15013376 12700139
$$ packed form
41361a5884406L129764J924371L283075P709258P986033J412326m378633k571301
41353B610487K531256K595641j977516l562426N04815M408576L073192j001818
41345I182207k551893j144412n10653k264904l947907l323013j517929m54591
41337f533095M99112K655470M157925J833608k846990m018764K38646L973445
41329d0643J699334k754670j451328N323709Q808014M510462j608206k646934
41321A1839738n38721j309108m598420m380908Q74252M904553K319107l600262
41313E510231n063249j00351M766446L018961l225710n915715j852538L005768
41305A43843J989064k837116l759156J618252P389671P590890K877928k313237
$$ plain form
41297 12700139 7537325 2544917 559843 2506598 6081586 8109120 8116844 7783073 7548796
41288 7548796 6237833 3622410 803823 -1681385 -3695794 -4186406 -3094338 -3678754
41280 -3678754 -8718415 -14535640 -13867636 -5914204 1616739 2902246 1390542 2944339
41272 2944339 6049725 4475468 -2691242 -9569109 -11528253 -9531885 -6094922 -1887455
41264 -1887455 2040595 3043023 883285 59803 4521403 11318656 13104169 7215211
41256 7215211 -801151 -4175969 -2997792 -2582571 -5117502 -7067014 -5911167 -5153603
41248 -5153603 -8850581 -13814112 -12615510 -4113021 4244942 5914889 2262370 -2104961
41240 -2104961 -6051676 -9908285 -10640659 -4654156 5964599 14889050 18813051 19220134
$$ packed form
41297A2700139n162814m992408j985074J946755L574988K027534P724l33771k34277
41288G548796j310963k615423k818587k485208k014409m90612J092068n84416
41280c678754n039661n817225O68004P953432P530943J285507j511704J553797
41272B944339L105386j574257p166710o877867j959144J996368L436963M207467
41264a887455L928050J002428k159738q23482M461600O797253J785513n888958
41256G215211q016362l374818J178177M15221k534931j949512J155847P57564
41248e153603l696978m963531J198602Q502489Q357963J669947l652519m367331
41240b104961l946715l856609p32374N986503J0618755Q924451L924001M07083
$$ plain form
41232 19220134 17536254 13219070 7188275 2769422 1744215 2695807 4215426 6274067
41224 6274067 7473805 5230443 832459 91607 5520999 11350719 10737858 5480730
41216 5480730 3395976 7118932 11051381 10020305 5709753 2313217 121931 -3194352
41208 -3194352 -7766141 -11580747 -13699537 -14235065 -12531802 -8715206 -5836172 -6488578
41200 -6488578 -7847557 -4678500 2237766 5759880 2414998 -2244366 -1907489 1253803
41192 1253803 843616 -3291965 -5419709 -3905726 -3967314 -8750722 -13400513 -11490447 -3701402
41183 -3701402 3616925 6478330 6516204 7046780 8464315 7793447 1975244 -8090988 -16768519
41174 -16768519 -18163310 -11604118 -1613518 6872136 11269855 10581661 5761099 1042332
$$ packed form
41232A9220134j683880m317184o030795m418853j025207R51592J519619K058641
41224F274067J199738k243362m397984p40852N429392N829720o12861n257128
41216E480730k084754L722956L932449j031076m310552l396536k191286l316283
41208c194352m571789l814606k118790n35528J703263L816596K879034o52406
41200f488578j358979L169057O916266L522114l344882m659364L36877L161292
41192A253803m10187m135581k127744J513983o1588m783408m649791J910066P789045
41183c701402P318327K861405L7874N30576J417535o70868n818203j0066232q677531
41174a6768519j394791O559192R990600Q485654M397719o88194m820562m718767
$$ plain form
41166 1042332 704472 3251159 2712496 -2737614 -7727269 -7553099 -4714976 -4084459 -5299446
41157 -5299446 -4463628 -1059485 1346810 351557 -2726205 -4996637 -4648723 -2487188 -1837290
41148 -1837290 -4635132 -7063750 -3228736 5565978 10950886 9589807 8204109 11684468
41140 11684468 13843974 8038314 364918 1363202 8604073 9942181 3012357 -1269011
41132 -1269011 3505860 9965642 9874455 6036003 5160599 6773294 5997361 2078231 -1591851
41123 -1591851 -2185806 1521190 8582808 13677600 10874418 2447014 -2138228 939374
41115 939374 5112514 5229502 5542903 9803004 12016017 6135724 -1798108 -1944643 3388458
41106 3388458 3637263 -2265724 -4065222 2784216 9237465 5952992 -3534197 -8113379
$$ packed form
41166A042332l37860K546687n38663n450110m989655J74170K838123O30517j214987
41157e299446Q35818L404143K406295r95253l077762k270432L47914K161535O49898
41148a837290k797842k428618L835014Q794714N384908j361079j385698L480359
41140A1684468K159506n805660p673396R98284P240871J338108o929824m281368
41132a269011M774871O459782r1187l838452q75404J612695p75933l919130l670082
41123a591851n93955L706996P061618N094792k803182q427404m585242L077602
41115I39374M173140J16988L13401M260101K213013n880293p933832j46535N333101
41106C388458K48805n902987j799498O849438O453249l284473r487189m579182
$$ plain form
41098 -8113379 -2627534 8384626 17291085 19842586 16620815 11067019 6485967 4366590
41090 4366590 4845387 6985491 8261294 6755898 5130659 8428086 15557185 17899464
41082 17899464 10589770 261645 -4159906 -3622374 -4485165 -6154075 -3037826 2881698
41074 2881698 2272766 -7185957 -15983220 -15407320 -7592139 -66272 2840074 253567
41066 253567 -6621520 -12467389 -10796775 -3094461 570518 -5778368 -15968458 -20437372
41058 -20437372 -17736558 -12589853 -7721403 -3567192 -2154216 -4792621 -8036550 -7424616
41050 -7424616 -3756517 -1201042 -1040322 -1788716 -3618227 -7666684 -12017703 -13158947
41042 -13158947 -11073143 -8756334 -7079015 -4320886 -894585 -270334 -3846042 -7953501
$$ packed form
41098h113379N485845J1012160Q906459K551501l221771n553796m581052k119377
41090D366590M78797K140104J275803j505396j625239L297427P129099K342279
41082A7899464p309694j0328125m421551N37532q62791j668910L116249N919524
41074B881698o08932r458723q797263N75900P815181P525867K906346k586507
41066B53567o875087n845869J670614P702314L664979o348886j0190090m468914
41058b0437372K700814N146705M868450M154211J412976k638405l243929O11934
41050g424616L668099K555475J60720p48394j829511m048457m351019j141244
41042a3158947K085804K316809J677319K758129L426301O24251l575708m107459
$$ plain form
41034 -7953501 -7847085 -3278490 1181051 1093753 -2822233 -4888700 -615077 7575592 12656317
41025 12656317 11103947 6014473 1689799 -1050933 -2363967 -427232 5283705 10737010
41017 10737010 11650643 9260716 7787359 7738687 6226503 3109770 1886988 3810497
41009 3810497 5490900 4258196 2674025 4952160 10389703 13163602 9123563 1170793
41001 1170793 -3613865 -1896149 2806318 5655657 6292517 6266906 3460986 -5179308 -15613540
40992 -15613540 -18047918 -8974773 3204323 7831911 3001919 -6080513 -14632680 -19563120
40984 -19563120 -17797962 -9658845 -1611558 -20544 -3538119 -6175947 -5807848 -4690080
40976 -4690080 -3827382 -2715836 -3190138 -7197638 -11140566 -8554979 945874 10463179
$$ packed form
41034g953501J06416M568595M459541q7298l915986k066467M273623Q190669N080725
41025A2656317j552370n089474m324674k740732j313034J936735N710937N453305
41017A0737010R13633k389927j473357m8672j512184l116733j222782J923509
41009C810497J680403j232704j584171K278135N437543K773899m040039p952770
41001A170793m784658J717716M702467K849339O36860k5611k805920q640294j0434232
40992a5613540k434378R073145J2179096M627588m829992r082432q552167m930440
40984a9563120J765158Q139117Q047287J591014l517575k637828L68099J117768
40976d690080Q62698J111546m74302m007500l942928K585587R500853R517305
$$ plain form
40968 10463179 14024986 11519251 5668423 -728952 -4307662 -3160227 -101991 737569
40960 737569 626723 4121393 10137335 11744070 6433422 22002 -2370373 -2940517 -5026927
40951 -5026927 -6149899 -2583070 3136583 5121013 2634521 545285 1777443 3520724
40943 3520724 1830548 -2518979 -4398103 -456539 5934385 7689802 2843979 -2410641
40935 -2410641 -2453298 -1022089 -5799030 -15663978 -20297490 -13476333 -322015 10804247
40927 10804247 17510254 21322223 22033004 18666839 12714577 6815683 2630184 1677738
40919 1677738 4434701 6960237 3496720 -4950285 -9931960 -6701025 -490513 2251416
40911 2251416 2782740 4703633 5471503 783829 -6291482 -8374829 -4153757 1079984
$$ packed form
40968A0463179L561807k505735n850828o397375l578710J147435L058236Q39560
40960G37569j10846L494670O015942J606735n310648o411420k392375n70144k086410
40951e026927j122972L566829N719653J984430k486492k089236J232158J743281
40943C520724j690176m349527j879124L941564O390924J755417m845823n254620
40935b410641m2657J431209m776941r864948m633512O821157J3154318J1126262
40927A0804247O706007L811969P10781l366165n952262n898894m185499r52446
40919A677738K756963K525536l463517q447005m981675L230935O210512K741929
40911B251416N31324J920893P67870m687674p075311k083347M221072N233741
$$ plain form
40903 1079984 3968408 5861709 7957162 9593790 10971985 12392766 11417467 5723941
40895 5723941 -1982165 -6683534 -7642902 -7588895 -7054125 -5153010 -4389057 -7955627 -12689602
40886 -12689602 -11546743 -3714582 3929496 6200938 4432582 1213743 -3112337 -6997225
40878 -6997225 -7134412 -4118988 -3360256 -7578263 -13034056 -15658768 -16220143 -16674372 -15830511
40869 -15830511 -11759832 -5066005 2518053 9316284 12152158 8445358 1931372 840431
40861 840431 7125939 12735846 10650857 4575014 2516947 5135441 6710884 4724517
40853 4724517 1823753 -296762 -2538610 -4119110 -2645316 522401 301608 -4505959
40845 -4505959 -7840619 -3805506 5168475 11203042 11005278 9152805 10328713 11908045
$$ packed form
40903A079984K888424J893301K095453J636628J378195J420781r75299n693526
40895E723941p706106m701369r59368N4007N34770J901115P63953l566570m733975
40886a2689602J142859P832161P644078K271442j768356l218839m326080l884888
40878f997225j37187L015424P58732m218007n455793k624712n61375m54229Q43861
40869a5830511M070679O693827P584058O798231K835874l706800o513986j090941
40861H40431O285508N609907k084989o075843k058067K618494J575443j986367
40853D724517k900764k120515k241848j580500J473794L167717k20793m807567
40845d505959l334660M035113Q973981O034567j97764j852473J175908J579332
$$ plain form
40837 11908045 8146140 221865 -3743502 -650527 1421716 -5638420 -16726698 -18982543
40829 -18982543 -9056638 3305001 9592386 11788638 14199956 14376092 8298850 -1048323
40821 -1048323 -7165389 -8965998 -10387990 -13241735 -15476837 -14973662 -11026337 -3897080
40813 -3897080 3684765 7194299 6046870 5462969 8654444 11173949 8398316 4586532
40805 4586532 7198073 14615557 17491219 11789498 3158632 -2014910 -3065170 -1698501
40797 -1698501 1217783 3755211 3400810 1243950 914133 2295228 1554435 -1467311 -1856292
40788 -1856292 2261968 5910181 4440010 -479082 -5001293 -8385266 -10858767 -10921873
40780 -10921873 -8675840 -7666794 -9182454 -8511520 -1741741 6705980 8723367 3150341
$$ packed form
40837A1908045l761905p924275l965367L092975K072243p060136j1088278k255845
40829a8982543R925905J2361639O287385K196252K411318J76136o077242r347173
40821a048323o117066j800609j421992k853745k235102N03175L947325P129257
40813c897080P581845L509534j147429n83901L191475K519505k775633l811784
40805D586532K611541P417484K875662n701721q630866n173542j050260J366669
40797a698501K916284K537428l54401k156860l29817J381095p40793l021746l88981
40788a856292M118260L648213j470171m919092m522211l383973k473501o3106
40780a0921873K246033J009046j515660O70934O769779Q447721K017387n573026
$$ plain form
40772 3150341 -3210511 -4693520 -2486844 -843478 -1143498 -1244108 749157 3179362
40764 3179362 1733688 -5437306 -13929728 -16839290 -12764968 -7185134 -4860768 -4319936
40756 -4319936 -1908227 2102466 4536095 3977319 1397466 -1832962 -3777452 -1980766
40748 -1980766 3155806 6857942 5013221 -707809 -5489538 -7286369 -7136453 -5690758
40740 -5690758 -3198729 -1435492 -1651233 -1461696 2461996 9106522 13835903 13765408 9315428
40731 9315428 1607854 -7715177 -14687587 -15352194 -10483589 -4944384 -2376109 -3295194
40723 -3295194 -7344448 -13338704 -17547114 -16480163 -11818174 -8571290 -8125944 -7333425
40715 -7333425 -4629613 -2129146 -884017 720808 2477250 1675813 -1068434 -916182
$$ packed form
40772C150341o360852j483009K206676J643366l00020j00610J993265K430205
40764C179362j445674p170994q492422k909562M074322N579834K324366N40832
40756d319936K411709M010693K433629n58776k579853l230428j944490J796686
40748a980766N136572L702136j844721n721030m781729j796831J49916J445695
40740e690758K492029J763237k15741J89537L923692O644526M729381p0495m449980
40731I315428p707574r323031o972410o64607M868605N539205K568275r19085
40723c295194m049254n994256m208410J066951M661989L246884M45346P92519
40715g333425K703812K500467J245129J604825J756442q01437k744247J52252
$$ plain form
40707 -916182 3429908 6789093 6204908 6714948 12741003 18723755 15957814 6186341 454039
40698 454039 4648512 13180248 18105815 18338980 17513148 17657202 18151471 17923224 16108305
40689 16108305 12510321 8824268 7170140 6376458 2576728 -4918398 -11257363 -11868351
40681 -11868351 -8285379 -5512513 -5434639 -5840308 -4769303 -2531806 248460 3219311
40673 3219311 4250431 94200 -8619281 -15055119 -12139427 -1067707 8667146 9074984
40665 9074984 1981103 -3985345 -3377991 1485882 5285145 5641510 3194844 -1105688
40657 -1105688 -6097941 -9653454 -10820629 -11720989 -14403135 -16639548 -14390839 -8448646
40649 -8448646 -4736498 -6745866 -11084340 -12552043 -10740180 -8899329 -8430311 -7787601
$$ packed form
40707i16182M346090L359185n84185N10040O026055N982752k765941r771473n732302
40698D54039M194473Q531736M925567K33165q25832J44054M94269k28247j814919
40689A6108305l597984l686053j654128p93682l799730p495126o338965o10988
40681a1868351L582972K772866P7874m05669J071005K237497K780266K970851
40673C219311J031120m156231q713481o435838K915692J1071720R734853M07838
40665I074984p093881n966448O07354M863873L799263L56365k446666m300532
40657a105688m992253l555513j167175r00360k682146k236413K248709N942193
40649h448646L712148k009368m338474j467703J811863J840851M69018O42710
$$ plain form
40641 -7787601 -5988099 -4223999 -3824044 -4608010 -5536370 -5666063 -4356510 -1456565 2674191
40632 2674191 7494170 11817172 13100952 9342940 2600015 -1914878 -2069111 -1569622
40624 -1569622 -4006540 -7094465 -6800914 -4606599 -4957061 -6584988 -3181440 6089125
40616 6089125 13346959 12453135 7231100 4936282 5969618 5427843 1829734 -1676964
40608 -1676964 -3514472 -5412215 -7920476 -9132987 -8732359 -9118074 -11151182 -12227748
40600 -12227748 -10232307 -6725380 -4544681 -4235858 -4302617 -3535840 -1980874 -498064 277726
40591 277726 1242879 4331082 9313979 12428476 10508279 5024497 -1001483 -8114345
40583 -8114345 -17639115 -25195255 -23884800 -15023760 -8679739 -10480003 -14382954 -13037574
$$ packed form
40641g787601J799502J764100L99955p83966r28360j29693J309553K899945M130756
40632B674191M819979M323002J283780l758012o742925m514893j54233M99489
40624a569622k436918l087925K93551K194315l50462j627927L403548R270565
40616F089125P257834q93824n222035k294818J033336n41775l598109l506698
40608a676964j837508j897743k508261j212511M00628l85715k033108j076566
40600a2227748J995441L506927K180699L08823o6759P66777J554966J482810P75790
40591B77726R65153L088203M982897L114497j920197n483782o025980p112862
40583h114345r524770p556140J310455Q861040O344021j800264l902951J345380
$$ plain form
40575 -13037574 -9119158 -9673730 -13669959 -13458390 -7114751 -1458001 -1915136 -5617828
40567 -5617828 -6464925 -2515644 3511310 7714072 7521564 3374614 -1203743 -3257129
40559 -3257129 -3884517 -5717824 -8091298 -8323970 -6810154 -6347177 -6863752 -5842612 -4015154
40550 -4015154 -4934326 -7894840 -7288227 -1152076 5358422 7816587 8108699 8550708 6339910
40541 6339910 -650513 -7202916 -6518595 -102797 4170117 2210818 -3581411 -10151060
40533 -10151060 -16226144 -19460331 -17260136 -11406648 -6999301 -5833722 -5127554 -3423527
40525 -3423527 -2822602 -3810546 -2795257 2210132 7085001 6292726 -17642 -6603045 -9466815
40516 -9466815 -8979283 -7460626 -6159794 -4985971 -3779430 -2903610 -2504826 -1676069 533014
$$ packed form
40575a3037574L918416n54572l996229K11569O343639N656750m57135l702692
40567e617828q47097L949281O026954M202762j92508m146950m578357k053386
40559c257129o27388j833307k373474k32672J513816M62977n16575J021140J827458
40550d015154r19172k960514O06613O136151O510498K458165K92112M42009k210798
40541F339910o990423o552403O84321O415798M272914j959299n792229o569649
40533a0151060o075084l234187K200195N853488M407347J165579P06168J704027
40525c423527O00925r87944J015289N005389M874869p92275o310368o585403k863770
40516i466815M87532J518657J300832J173823J206541Q75820L98784Q28757K209083
$$ plain form
40507 533014 2932757 2733368 -329860 -2199444 727563 6333885 9348519 8400235 7000140
40498 7000140 7601855 8528889 7765380 6345309 6178638 6872164 6401046 3598875 -589834
40489 -589834 -2995824 -135422 7010979 11040874 5318613 -6651047 -14042987 -12236844
40481 -12236844 -8120653 -9228046 -13224212 -13093274 -8551266 -5921175 -8320814 -11948813
40473 -11948813 -12463154 -10598845 -10192933 -13069347 -16625714 -15663576 -7765294 2138251
40465 2138251 5177236 -1278281 -9820665 -12441209 -10297088 -9522492 -10681913 -8978214
40457 -8978214 -3253615 2646576 7556423 14484659 22749021 25931167 21113344 13945816
40449 13945816 10204429 7736964 2088908 -4414149 -5850282 -2567845 -1181560 -4983050
$$ packed form
40507E33014K399743j99389l063228j869584K927007N606322L014634r48284j400095
40498G000140O01715R27034p63509j420071j66671O93526m71118k802171m188709
40489e89834k405990K860402P146401M029895n722261j1969660p391940J806143
40481a2236844M116191j107393l996166J30938M542008K630091k399639l627999
40473a1948813n14341J864309M05912k876414l556367R62138P898282R903545
40465B138251L038985o455517q542384k620544K144121P74596j159421J703699
40457h978214N724599N900191M909847O928236Q264362L182146m817823p167528
40449A3945816l741387k467465n648056o503057j436133L282437J386285l801490
$$ plain form
40441 -4983050 -9914160 -10935976 -8060701 -4707683 -3264518 -3659182 -4173557 -2844821
40433 -2844821 237276 1976052 -255454 -4193875 -4419022 743404 6392297 6324425 -408931
40424 -408931 -8978017 -13294165 -10491745 -2638506 5090703 9116928 10642961 12725513
40416 12725513 14651848 12453666 5861644 756486 1688706 5045364 4037042 -1281109
40408 -1281109 -4279029 -1973526 812851 -254847 -1734618 2175636 10231399 15642349
40400 15642349 15821013 15051693 16679469 17776045 14280303 7921192 4460393 6522704
40392 6522704 10954167 12660462 9284759 2963870 -1046715 1240119 7718425 11036196
40384 11036196 6490516 -1800965 -4873394 1427312 12567516 20251283 19262893 10601665
$$ packed form
40441d983050m931110j021816K875275L353018J443165l94664n14375J328736
40433b844821L082097J738776k231506l938421k25147N162426N648893o7872o733356
40424d08931q569086m316148K802420P853239P729209M026225J526033K082552
40416A2725513J926335k198182o592022n105158R32220L356658j008322n318151
40408a281109k997920K305503K786377j067698j479771L910254Q055763N410950
40400A5642349J78664p69320J627776J096576l495742o359111l460799K062311
40392F522704M431463J706295l375703o320889m010585K286834O478306L317771
40384A1036196m545680q291481l072429O300706J1140204P683767r88390q661228
$$ [...]
##END NTUPLES=NMR SPECTRUM
##END=
