##TITLE=31Pdec_SR95chl
 CDCl3, 24 sc
 28.10.2021
##JCAMPDX= 6.0         $$ Bruker NMR JCAMP-DX V2.0
##DATA TYPE= NMR SPECTRUM
##DATA CLASS= NTUPLES
##ORIGIN= UXNMR, Bruker Analytische Messtechnik GmbH
##OWNER= root
$$ XWIN-NMR		Version 3.5
$$ Thu Oct 28 11:42:55 2021 Russian Standard Time (UT+4h)  she@DPX200
##.OBSERVE FREQUENCY= 81.013821
##.OBSERVE NUCLEUS= ^31P
##.ACQUISITION MODE= SIMULTANEOUS
##.ACQUISITION SCHEME= undefined
##.AVERAGES= 24
##.DIGITISER RES= 16
##SPECTROMETER/DATA SYSTEM= spect
##.PULSE SEQUENCE= zgpg30
##.SOLVENT NAME= CDCl3
##.SHIFT REFERENCE= (INTERNAL, CDCl3, 0, 248.564)
##AUDIT TRAIL= $$ (NUMBER, WHEN, WHO, WHERE, WHAT)
$$ ##TITLE= Audit trail, XWIN-NMR		Version 3.5
$$ ##JCAMPDX= 5.01
$$ ##ORIGIN= Bruker BioSpin GmbH
$$ ##OWNER= she
$$ F:/spectra/data/she/nmr/P31/1/pdata/1/auditp.txt
$$ ##AUDIT TRAIL=  $$ (NUMBER, WHEN, WHO, WHERE, WHAT)
(   1,<2021-10-28 11:41:50.25 +0400>,<she>,<DPX200>,
      <created by zg, POWCHK disabled, PULCHK disabled
       configuration hash MD5:
       00 E9 B6 7A A2 85 ED C7 34 08 36 98 17 FE 4E 26
       data hash MD5: 32K
       9E 0C FA 25 88 A5 66 26 CD 89 BF 74 D7 CD 5F F2>)
(   2,<2021-10-28 11:41:53.84 +0400>,<she>,<DPX200>,
      <Start of raw data processing
       efp BC_mod = 2 LB = 1 FT_mod = 6 PKNL = 1 PHC0 = -8992.92 PHC1 = 409.2694 SI = 64K 
       data hash MD5: 64K
       81 00 2C B4 00 45 8B 33 31 31 31 59 F6 EA F5 2B>)
(   3,<2021-10-28 11:42:15.03 +0400>,<she>,<DPX200>,
      <pk PHC0 = 41.06916 PHC1 = -8.799998 
       data hash MD5: 64K
       24 83 43 FE C2 CE F9 20 7E 4F D1 37 F3 8E 51 56>)
$$ ##END=
$$ 
$$ hash MD5
$$ CF 12 80 7D 5B 25 74 D2 EC 03 E2 2A B2 86 76 B2
##$RELAX= 
##$RELAX= 
##$RELAX= 
##$RELAX= 
##$RELAX= 
##$RELAX= 
##$RELAX= 
##$RELAX= 
$$ Bruker specific parameters
$$ --------------------------
##$DU= <F:/spectra>
##$EXPNO= 1
##$NAME= <P31>
##$PROCNO= 1
##$TYPE= <nmr>
##$USER= <she>
##$AMP= (0..31)
100 100 100 100 100 100 100 100 100 100 100 100 100 100 100 100 100 100 
100 100 100 100 100 100 100 100 100 100 100 100 100 100 
##$AQSEQ= 0
##$AQ_mod= 1
##$AUNM= <au_zg>
##$AUTOPOS= <>
##$BF1= 81.014009
##$BF2= 200.13
##$BF3= 200.13
##$BF4= 200.13
##$BF5= 200.13
##$BF6= 200.13
##$BF7= 200.13
##$BF8= 200.13
##$BYTORDA= 1
##$CFDGTYP= 0
##$CFRGTYP= 5
##$CHEMSTR= <none>
##$CNST= (0..31)
1 1 145 1 1 1 1 1 1 1 1 1 1 1 1 1 1 1 1 1 1 1 1 1 1 1 1 1 1 1 1 1 
##$CPDPRG= <waltz16>
##$CPDPRG1= <>
##$CPDPRG2= <waltz16>
##$CPDPRG3= <>
##$CPDPRG4= <mlev>
##$CPDPRG5= <mlev>
##$CPDPRG6= <mlev>
##$CPDPRG7= <mlev>
##$CPDPRG8= <mlev>
##$CPDPRGB= <>
##$CPDPRGT= <>
##$D= (0..31)
0 1 0 0 0 0 0 0 0 0 0 0.03 2e-05 3e-06 0 0 0 0 0 0 0 0 0 0 0 0 0 0 0 0 
0 0 
##$DATE= 1635406909
##$DBL= (0..7)
120 120 120 11 120 120 24 19 
##$DBP= (0..7)
150 150 150 150 150 150 150 150 
##$DBP07= 0
##$DBPNAM0= <>
##$DBPNAM1= <>
##$DBPNAM2= <>
##$DBPNAM3= <>
##$DBPNAM4= <>
##$DBPNAM5= <>
##$DBPNAM6= <>
##$DBPNAM7= <>
##$DBPOAL= (0..7)
0.5 0.5 0.5 0.5 0.5 0.5 0.5 0.5 
##$DBPOFFS= (0..7)
$$ [...]
##$SUBNAM2= <"">
##$SUBNAM3= <"">
##$SUBNAM4= <"">
##$SUBNAM5= <"">
##$SUBNAM6= <"">
##$SUBNAM7= <"">
##$SUBNAM8= <"">
##$SUBNAM9= <"">
##$SW= 501.771253377433
##$SWIBOX= (0..15)
0 1 3 0 0 0 0 0 0 0 0 0 0 0 0 0 
##$SW_h= 40650.406504065
##$TD= 32768
##$TD0= 1
##$TE= 0
##$TE2= 300
##$TE3= 300
##$TEG= 300
##$TL= (0..7)
0 120 53 12 22 120 120 120 
##$TP= (0..7)
150 150 150 150 150 150 150 150 
##$TP07= 0
##$TPNAME0= <>
##$TPNAME1= <>
##$TPNAME2= <>
##$TPNAME3= <>
##$TPNAME4= <>
##$TPNAME5= <>
##$TPNAME6= <>
##$TPNAME7= <>
##$TPOAL= (0..7)
0.5 0.5 0.5 0.5 0.5 0.5 0.5 0.5 
##$TPOFFS= (0..7)
0 0 0 0 0 0 0 0 
##$TUNHIN= 0
##$TUNHOUT= 0
##$TUNXOUT= 0
##$USERA1= <user>
##$USERA2= <user>
##$USERA3= <user>
##$USERA4= <user>
##$USERA5= <user>
##$V9= 5
##$VALIST= <valist>
##$VCLIST= <CCCCCCCCCCCCCCC>
##$VD= 0
##$VDLIST= <DDDDDDDDDDDDDDD>
##$VPLIST= <PPPPPPPPPPPPPPP>
##$VTLIST= <TTTTTTTTTTTTTTT>
##$WBST= 1024
##$WBSW= 4
##$XGAIN= (0..3)
0 0 0 0 
##$XL= 0
##$YL= 0
##$YMAX_a= 1964
##$YMIN_a= -1883
##$ZGOPTNS= <>
##$ZL1= 120
##$ZL2= 120
##$ZL3= 120
##$ZL4= 120
##$ABSF1= 0
##$ABSF2= 0
##$ABSG= 0
##$ABSL= 0
##$ALPHA= 0
##$AQORDER= 0
##$ASSFAC= 0
##$ASSFACI= 0
##$ASSFACX= 0
##$ASSWID= 0
##$AUNMP= <proc_1d>
##$AZFE= 0.1
##$AZFW= 0.5
##$BCFW= 0
##$BC_mod= 2
##$BYTORDP= 0
##$COROFFS= 0
##$CY= -3
##$DATMOD= 1
##$DC= 0
##$DFILT= <>
##$DTYPP= 0
##$F1P= 0
##$F2P= 0
##$FCOR= 1
##$FTSIZE= 65536
##$FT_mod= 6
##$GAMMA= 0
##$GB= 0
##$INTBC= 1
##$INTSCL= 5.30512e-09
##$ISEN= 30
##$LB= 1
##$LEV0= 0
##$LPBIN= 0
##$MAXI= 10000
##$MC2= 0
##$MEAN= 0
##$ME_mod= 0
##$MI= 50
##$NCOEF= 0
##$NC_proc= -8
##$NLEV= 6
##$NOISF1= 182.463
##$NOISF2= 159.3651
##$NSP= 0
##$NTH_PI= 0
##$NZP= 0
##$OFFSET= 248.5645
##$PC= 4
##$PHC0= -8951.851
##$PHC1= 400.4694
##$PH_mod= 1
##$PKNL= yes
##$PPARMOD= 0
##$PSCAL= 0
##$PSIGN= 0
##$REVERSE= no
##$SF= 81.014009
##$SI= 65536
##$SIGF1= 159.3651
##$SIGF2= -187.1042
##$SINO= 113.3802
##$SIOLD= 16384
##$SREGLST= <1H.CDCl3>
##$SSB= 0
##$STSI= 65536
##$STSR= 0
##$SW_p= 40650.406504065
##$SYMM= 0
##$S_DEV= 0
##$TDeff= 32768
##$TDoff= 0
##$TI= <>
##$TILT= no
##$TM1= 0
##$TM2= 0
##$TOPLEV= 0
##$USERP1= <user>
##$USERP2= <user>
##$USERP3= <user>
##$USERP4= <user>
##$USERP5= <user>
##$WDW= 1
##$XDIM= 65536
##$YMAX_p= 319738181
##$YMIN_p= -219151201
$$ End of Bruker specific parameters
$$ ---------------------------------
##NTUPLES= NMR SPECTRUM
##VAR_NAME=  FREQUENCY,     SPECTRUM/REAL,   SPECTRUM/IMAG
##SYMBOL=    X,             R,               I
##VAR_TYPE=  INDEPENDENT,   DEPENDENT,       DEPENDENT
##VAR_FORM=  AFFN,          ASDF,            ASDF
##VAR_DIM=   65536,         65536,           65536
##UNITS=     HZ,            ARBITRARY UNITS, ARBITRARY UNITS
##FACTOR=    0.620285442955139, 1,           1
##FIRST=     20137.2065510759, 0,            0
##LAST=      -20513.1999529892, 0,           0
##MIN=       -20513.1999529892, -219151201,  0
##MAX=       20137.2065510759, 319738181,    0
$$ Real data points
##PAGE= N=1
##DATA TABLE= (X++(R..R)), XYDATA
$$ [...]
13041I384803l968515K666J58093m640123o570885j790320M066491N506303L985695
13032F134208K387478K64697k146485j875637J185396K327425p20222l523091
13024D033769j604769K726023L925194O98810l233852m062586j456999J637261
13016B662851J923253o59117k891311k911633k652526l482805k816130J067271
13008i760147M379780L247793M36191M86527J551533m30666k670878J46511M790305
12999B176949L411438k358635l038612K215700L563031k061553m743142J235726
12991D00902O651041K484844m996132n005280M05875J652755j667769j817858
12983a891622K478485M472056J807385j48736J444448K310709r06959m996354
$$ y = [9384803, 5416288, 5418954, 5577047, 936924, -5633961, -7424281, -3357790, 2148513, 6134208, 8521686, 8786383, 6639898, 4764261, 5949657, 8277082, 7556860, 4033769, 2429000, 5155023, 9080217, 9779027, 6545175, 2482589, 1025590, 2662851, 4586104, 3926987, 1035676, -1875957, -4528483, -8011288, -10827418, -9760147, -5380367, -2132574, -1696383, -1209856, 341677, -88989, -2759867, -2613356, 2176949, 5588387, 3229752, 191140, 2406840, 5969871, 3908318, -834824, 400902, 7051943, 9536787, 4540655, -464625, -58750, 1594005, -73764, -1891622, 586863, 5058919, 6866304, 6717568, 8162016, 10472725, 9565766, 4569412]
12975D569412n393546k205833J201184K254165O32074j719893j929110K66648
12967b324899J523050q9732j462028N58582L326946K470340n45327p81661J734743
12958D410014K315892j33655j640065m47189M19242q02572j693588o65298K12650
12949A975431m28183o70992N61854J047859m68375j392564M18813K695510K128695
12940E868048p32273k673346j980263P23327L841603N147395K893064j487020
12932A1600535l867537k514034m82877r30762k452887j816090O36492J561377
12924A734217l38824k739087k919430n05553K652517L755324J086707l435716
12916g09845m851002o38897N151024N918706N07549n408001o245675k410581J508803
$$ y = [4569412, -824134, -3029967, -1828783, 425382, 1057456, -662437, -2591547, -2324899, -801849, -891581, -2353609, -1795027, 1531919, 4002259, 3456932, 2675271, 4410014, 6725906, 6592251, 4952186, 4504997, 4924239, 4121667, 2428079, 1762781, 1975431, 1547248, 876256, 1438110, 2485969, 2017594, 625030, 1043843, 3739353, 5868048, 5135775, 2462429, 482166, 1205493, 5047096, 10194491, 13087555, 11600535, 7732998, 5218964, 4736087, 3805325, 1352438, -463652, 172840, 1734217, 1395393, -1343694, -4263124, -4768677, -2116160, 1639164, 2725871, -709845, -5560847, -6199744, -1048720, 4869986, 5377535, -30466, -6276141, -8686722, -7177919]
12907g177919K343396Q81365Q9130J843601M745527M997951O55992n027266o504636
12898c152859k768931J077229N37576k343927k331661J370301M296655L286801
12890b8816M44926m97472Q92947K136242J402654r65285l326993l742566j130412
12881d814775L172143N807374M682439J284105j315084k002087k045563k694840
12873B073712l616793l416556j003878K997921N870713N048052J254997k165973
12865G042195l541725m144649m408219k399411J655089L131072o54589m899881
12857h220118l299794K477957N274252L336983J908494L425808L420375j084765
12849G239192n510079m485071p4276J690442l84955j970757R8012M106183N913894
$$ y = [-7177919, -4834523, -3953158, -3864028, -2020427, 2725100, 7723051, 8379043, 3351777, -3152859, -5921790, -4844561, -4306985, -6650912, -8982573, -7612272, -3315617, -28816, 416110, -81362, 811585, 2947827, 4350481, 3385196, 58203, -3684363, -4814775, -1642632, 4164742, 8847181, 10131286, 8816202, 6814115, 4768552, 2073712, -1543081, -4959637, -5963515, -2965594, 2905119, 7953171, 9208168, 7042195, 3500470, -644179, -5052398, -7451809, -5796720, -2665648, -3320237, -8220118, -11519912, -9041955, -3767703, -430720, 1477774, 4903582, 8323957, 7239192, 1729113, -2755958, -2830234, -1139792, -1524747, -3495504, -3397492, 708691, 6622585]
12840F622585L141522k233318m843195j671504L051610K533778k495033m001978
12832A04467R46872M696009N18312o575034p255954j469593L108712L094692J754771
12823a076746J109952j07797j108172N13962K796407J406033j996590j343342
12815A93707K936789L347082j954098m940231n57813M771694L627690q25644j301398
12806E297778J400421J250193j839268k665908o50029m52486k975114l723463
12798d357876j150915N26665j125860k616943p45459K126299K337601O26427J65882
12789d214179J533878K668509K205793O16872q60823j117000j30358M85974n41590
12780F47076j797926j184458J90684l23495j540664M09023M582454M708278r80025
$$ y = [6622585, 9764107, 7530789, 2687594, 1016090, 4067700, 6601478, 4106445, 104467, 1051339, 5747348, 6265660, -309374, -7565328, -9034921, -5926209, -2831517, -1076746, 33206, -74591, -1182763, -668801, 2127606, 3533639, 1537049, 193707, 3130496, 6477578, 4523480, -416751, -974564, 3797130, 7424820, 6599176, 5297778, 6698199, 7948392, 6109124, 3443216, 2793187, 2340701, -634413, -4357876, -5508791, -4982126, -6107986, -8724929, -9470388, -7344089, -5006488, -4380061, -4214179, -2680301, -11792, 2194001, 2810873, 1950050, 833050, 702692, 1188666, 647076, -1150850, -2335308, -2144624, -2468119, -4008783, -3599760, 982694, 5690972, 4710947]
12771D710947n228079j886261M406331M986298o0593l359977k376907j726049
12763e34290l364767l008082J285699M480910K574821p49019l01683K439969K569894
12754E393452k63926k398886k355352j539568m38609J214649J773140k91678k643863
12745a550641j790635J177772J991122j02596j593119o66376O23638O37691L19843
12736i53301K92098k28507p86412J50175J631440Q98858j553702j973353M67913
12727b054791K118298R75045n11590o50005j221557k415380q02078L889338N765335
12718E092615J622792k605166o71919L489359K042856l479813m618621l73185
12710D98918J096408l314176n676653J08505P516893O370211k311030p819454
$$ y = [4710947, -517132, -2403393, 2002938, 6989236, 6928643, 3568666, 1191759, -534290, -3899057, -6907139, -5621440, -1140530, 1434291, 685272, 383589, 2823558, 5393452, 5129526, 2730640, 375288, -1164280, -1602889, -388240, 1384900, 1093222, -1550641, -3341276, -2163504, -172382, -274978, -1868097, -2534473, -1910835, -1273144, -953301, -661203, -889710, -1676122, -1525947, 105493, 1004351, -549351, -2522704, -2054791, 63507, 1038552, 526962, -123043, -1344600, -3759980, -4562058, -672720, 5092615, 6715407, 4110241, 3438322, 6927681, 8970537, 5490724, 872103, 498918, 1595326, -1718850, -7395503, -7286998, 229895, 6600106, 4289076, -3530378]
12702c530378m194872L342613O525579L537440j091695k770478r88590J466583
12694B296202J960322O26606m48431n08525j281764l859462n853783l957827R65277
12685a0061385L976017K243003j070047j138223J813198L187226J132052p89917
12677g08076M05712K133097O74427k094403j355923K360057L246002o65797m122768
12668a27672k775215M21076O14560j295329j084517J506895K835132J392051m70008
12659A016973m21469J300080K746204J708783k258790n746057m144353J654437
12651d144192M999796K617070p96295r74808j167144m647656o212603k20670P422140
12642c124362O430936j062892l145173K550138N179514r95034p500739o241350
$$ y = [-3530378, -7725250, -4382637, 2142942, 5680382, 4588687, 1818209, 829619, 2296202, 4256524, 4883130, 4434699, 3926174, 2644410, -1215052, -7068835, -11026662, -10061385, -6085368, -3842365, -4912412, -6050635, -4237437, -1050211, 81841, -708076, -302364, 1830733, 2505160, 410757, -945166, 1414891, 4660893, 3995096, -127672, -2902887, -2481811, -1867251, -3162580, -4247097, -2740202, 94930, 1486981, 1016973, 595504, 1895584, 4641788, 6350571, 4091781, -1654276, -5798629, -4144192, 855604, 3472674, 2676379, 1701571, 534427, -4113229, -10325832, -10546502, -3124362, 3306574, 2243682, -901491, 1648647, 6828161, 5833127, -1667612, -7908962]
12634g908962j542102k90827k28971L057935N890654L086160j641123j733099
12626a310335R23774N53264j228374Q50419M188905J815382m273531m772984J649458
12617a604022N777076K540353j976680j715915M57194j2042j072452Q60842L349879
12608F604233J924616k125519l856554k182151j63831N72335J059155J530418
12600C362702R63286k8449N33721K310607K318432n05143k899076j596767J367274
12591E826587P22250m292638p570513m102941K280324L685187l88244k378378
12583f218366J453995N233566L249591q63430q03753J656511N19752l108242k620542
12574a500918K107481L605326j011194n199230l201844K074058M904423M289295
$$ y = [-7908962, -9451064, -9741891, -9970862, -6912927, -1022273, 2063887, 422764, -1310335, -386561, 166703, -1061671, -211252, 3977653, 5793035, 1519504, -3253480, -1604022, 4173054, 6713407, 4736727, 3020812, 3478006, 3465964, 2393512, 3254354, 6604233, 8528849, 6403330, 2546776, 364625, 200794, 773129, 1832284, 3362702, 4325988, 4297539, 4831260, 7141867, 9460299, 8955156, 6056080, 4459313, 5826587, 6548837, 2256199, -5314314, -9417255, -7136931, -3451744, -3839988, -6218366, -4764371, 469195, 3718786, 2855356, 2051603, 3708114, 4227866, 1119624, -1500918, 606563, 4211889, 3200695, -1998535, -5200379, -3126321, 1778102, 6067397]
12566F067397J941900j571091m620339l676509R07302L075067k82662l547866
12558a706801p54797M477148M126563j837248n505373k673922K305118L954477
12550B385165K117082o27621l078574m463994l020664J444596N501469N213446
12542E470905O77302m074944n309991k778747R00420L017046K725919R08744j004118
12533E32536j762115p21397J407824K681140J944738L45509m39552p87507k063480
12524A137696l548917k940632N4791L091073M333272L817013J730941j646307
12516F028930m113115l147896o1650J044573n66033j097060J322338L243175J369433
12507D022695k338993l835533k101616J349165M720724N338223Q27742o060481
$$ y = [6067397, 8009297, 6438206, 1817867, -1858642, -951340, 2123727, 1841065, -1706801, -2461598, 2015550, 6142113, 4304865, -1200508, -3874430, -1569312, 2385165, 4502247, 3874626, 796052, -3667942, -6688606, -5244010, 257459, 5470905, 6148207, 2073263, -3236728, -6015475, -5115055, -2098009, 627910, 1536654, 532536, -1229579, -1950976, -543152, 2137988, 4082726, 4428235, 3988683, 3201176, 1137696, -2411221, -5351853, -5297062, -2205989, 2127283, 5944296, 7675237, 6028930, 1915815, -1232081, -1293731, -249158, -815191, -1912251, -589913, 2653262, 4022695, 1683702, -2151831, -4253447, -2904282, 1816442, 7154665, 7982407, 1921926]
12499A921926q026331k460501L950922M259158P16702k76891J177675l8963m096564
12490b872867n328923j341234L499167M738954K866750N60069q19554r79491l77505
12481e4634n81275k071708k378604K91234L031724K179799k32004N97430L765814
12472D547776L451131j475731n080429l325797L57221J019806j006113k114853
12464c626989p04087J973376L609360K169416j955228m737636k647126K088515
12456c830399M155455K630885J085541P94376j83858j165393Q03650L672763J403701
12447I366721n128513o570407R78199Q262240N591682l086508o546480k237135
12439F29799K355906J964984p42276j560935n70162l58237k202897m806026n093980
$$ y = [1921926, -6104405, -8564906, -4613984, -354826, 361876, 84985, 1262660, 1223697, -2872867, -8201790, -9543024, -6043857, -1304903, 1561847, 2121916, 1302362, 322871, -54634, -635909, -2707617, -5086221, -4794987, -1763263, 416536, 184532, 781962, 4547776, 7998907, 6523176, 1442747, -1883050, -1525829, -506023, -1512136, -3626989, -4331076, -2357700, 1251660, 3421076, 1465848, -3271788, -5918914, -3830399, 325056, 2955941, 4041482, 4835858, 4652000, 3486607, 4290257, 7963020, 9366721, 4238208, -2332199, -1354000, 6908240, 12499922, 9413414, 2866934, 629799, 2985705, 4950689, 4208413, 2647478, 2077316, 1719079, -483818, -5289844, -10383824]
12430a0383824j224117M026192N488063K741412J138255L353945M819801J421664
12422A1381391l242046l556509n77393Q77544J73883l39062j165311l543669m270513
12413d261685J32813O016680O537618J619246k819910m034605l776429k164016
12405b750288J826500M842804K517650k129185k205902J487803J799169j740381
12397C648170j926018K389735L110733k685407o555768k856904J639304O7130
12389c169025k444116J201695O137954L237921m722988o751684p48012M609988
12381b648267M272104K298393K122011J257529j807168l738754k595394j290068
12373b129614j777754j619809O50776K109043O58841j006901k2605K109368K795203
$$ y = [-10383824, -11607941, -7581749, -2093686, 647726, 1785981, 5139926, 9959727, 11381391, 8139345, 4582836, 4005443, 4882987, 5056870, 4717808, 3552497, 8828, -4261685, -4128872, 1887808, 8425426, 10044672, 7224762, 3190157, -586272, -2750288, -923788, 3919016, 6436666, 4307481, 2101579, 3589382, 5388551, 3648170, 1722152, 4111887, 7222620, 4537213, -2018555, -4875459, -3236155, -3169025, -5613141, -4411446, 1726508, 4964429, 241441, -6510243, -7258255, -2648267, 1623837, 3922230, 6044241, 7301770, 5494602, 1755848, -839546, -2129614, -3907368, -5527177, -4876401, -2767358, -2108517, -3115418, -3138023, -1028655, 1766548]
12364A766548K400105J817065k64787l963846n523655k397253J686444J545569
12356b933810j476123j662477J736097L098226n67662m542748l241435J709815
12348g880117M162358K057032q66635j338543m08683j81501k11162Q13034K170992
12339a683225K298557J370049M41108o85709k251740k376840P33650M842790N357549
12330H046189J379037l036831m349456l104027j094760J461895M016880M266280
12322G585207J370282j860303k658895k012725k120435k527542j840842j020759
12314e086012j367133j139820J752119N099192M817187J245249j399268j451184
12306B470330j070710j126021J00960K211069J895108j179256k504510L94190
$$ y = [1766548, 4166653, 5983718, 5718931, 1755085, -3768570, -6165823, -4479379, -2933810, -4409933, -6072410, -4336313, -1238087, -1805749, -6348497, -9589932, -7880117, -3717759, -1660727, -2527362, -3865905, -4274588, -4456089, -4667251, -3854217, -1683225, 615332, 1985381, 2426489, 1740780, -510960, -2887800, -2154150, 2688640, 8046189, 9425226, 6388395, 2038939, -1065088, -2159848, -697953, 3318927, 7585207, 8955489, 7095186, 4436291, 2423566, 303131, -2224411, -4065253, -5086012, -6453145, -7592965, -5840846, -741654, 4075533, 5320782, 3921514, 2470330, 1399620, 273599, 374559, 2585628, 4480736, 3301480, 796970, 1191160]
12298A191160L461318K062468k021984l631871j731212L49897M99332m86261j762101
12289b069254k986508k529187R27797M893139M909646O32199l181672k770701
12281b174541M23940K790003K974999J729004j47388j681322j500586J94014R71499
12272C579622n17080k047314q76875K002280L262082J984804J18491j356625l375562
12263B773823n428644m691642k98275M075989M305334J031096j470317p84767
12255d87403J381942K132669P62671r86733j030745P72036K104161O90502k362884
12246B976216l329464r39830J407259N28375j557602p62575K374162L347655Q85486
12237D929682j134638k44278O14461j557609m112919k520107K179843M214066
$$ y = [1191160, 4652478, 6714946, 4692962, 1061091, -670121, -320224, 179108, -307153, -2069254, -5055762, -7584949, -6657152, -1764013, 3145633, 3777832, 596160, -2174541, -1750601, 1039402, 4014401, 5743405, 5596017, 3914695, 2414109, 2608123, 3579622, 3062542, 1015228, 138353, 2140633, 5402715, 7387519, 7506010, 6149385, 2773823, -2654821, -7346463, -7644738, -3568749, 736585, 1767681, 297364, -487403, 894539, 3027208, 3789879, 2803146, 1772401, 2544437, 4648598, 5339100, 2976216, -353248, -1293078, 114181, 642556, -915046, -1677621, 696541, 4044196, 4929682, 3795044, 3550766, 4165227, 2607618, -1505301, -4025408, -1845565, 2368501]
12229B368501J156765k849367l025969L9611K305577K065478J146529J039443
12221D246568P13120p91391j882678p59388J003147K73854k240455k104441J765328
12212B23664L925937j54076o314580o358177O16086O896483O594270K241671o44953
12203G026325q87344p87295j502043k345526k488891j227417J357861K805985
12195A951655M11983l720948l741187J666971O342665N036377M29302k077667
12187F299151k235330k595052k214628R60817M022277K251445k756170m650622
12179i18112j790655J015395O15490o08645j73512O00854K8975r17109r18593
12170c065912l23961L35166Q91423K97495j909043l175454r02704K569280K579334
$$ y = [2368501, 3525266, 675899, -2350070, -2310459, -4882, 2060596, 3207125, 4246568, 4959688, 4168297, 2285619, 1526231, 2529378, 2803232, 562777, -1541664, 223664, 4149601, 3995525, -2319055, -8677232, -8061146, -1164663, 5429607, 7671278, 7026325, 6138981, 5351686, 3849643, 1504117, -984774, -2212191, -854330, 1951655, 2363638, -1357310, -5098497, -3431526, 2911139, 7947516, 8376818, 6299151, 4063821, 1468769, -745859, 214958, 4237235, 6488680, 3732510, -918112, -2708767, -1693372, -1077882, -1686527, -1860039, -1259185, -1230210, -2147319, -3065912, -3389873, -3054707, -2163284, -1865789, -3774832, -6950286, -7852990, -5283710, -2704376]
12161b704376m92170j712784M71311K589459K952056L694687M731210K522644
12153A2052037k683419n073079k035364J482620J021732j060563j292328r26101
12145A485535j435939l68479K902830L396419j219195m570418j198249L394145
12137B386649J190119m512289m122818K181402M680686O228m261839k695558M05250
12128d742170P4345j362239p0594K416436K999739K328394J879972L63959k827074
12119A060768m759094l478234j507569j132691k59905K907841N081255K758194
12111F70565j317141k023879M0313M8240k589257l093104Q13290M929971M345305
12102A824303k09841l861986l435745p7232K777121K715903J46209k420649k923418
$$ y = [-2704376, -3196546, -4909330, -4438019, -1848560, 1103496, 4798183, 9529393, 12052037, 9368618, 4295539, 2260175, 3742795, 4764527, 3703964, 2411636, 1485535, 49596, -318883, 2583947, 5980366, 4761171, 190753, -1007496, 2386649, 3576768, -935521, -5058339, -2876937, 1803749, 1809977, -2451862, -5147420, -4742170, -4667825, -6030064, -6100658, -3684222, -684483, 1643911, 3523883, 3887842, 1060768, -3698326, -7176560, -8684129, -9816820, -10076725, -7168884, -2087629, 670565, -646576, -2670455, -2630142, -2581902, -5171159, -8264263, -7450973, -2521002, 1824303, 1614462, -2247524, -5683269, -5760501, -2983380, -267477, -121268, -2541917, -5465335]
12093e465335j647801l92908o7160K74349J898534M269591M990188K487394j369862
12084D976990k719951n14094J774352Q48123j683023j832667P59703K646129J848085
12075F103647j99918j931707l218736l360575j339944J267292J575711L35300
12067g68930J175022L858597L583640q15672l632830r23338K857715J729074k669281
12058D393997m426976k455062k22437J032571K545677L144129M69735l559826
12050I21808m330576j383958J484572K452565K679192J855212j175437l657623
12042a154245j451334L273226L882454r2653j753813J549232L497295k89749m450677
12033C009736k978543N65741m29616l776541j942900M982965Q543903M310623
$$ y = [-5465335, -7113136, -7506044, -7573204, -7298855, -5400321, -1130730, 3859458, 6346852, 4976990, 2257039, 1742945, 3517297, 4365420, 2682397, 849730, 1609433, 4255562, 6103647, 5903729, 3972022, 753286, -2607289, -3947233, -2679941, -1104230, -768930, 406092, 4264689, 7848329, 7032657, 3399827, 2476489, 5334204, 7063278, 4393997, -32979, -2488041, -2710478, -1677907, 867770, 4011899, 4481634, 921808, -3408768, -4792726, -3308154, -855589, 1823603, 3678815, 2503378, -1154245, -2605579, 667647, 4550101, 4457448, 2703635, 4252867, 7750162, 7460413, 3009736, 31193, 596934, 167318, -3609223, -5552123, -569158, 7974745, 12285368]
12025A2285368k406826m866387k979363p37179j38113n33975j087290j281489
12017a745254n19087J149474K750690L351328K420077l15722l773034m953986
12009a635514j887751K980909M853687K392246q50675j406677N931N36710m78315
12000D510551j060096J10190J444952K55452l344931n449204k730852K589000
11992c674938M630149J397379k546808k837787j485975k656181m788685k372784
11984a4335630M620066Q730627M766704k547527m359009R01388N818083L761767
11976G356469k893255o223725k769383K887682M947640L574904K592645K447089
11968A1920066K35787l676128m683743j347318J445824j51110l090750k970964
$$ y = [12285368, 9878542, 5012155, 2032792, 1295613, 1157500, 623525, -463765, -1745254, -2264341, -1114867, 1635823, 4987151, 7407228, 7091506, 3318472, -1635514, -3523265, -542356, 4311331, 6703577, 5852902, 4446225, 4452156, 4988866, 4510551, 3450455, 3560645, 5005597, 5261049, 1916118, -3533086, -6263938, -3674938, 955211, 2352590, -194218, -3032005, -4517980, -7174161, -11962846, -14335630, -9715564, -984937, 3781767, 1234240, -3124769, -2223381, 3594702, 7356469, 4463214, -1760511, -4529894, -1642212, 3305428, 6880332, 9472977, 11920066, 12155853, 8479725, 3795982, 2448664, 3894488, 3743378, 652628, -2318336]
11960b318336j093781r84406j685959m78533Q13008j035788l448484j361093L497619
11951h095753M382179L81467k413387j303764m02064j753499j189796L462051
11943f932566P224586N438893N48276k818100m171638m382786j926761L207038
11935c813058O373566M066634o51678k744840j726714J00469J878711K790068
11927F273158P76360l119392l634277R40239M590797K275631k128521k492052
11919C481943k07661l30946k173145j580932N70511L00462j328387j53006K551829
11910A130668J708197k138062l093796L62671L534670L746693L149016K660667
11902A1060724K50070l587174n173561l687619j977330p72259J820052M746429
$$ y = [-2318336, -3412117, -4396523, -6082482, -6561015, -5748007, -6783795, -10232279, -11593372, -8095753, -3713574, -3332107, -5745494, -7049258, -7451322, -9204821, -10394617, -6932566, 292020, 5730913, 6279189, 3461089, -710549, -5093335, -7020096, -3813058, 2560508, 6627142, 5975464, 3230624, 1503910, 1604379, 3483090, 6273158, 7049518, 3930126, 295849, 1236088, 5826885, 8102516, 5973995, 3481943, 3274282, 2943336, 770191, -810741, -240230, 60232, -1268155, -1421161, 1130668, 2838865, 700803, -2392993, -2030322, 1504348, 5251041, 8400057, 11060724, 11310794, 7723620, 2550059, -1137560, -3114890, -3887149, -2067097, 2679332]
11894B679332M506682J692726L83416P51261n74279k675300j132720K661804K105822
11885A0398744l001638n076186j680336L52635k187291k536783L246100P297134
11877F812379K292601n578421n815001M06600L557230P99932k156360j712197
11869a393237J20776J565394K712677K259462p50183l099055j397681J665744
11861A683897J133121j962929k501833J46940J928346J207703k83915k287901
11853i36571n189231n579868J18510P986987R775750M102528k204426m290917
11845C782762l889931l056775o77936K752908L591247J071905p11661N12066J681728
11836E056313J49587j950001j833905k65568Q99082J444834J118551p01248k112789
$$ y = [2679332, 7186014, 8878740, 9262156, 10013417, 9439138, 6763838, 5631118, 8292922, 10398744, 7397106, 2320920, 640584, 993219, -1194072, -3730855, -484755, 6812379, 9104980, 3526559, -2288442, -1881842, 1675388, 2475320, 318960, -1393237, -1272461, 292933, 3005610, 5265072, 4514889, 1415834, 18153, 1683897, 2817018, 854089, -1647744, -1500804, 427542, 1635245, 1351330, -936571, -6125802, -11705670, -11587160, -3600173, 6175577, 10278105, 8073679, 3782762, -107169, -3163944, -3841880, -1088972, 2502275, 3574180, 2862519, 3374585, 5056313, 5205900, 3255899, 1421994, 1156426, 2055508, 3500342, 4618893, 3917645, 1804856]
11827A804856j70551L187981K291486k902383m885420K37928N853538M329857
11819I747292j913453n120486l794883k477409k634888j285210K060285L917101
11811a501651K818717J180542M24575p38025k289753k029309N2019J135270P78025
11802a69590J952376M737210M069067k435463q693989p378237l14896L988979
11794d244543K120413q27736j28548K146657K078631M74764M66843J626681J039868
11785D753030j235977k188770r53157J10797k53037m83035L49094P83407m7492
11776H34860p23943k84740J93455K63543J270608K940720K158917k007736n109860
11767d64176k839833K470789M908807L008190N11740k441J84744l26518q41868
$$ y = [1804856, 1634305, 4822286, 7113772, 4211389, -674031, -436103, 5417435, 9747292, 7833839, 2713353, -1081530, -3558939, -6193827, -7479037, -5418752, -1501651, 1317066, 2497608, 2922183, 2184158, -105595, -2134904, -2082885, -947615, -169590, 1782786, 6519996, 10589063, 8153600, -540389, -7918626, -8233522, -4244543, -2124130, -2951866, -3080414, -933757, 1144874, 1619638, 2086481, 3713162, 4753030, 3517053, 1328283, 375126, 485923, 232886, -250149, 98945, 882352, 834860, 110917, -173823, 19632, 283175, 1553783, 4494503, 6653420, 4645684, -464176, -3304009, -833220, 4075587, 7083777, 7595517, 7593076, 7777820, 7451302, 6609434]
11758F609434j033333j999497l431107k749351J003992M602943M142133Q1332
11750G226546l021808j773271K107427L763831J139753k213908j834016J106544
11742F501098J291130k378477m505293j661525J667419J69639l229414j797221
11734c942644L722853N595049Q10596m691184n045869j565220J494072K775128
11726h47219K469774o2502l724881m511818o23831M017863M615979J506242j457564
11717A382043k123137q74288J420939L357097K811096l94311l227969l166289
11709h14819j429959m56990l71889l14700p94570j832255j204925J997686M252572
11700i69849K091400j948719k458800N98189J821286j022446l395776j114217
$$ y = [6609434, 5576101, 3576604, 145497, -2603854, -1599862, 3003081, 7145214, 7226546, 4204738, 2431467, 4538894, 8302725, 9442478, 7228570, 5394554, 6501098, 7792228, 5413751, 908458, -753067, 914352, 1083991, -2145423, -3942644, -219791, 5375258, 6185854, 1494670, -3551199, -5116419, -3622347, -847219, 1622555, 1560053, -2164828, -6676646, -7300477, -3282614, 1333365, 2839607, 1382043, -741094, -1615382, -194443, 3162654, 5973750, 5579439, 2351470, -814819, -2244778, -2701768, -3073657, -3388357, -4182927, -6015182, -7220107, -5222421, -969849, 1121551, -827168, -3285968, -2687779, -866493, -1888939, -5284715, -6398932]
11692f398932L040941L342671n30123l115010q93647L035065L496349K73774k035584
11683B15504p33301J436743Q52513j393988j393308J357501L242156K111174O154
11674E701148p36946q01576j525044k055636j166939K43008P61773Q25632J353772
11665B599192J688415R98010J11392j45972p48881k385314l379735k238769m98038
11656c999700j49212K9925K097148M290941K923438j474798m144248k785370l62701
11647c574577P173n94303K58435J852029J443400j368867l700565k727174J186625
11638g217824M746400M819087J520900j921668k853566k013197j577414j465405
11630e962687O7550K480384K657711l82277l209356k442236M48830J379512l60780
$$ y = [-6398932, -3357991, -15320, -545443, -3660453, -4554100, -1519035, 1977314, 2251088, 215504, -517797, 918946, 1771459, 377471, -1015837, 341664, 3583820, 5694994, 5701148, 4964202, 4162626, 2637582, 581946, -584993, -341985, 419788, 1245420, 2599192, 4287607, 5285617, 5397009, 5251037, 4502156, 2116842, -1262893, -3501662, -3999700, -4148912, -4118987, -2021839, 2269102, 5192540, 3717742, -426506, -3211876, -3574577, -3567404, -4161707, -3903272, -2051243, -607843, -1976710, -5677275, -8404449, -7217824, -2471424, 2347663, 3868563, 1946895, -906671, -2919868, -4497282, -5962687, -5895137, -3414753, -757042, -1139319, -4348675, -6790911, -6342081, -4962569, -5323349]
11621e323349j280738J009036M338834N060059K679807m00240k579160m096759
11613e92510m587815k428657K051161M894230K704423k286550m175986p15345
11605e137049L890926M524838J224280j939101k267709n61470J130358J585965
11597B451038M95147j550079k943348k445560q90046j79119m47936J73350K384332
11588b952221L965778K636093l84849j667127l66892M49661j584462m079497k889833
11579f873349J590709M350628K701744j2K49931J907214P44457k849815m111038
11570b289531j416269J113412N0987k303304j929270Q68084K597527J902882N00984
11561i04498l28649j129482k029250j628354Q11100L363253K997520o75847m031966
$$ y = [-5323349, -6604087, -5595051, -1256217, 3803842, 6483649, 6083409, 3504249, -592510, -5180325, -7608982, -5557821, -663591, 2040832, -245718, -4421704, -5137049, -1246123, 3278715, 4502995, 2563894, 296185, -265285, 865073, 2451038, 2946185, 1396106, -1547242, -3992802, -4882848, -5061967, -5509903, -5336553, -2952221, 1013557, 3649650, 3264801, 1597674, 1230782, 1680443, 95981, -3983516, -6873349, -5282640, -932012, 1769732, 1769720, 2019651, 3926865, 4671322, 1821507, -2289531, -3705800, -2592388, -2541401, -4844705, -6773975, -5905891, -3308364, -1405482, -904498, -1233147, -2362629, -4391879, -6020233, -5209133, -1845880, 1151640, 475793, -3556173]
11552c556173l123760J008269K752177o95314m619639k893577K750480M585919
11544c791618J77092l911925j853996L312434N061907K594997p5868j130162j741532
11535a358671j772487r9680J448370l22169m090295m446126M71718N609424N286472
11526G26556K50720l661146k551966J544965L449462Q53301k963032l181780K14919
11517e318001K411711O23630k118527j974988J12457J005223P63122J334184J889889
11508a271300J91211k486672k618344k74192R39283j14589o91650P21135K246763
11499c358355K443347K221064J969183P07270q62450l86063J894180K782813J161488
11490H572477n98553j305457k493581l844208k149135K689483N592012L486653
$$ y = [-3556173, -6679933, -5671664, -2919487, -3614801, -8234440, -11128017, -8377537, -3791618, -3614526, -7526451, -9380447, -6068013, -1006106, 1588891, 1513023, 382861, -1358671, -3131158, -3230838, -1782468, -2104637, -6194932, -10641058, -10169340, -4559916, 726556, 977276, -2683870, -5235836, -3690871, -241409, 611892, -2351140, -5532920, -5318001, -2906290, -2282660, -4401187, -6376175, -6263718, -5258495, -4495373, -3161189, -1271300, -1080089, -3566761, -6185105, -6459297, -5520014, -5634603, -6326253, -5605118, -3358355, -915008, 1306056, 3275239, 3982509, 3120059, 2733996, 4628176, 7410989, 8572477, 7973924, 6668467, 4174886, 330678, -1818457, 871026, 6463038, 9949691]
11482I949691j8431q18150o32909k660147n047092m109292r32453Q56873J450212
11473a961698L195979M568049K094652k650811m273905j697180Q24970J017847
11465A117903Q53181Q58069j290971m697508m357006N56365L638077P15878l145814
11456e751826j463557L482570M810244K110870R45902K699292K683575r22320
11448H594750l462285j659079R46728J43622k069580j291555J827101K876337
11440E906039Q05565r51329k18128J045215L47255j776150k981205k145064k32850
11431b00652R87666P54772J55450N96840J266522p8201k896857l172945P45176
11422a842229M377061K876593j622251l123303p96974O84400n63518j267787J01065
$$ y = [9949691, 9931260, 9113110, 8480201, 5820054, 772962, -3336330, -4268783, -3411910, -1961698, 1234281, 5802330, 7896982, 5246171, 972266, -724914, 100056, 1117903, 1971084, 2829153, 1538182, -3159326, -7516332, -6959967, -3321890, -2606012, -5751826, -7215383, -3732813, 1077431, 3188301, 4134203, 6833495, 9517070, 8594750, 5132465, 3473386, 4420114, 4563736, 2494156, 1202601, 3029702, 5906039, 6711604, 5760275, 5542147, 6587362, 6934617, 5158467, 2177262, 32198, -200652, 787014, 1541786, 1697236, 2294076, 3560598, 3482397, 585540, -2587405, -1842229, 2534832, 5411425, 3789174, 665871, -131103, 553297, -10221, -1278008, -1176943]
11413a176943M90638j274065j319688K373414N369494L532424l38317j519713
11405F137244p73470j387459k618518j952589o64102j036417j111716J284300
11397b122727K535304j023875m316531K3165P953571P752343j779130q326243
11389F95877m556858J655350J273272k040988m62355L957649L908838j15682j830444
11380B484659q41733k015262m808452l403234K274792N217697K821538R76892
11372B706897L450381N041657L36862o713658q076879k995723J852547K058123
11364b339793M1282l72665L20321q80185l952288m927900j207248L934159M644427
11355d739890L52468k823650k95332M538490N465799K478902O65542J410931P21144
$$ y = [-1176943, -686305, -1960370, -3280058, -906644, 4462850, 7995274, 7656957, 6137244, 5363774, 3976315, 1357797, -594792, -1258894, -2295311, -3407027, -2122727, 412577, -611298, -4927829, -4904664, 3048907, 10801250, 9022120, 695877, -3860981, -2205631, -932359, -2973347, -3435702, 521947, 4430785, 4315103, 2484659, 1642926, -372336, -5180788, -8584022, -6309230, -1091533, 1730005, 2706897, 6157278, 11198935, 11535797, 4822139, -3254740, -6250463, -4397916, -2339793, -2298511, -2671176, -2350855, -3231040, -7183328, -12111228, -13318476, -9384317, -4739890, -4387422, -7211072, -7506404, -2967914, 2497885, 4976787, 5642329, 7053260, 7774404]
11346G774404l011050n530143l503035J62420J277036P67840J963150M170892
11338D071514L529965p49139m881437n310826k414193O62424J076136j532856
11330e548412m501354m330878n60968L500610M904187M249331L364793K056331
11322C133640l72811k321374j859762k66478j30042p08582R33901M210866M672836
11313G292194O35593l597140l409124j5927J775329J78505k077196k190836o10221
11304b018823N12726M67625N49936J881671L425859K849948l38869l351196l062838
11295I16039j05754J638668n3510l020513l736519j626316Q87221J678292Q74782
11286b547610p9122j66111M26241O98796L8028q96108r40243r5852M35407J08270
$$ y = [7774404, 4763354, -766789, -4269824, -4107404, -2830368, -2062528, -99378, 4071514, 7601479, 6852340, 1970903, -3339923, -5754116, -5091692, -4015556, -5548412, -10049766, -14380644, -14941612, -11441002, -6536815, -2287484, 1077309, 3133640, 2760829, 439455, -1420307, -1686785, -1816827, -2525409, -1591508, 2619358, 7292194, 7927787, 4330647, 921523, 905596, 2680925, 2859430, 782234, -1408602, -2018823, -1506097, -1038472, -488536, 1393135, 4818994, 7668942, 7330073, 3978877, 916039, 810285, 2448953, 2395443, -625070, -4361589, -5987905, -5100684, -3422392, -2547610, -2626732, -2792843, -2366602, -1667806, -1629778, -2525886, -3466129, -3561981, -3126574, -3018304]
11276c018304j19283O91549K076463K957802K932018K130735P49863n32404o57884
11267G210555L31630P87546m59112k154810j952231N87164L236041L313118L04030
11258A1203931l433262m601918k368671L48255L14847j573647j574468R24882
11250g60051J970679p47658l588762k059539K237474L834463J246119j763425
11242C69300k376834j719785j069419N43373L192113M205879J977996j013077
11234D109546j536288K7757J101545R91397Q43131N90539j171822m264939o125029
11225e434163m610731n07910L158343L837998J690294m21880L31321L453668N229289
11216F726229K846253k265781o051319o068959l115421N74577L109941L134313
$$ y = [-3018304, -3137587, -2446038, -369575, 2588227, 5520245, 7650980, 8400843, 7868439, 7210555, 7542185, 8329731, 7870619, 5715809, 3763578, 4350742, 7586783, 10899901, 11203931, 7770669, 3168751, 800080, 1148335, 1463182, -110465, -1684933, -760051, 1210628, 462970, -3125792, -5185331, -2947857, 886606, 2132725, 369300, -2007534, -3727319, -4796738, -4253365, -1061252, 3144627, 5122623, 4109546, 2573258, 2601015, 3702560, 4693957, 5537088, 6127627, 4955805, 690866, -5434163, -10044894, -10552804, -7394461, -3556463, -1866169, -2288049, -1956728, 1496940, 6726229, 9572482, 7306701, 1255382, -4813577, -7928998, -7354421, -4244480, -1110167]
11208a110167K53333l708579n210114k450204K012747L842981K383723J457989
11200b528291L496825N239824K317278l349302n232017j645551J431249p89076
11192a059061m855490m715085o15211K593562L332476L776578M074133K219053
11184D750955o92092j101350P18471Q54112j035674q96185J883221K382693j423801
11175E440350m522354k864191L22334O47081m59714j3064L44723j554850k506114
11166e165799J056259N556861N055185R78585n56594O47492o63184m556997m675726
11157b323918P11387M755486K513377j751244k168098j17773r1739j404420l38312
11148b15254K185583J537099k653962n112742k537828J672463K355614m32634
$$ y = [-1110167, -856834, -4565413, -9775527, -12225731, -10212984, -6370003, -3986280, -2528291, 968534, 6208358, 8525636, 5176334, -55683, -1701234, -269985, -1059061, -5914551, -10629636, -11244847, -8651285, -5318809, -1542231, 2531902, 4750955, 4058863, 2957513, 3675984, 4530096, 3494422, 2598237, 4481458, 6864151, 5440350, 917996, -1946195, -1623861, -976780, -1436494, -1449558, -1104835, -2659685, -5165799, -4109540, 1447321, 6502506, 7481091, 6924497, 7571989, 6908805, 2351808, -2323918, -1612531, 3142955, 5656332, 3905088, 1736990, 1619217, 1527478, 123058, -215254, 1970329, 3507428, 853466, -4259276, -6797104, -5124641, -2769027, -3201661]
11140c201661j854005J153883N760931O339969J087585n423918o994847k666474
11132e798537K397512L097072q781k325338j259909J242370K075531Q47899p27993
11123d60174j824078k770543k824161l95621L558425N005038J896922k237085
11115e1277k716330k73933M76480j604537k750724o93415J912713K053672N34102
11106c113249m18781m31788J29682J420560K401725J218781q65449J29136M205728
11097D676345N560342Q87194m753958m737220J6382L360241K350742j194090m681854
11088A484124n766694k396556L486492N565292J411660k702476r76043K449133
11080B554932O80853l549849k382117K963996L531659k108811n149070r64393
$$ y = [-3201661, -5055666, -3901783, 1859148, 8199117, 9286702, 3862784, -3132063, -5798537, -3401025, -303953, -312734, -2638072, -3897981, -2655611, -580080, 267819, -460174, -2284252, -5054795, -7878956, -8274577, -4716152, 288886, 2185808, -51277, -2767607, -3041540, -2565060, -4169597, -6920321, -7613736, -5701023, -3647351, -3113249, -3532030, -3963818, -3834136, -2413576, -11851, 1206930, 341481, 470617, 4676345, 10236687, 11123881, 6369923, 1632703, 1649085, 5009326, 7360068, 6165978, 1484124, -4282570, -6679126, -3192634, 2372658, 3784318, 1081842, 105799, 2554932, 3235785, -314064, -2696181, 267815, 3799474, 1690663, -3458407, -4422800]
11072d422800M213925M335286J720291J42652j371417l011601q85764M993556
11064E714128P111763J401892m989534m031258J061275J867497j971418m067983
11056B096362k518941j102864r27150P79008L673228L619076O4260k230777n82386
11047B869816J730975J133785r54485j127449O81994J668467M94711j111599r66820
11038D419395N43214O66373k236702n888759o098832j874968K988153M268078
11030c214048J926955o47376r02493N18590J187161j9550j354402l68032K158447
11021g14748K425846q03897l456564j879663J310688J425368n22828M8789K696333
11012E29324K293974j764528l719473n77299L235748K884281o13270l549211m045140
$$ y = [-4422800, -208875, 4126411, 5846702, 5989354, 4617937, 1606336, 720572, 5714128, 12825891, 14227783, 9238249, 5206991, 6268266, 8135763, 6164345, 2096362, -422579, -1525443, -2452593, -1673585, 1999643, 5618719, 5682979, 3452202, 2869816, 4600791, 5734576, 4780091, 3652642, 4334636, 6003103, 6497814, 5386215, 4419395, 4962609, 5628982, 3392280, -2496479, -8595311, -10470279, -7482126, -3214048, -1287093, -1934469, -2836962, -2318372, -1131211, -1150761, -2505163, -2873195, -714748, 1711098, 907201, -2549363, -4429026, -3118338, -1692970, -2215798, -2167009, 529324, 2823298, 1058770, -2660703, -3238002, -2254, 2882027, 2268757, -1280454, -5325594]
11003e325594j563734K991430N370252J998145l105577k514371K405134K449269
10995B704954l882659o505814l97289N078517J483842m412028k280713M364098
10987c847092M909207k81954j908340J666271L175291N52784l35124K431404L636815
10978I999262J179356o54071o1540n24773k712050k568383J44697J05644l863382
10969A044760n558810j322361M144822N395629L010902l48236l989861o113499
10961c736654l390979K760306N704085K838010q69032j757332k776485n773248
10953g001329o084158q36455M032003K351647j909819q43161M520258N967415
10945A96401J107226l454728k384959J596989L005011Q76534j567507j797849
$$ y = [-5325594, -6889328, -3897898, 1472354, 3470499, 364922, -2149449, 255685, 2704954, -1177705, -7683519, -8080808, -3002291, -1518449, -5930477, -8211190, -3847092, 1062115, 780161, -1128179, 538092, 3713383, 4266167, 3931043, 6362447, 9999262, 11178618, 10524547, 10463007, 9938234, 7226184, 4657801, 4802498, 4908142, 1044760, -4514050, -5836411, -1691589, 3704040, 6714942, 6366706, 2376845, -3736654, -7127633, -4367327, 1336758, 4174768, 3305736, 1548404, -1228081, -7001329, -13085487, -13921942, -9889939, -7538292, -9448111, -10291272, -5771014, 196401, 1303627, -2151101, -4536060, -2939071, 65940, 942474, -625033, -2422882]
10937b422882m63977R6149j042219k041253q10971J607562K378399J498213J783876
10928E82897L630186L870365J395529o13524n20930j434529m916557o408833k193684
10919f609080L167635K868877j410734k052512K402752N268799K535662j406899
10911D764500j309846J462915K444505P89531j213409k442393l265682l415607
10903b185486k445803j051706J94825J928211L792788L115615j317387n561615
10895c530558m255986J978445O350232M157899j628140m768891l349342m14247
10887e460588J385129K356746L015202K164806o75363l196188k785314N3541K529902
10878f12127K896464J377998j085488l079257k795702k30504J657792O84907p36784
$$ y = [-2422882, -2886859, -2790710, -3832929, -5874182, -6685153, -5077591, -2699192, -1200979, 582897, 4213083, 8083448, 9478977, 8865453, 8344523, 6909994, 1993437, -4415396, -6609080, -3441445, -572568, -1983302, -4035814, -1633062, 3635737, 6171399, 4764500, 3454654, 4917569, 7362074, 8151605, 6938196, 4495803, 1230121, -2185486, -4631289, -5682995, -5488170, -3559959, 232829, 3348444, 2031057, -3530558, -7786544, -5808099, 542133, 4700032, 3071892, -1696999, -5046341, -5460588, -4075459, -1718713, 1296489, 3461295, 2785932, -410256, -3195570, -3142029, -612127, 2284337, 3662335, 2576847, -502410, -3298112, -3528616, -1870824, -1185917, -1922701]
10869a922701Q77692L598620K188336k831812m317709O64376N227400K736105
10861F220307k721228k755408K049248L640567q6781k471858J06132K399203j79720
10852F200462l817611l219410j39589Q55811J88592N90550Q49138j050840k130998
10843a673895Q96480M067075J327725m807327o411741k714430j71107l66107J690024
10834h163303N919088N094665j988112o137427k010388L312532K565813n18713
10826a925845q0662J025580j497418l675517j140099J055152k150156m162092
10818a2551057K322632R568734N539360m657405n576639K827064N254779k538687
10810A88781p091510j174768M773187K566477k11708L335783N600068n64496o992074
$$ y = [-1922701, -1045009, 2553611, 4741947, 1910135, -2407574, -1743198, 3484202, 6220307, 3499079, 743671, 2792919, 6433486, 6346705, 3874847, 3980979, 6380182, 6200462, 2382851, -836559, -976148, -120337, 68255, 658805, 1507943, 457103, -1673895, -777415, 3289660, 4617385, -189942, -6601683, -9316113, -9487220, -9853327, -8163303, -2244215, 2850450, 862338, -5275089, -7285477, -3972945, -1407132, -1925845, -2006507, -980927, -2478345, -6153862, -7293961, -6238809, -8388965, -12551057, -10228425, -659691, 4879669, 222264, -5354375, -2527311, 2727468, 188781, -6902729, -8077497, -3304310, -737833, -949541, 2386242, 7986310, 7421814, 429740]
10801D29740m192761J533473j68185m685491j250053O559439O051465k953424
10793A324203q068487m415161K87256R30926J393949L783898L720197k48291k677713
10784c969223l55626K776932K877817J276254j41839k013159l760758k878055
10776f187657J1836Q78074j288273k897180j833631n2815R11312J980671L036977
10767e440686K292559K64391k31494R05430N16926k175287l595778j062115L246247
10758e279807N006609K365575k613999n593609l711914Q89879K941697Q19677
10750e175892j409574n21741J309227J294245P60089J264232P54288j756642k502159
10741e983927P80879L781107K568176M91332J639180K807965l57125m286610l126893
$$ y = [429740, -3763021, -2229548, -2397733, -7083224, -8333277, -1773838, 4277627, 1324203, -6744284, -11159445, -10872189, -9941263, -8547314, -4763416, -1043219, -1291510, -3969223, -4324849, -1547917, 1329900, 2606154, 2464315, 451156, -3309602, -6187657, -6175821, -5297747, -6586020, -9483200, -11316831, -11369646, -10458334, -8477663, -5440686, -3148127, -2883736, -3115230, -2209800, -1692874, -3868161, -7463939, -8526054, -5279807, -273198, 2092377, -521622, -6115231, -9827145, -8937266, -5995569, -5175892, -6585466, -7107207, -5797980, -4503735, -3743646, -2479414, -1725126, -3481768, -5983927, -5203048, -1421941, 1146235, 1637567, 3276747, 6084712, 5727587, 1440977, -1685916]
10732a685916R59896K019374O35819P72398N94382l261540o180053j766714N316497
10723b595857M763557k767387o550584k638275K078426K704849J609510K30452
10715c165309l123465o212198m192607J103350L228784K263766L284245M856493
10707a956941J506837l175973k49145P266351O437359l757873q964598k481034
10699e375017M491385K511904j769977l2848L052582L91829m073996l763569j561269
10690f128976k560749l234134J271457O309679M877900l59644k084093k01689
10682b110249M68350k85059M14209J494709M57542n93240J356868L877338K948901
10673H029369j32202j617707j734706k791268m091533l657030k031097n10924
$$ y = [-1685916, -726020, 1293354, 1929173, 2701571, 3295953, 34413, -6145640, -7912354, -2595857, 2167700, -599687, -7150271, -9788546, -7710120, -5005271, -3395761, -3165309, -6288774, -12500972, -16693579, -15590229, -12361445, -10097679, -6813434, -1956941, -450104, -3626077, -3875222, 3391129, 9828488, 6070615, -2893983, -5375017, -883632, 1628272, -141705, -174553, 2878029, 3269858, -804138, -4567707, -6128976, -8689725, -11923859, -10652402, -4342723, 535177, 175533, -1908560, -2110249, -1641899, -1926958, -1512749, -18040, 439502, -153738, 1203130, 5080468, 8029369, 7897167, 6279460, 4544754, 1753486, -2338047, -5995077, -8026174, -8537098]
10665h537098J076904K005024L53138k484482k186067J279172K740622M27518
10657e325269j185874M16154K022203J763830K137660L204397J244451k810670
10649A466882k814488J414242K409074j591305k733680J967152M141046j107466
10641C151457n678642k322572K948415J987525j784421j177354J863469J662190
10633F50067l14514m0052M34886j651177k565948P00243L093212L97206k030920
10624a326997J085006M298422Q05649m914026m861688j268911j217401l438619
10616a0838565k057715J499659J725497p5723J058167L504609K264943j140353
10608d059481j705766l18606q52594j634653J046542M528811L711752M624j717647
$$ y = [-8537098, -7460194, -5455170, -5102032, -7586514, -9772581, -8493409, -5752787, -5325269, -6511143, -6094989, -4072786, -2308956, -171296, 3033101, 4277552, 1466882, -1347606, 66636, 2475710, 884405, -1849275, 117877, 4258923, 3151457, -2527185, -4849757, -1901342, 86183, -1698238, -2875592, -1012123, 650067, 335553, 295501, 730387, -920790, -3486738, -2786495, 306717, 703923, -1326997, -241991, 4056431, 4862080, -51946, -4913634, -6182545, -7399946, -10838565, -12896280, -11396621, -9671124, -9746847, -8688680, -5184071, -2919128, -4059481, -5765247, -6083853, -6936447, -8571100, -7524558, -2995747, 716005, 720629, -997018]
10599i97018j370067j444425r80443J024032J199129k115907m026507j282596
10591i993802J194355q23849k865797m30313K255755O39415j175897J131522L088456
10582f980155L41735k077986O08449K959096m69010m033166j234457L171283K714747
10573d999464J212438L262217L127890l652261q165380k322143N104349K497158
10565c935196m371211l226102K679418J886704l455393k281091M357471N602782
10557b742618L11915k889599j725274q38653r0310L149707M684010K43178m339883
10548d237527k891872r18464m285896n997582M78151O094864J607814m062255
10540a4212767J98217O160057J842263m415867Q29411R285559N196082m894540
$$ y = [-997018, -2367085, -3811510, -4791953, -3767921, -2568792, -4684699, -8711206, -9993802, -8799447, -9623296, -12489093, -12919406, -10663651, -10024236, -11200133, -10068611, -6980155, -6638420, -8716406, -8107957, -5148861, -5617871, -9651037, -10885494, -7714211, -4999464, -3787026, -524809, 2603081, -1049180, -9214560, -11536703, -6432354, -3935196, -8306407, -11532509, -8853091, -6966387, -10421780, -12702871, -8345400, -2742618, -2430703, -5320302, -7045576, -7884229, -7974539, -4824832, -140822, 102356, -4237527, -7129399, -8047863, -12333759, -18331341, -17853190, -11758326, -10150512, -14212767, -14014550, -7854493, -6012230, -10428097, -9598686, -313127, 4882955, -11585]
10532a1585m157349L066965P78980p015995m506170M071005K110656o591393m686257
10523a6941143N002019N000990k971376k623471L839186J087945o482239k471124
10515a6559213O812231K310283r256946o068240N988479L347713q742587n469045
10507b7637325P627821L694125j1262297p365910R260355M749617j5577444j3246424
10499d9757482Q765387Q359106j3778626j3018859R352949L607087k5704098j7134515
10491h9309051J9987247l122859q0854695o5851843J03593111K51496584J83799687
10484C19738181k5904938j35481733p0439005J5038653L440594l9904872k5803764
10477D0683116J2107249P924024j6272563r392270J0959417K730491j7885981
$$ y = [-11585, -4168934, -1101969, -322989, -7338984, -11845154, -7774149, -5663493, -12254886, -16941143, -11939124, -6938134, -9909510, -12532981, -8693795, -7605850, -14088089, -16559213, -9746982, -7436699, -16693645, -22761885, -16773406, -13425693, -22168280, -27637325, -20009504, -16315379, -27577676, -34943586, -25683231, -20933614, -36511058, -49757482, -40992095, -32632989, -46411615, -59430474, -50077525, -46470438, -72174536, -89309051, -69321804, -72444663, -153299358, -219151201, -115558090, 135938494, 319738181, 293833243, 158351510, 87912505, 102951158, 106391752, 66486880, 40683116, 52790365, 60714389, 44441826, 35049556, 46008973, 48739464, 30853483]
10470C0853483j2373304O740370M605672j0067130p240412O253001M576211o183520
10462A7164371l767437N521427K450752m960666J201152J0073768J374820j3465214
10454A5592973r499717O529689Q183964m490834q401927O28766M909323m72941
10446A2979296k564190J722628J624424m192714n451694r60850M62637j507685
10438B111852O51444N233120L791871j684990j960023J889639J204770l049944
10430H187739k544822J917054K384298n41247L13084L598914J684925m061711
10422A0938234m948616m72375J566526o73713j451098Q40076K015745J342277
10414I157056J970459L235017J803044j215831k546989l226959m938679m101779
$$ y = [30853483, 18480179, 25220549, 29826221, 19759091, 12518679, 18771680, 23347891, 17164371, 13396934, 18918361, 21369113, 16408447, 17609599, 27683367, 29058187, 15592973, 6093256, 12622945, 20806909, 16316075, 7914148, 8542914, 13452237, 12979296, 10415106, 12137734, 13762158, 9569444, 4117750, 3156900, 3619537, 2111852, 2763296, 7996416, 11788287, 10103297, 8143274, 10032913, 11237683, 8187739, 5642917, 7559971, 9944269, 9403022, 9716106, 13315020, 14999945, 10938234, 5989618, 5517243, 7083769, 6410056, 4958958, 5799034, 7814779, 9157056, 11127515, 14362532, 16165576, 14949745, 12402756, 9175797, 4237118, 135339]
10406A35339J851800O879576M148887k710383n111339k203385N00197R05114L91164
10397D786970j441893m035326k805901L285908O729346K209663l852937l299606
10389A576224Q47479J206337p94585N34054L160933J459296k231887j628462J624624
10380E754013J241547j755292j381420J640590J394799j915245k534249J41988
10372B586731J064103r20270j677412L99932K569949L106363K393876K79710k328605
10363G474377k153213R55143J499494l000571o296342l075366J837772J963179
10355g95527L62906K721310N374691J690964m291417l115573L916436O354455
10347A2218245J409200k884872j787712J19002j107818k649205j551821M74152
$$ y = [135339, 1987139, 8866715, 13015602, 10305219, 5193880, 2990495, 3490692, 4395806, 4786970, 3345077, -690249, -3496150, -210242, 6519104, 8728767, 4875830, 1576224, 2423703, 3630040, 2835455, 3369509, 6530442, 7989738, 5757851, 4129389, 5754013, 6995560, 5240268, 3858848, 5499438, 6894237, 4978992, 2444743, 2586731, 3650834, 2730564, 1053152, 1453084, 4023033, 7129396, 9523272, 9802982, 7474377, 5321164, 6276307, 7775801, 4775230, -1521112, -4596478, -2758706, -795527, -432621, 2288689, 7663380, 9354344, 5062927, 1947354, 5863790, 12218245, 13627445, 10742573, 8954861, 9073863, 7966045, 5316840, 3765019, 4239171]
10339D239171J507378K159524J984868q88047m897229n265728q18517L805097
10331A826517M147668Q34742k157703j681762J851852M276046J859334l076916
10323G879778m155453j76206K677905N88298k053534q11122J185350l83098k870446
10314A881472j679693J440617J975916K29094j154181k757389m999132m065663
10306i128959J706521O264606M191298j53354J79420L128980K021339k486192
10298E723659m180759k118782p02937j066946o04583P72000J235416J651482K954921
10289C663471K166592k269881n328557k801813R57211N83935n71021K574849O021519
10280D996305L721042j6791K375362O644245K670490p177257j0351626m149496
$$ y = [4239171, 5746549, 7906073, 9890941, 9002894, 4105665, -1160063, -1978580, 1826517, 5974185, 6808927, 4651224, 2969462, 4821314, 9097360, 10956694, 7879778, 3724325, 3548119, 6226024, 6814322, 4760788, 3949666, 5135016, 4751918, 1881472, 201779, 1642396, 3618312, 3847406, 2693225, -64164, -5063296, -9128959, -7422438, -1157832, 3033466, 2880112, 3059532, 6188512, 8209851, 5723659, 1542900, -575882, -1278819, -2345765, -2950348, -2178348, -942932, 708550, 3663471, 5830063, 3560182, -1768375, -4570188, -3612977, -3029042, -3600063, -1025214, 4996305, 8717347, 8700556, 11075918, 17720163, 20390653, 13213396, 2861770, -1287726]
10272a287726J222057N85909K05890L343240L497138k617380p443031m499869
10264f993772J707951M078824L117490K678467K464739Q08840n27024K08932P07661
10255H252108j484516m278574l861209J43345M496521N450449J586050m160535
10247F143639o065426k084570K901749L686296J761674J203997J096610j616496
10239G027473m794824m008962n65799Q87637P36281K525213M731761K954675j158828
10230H334627k029321j35991q70778m183560m674791j661894K29148L15892K065286
10221b611382M188782J845721k790537k006786M008918O153437J167999l406139
10213F550013k251999K16865n13499j653218q3913J792466J695799J320723J002898
$$ y = [-1287726, -65669, 520240, 726130, 4069370, 7566508, 4949128, -2493903, -6993772, -5285821, -1206997, 1910493, 4588960, 7053699, 7862539, 7335515, 7544447, 8252108, 6767592, 2489018, -1372191, -1228846, 3267675, 8718124, 10304174, 6143639, 78213, -2006357, 895392, 4581688, 6343362, 7547359, 8643969, 7027473, 2232649, -1776313, -2342112, -1454475, -718194, 1807019, 6538780, 9493455, 8334627, 6305306, 6169315, 5298537, 1114977, -3559814, -5221708, -4992560, -4676668, -2611382, 1577400, 3423121, 632584, -1374202, 2634716, 8788153, 9956152, 6550013, 4298014, 4514879, 4001380, 2348162, 2264249, 4056715, 5752514, 7073237, 8076135]
10204H076135j601938m539124k009194M866558P069084J547291l487442j998367
10196G923003Q54876q08322l456609j927729P79443l22364k777170j565786J716705
10187D16047K132409k45204j888423k094725j935024m95751K606131M412560K904356
10178E812376N57432j81218p49796k177607j895587J047688K656278L79670k028784
10169C420452o46440K295977K745557R08310j268428l862502n990933m313180
10161f711187Q78889L510742O58491j994553P36185M667200L198303j830381l701701
10152e88012j497664L09226K73078P34680J853097J513665K77100P07955K374995
10143E958120K343909P5818k127339k716571j747749L31915J900869M58157l315573
$$ y = [8076135, 6474197, 1935073, -74121, 4792437, 11861521, 13408812, 9921370, 7923003, 8777879, 7969557, 4512948, 2585219, 3364662, 3042298, 265128, -1300658, 416047, 2548456, 2303252, 414829, -1679896, -3614920, -4110671, -1504540, 2908020, 5812376, 6369808, 6188590, 5438794, 3261187, 1365600, 2413288, 5069566, 5449236, 3420452, 2774012, 5069989, 7815546, 8723856, 7455428, 3592926, -2398007, -6711187, -5832298, -2321556, -1663065, -3657618, -2921433, 1745767, 4944070, 3113689, -588012, -2085676, -1776450, -1503372, -768692, 1084405, 2598070, 2875170, 3583125, 5958120, 8302029, 8377847, 6250508, 3533937, 1786188, 2118103, 4018972, 4477129, 1161556]
10134A161556m633746j125781K838392K305346q29849j169979J798363L578512
10126C922814J639555j787870l371734k044353P17379K023361K07582k507433
10118a200699k261271O45371J718360o12605k243086q1878L018762L135692R74731
10109C093377o57747j327234j597726p20018J179164J949164J018280N08030Q44390
10100D289680j09277j745236m76742K771379J905487l844409o486682j547517
10092e243317L972487K726952j256115m07861L197596K392883j883178k416951
10084A082496J725821M428507L157459J233275L1387k314228m335631j964008
10076C045078L092059L804876j229391m613601j110128M259273L332826l790044
$$ y = [1161556, -3472190, -4597971, -1759579, 545767, -284082, -1454061, 344302, 3922814, 5562369, 3774499, 402765, -1641588, -924209, 1099152, 1306734, -1200699, -3461970, -2816599, -1098239, -1710844, -3953930, -4035808, -1017046, 2118646, 3093377, 2435630, 1108396, -489330, -1209348, -30184, 1918980, 2937260, 3445290, 4289680, 4180403, 2435167, 1958425, 4729804, 6635291, 2790882, -3695800, -5243317, -1270830, 1456122, 200007, -207854, 2989742, 5382625, 3499447, 1082496, 2808317, 7236824, 10394283, 11627558, 11658945, 9344717, 5009086, 3045078, 6137137, 9942013, 8712622, 4099021, 2988893, 7248166, 10580992, 6790948]
10068F790948q866627n897832J689882N231610J401077l554142k241797L373416
10060b073465N093168J456411j03289L769691N956690Q55430n283782l984341
10052E686513J782179K842321j672849m772850l727449k163116j666927m15978
10044d108156O90942q90813k838132q61749K683944J831989j976279j464356L571260
10035c361350N097905M61843k917656k0279L887601K824488l68835q7945K488643
10026H004415K227613j534704m891469n174716k729816J039262M197189M647335
10018E785109K335089m70486k256579l470198m052260k778087k5669J786818J599848
10009a546415Q69925O33969J69329q27742j345446p73795N92641K351356L282146
$$ y = [6790948, -2075679, -7973511, -6283629, -1052019, 349058, -3205084, -5446881, -2073465, 3019703, 4476114, 4372825, 8142516, 14099206, 14954636, 9670854, 5686513, 7468692, 10311013, 8638164, 3865314, 137865, -2025251, -3692178, -4108156, -3417214, -4308027, -7146159, -8007908, -5323964, -3491975, -5468254, -6932610, -3361350, 1736555, 2198398, -719258, -739537, 3148064, 5972552, 5603717, 5515772, 8004415, 10232028, 8697324, 3805855, -1368861, -4098677, -3059415, 1137774, 5785109, 8120198, 7649712, 5393133, 1922935, -2129325, -4907412, -4933081, -3146263, -1546415, -676490, -42521, 126808, -700934, -2046380, -2820175, -2227534, 123822, 3405968]
10000C405968J508305j931850k357623J768998M568286P75553n119346m938544
9992b320253L86446K602294m45050k546191o00443J271608P33472Q52717K102860
9983B037460K12497m391759m446537K032895O589213L173128k437601k932019
9975a62723r42929j975086l266359L79169N149528L386479l050363n170861j168975
9966f822120J800378K86075p26799K188256M648447K044039k798226l902223k70444
9957c552617L980957N257387L390874L45305j809961k129741j096271K83655J459173
9948F128761K110409J863269R38399K25j223206l537848n884316n679913k624296
9939g908516N00510K076424L383264M401922K161176l526071o875246l337730
$$ y = [3405968, 4914273, 2982423, 624800, 2393798, 6962084, 7737637, 2618291, -2320253, -1933807, 668487, 223437, -2322754, -2923197, -1651589, -918117, -65400, 2037460, 2249957, -2141802, -6588339, -4555444, 2033769, 5206897, 2769296, -162723, -1105652, -3080738, -6347097, -5967928, -818400, 2568079, -482284, -5653145, -6822120, -5021742, -4735667, -5462466, -3274210, 1374237, 3418276, 620050, -3282173, -3552617, 428340, 5685727, 9076601, 9421906, 7611945, 5482204, 4385933, 4669588, 6128761, 8239170, 10102439, 11040838, 11041063, 9817857, 6280009, 395693, -5284220, -7908516, -7408006, -5331582, -1948318, 2453604, 4614780, 1088709, -5786537, -9124267]
9931i124267L189870N511756K968162N58012K18289o64953k704007k909002m20604
9922c376744J697019J675006J212624J142738k74906k936631l355793o9579L215821
9913a070445K675732m64415k487500k287337j160957L41516K403592M003083L551724
9904E504993J085877j693287l144964k710354j072556K09473K74042K36600J393252
9895H3076K443550R74731k222408l527435k011343j051673k688658l876854j140682
9886a3017696L875850O778812O212429L958935J061416k487649n304067n500197
9878d422167l609430j692033k50800J058411R30506j499183k979659P09885P751565
9869d002905J1216711Q055907K618381k92313j189970k464077l786128m200487
$$ y = [-9124267, -5934397, -422641, 2545521, 3103533, 3321822, 2656869, -47138, -2956140, -3376744, -1679725, -4719, 1207905, 2350643, 2075737, -860894, -4216687, -4286266, -1070445, 1605287, 1140872, -1346628, -3633965, -4794922, -4453406, -2049814, 1953269, 5504993, 6590870, 4897583, 1752619, -957735, -2030291, -1820818, -1546776, -1310176, 83076, 2526626, 3501357, 1278949, -2248486, -4259829, -5311502, -8000160, -11877014, -13017696, -9141846, -2363034, 3849395, 7808330, 8869746, 6382097, 1078030, -4422167, -8031597, -9723630, -9974430, -8916019, -7985513, -9484696, -12464355, -11754470, -4002905, 7213806, 15269713, 17888094, 17595781, 16405811, 13941734, 10155606, 5955119]
9861E955119m798336n626675l648022J956620N919498L510464j641130k199310
9853e71772K059253M337392J285742k883221l586431j544386L63097J147639Q24608
9844A431921m04935n78365K352262N957105M939224j006855n647182m678294r91652
9835A373229J035136J396001J279019o95002m467548n445945r13496M204911L856971
9826A623276M5431p88668J910031L013622Q74063q53331m48750l51748j259637
9817C764289l72642K728635M110986J651422j664169k855626k858938k985428
9809A518529j952015N97343J614248p84104l390847k187316J729089L894626K514748
9800C554301k52360j782015j169164R66969K641216J575681j933845m509018l880157
$$ y = [5955119, 1156783, -4469892, -8117914, -6161294, -241796, 3268668, 1627538, -571772, 1487481, 5824873, 7110615, 4227394, 640963, -903423, -540326, 607313, 1431921, 1026986, 448621, 2800883, 8757988, 13697212, 12690357, 7043175, 2364881, 1373229, 2408365, 3804366, 5083385, 4388383, -79165, -5525110, -6438606, -2233695, 1623276, 1668707, 880039, 2790070, 5803692, 6677755, 5824424, 5375674, 5023926, 3764289, 3391647, 6120282, 10231268, 11882690, 10218521, 7362895, 4503957, 1518529, -433486, 163857, 1778105, 994001, -2396846, -4584162, -2855073, 1039553, 3554301, 3301941, 1519926, 350762, 1317731, 3958947, 5534628, 3600783, -908235, -4788392]
9791d788392j893721j133634n60495K225722N814886O182679K878694j42835p33576
9782G849328j394727l783272m447748j40660N303167M936985r59930m446474j367562
9773A549107K670523J475142k003372j276992K212307J491296l321333m048936
9765a252258K061287O734169K988053m333526o361950k736773M63267Q70977O19650
9756i47104J36714j462263j849997J491635N216662M088313k30211j580853M96595
9747E359491Q58519j260269r84202K384160L026852j232841m534377k541684P79877
9738A855526M29224j875897k157498j045468j026986j206102J63716J488497P84725
9729b590263k94258M91675J880046J837808J318039J654767J400069n24357j721303
$$ y = [-4788392, -6682113, -7815747, -8376242, -6150520, -335634, 5847045, 8725739, 8582904, 7849328, 6454601, 2671329, -1776419, -1917079, 3386088, 8323073, 7363143, 2916669, 1549107, 4219630, 5694772, 3691400, 2414408, 4626715, 6118011, 2796678, -1252258, 809029, 7543198, 10531251, 6197725, -164225, -2900998, -2437731, -1566754, -947104, -810390, -2272653, -4122650, -2631015, 2585647, 6673960, 6443749, 4862896, 5359491, 6218010, 4957741, 3973539, 6357699, 9384551, 8151710, 3617333, 1075649, 1855526, 2284750, 408853, -1748645, -2794113, -3821099, -5027201, -4863485, -3374988, -2590263, -2884521, -2392846, -512800, 1325008, 2643047, 4297814, 5697883, 5173526, 3452223]
9720C452223k10846J648678J009094o72404n51942P84879J209976Q46957L97525
9711G914140j031514k802461j432179L243528M941603m79463p238447o934619
9703c819412n19214M021856L582527K018977J594715J10839l059425m865365l700925
9694d635427j368257O37434K056184J434358j916349m082495p28440N062899N720970
9685B180877M16830l551929j822723J639087K297009J246490O65893m61453k467028
9676A43053k712105r11178r74310l626024l436435J844313N479571J933352l026725
9667e286488r09639N297278N668808j44773k254940K750317N779154K44565o798764
9658D345518n764122N50663K240284j859007l612810K26388L209662O93327k472360
$$ y = [3452223, 3241377, 4890055, 5899149, 5226745, 4674803, 5459682, 6669658, 7516615, 7914140, 6882626, 4080165, 2647986, 5891514, 10833117, 10353654, 3115207, -3819412, -4338626, -316770, 3265757, 5284734, 6879449, 6990288, 3930863, -934502, -4635427, -6003684, -5366250, -3310066, -1875708, -3792057, -7874552, -8602992, -3540093, 2180877, 2597707, -954222, -2776945, -1137858, 1159151, 2405641, 3071534, 2610081, 143053, -2569052, -3480230, -4454540, -8080564, -11516999, -9672686, -4193115, -2259763, -5286488, -6196127, -898849, 4769959, 4625186, 2370246, 5120563, 10899717, 11144282, 4345518, -1418604, -867941, 1372343, -486664, -4099474, -3873086, -663424, 29903, -2442457]
9649b442457l98090M211986M893507J474319j232813j975713l389340n099899
9641c958500l696967P7077J117738j340810j482180L590332Q204116O286499J59691
9632H956996l760694l873767k665145p33938K355118L896266J172072k820378
9624B526530l029514n31976n12665k869598k243688K060541L973200P25181k307398
9615b209387n48149K444777J555736j205316n61909K967049M100496J259302j651914
9606F150685j638129j18489M30941l16929j468114k285635j930814k6983J929349
9597G25882J632890r26850l054186k735570j029396j50074k99047J65485J711987
9588c958879K450309Q69215j411642j500467M50210J236266m01195j541190L29761
$$ y = [-2442457, -2840547, 1371439, 6264946, 7739265, 6506452, 4530739, 1141399, -3958500, -7655467, -7578390, -6460652, -7801462, -9283642, -5693310, 2510806, 8797305, 8956996, 5196302, 1322535, -1342610, -2076548, 278570, 4174836, 5346908, 2526530, -502984, -1034960, -1547625, -4417223, -6660911, -4600370, -627170, 98011, -2209387, -2757536, -312759, 1242977, 37661, -524248, 2442801, 6543297, 7802599, 6150685, 4512556, 4394067, 4825008, 4508079, 3039965, 754330, -1176484, -1203467, 725882, 2358772, 1431922, -1622264, -4357834, -5387230, -5537304, -5836351, -5670866, -3958879, -1508570, -639355, -2050997, -3551464, -3101254, -1864988, -2266183, -3807373, -3477612]
9579c477612L132414L402261J476908L9982o30445j861861k553058p47845J668128
9570D48872J146528j063744n61908J956700J014576l645513m937320L65046N606900
9561C30137M433663M37574K41019K474133J379825k419497l136500M0998J983528
9552E764880L74981j661587j926316j666478j144154J189231L997450L225504
9544H153511j434918n065009l991715L32619M546604O154298L113073l988714
9536G819749r063828n986162K118475N605091J774367j792635J41730K805083
9528C421870R73852j877680p40147J446692l42269l227918j490281K194996O08679
9519I67794m843278n210210J508957O891526N157534O84821q50272o75233j718714
$$ y = [-3477612, -345198, 3057063, 4533971, 4573953, 3943508, 2081647, -471411, -1219256, 448872, 1595400, 531656, -30252, 1926448, 2941024, -704489, -5641809, -5276763, 330137, 4763800, 5201374, 5442393, 7916526, 9296351, 6876854, 3740354, 3781352, 5764880, 6139861, 4478274, 2551958, 885480, -258674, 930557, 4928007, 8153511, 6718593, 1653584, -2338131, -2005512, 2541092, 8695390, 11808463, 7819749, -1244079, -7230241, -5111766, 493325, 2267692, 475057, 616787, 3421870, 4395722, 2518042, 1777895, 3224587, 2882318, -345600, -1835881, 359115, 967794, -3875484, -9085694, -7576737, -685211, 4472323, 5157144, 4306872, 3631639, 1912925]
9510A912925k180661J96249K756763K322042P09869P42242P20519j711333l818017
9501A650598j907635J593339J587639j083779j132896J977516L115034J15755
9493E915571l029032k942976j129481K91042J784662L159389K210716o86423j488001
9484D085467Q28336J345201k888401o651981l760158L022264N664586K434828
9476D080142q87481o21851P52918P53481N89033Q78061l52624k684898j882890
9467F23891K950000N878562K392932l217602m190883j340421l44472j653175p26160
9458C72672K482329K457976k024802m642860j337698L231634L412193J018528
9450D969972O89152J562907P8341k290388j301461J753643J320139k997406n215101
$$ y = [1912925, -267736, -71487, 2685276, 5007318, 5717187, 6459429, 7179948, 5468615, 1650598, -257037, 1336302, 2923941, 1840162, 707266, 2684782, 5799816, 5915571, 2886539, -56437, -1185918, -894876, 889786, 4049175, 6259891, 5573468, 4085467, 4913803, 6259004, 3370603, -3281378, -7041536, -4019272, 1645314, 4080142, 3192661, 2570810, 3323728, 4077209, 4666242, 5544303, 5191679, 2506781, 623891, 3573891, 9452453, 11845385, 8627783, 4436900, 3096479, 2752007, 1098832, 372672, 2855001, 5312977, 3288175, -1354685, -2692383, 539251, 3951444, 4969972, 5659124, 7222031, 7300372, 5009984, 3708523, 5462166, 6782305, 3784899, -1430202]
9441a430202k256961J816866K707242J271058k97075k172286l791659k263305
9433f416322K297175M500024J207709k753246j457762L026269M192884J198644
9425E795375r67627k16570J94964j777578l742257l461352j953897o09024P60848
9416e977118J738792J031122m04002J67342K286317J887376k182853n197063k886287
9407i536374K428976N142749L530619P14492K3194J796703L773461L172494m16708
9398A0629606l635281k953686M5468L69921k585199l538160R5136L152957N39552
9389B120314m130696l509114K388302O332724M291835k35168k619549k491540
9381B147108j519729l81673K63645o17978k104798j571333J226094L095324J904950
$$ y = [-1430202, -3687163, -1870297, 836945, 2108003, 1810928, -361358, -4153017, -6416322, -4119147, 380877, 1588586, -1164660, -2622422, 403847, 4596731, 5795375, 4827748, 4611178, 4806142, 3028564, -713693, -4175045, -6128942, -6737966, -5977118, -4238326, -3207204, -3611206, -3443864, -1157547, 729829, -1453024, -6650087, -9536374, -7107398, -1964649, 1565970, 2280462, 2303656, 4100359, 7873820, 11046314, 10629606, 6994325, 4040639, 4086107, 4456028, 1870829, -1667331, -1572195, 1580762, 2120314, -2010382, -5519496, -3131194, 3201530, 7493365, 7258197, 4638648, 2147108, 627379, 245706, 509351, -108627, -2213425, -3784758, -2558664, 536660, 2441610]
9372B441610m78550j241664j77101J284285K219739J854381n73391l802399m633725
9363c106815k066890O46955L67314j297076m59604L052754N205735L239565q89014
9354D692924l286750k635531q55034j00972k77204J58074J463444J845871J35295
9345A140117j844808j388675R68448J799255k32982k240752j361817J112286K035264
9336a3664J153111Q23961J827745K349408J265288p8138j44539N63500M68350
9327H215022j074316l274670m407830k791547J224426M229629K882515j352634
9319C650595l141606l13026K766527J279713l060054m732410k452663M9434P69391
9310e184099J722757L507132L004321p25966l131977r02219J989334K03365m011715
$$ y = [2441610, 1963060, 721396, 544295, 1828580, 4048319, 5902700, 5329309, 1526910, -3106815, -5173705, -4526750, -4159436, -5456512, -5916116, -2863362, 2342373, 5581938, 4692924, 1406174, -1229357, -2084391, -2185363, -2462567, -2304493, -841049, 1004822, 1140117, -704691, -2093366, -1124918, 674337, 441355, -1799397, -3161214, -2048928, -13664, 1139447, 1963408, 3791153, 6140561, 7405849, 7327711, 7183172, 7746672, 8215022, 7140706, 3866036, -541794, -3333341, -2108915, 2120714, 5003229, 3650595, 508989, 195963, 2962490, 4242203, 1182149, -3550261, -6002924, -5953490, -5184099, -3461342, 45790, 3050111, 2324145, -807832, -1710051, 279283, 482648, -3529067]
9301c529067m028682O16710L730610K487263J034503K495741L835544J743863
9293H386485j685437k807604j748218m20081R06132J706270o1763l571007l674561
9284b969784J610787O207384M036850j571915k942450K30028J580941q48301k110922
9275C222618M94670L071546J996309q50247k314427k511112k469963j430255P62927
9266b7934J930787P51664r64511j093719O7471J128540J259774j25062k592745
9257C34265l432081n89445L099609K800184r33186k526996J08468K873676K698380
9248D432874J660959J629579O90709j934678l055819j260234n4830j310325j256189
9239d57954K301660M636988J785366k005655j369132P56768j168277m470043k448299
$$ y = [-3529067, -7557749, -6941039, -3210429, -723166, 311337, 2807078, 6642622, 8386485, 6701048, 3893444, 2145226, 1725145, 2631277, 4337547, 4275784, 704777, -2969784, -1358997, 4848387, 8885237, 7313322, 4370872, 4600900, 6181841, 5333540, 3222618, 3717288, 6788834, 8785143, 7934896, 5620469, 3109357, 639394, -790861, -27934, 1902853, 2654517, 1690006, 596287, 663758, 1792298, 3052072, 2927010, 334265, -3097816, -3687261, -587652, 2212532, 1279346, -1247650, -1139182, 1734494, 4432874, 6093833, 7723412, 8414121, 6479443, 3423624, 2163390, 2108560, 798235, -457954, 1843706, 6480694, 8266060, 6260405, 4891273, 5648041, 4479764, 9721, -2438578]
9230b438578L372670N101578J543679n29839J382325J789374k220902n717174
9222B283133m544210j373066N70024K596926N210248M540246p47883m901374l106412
9213E27632Q45856Q24852j928379j863457J147647K092378m13470k113173k80085
9204a160199K247204J583447k002960m720181l343687J577432N540869M111401
9196C833326j595189n270070l111113J183455J909566n59162j226139J432676
9188c402650L560308K261387m02781j139859q6294J19251j691270l672694l060352
9179g514954M73067L634665K807895j103104l242606j353828J118740P45247m49609
9170d884487P75830K275114k5371l696873j914622N388701R509333M819404l286833
$$ y = [-2438578, 934092, 6035670, 7579349, 7049510, 8431835, 10221209, 8000307, 2283133, -2261077, -3634143, -3064119, -467193, 4743055, 9283301, 8535418, 3634044, 527632, 1373488, 2198340, 269961, -1593496, -445849, 1646529, 1233059, -880114, -1160199, 1087005, 2670452, 667492, -4052689, -7396376, -5818944, -278075, 3833326, 2238137, -3031933, -6143046, -4959591, -3050025, -3609187, -4835326, -3402650, 157658, 2419045, 2016264, 876405, 790111, 909362, -781908, -4454602, -7514954, -7041887, -3407222, -599327, -1702431, -4945037, -6298865, -5180125, -4434878, -4884487, -4108657, -1833543, -1858914, -5555787, -7470409, -2081708, 7427625, 12247029, 8960196]
9161H960196o122057k650895J642874L027840J887775m12130k224218j130923
9153B978462K755868M735892J276795l883972m461056r95982N00446j298316j279914
9144C28223K435842M320190M85120m241193l444059J119463K719752k02521k987221
9135E33596k443758j40037J500689J588483m93745m180940n735762j898565M343027
9126f927012O526448L602549O95925L13017p64038l712453l845410J155620N471734
9117B516380L503720j056211j300142J848192K416730K06581J5539J478269o97685
9108H931373n745278n960437L08968M151962m13891o645671n560638L93387K364364
9099h175861p15064j981928J272218M084590K750010p1689q23263J36131J183231
$$ y = [8960196, 2838139, 187244, 1830118, 4857958, 6745733, 6333603, 4109385, 2978462, 5734330, 10470222, 11747017, 7863045, 3401989, 2406007, 2906453, 1608137, 328223, 2764065, 7084255, 7569375, 3328182, -115877, 1003586, 3723338, 3520817, 533596, -1910162, -2050199, -549510, 1038973, 545228, -3635712, -9371474, -11270039, -6927012, -400564, 3201985, 3897910, 4210927, 3446889, -265564, -4110974, -2955354, 2516380, 6020100, 4963889, 3663747, 5511939, 7928669, 8135250, 8150789, 9629058, 8931373, 3186095, -2774342, -2465374, 1686588, 1272697, -5372974, -10933612, -10540225, -8175861, -8890925, -10872853, -9600635, -5516045, -2766035, -2837724, -3660987, -3524856, -2341625]
9090b341625K288013L160508K217082o78756l222385l639574k152547Q60719M923684
9081A415119P266773M530831j990290o436299n442931j903156j6534j6430n8417
9072b651334j10858r91274j822548j323448o8915P63401J286161J624814O86841
9063b607160j651228l020730j530878J412392L400067M257639M670354L656441
9055H586897L92509l000398l616713j714331J79361R49342J027546K98684j040841
9046B062056r45428J579888L222786J69023n381638p014651k757501K450789L955380
9037b659296K794297K100059J950416N93621j769672l236913k844773j038762
9029d111023J266152K719139K051607j27931j423521o96508L70302j46227j654034
$$ y = [-2341625, -53612, 3106896, 5323978, 4645222, 1422837, -2216737, -4369284, -3508565, 1415119, 8681892, 13212723, 11222433, 4786134, -656797, -2559953, -2576487, -2592917, -2651334, -2762192, -3753466, -5576014, -6899462, -6968377, -6204976, -4918815, -3294001, -2607160, -4258388, -7279118, -8809996, -7397604, -3997537, 260102, 4930456, 8586897, 8979406, 5979008, 2362295, 647964, 827325, 1776667, 2804213, 3102897, 2062056, 1116628, 2696516, 5919302, 6088325, 706687, -6307964, -9065465, -6614676, -2659296, 135001, 2235060, 4185476, 4779097, 3009425, -227488, -3072261, -4111023, -2844871, -125732, 1925875, 1797944, 374423, -322085, 48217, -98010, -1752044]
9020a752044k028434k81537K525729M076986K424197j690749m411903k905000
9012d042755M01778Q06332j550544j783801J680086M191818K402503m08576m08485
9003A288356J19694k426597n343959l587607R40333J717922j300882j044086M602479
8994e034347Q086622L711777k816654k617338K975773M632311r52402o575937
8986A409805n206528Q76072M604483L570361R87025l84949q96487j137507m63649
8977C358626O71494K01301j985587k707545j79987K315114Q84781k470724k212784
8968b125311K250258N336788L555226M7194j335498j558477k424952j733709K294586
8959D306105N265959J847528n003100o917431j958909L159135L454799J427120
$$ y = [-1752044, -3780478, -4062015, -1536286, 2540700, 4964897, 3274148, -1137755, -4042755, -3640977, -2834645, -4385189, -6168990, -4488904, -297086, 2105417, 1696841, 1288356, 1408050, -1018547, -6362506, -9950113, -9009780, -7291858, -8592740, -9636826, -5034347, 3052275, 6764052, 3947398, 1330060, 4305833, 8938144, 7985742, 1409805, -3796723, -2920651, 1683832, 5254193, 6241218, 5856269, 4959782, 3822275, 3358626, 4030120, 4231421, 2245834, -461711, -641698, 1673416, 2558197, 87473, -2125311, 124947, 5461735, 9016961, 9064155, 7728657, 6170180, 3745228, 2011519, 4306105, 9572064, 11419592, 6416492, -500939, -2459848, 699287, 4154086, 5581206]
8951E581206M10567r63455l858989m678233o02892M462858M870284J244822j548281
8942D917887j996045k171043k207977l18380K288533K056978r18698k459768p91190
8933a599703R77300J74025j668778k057385r98287N91753K650276M146545K661340
8924D877086j710802m729248l132871O21392J622225j003473l710261l594444
8916a0760396j034808K161496M560856M989755K887277n54945k822059k155488
8908b728312R80090L964520L561809r04160n372026m589387P05269L331862p31444
8899a781779n683585l683604L237917N819378J586737j681021J268084M776302
8891C858429J892325l940557m304708P83008L307403J50867k668948j73696M200943
$$ y = [5581206, 5991773, 5028318, 1169329, -3508904, -4111796, 351062, 5221346, 6466168, 4917887, 2921842, 750799, -1457178, -1775558, 512975, 2569953, 1651255, -808513, -1599703, -622403, -448378, -2117156, -4174541, -5172828, -4581075, -1930799, 2215746, 4877086, 3166284, -1562964, -4695835, -4074443, -2452218, -3455691, -7165952, -10760396, -11795204, -9633708, -5072852, -83097, 2804180, 2249235, -572824, -2728312, -1748222, 2216298, 5778107, 4873947, -498079, -5087466, -4382197, -1050335, -1781779, -7465364, -11148968, -7911051, -2091673, -504936, -2185957, -917873, 3858429, 5750754, 1810197, -2494511, -1711503, 1595900, 1746767, -922181, -1095877, 3105066]
8882C105066M643326J128342k282793l561873l331038k041699j39897P39713k10076
8873a950929j172638l89749R59741R44107J71436K91795Q92875O62372R6106K19129
8863G24245K21392o03268l98903K104304L783986J066920l527428m151343o37671
8854a417766J215582p71317j752005J347890L883984J007313l767375l507589
8846c761283J579287M850526L225047L48537l61645r6060o06469o74448Q75799
8837E379291K219706J251519j291123l566024m955603m638645r74820M652533
8829a923166O499024J445690m834443m246428K019003M553836n21174n772623
8821b780281l820642J852287L268980M04480l29609K357748L023816l79094k849684
$$ y = [3105066, 7748392, 8876734, 6593941, 3032068, -298970, -2340669, -2480566, -1740853, -1950929, -3123567, -3513316, -2553575, -1609468, -1438032, -1146237, -253362, 409010, 505116, 724245, 945637, 342369, -56534, 2047770, 5831756, 6898676, 3371248, -780095, -1417766, -202184, -973501, -2725506, -1377616, 2506368, 3513681, -253694, -3761283, -2181996, 2668530, 5893577, 6242114, 5880469, 5784409, 5177940, 4503492, 5379291, 7598997, 8850516, 7559393, 3993369, -962234, -5600879, -6575699, -1923166, 4575858, 6021548, 1187105, -3059323, -1040320, 3513516, 2992342, -2780281, -6600923, -4748636, -1479656, -1075176, -1404785, 952963, 3976779, 3597685, 748001]
8812G48001j043315J475041J094021m0402O26011O71932j999184l508253m7864
8803b024012M350315L243561j720614l315911k64615J632734k63781k016536j247910
8794a626769j104128l288553l792759M18492N565513O204358K614371p97772j748825
8785B443928j402850j413872k158663k537372n87004L622146N849423K150150
8777E965886m434880o518436k446286J824877K230720J479270K017478J313847
8769A432476j733381k686476O61816K910163q2271l134846l25116L985205K106659
8760C134229l214236k739125L581920O072563Q61524m644888m173522j061876
8752b183411n52465j484233l88856J996098K885669J961764K89445j722381k896627
$$ y = [748001, -295314, 1179727, 2273748, 2233346, 2859357, 3531289, 1532105, -1976148, -2024012, 2326303, 5569864, 3849250, 533339, 268724, 1901458, 1637677, -378859, -1626769, -2730897, -6019450, -9812209, -9393717, -3828204, 2376154, 4990525, 4192753, 2443928, 1041078, -372794, -2531457, -5068829, -5655833, -2033687, 3815736, 5965886, 1531006, -4987430, -7433716, -5608839, -3378119, -1898849, 118629, 1432476, -300905, -2987381, -2325565, 584598, 502327, -2632519, -2957635, 1027570, 3134229, -80007, -2819132, 762788, 6835351, 7696875, 3051987, -1121535, -2183411, -2735876, -4220109, -4608965, -2612867, 272802, 2234566, 2524011, 801630, -2094997]
8743b094997j552868R30914Q30685j993747l186372n58883K835590L923087L144390
8734B277799J164629k629356o255772n365501j07873L565924K332014j72587l14520
8725e505243K30062l83184p3712J810291J487461j901193k633236J913338M919566
8716a35850R82973l590523q46388M545146K726048l870912l947221L093394N269770
8707D226437k101497q176110l605579N577502Q377107M224589j21763k234102
8699F166584m011015m620393j803952K154486K749419J67289j611397j073869
8691a882848L30019J999111L487907K106377l176931p129937l846506L738344
8683d374464O448492J459323m119031l851442j4164J932722J501674J472252J881630
$$ y = [-2094997, -3647865, -2716951, -1886266, -3880013, -7066385, -7625268, -4789678, -866591, 2277799, 3442428, 813072, -5442700, -10808201, -10916074, -7350150, -5018136, -5190723, -5505243, -5275181, -5658365, -5732077, -3921786, -2434325, -4335518, -6968754, -5055416, -135850, 847123, -2743400, -3589788, 955358, 3681406, -189506, -4136727, -1043333, 4226437, 2124940, -6051170, -9656749, -4079247, 4297860, 8522449, 8400686, 6166584, 2155569, -2464824, -4268776, -2114290, 635129, 802418, -808979, -1882848, -1552829, 446282, 3934189, 6040566, 2863635, -4266302, -8112808, -4374464, 2074028, 3533351, -585680, -4437122, -4451286, -2518564, -1016890, 455362, 2336992]
8674B336992P39276j216635j195949P75788J674261M06680n32036O63021K010595
8665E661993P57975k214608l171661l81604L435995M077612N85103l648585m499173
8656F03047j410790K260087L003581O76579j868835k006743L48652L155646M156578
8647H917802K519850n96464k930099l084968j702421l15880M98539Q61477J01708
8638D269544k357849m385354k301986L501147O814412K900163m154838n834203
8630a548964n49526M495563L838060N49234n26422q75888m178570p869944n987151
8621a2653608P47842M805936K590845j074697j099086J067847J698311P83729
8613c132881R6377n71033j344489j36442L329234M821721J463509k916065l306029
$$ y = [2336992, 3076268, 1859633, 663684, 1439472, 3113733, 3520413, 2988377, 3651398, 5661993, 6419968, 4205360, 1033699, 652095, 4088090, 8165702, 8750805, 5102220, 603047, -807743, 1452344, 4455925, 5132504, 3263669, 1256926, 1605578, 4761224, 8917802, 11437652, 10841188, 7911089, 4826121, 3123700, 2807820, 3306359, 4167836, 4269544, 1911695, -2473659, -4775645, -1274498, 5539914, 8440077, 4285239, -1548964, -2098490, 2397073, 6235133, 6784367, 6257945, 5382057, 1203487, -6666457, -12653608, -11905766, -7099830, -4508985, -5583682, -6682768, -5614921, -3916610, -3132881, -3036504, -3607537, -4952026, -5088468, -1759234, 3062487, 4525996, 1609931, -1696098]
8604a696098j314035j543921k920938q94490L216533L354443n24839j398874L005673
8595g16546N725909J854140l319440l045706L95337O87094j988799k840895j436105
8586d685011j125759j672764p4935K390608J518613j684024j745543J793035L203225
8577b082555L88945j671272R9383J812535K34279j497903n10986P998k475854
8568e695430l363723J558594P042772N346060j068302l094734M82329K003181
8560C210747j235344k516717J966833N846595K971616k634608l903659j924112
8552A781351k410747m940528l909033J346945N053659L924293J161374L62441
8544B369755Q42303P46375K69567k35020j558309l088939k440532L50169J639506
$$ y = [-1696098, -3010133, -4554054, -7474992, -8369482, -5152949, -1798506, -2323345, -3722219, -716546, 5009363, 6863503, 3544063, 498357, 893694, 1580788, -408011, -3248906, -4685011, -5810770, -7483534, -7558469, -5167861, -3649248, -5333272, -7078815, -5285780, -2082555, -1693610, -3364882, -3265499, -1452964, -1218685, -2716588, -3227574, -3219576, -5695430, -9059153, -7500559, -457787, 4888273, 3819971, 725237, 1207566, 3210747, 1975403, -541314, 1425519, 7272114, 10243730, 7609122, 3705463, 1781351, -629396, -5569924, -9478957, -8132012, -3078353, 845940, 2007314, 2369755, 3212058, 3958433, 4228000, 3992980, 2434671, -654268, -3094800, -2744631, -1105125]
8535a105125m09840k451368r85818K010733K146577n96025k116872m69276J845494
8526b131520J950564j19316k607497l896531k713364J040880M918656N582008
8518B023880K753442l20889j115250o07574r09117k122094k937889k732992j594608
8509g563091L83961K434259L077262K191144J710338K685091L251685J589585
8501I760234p61115j333366j073135k530127m382392k479237K679121M467119
8493D347102p86749p205761o496939N87993N344786L216780r27131j227895Q47936
8484b299878N73683j499161p66312K932672M096741J32616m065395l207456O46447
8475c456043J742148m94120j451216N82374J877873n1487k275332j616900J04390
$$ y = [-1105125, -1514965, -3966333, -4952151, -2941418, -794841, -1390866, -3507738, -3977014, -2131520, -180956, -300272, -2907769, -6804300, -9517664, -8476784, -3558128, 2023880, 4777322, 4456433, 3341183, 2733609, 1824492, -297602, -3235491, -5968483, -7563091, -7179130, -4744871, -1667609, 523535, 2233873, 4918964, 8170649, 9760234, 8999119, 7665753, 6592618, 4062491, -319901, -2799138, -120017, 4347102, 3560353, -3645408, -10142347, -9554354, -4209568, -992788, -1919919, -3147814, -2299878, -1726195, -3225356, -3991668, -1058996, 3037745, 3170361, -895034, -4102490, -3456043, -1713895, -2208015, -3659231, -3076857, -1198984, -1250471, -3525803, -5142703, -5038313]
8466e038313l01693j582103l34752K640815L128515L06951j797915m78749J989891
8457a467353K359110P40626j038435k631244m267055m646121k422574J203178
8449a2169868L630017M058653L711384L319221K323701O90162k00405O79738K207782
8440H250385K156507J11928j569120o85026J384000J043660k200066m236784k094505
8431B160979J169093P21365k478547k972474N38212L024756J081194j981422j930131
8422f66975j79738m59781k136059j741679O13530J352732m80359j733287k53911
8413e685527K251670L443149L313235K635888J002480j883105m534386m943210
8405d399806k944178m37603N62518p7988m77967R55511K982700K592349o11907
$$ y = [-5038313, -5340006, -6922109, -7256861, -4616046, -1487531, -1180580, -2978495, -3457244, -1467353, 891757, 1632383, 593948, -2037296, -6304351, -10950472, -13373046, -12169868, -8539851, -4481198, -769814, 2549407, 4873108, 5563270, 5362865, 6042603, 8250385, 10406892, 10518820, 8949700, 8264674, 9648674, 10692334, 8492268, 4255484, 2160979, 3330072, 4051437, 1572890, -1399584, -861372, 2163384, 3244578, 1263156, -666975, -846713, -1306494, -3442553, -5184232, -4570702, -3217970, -3698329, -5431616, -5685527, -3433857, 9292, 3322527, 5958415, 6960895, 5077790, 543404, -4399806, -7343984, -7781587, -7219069, -7297057, -7775024, -6819513, -3836813, -1244464, -1856371]
8396a856371k792070m67643M458897O561177L396374j863767m336443k424375
8388F75779J167732K364006j75340l289007k520468K243912N888984M101393j404290
8379I052701n486858n767984l912594k012446l95825J319950L036702L979360
8371a86994K891085m21541l230051k136787J594289K480949j070753l240334P09181
8362b610956O404065O331829P89713l553218l964684l455179l330731j543710
8354d932871J187587J082659j501791j627549J582144K900871J95990j464764
8346b577724J336654M105396J920517k490474l657400j756591m55834q7012J345544
8337b316924L097626K919416J282411p6237j535077l368265k999384Q59242M179072
$$ y = [-1856371, -4648441, -5116084, -657187, 5903990, 9300364, 7436597, 3100154, 675779, 1843511, 4207517, 4032177, 743170, -1777298, 466614, 6355598, 10456991, 9052701, 3565843, -2202141, -6114735, -8127181, -8523006, -7203056, -4166354, -186994, 2704091, 2282550, -947501, -3084288, -1489999, 990950, -79803, -3320137, -2610956, 3793109, 10124938, 10914651, 7361433, 3396749, -58430, -3389161, -4932871, -3745284, -2662625, -4164416, -5791965, -4209821, -1308950, -1112960, -2577724, -1241070, 2864326, 4784843, 2294369, -1363031, -3119622, -3575456, -3662468, -2316924, 780702, 3700118, 4982529, 4906292, 3371215, 2950, -2996434, -2137192, 2041880]
8328B041880K925325k70238m64546J115144k60013l383176k272785L060575N126854
8319G619020N35076m246648k744485J885587K504878r21326k346687O6858J406150
8310C758423j333355l897565j490371L076738L038794j892132m477885n93892
8302c811245M485955M008044m61577k518607j127297n59386j569392m75692K381029
8293C51832J554519l442057n033488P72134O799560N039994j297234l407405j54941
8284A182914K269116J139642m47532p79638j547754k767569k254623m65434j14374
8275c785252q63714Q0898K183401K158341L79959N70530K506680J487101l293554
8266A424390o008601k566513L349269N659269L312706m85252l063965l520295
$$ y = [2041880, 4967205, 4696967, 4232421, 5347565, 5087552, 1704376, -568409, 2492166, 7619020, 8154096, 3907448, 1162963, 3048550, 5553428, 4632102, 2285415, 2352273, 3758423, 2425068, -1472497, -2962868, 113870, 3152664, 1260532, -3217353, -3811245, 674710, 4682754, 4221177, 1702570, 575273, 15887, -1553505, -2029197, 351832, 1906351, -1535706, -6569194, -5797060, 1002500, 6042494, 4745260, 1337855, 1182914, 3452030, 4591672, 4144140, 3364502, 1816748, -950821, -3205444, -3670878, -3785252, -4648966, -4568068, -2384667, -226326, 153633, 724163, 3230843, 4717944, 1424390, -4584211, -7150724, -3801455, 1857814, 5170520, 4685268, 1621303, -1898992]
8258a898992j770400J095262L049109L140448K097823Q09808j74852l00111k27778
8249E820317j987353n221704n609949j031838L371665J889681k365169j888714
8241g023064K866562M151012J13058k028869J628889N150340K875030j751190
8233E981768k762245p31781K84493k71057p59055j321873k031079j120479J180058
8224a551250J578950j88831K42678L735222M510105p8649l789638j741760Q20617
8215C537444k091319n862690l047667K995882L358812j190059k016333K131018
8207b184912L683386J36178k372040j106550j144395m426550m838636Q64890O209277
8198e179352M940008M73293p13565R23186R06114j044743j788784m99524J340382
$$ y = [-1898992, -3669392, -2574130, 474979, 3615427, 5713250, 6523058, 6348206, 6048095, 5820317, 3832964, -1388740, -6998689, -8030527, -4658862, -2769181, -5134350, -7023064, -4156502, -5490, 107568, -1921301, -292412, 4857928, 7732958, 5981768, 3219523, 2487742, 2772235, 2501178, 1742123, 420250, -1610829, -2731308, -1551250, 27700, -161131, 81547, 3816769, 8326874, 8248225, 4458587, 2716827, 3537444, 1446125, -4416565, -7464232, -4468350, -1109538, -2299597, -4315930, -2184912, 1498474, 1634652, -737388, -1843938, -2988333, -7414883, -12253519, -11388629, -5179352, -239344, 233949, -479616, 443570, 1349684, 304941, -1483843, -1983367, -642985]
8189f42985K845525K809172o20733n613004o134043j99501N473112M257535p34543
8180A440535j845116J386667K684142k85521k928456j859540K56849k02512k517611
8171c870563l534761j854925J387930L834112L454173P32728j018304J96958J545882
8162H73230q04389n137028n560110j78531O069350P665708M225194q37268l956047
8153B360109k939164J524372M827265K661321k572967l833530M83801L599870
8145F111077M75334m356576l943829L89402J851061q93438k614830p20422J191383
8136b510838N3339k100848k257956o64262R90786J909189J210006j632826m067736
8127i071146k338255K351469M130524J047068j657540M5730K538625J092331j873774
$$ y = [-642985, 2202540, 5011712, 4390979, -1222025, -7356068, -7555569, -2082457, 2175078, 1440535, -404581, 982086, 3666228, 3380707, 452251, -1407289, -1150440, -1352952, -3870563, -7405324, -9260249, -7872319, -4038207, -584034, 148694, -869610, -672652, 873230, 68841, -5068187, -10628297, -10806828, -4737478, 2928230, 7153424, 6316156, 2360109, -579055, 945317, 5772582, 8433903, 5860936, 2027406, 2511207, 6111077, 6586411, 2229835, -1713994, -1324592, 526469, -366969, -2981799, -3702221, -2510838, -2457499, -4558347, -6816303, -7480565, -6489779, -4580590, -3370584, -5003410, -9071146, -11409401, -9057932, -4927408, -3880340, -5537880, -5492150, -2953525, -1861194, -3734968]
8118c734968j047279K646898L823466J609854J50094R05938R74828o12352j016152
8109C700327P75733J755976O4361k041560k078367n59549R29761J612011Q62097
8100E020790r96782j357958J277332L271267L91565m256577l586813J821172L472412
8091E056408j478180n010523j030734M670344L745527j889628m149676j073542
8083a160004K610052L947677L523639J205338k973232n520487l411062M68433
8075a309646J631865J251357K673170L649567N3191m768516l532466K598012M628511
8066F875045k53339m553211k760641R96309J262180n89785j052775p09246r47204
8057a732667j16745K296285K774944k28341k212720M69723M026760K902764j591101
$$ y = [-3734968, -4782247, -2135349, 1688117, 3297971, 3448065, 4354003, 5328831, 4716479, 3700327, 4476060, 6232036, 6296397, 4254837, 2176470, 1616921, 2546682, 4158693, 5020790, 4024008, 2666050, 3943382, 7214649, 7606214, 3349637, -237176, 1583996, 5056408, 3578228, -1432295, -2463029, 2207315, 5952842, 4063214, -86462, -1160004, 1450048, 5397725, 8921364, 10126702, 7153470, 1632983, -1778079, -1309646, 322219, 1573576, 4246746, 7896313, 7949504, 3180988, -351478, 2246534, 6875045, 6621706, 2068495, -692146, 304163, 1566343, 976558, -76217, -785463, -1732667, -1849412, 446873, 3221817, 2993476, 780756, 1250479, 5277239, 8180003, 6588902]
8048F588902l803827k148487K11151R91655M10542j144053k937235k887300k35948
8039d954600K413427K579877J214816M8991j131195j749422P90399N765735P224563
8030A2202591K432900k464206j427263J512327q40846n931890n221882J159356
8022A421087M270810J115798j285269J099902K720739p23481m310018k880519
8014A429049k2939q37508k311022Q27944N534692M718676p16681l055605r1784
8005E474822K181946m1974k968836k452536l19344j09163j208204r40401N92834
7996B09144J183737J58629j315382k279185k373226j317277M42696J589084J579684
7987b122096J301894J207950L29403j697106l175807k411195n0643J965911K669635
$$ y = [6588902, 2785075, 636588, 847739, 1839394, 2249936, 1105883, -1831352, -4718652, -4954600, -2541173, 38704, 1253520, 1302511, 171316, -1578106, -787707, 4978028, 12202591, 14635491, 12171285, 10744022, 12256349, 11415503, 5483613, 261731, 1421087, 5691897, 6807695, 5522426, 6622328, 9343067, 8619586, 4309568, 1429049, 1406110, 568602, -1742420, -914476, 4620216, 9338892, 8622211, 5566606, 5474822, 7656768, 7614794, 4645958, 2193422, 1874078, 1764915, 556711, -383690, 209144, 1392881, 1551510, 236128, -2043057, -4416283, -5733560, -5290864, -3701780, -2122096, -820202, 387748, 717151, -979955, -4155762, -6566957, -6617600, -4651689, -1982054]
7978a982054K067476K89470j709233j971093N661J780114J087701o07597k66859
7969a306414J795907K321395L81443j268280r43807n22564j339061j122271J818952
7960a84700M174828J758255l359510m737811p81810K732054J025040k985594l320362
7951e679610P47214M600131M776916K037634j204877l212336k920282n96374J350129
7942a01455P70562r81552p96391J333943K337952J137694N39l7456r10759k815051
7932f1974k265902J758529L946491k5437n388478l888849L768537Q004841L619358
7923I467116l625929n937443l052781N84368K893077L693300J488233l521813
7915A988128o102552j950837M509065M771247j540431n689776k276565L681312
$$ y = [-1982054, 85422, 374892, -1334341, -3305434, -3299773, -1519659, -431958, -1039555, -1306414, 489493, 2810888, 3192331, 1924051, 980244, 457680, -881381, -2003652, -184700, 3990128, 5748383, 2388873, -2348938, -3130748, -398694, 626346, -2359248, -5679610, -4932396, -332265, 4444651, 6482285, 5277408, 2065072, -855210, -1451584, -101455, 669107, -312445, -1108836, 225107, 2563059, 3700753, 3701292, 3663836, 2753077, -61974, -2327876, -569347, 3377144, 3351707, -2036771, -5925620, -2157083, 5847758, 9467116, 5841187, -96256, -3149037, -2564669, 328408, 4021708, 5509941, 1988128, -4114424, -6065261, -1556196, 3215051, 1674620, -4015156, -6291721, -2610409]
7907b610409M885565J434795j683282k448205k267391j460853N41449J954864
7899a653467M95919k012539j446088K039760L649848J164157j697571j192518
7891f52499P18648l00181m108502o132109l701917O77923K964835K358734J266495
7882f908573J593480K524461K183476N85052k08112Q38740J720728j1006l107543
7873g89297l410325L10876L588219J720315l238496m336898R08741O366155M850318
7864E969608k427048p445511n633768o12333J998549J426763J6354j708282m036693
$$ y = [-2610409, 2275156, 3709951, 2026669, -421536, -2688927, -4149780, -3608331, -1653467, -1157548, -3170087, -4616175, -2576415, 1073433, 2237590, 540019, -652499, 66149, -234032, -4342534, -10474643, -14176560, -13498637, -10533802, -8175068, -6908573, -5315093, -2790632, -607156, -22104, -230216, 608524, 2329252, 2318246, -789297, -4199622, -3888746, -300527, 1419788, -1818708, -6155606, -5246865, 1119290, 5969608, 3542560, -3902951, -9536719, -10149052, -8150503, -6723740, -6707386, -8415668, -12452361]
$$ [...]
##END NTUPLES=NMR SPECTRUM
##END=
