##TITLE=31Pdec_SR95+rm1
 , 24 sc
 27.10.2021
##JCAMPDX= 6.0         $$ Bruker NMR JCAMP-DX V2.0
##DATA TYPE= NMR SPECTRUM
##DATA CLASS= NTUPLES
##ORIGIN= UXNMR, Bruker Analytische Messtechnik GmbH
##OWNER= root
$$ XWIN-NMR		Version 3.5
$$ Wed Oct 27 11:23:16 2021 Russian Standard Time (UT+4h)  she@DPX200
##.OBSERVE FREQUENCY= 81.013821
##.OBSERVE NUCLEUS= ^31P
##.ACQUISITION MODE= SIMULTANEOUS
##.ACQUISITION SCHEME= undefined
##.AVERAGES= 24
##.DIGITISER RES= 16
##SPECTROMETER/DATA SYSTEM= spect
##.PULSE SEQUENCE= zgpg30
##.SOLVENT NAME= CDCl3
##.SHIFT REFERENCE= (INTERNAL, CDCl3, 0, 248.564)
##AUDIT TRAIL= $$ (NUMBER, WHEN, WHO, WHERE, WHAT)
$$ ##TITLE= Audit trail, XWIN-NMR		Version 3.5
$$ ##JCAMPDX= 5.01
$$ ##ORIGIN= Bruker BioSpin GmbH
$$ ##OWNER= she
$$ F:/spectra/data/she/nmr/P31/1/pdata/1/auditp.txt
$$ ##AUDIT TRAIL=  $$ (NUMBER, WHEN, WHO, WHERE, WHAT)
(   1,<2021-10-27 11:21:58.92 +0400>,<she>,<DPX200>,
      <created by zg, POWCHK disabled, PULCHK disabled
       configuration hash MD5:
       00 E9 B6 7A A2 85 ED C7 34 08 36 98 17 FE 4E 26
       data hash MD5: 32K
       73 B2 30 F7 1D 93 BF BD 69 C4 EC 0F 35 16 70 D9>)
(   2,<2021-10-27 11:22:01.32 +0400>,<she>,<DPX200>,
      <Start of raw data processing
       efp BC_mod = 2 LB = 1 FT_mod = 6 PKNL = 1 PHC0 = -9014.679 PHC1 = 536.4695 SI = 64K 
       data hash MD5: 64K
       4C 6D 10 D8 54 74 B1 FC F3 F8 A0 CE AA 30 83 1E>)
(   3,<2021-10-27 11:22:14.31 +0400>,<she>,<DPX200>,
      <pk PHC0 = 4.924395 PHC1 = 0 
       data hash MD5: 64K
       3F 40 3D 3B 8A C8 B0 E5 7F AC DD 02 62 37 43 F8>)
(   4,<2021-10-27 11:22:18.07 +0400>,<she>,<DPX200>,
      <abs ABSG = 5 
       data hash MD5: 64K
       86 04 CB 71 21 7B 06 DB A1 A8 2D B4 12 FB 2B 81>)
$$ ##END=
$$ 
$$ hash MD5
$$ F4 16 FD 94 6C 5A D7 7D EE 0E C5 E7 0F 53 0E CB
##$RELAX= 
##$RELAX= 
##$RELAX= 
##$RELAX= 
##$RELAX= 
##$RELAX= 
##$RELAX= 
##$RELAX= 
$$ Bruker specific parameters
$$ --------------------------
##$DU= <F:/spectra>
##$EXPNO= 1
##$NAME= <P31>
##$PROCNO= 1
##$TYPE= <nmr>
##$USER= <she>
##$AMP= (0..31)
100 100 100 100 100 100 100 100 100 100 100 100 100 100 100 100 100 100 
100 100 100 100 100 100 100 100 100 100 100 100 100 100 
##$AQSEQ= 0
##$AQ_mod= 1
##$AUNM= <au_zg>
##$AUTOPOS= <>
##$BF1= 81.014009
##$BF2= 200.13
##$BF3= 200.13
##$BF4= 200.13
##$BF5= 200.13
##$BF6= 200.13
##$BF7= 200.13
##$BF8= 200.13
##$BYTORDA= 1
##$CFDGTYP= 0
##$CFRGTYP= 5
##$CHEMSTR= <none>
##$CNST= (0..31)
1 1 145 1 1 1 1 1 1 1 1 1 1 1 1 1 1 1 1 1 1 1 1 1 1 1 1 1 1 1 1 1 
##$CPDPRG= <waltz16>
##$CPDPRG1= <>
##$CPDPRG2= <waltz16>
##$CPDPRG3= <>
##$CPDPRG4= <mlev>
##$CPDPRG5= <mlev>
##$CPDPRG6= <mlev>
##$CPDPRG7= <mlev>
##$CPDPRG8= <mlev>
##$CPDPRGB= <>
##$CPDPRGT= <>
##$D= (0..31)
0 1 0 0 0 0 0 0 0 0 0 0.03 2e-05 3e-06 0 0 0 0 0 0 0 0 0 0 0 0 0 0 0 0 
0 0 
##$DATE= 1635319318
##$DBL= (0..7)
120 120 120 11 120 120 24 19 
##$DBP= (0..7)
150 150 150 150 150 150 150 150 
##$DBP07= 0
##$DBPNAM0= <>
##$DBPNAM1= <>
##$DBPNAM2= <>
$$ [...]
##$SUBNAM3= <"">
##$SUBNAM4= <"">
##$SUBNAM5= <"">
##$SUBNAM6= <"">
##$SUBNAM7= <"">
##$SUBNAM8= <"">
##$SUBNAM9= <"">
##$SW= 501.771253377433
##$SWIBOX= (0..15)
0 1 3 0 0 0 0 0 0 0 0 0 0 0 0 0 
##$SW_h= 40650.406504065
##$TD= 32768
##$TD0= 1
##$TE= 0
##$TE2= 300
##$TE3= 300
##$TEG= 300
##$TL= (0..7)
0 120 53 12 22 120 120 120 
##$TP= (0..7)
150 150 150 150 150 150 150 150 
##$TP07= 0
##$TPNAME0= <>
##$TPNAME1= <>
##$TPNAME2= <>
##$TPNAME3= <>
##$TPNAME4= <>
##$TPNAME5= <>
##$TPNAME6= <>
##$TPNAME7= <>
##$TPOAL= (0..7)
0.5 0.5 0.5 0.5 0.5 0.5 0.5 0.5 
##$TPOFFS= (0..7)
0 0 0 0 0 0 0 0 
##$TUNHIN= 0
##$TUNHOUT= 0
##$TUNXOUT= 0
##$USERA1= <user>
##$USERA2= <user>
##$USERA3= <user>
##$USERA4= <user>
##$USERA5= <user>
##$V9= 5
##$VALIST= <valist>
##$VCLIST= <CCCCCCCCCCCCCCC>
##$VD= 0
##$VDLIST= <DDDDDDDDDDDDDDD>
##$VPLIST= <PPPPPPPPPPPPPPP>
##$VTLIST= <TTTTTTTTTTTTTTT>
##$WBST= 1024
##$WBSW= 4
##$XGAIN= (0..3)
0 0 0 0 
##$XL= 0
##$YL= 0
##$YMAX_a= 2306
##$YMIN_a= -4816
##$ZGOPTNS= <>
##$ZL1= 120
##$ZL2= 120
##$ZL3= 120
##$ZL4= 120
##$ABSF1= 248.5645
##$ABSF2= -253.2056
##$ABSG= 5
##$ABSL= 3
##$ALPHA= 0
##$AQORDER= 0
##$ASSFAC= 0
##$ASSFACI= 0
##$ASSFACX= 0
##$ASSWID= 0
##$AUNMP= <proc_1d>
##$AZFE= 0.1
##$AZFW= 0.5
##$BCFW= 0
##$BC_mod= 2
##$BYTORDP= 0
##$COROFFS= 0
##$CY= -3
##$DATMOD= 1
##$DC= 0
##$DFILT= <>
##$DTYPP= 0
##$F1P= 0
##$F2P= 0
##$FCOR= 1
##$FTSIZE= 65536
##$FT_mod= 6
##$GAMMA= 0
##$GB= 0
##$INTBC= 1
##$INTSCL= 5.30512e-09
##$ISEN= 30
##$LB= 1
##$LEV0= 0
##$LPBIN= 0
##$MAXI= 10000
##$MC2= 0
##$MEAN= 0
##$ME_mod= 0
##$MI= 50
##$NCOEF= 0
##$NC_proc= -8
##$NLEV= 6
##$NOISF1= 182.463
##$NOISF2= 159.3651
##$NSP= 0
##$NTH_PI= 0
##$NZP= 0
##$OFFSET= 248.5645
##$PC= 4
##$PHC0= -9009.754
##$PHC1= 536.4695
##$PH_mod= 1
##$PKNL= yes
##$PPARMOD= 0
##$PSCAL= 0
##$PSIGN= 0
##$REVERSE= no
##$SF= 81.014009
##$SI= 65536
##$SIGF1= 159.3651
##$SIGF2= -187.1042
##$SINO= 113.3802
##$SIOLD= 16384
##$SREGLST= <1H.CDCl3>
##$SSB= 0
##$STSI= 65536
##$STSR= 0
##$SW_p= 40650.406504065
##$SYMM= 0
##$S_DEV= 0
##$TDeff= 32768
##$TDoff= 0
##$TI= <>
##$TILT= no
##$TM1= 0
##$TM2= 0
##$TOPLEV= 0
##$USERP1= <user>
##$USERP2= <user>
##$USERP3= <user>
##$USERP4= <user>
##$USERP5= <user>
##$WDW= 1
##$XDIM= 65536
##$YMAX_p= 167038638
##$YMIN_p= -515483030
$$ End of Bruker specific parameters
$$ ---------------------------------
##NTUPLES= NMR SPECTRUM
##VAR_NAME=  FREQUENCY,     SPECTRUM/REAL,   SPECTRUM/IMAG
##SYMBOL=    X,             R,               I
##VAR_TYPE=  INDEPENDENT,   DEPENDENT,       DEPENDENT
##VAR_FORM=  AFFN,          ASDF,            ASDF
##VAR_DIM=   65536,         65536,           65536
##UNITS=     HZ,            ARBITRARY UNITS, ARBITRARY UNITS
##FACTOR=    0.620285442955139, 1,           1
##FIRST=     20137.2065510759, 0,            0
##LAST=      -20513.1999529892, 0,           0
##MIN=       -20513.1999529892, -515483030,  0
##MAX=       20137.2065510759, 167038638,    0
$$ Real data points
##PAGE= N=1
##DATA TABLE= (X++(R..R)), XYDATA
$$ [...]
$$ plain form
13033 4861536 4461931 4122546 2681918 615735 -51728 1428226 3158372 2966003 1592657
13024 1592657 2120440 5758231 9538016 9495756 5244102 -267794 -4820573 -8447360 -10980083
13015 -10980083 -10885107 -7826130 -4316599 -2962587 -3202257 -2524667 -245628 1703074 1742378
13006 1742378 950533 1762964 4969659 8649663 10232027 9412269 8547048 9830077 12524367
12997 12524367 13706622 11560822 7154383 3053367 1038462 1124671 1748844 726901
12989 726901 -2766424 -6538873 -6741874 -1940482 4650832 7935494 5776916 443299
12981 443299 -4394215 -7016085 -7874116 -7670068 -6362321 -3959989 -1303782 580312 1646870
12972 1646870 2787528 4529463 6197453 6733877 6192241 5849149 6490695 7037057 5733687
$$ packed form
13033D861536l99605l39385j440628k066183o67463J479954J730146j92369j373346
13024A592657N27783L637791L779785m2260m251654n511896m552779l626787k532723
13015a0980083R4976L058977L509531J354012k39670O77590K279039J948702L9304
13006A742378p91845Q12431L206695L680004J582364q19758q65221J283029K694290
12997A2524367J182255k145800m406439m101016k014905Q6209O24173j021943
12989G26901l493325l772449k03001M801392O591314L284662k158578n333617
12981D43299m837514k621870q58031K04048J307747K402332K656207J884094J066558
12972A646870J140658J741935J667990N36424n41636l43092O41546N46362j303370
$$ plain form
12963 5733687 2739504 400402 329162 1386787 1735508 1681008 2545108 3729996 3667448
12954 3667448 3122086 3905742 4181935 -126914 -7477268 -9672349 -2880832 4879448 3339180
12945 3339180 -5886308 -11827694 -9508609 -4957204 -4144796 -4798613 -2461066 1701957
12937 1701957 3740580 3183426 1994699 449821 -1881401 -3516097 -3099872 -2085107
12929 -2085107 -2264549 -2561688 -1036187 1899782 4701734 6854438 7618725 5568842 1929892
12920 1929892 910052 3453478 4403735 147174 -4504061 -2485539 5096063 10641022
12912 10641022 10553354 8116092 6760440 6466152 6877107 8324553 9082560 6711091 2924849
12903 2924849 2206966 4617971 4952667 520571 -4991734 -7330801 -6892264 -5836140 -4166204
$$ packed form
12963E733687k994183k339102p1240J057625L48721n4500Q64100J184888o2548
12954C667448n45362P83656K76193m308849p350354k195081O791517P760280j540268
12945C339180r225488n941386K319085M551405Q12408o53817K337547M163023
12937A701957K038623n57154j188727j544878k331222j634696M16225J014765
12929b085107j79442k97139J525501K935969K801952K152704P64287k049883l638950
12920A929892j019840K543426R50257m256561m651235K018522P581602N544959
12912A0641022q7668k437262j355652k94288M10955J447446P58007k371469l786242
12903B924849p17883K411005L34696m432096n512305k339067M38537J056124J669936
$$ plain form
12894 -4166204 -1623126 -92871 -893806 -2039109 -1081985 1101511 1779634 59498 -2907828
12885 -2907828 -5816775 -7270298 -5462341 -189940 5456694 7429990 4869962 913514
12877 913514 -678240 739232 2323032 1170379 -1969196 -3388575 -1268189 1788050
12869 1788050 2340025 533022 -934263 -599406 1234970 3983290 6135160 5116573
12861 5116573 1117929 -972155 2390512 7273768 7229960 3009506 1261805 3856904
12853 3856904 5243860 1786512 -2661371 -3098265 96000 3890982 7098797 8998476
12845 8998476 7722959 3428220 -249584 -681358 945784 3255891 7005325 11322396
12837 11322396 12169633 8043958 3342592 2444100 3900311 3943630 2231540 527159 -820316
$$ packed form
12894d166204K543078J530255q00935j145303R57124K183496O78123j720136k967326
12885b907828k908947j453523J807957N272401N646634J973296k560028l956448
12877I13514j591754J417472J583800j152653l139575j419379K120386L056239
12869A788050N51975j807003j467285L34857J834376K748320K151870j018587
12861E116573l998644k090084L362667M883256m3808m220454j747701K595099
12853C856904J386956l457348m447883m36894L194265L794982L207815J899679
12845H998476j275517m294739l677804m31774J627142K310107L749434M317071
12837A1322396Q47237m125675m701366q98492J456211M3319j712090j704381j347475
$$ plain form
12828 -820316 -1362822 951669 5857449 8774020 6704328 2674400 419919 -1205129
12820 -1205129 -3930466 -4822263 -1381482 2114025 372178 -3838228 -3781916 357864 2521528
12811 2521528 1284398 1134193 3493467 4573302 3062526 2383616 3722688 3888100 2160957
12802 2160957 2585402 6793434 10507440 9960265 6494618 2467021 -1813413 -4608478
12794 -4608478 -2391239 3451374 5271101 -1047579 -9658305 -12592164 -9790133 -6652049
12786 -6652049 -5434253 -4343145 -2511350 -802632 785193 2491045 2972087 1280043
12778 1280043 -1140815 -3103185 -5723269 -8901115 -9029859 -4162285 1410173 2097969
12770 2097969 -1856302 -6365754 -9847842 -12682813 -13013765 -9123563 -4493550 -4323749
$$ packed form
12828h20316n42506K314491M905780K916571k069692m029928k254481j625048
12820a205129k725337q91797L440781L495507j741847m210406N6312M139780K163664
12811B521528j237130j50205K359274J079835j510776o78910J339072J65412j727143
12802B160957M24445M208032L714006n47175l465647m027597m280434k795065
12794d608478K217239N842613J819727o318680q610726k933859K802031L138084
12786f652049J217796J091108J831795J708718J587825J705852M81042j692044
12778A280043k420858j962370k620084l177846j28744M867574N572458O87796
12770B097969l954271m509452l482088k834971l30952L890202M630013J69801
$$ plain form
12762 -4323749 -7645558 -8851913 -6705185 -5427976 -6421410 -5732608 -1689114 1288471
12754 1288471 -295296 -3335908 -3166305 -207473 2127943 2812067 2694650 1353623 -1594462
12745 -1594462 -3829823 -2669180 845909 3118132 2593544 913134 177283 977646 2466820
12736 2466820 2959193 1431803 -524439 117395 3468087 5700298 4161366 1215147
12728 1215147 565877 1861326 1956572 -15290 -2032486 -2625099 -1951676 -353191 1262063
12719 1262063 657661 -2821689 -5563294 -3754380 424624 1098017 -2527355 -4436233
12711 -4436233 -410965 6007149 8810220 7340038 5603717 6143086 7864192 8613772
12703 8613772 7049839 2733284 -3247239 -8121262 -9570492 -7583290 -3428499 1547268
$$ packed form
12762d323749l321809j206355K146728J277209r93434O88802M043494K977585
12754A288471j583767l040612J69603K958832K335416O84124j17417j341027k948085
12745a594462k235361J160643L515089K272223n24588j680410p35851Q00363J489174
12736B466820M92373j527390j956242O41834L350692K232211j538932k946219
12728A215147o49270J295449R5246j971862k017196n92613O73423J598485J615254
12719A262063o04402l479350k741605J808914M179004O73393l625372j908878
12711d436233M025268O418114K803071j470182j736321N39369J721106P49580
12703H613772j563933m316555n980523m874023j449230J987202M154791M975767
$$ plain form
12695 1547268 4871449 3316307 -2781674 -7443175 -5061991 2145356 6410123 4131523
12687 4131523 -510606 -2469081 -2318511 -3496974 -6248430 -7867029 -7478658 -6865695 -6543503
12678 -6543503 -4447422 16220 3168288 1040035 -4698132 -7856409 -5661935 -2906904
12670 -2906904 -5672179 -12464479 -15339159 -10236331 -2443753 338945 -2578013 -5496597
12662 -5496597 -4268021 275877 5719247 10338034 11610153 7052737 -1366466 -7133773
12654 -7133773 -6230886 -1825186 685530 874520 2071637 4731632 5524383 3152539 929029
12645 929029 1937707 4581586 5096020 2554924 -821208 -2998408 -3415072 -1712498 2161614
12636 2161614 6320842 7785072 6034595 3958229 3889038 4277578 2323124 -1282938 -3165116
$$ packed form
12695A547268L324181j555142o097981m661501K381184P207347M264767k278600
12687D131523m642129j958475J50570j178463k751456j618599L88371O12963L22192
12678f543503K096081M463642L152068k128253n738167l158277K194474K755031
12670b906904k765275o792300k874680N102828P792578K782698k916958k918584
12662e496597J228576M543898N443370M618787J272119m557416q419203n767307
12654g133773R02887M405700K510716J88990J197117K659995P92751k371844k223510
12645I29029J008678K643879N14434k541096l376132k177200m16664J702574L874112
12636B161614M159228J464230j750477k076366o9191L88540j954454l606062j882178
$$ plain form
12627 -3165116 -2715156 -3339523 -6788893 -9266667 -6141566 1170225 6414113 6008391 2111427
12618 2111427 -1708691 -4238052 -5142633 -3417064 382606 3034267 2530367 1170505
12610 1170505 1969611 3649111 2672196 -624286 -1920346 627206 3517556 3048261 365361
12601 365361 -874817 151094 979307 -336947 -3336566 -6550394 -8584700 -7872331 -3526306
12592 -3526306 2805092 7402113 7789642 4976582 1989364 874622 1357244 1465839 -933912
12583 -933912 -6096232 -11096265 -11645854 -6442327 893358 5355078 5457038 3424170 1378789
12574 1378789 -492436 -2038995 -2028248 -241687 1099523 -173887 -3117120 -4748011
12566 -4748011 -3854977 -2345985 -2702846 -4971337 -6578187 -5090416 -1387506 379990
$$ packed form
12627c165116M49960o24367l449370k477774L125101P311791N243888m05722l896964
12618B111427l820118k529361r04581J725569L799670K651661n03900j359862
12610A170505P99106J679500r76915l296482j296060K547552K890350m69295k682900
12601C65361j240178J025911Q28213j316254k999619l213828k034306P12369M346025
12592c526306O331398M597021L87529k813060k987218j114742M82622J08595k399751
12583i33912n162320n000033n49589N203527P335685M461720J01960k032868k045381
12574A378789j871225j546559J0747J786561J341210j273410k943233j630891
12566d748011Q93034J508992l56861k268491j606850J487771L702910J767496
$$ plain form
12558 379990 -2720568 -8137907 -10188317 -7217655 -3778150 -4191575 -6840989 -7530472 -5856249
12549 -5856249 -4366366 -3269230 -746987 2195754 2318293 -69169 -1018234 217133
12541 217133 -430588 -4398227 -6852059 -4283342 -1007315 -2811632 -7414155 -7432327 -1528616
12532 -1528616 3537712 2555269 -1549281 -2588188 961481 5137069 5774399 3008857
12524 3008857 1042044 3538288 8872149 11332702 8271971 3777675 2713591 3677459
12516 3677459 2038867 -2017457 -4143123 -3951223 -5971883 -11054209 -13204028 -8444479
12508 -8444479 -1690839 -275965 -4330284 -8404154 -9876983 -10425422 -10565683 -8277440
12500 -8277440 -3571555 -89245 -619306 -3633921 -5474333 -4274821 -1096345 1440912
$$ packed form
12558C79990l100558n417339k050410K970662L439505m13425k649414o89483J674223
12549e856249J489883J097136K522243K942741J22539k387462r49065J235367
12541B17133o47721l967639k453832K568717L276027j804317m602523j8172N903711
12532a528616N066328r82443m104550j038907L549669M175588O37330k765542
12524C008857j966813K496244N333861K460553l060731m494296j064084R63868
12516C677459j638592m056324k125666J91900k020660n082326k149819M759549
12508h444479O753640J414874m054319m073870j472829n48439j40261K288243
12500h277440M705885L482310n30061l014615j840412J199512L178476K537257
$$ plain form
12492 1440912 1348527 -827926 -2449553 -2020227 -1132384 -1944228 -4017014 -5540614 -6358019
12483 -6358019 -7275372 -7503636 -5842486 -3730864 -3699109 -4903192 -3838253 -47036 2519354
12474 2519354 1065146 -2469242 -5018100 -6399891 -7545684 -7590668 -5564375 -2957768
12466 -2957768 -1738388 -1228323 362594 2513071 3338500 3204668 4452756 7459062 9430430
12457 9430430 7767146 3152146 -1082203 -1805954 1397822 5655289 7295285 5752591
12449 5752591 3995131 4282938 5421740 5834826 6875438 9951323 12271139 9765987
12441 9765987 3713731 64353 1715627 5541603 7919706 8899185 9291282 8083161
12433 8083161 5578757 5208725 8351570 10232056 5459234 -3908838 -10249713 -9815074
$$ packed form
12492A440912r2385k176453j621627M29326Q87843q11844k072786j523600q17405
12483f358019r17353k28264J661150K111622L1755j204083J064939L791217K566390
12474B519354j454208l534388k548858j381791j145793m4984K026293K606607
12466b957768J219380N10065J590917K150477Q25429j33832J248088L006306J971368
12457I430430j663284m615000m234349p23751L203776M257467J639996j542694
12449E752591j757460K87807J138802M13086J040612L075885K319816k505152
12441I765987o052256l649378J651274L825976K378103R79479L92097j208121
12433H083161k504404l70032L142845J880486m772822r368072o340875M34639
$$ plain form
12425 -9815074 -6223106 -4281335 -4199028 -3404029 -1248758 413015 325382 -251258 1018402
12416 1018402 4637922 8278009 9183319 7236053 4479845 2021315 -328131 -1220282
12408 -1220282 1970761 8362174 12386105 10254802 4900917 1372514 171580 -907688
12400 -907688 -1228505 1084835 3968759 3852192 2182910 3059254 4818434 1500189 -6252370
12391 -6252370 -9817040 -5223571 342307 -658538 -5410006 -6708167 -4094376 -2132736
12383 -2132736 -1693460 -340268 1256413 565451 -846123 360205 2206827 -99843
12375 -99843 -5088260 -6104188 -2106210 389071 -1916147 -3967212 -1379331 2324790
12367 2324790 2251704 238540 793755 3114097 3028350 108578 -2746329 -4826210 -7305158
$$ packed form
12425i815074L591968J941771Q2307P94999K155271J661773q7633n76640J269660
12416A018402L619520L640087R05310j947266k756208k458530k349446q92151
12408a220282L191043O391413M023931k131303n353885l528403j200934j079268
12400i07688l20817K313340K883924j16567j669282Q76344J759180l318245p752559
12391f252370l564670M593469N565878j000845m751468j298161K613791J961640
12383b132736M39276J353192J596681o90962j411574J206328J846622k306670
12375i9843m988417j015928L997978K495281k305218k051065K587881L704121
12367B324790p3086k013164N55215K320342q5747k919772k854907k079881k478948
$$ plain form
12358 -7305158 -8865242 -7122011 -3752204 -2714175 -3305912 -683238 5502346 8670771
12350 8670771 4436212 -2444456 -4366734 -1036166 1366635 -364444 -2822393 -2108414
12342 -2108414 865678 3086089 4031130 4490117 2858182 -3357230 -12195022 -17028256
12334 -17028256 -13698428 -5898184 -1194828 -2713576 -6997026 -9506857 -9445929 -8476072
12326 -8476072 -7249653 -5256181 -2953693 -1923621 -2835812 -4532087 -5322332 -4352371 -1691943
12317 -1691943 1921402 5116799 6622210 6658120 6960357 8547353 9931684 8776345 5253274
12308 5253274 2182157 1246874 809902 -1055453 -2927077 -1865713 1895843 4958787
12300 4958787 5391279 4333829 2670030 -248728 -3310021 -3164135 260042 1469968
$$ packed form
12358g305158j560084J743231L369807J038029n91737K622674O185584L168425
12350H670771m234559o880668j922278L330568K402801j731079k457949P13979
12342b108414K974092K220411R45041M58987j631935o215412q837792m833234
12334a7028256L329828P800244M703356j518748m283450k509831O0928R69857
12326h476072J226419J993472K302488J030072r12191j696275p90245R69961K660428
12317a691943L613345L195397J505411L5910L02237J586996J384331j155339l523071
12308E253274l071117r35283m36972j865355j871624J061364L761556L062944
12300D958787M32492j057450j663799k918758l061293J45886L424177J209926
$$ plain form
12292 1469968 -3512656 -10757772 -13632865 -11902107 -10160292 -9006964 -4661961 2483345
12284 2483345 6161231 3427135 -655905 -1028392 65754 -1710084 -4787409 -4580270
12276 -4580270 -1587929 -661459 -3199956 -5480124 -4977110 -3773910 -4624775 -7143930 -9255102
12267 -9255102 -9870431 -8908836 -6591225 -3779158 -1646294 -350291 893990 2253110
12259 2253110 3012193 2918409 2458494 1706423 253657 -1476495 -2148698 -1292792 -283520
12250 -283520 -899562 -3138546 -4793265 -3474658 664943 4650640 5878058 4943075 3862471
12241 3862471 2346575 -1413193 -6317204 -8267173 -5733728 -2134112 -910567 -1466678
12233 -1466678 -2035392 -2906285 -3856892 -2162165 2754895 6028478 3625927 -855650 -1293221
$$ packed form
12292A469968m982624p245116k875093J730758J741815J153328M345003P145306
12284B483345L677886k734096m083040l72487J094146j775838l077325K07139
12276d580270K992341R26470k538497k280168N03014J203200q50865k519155k111172
12267i255102o15329R61595K317611K812067K132864J296003J244281J359120
12259B253110P59083r3784m59915p52071j452766j730152o72203Q55906J009272
12250b83520o16042k238984j654719J318607M139601L985697J227418r34983j080604
12241C862471j515896l759768m904011j949969K533445L599616J223545n56111
12233a466678n68714q70893r50607J694727M917060L273583k402551m481577m37571
$$ plain form
12224 -1293221 1286579 716985 -3728707 -6068644 -3587831 -1032557 -2548891 -5344092
12216 -5344092 -4495056 404448 6217961 10099465 10076138 5651273 150932 -1202592 2193163
12207 2193163 5224186 4236989 1211902 -1100443 -3311819 -5843884 -6177720 -3345703
12199 -3345703 -717486 -406960 602376 4436844 7270280 5732309 3821388 6663135
12191 6663135 10942119 9309078 2272813 -2330211 -1158711 1094198 568078 -682370
12183 -682370 -208996 643694 520304 771683 2007169 2465804 1879813 2569346 4736782
12174 4736782 5201770 3089525 2210298 4834845 7203988 4722858 -1561495 -7049683
12166 -7049683 -9596448 -10324561 -10526751 -10486876 -9744237 -6742098 -453020 6167213 7647994
$$ packed form
12224a293221K579800n69594m445692k339937K480813K555274j516334k795201
12216e344092Q49036M899504N813513L881504k3327m424865n500341j353524L395755
12207B193163L031023r87197l025087k312345k211376k532065l33836K832017
12199c345703K628217L10526J009336L834468K833436j537971j910921K841747
12191F663135M278984j633041p036265m603024J171500K252909n26120j250448
12183f82370M73374Q52690j23390K51379J235486M58635n85991O89533K167436
12174D736782M64988k112245q79227K624547K369143k481130o284353n488188
12166g049683k546765p28113k02190L9875P42639L002139O289078O620233J480781
$$ plain form
12157 7647994 3321277 -251613 2458903 8182078 9428597 4806743 256981 696468
12149 696468 4596885 7423439 7369506 6337684 6605421 7634453 6622828 2676363 -734610
12140 -734610 94296 3188139 3018281 -1117943 -3846648 -2540770 -1507267 -3610470 -3741665
12131 -3741665 2944929 10842572 10285385 2117566 -2930115 224895 4583325 2682516
12123 2682516 -2801115 -4559341 -1447404 1464529 667832 -2554496 -5179690 -5208145 -2221484
12114 -2221484 2281493 5711647 7035712 7467128 7536119 5619936 1147376 -2880638 -3067932
12105 -3067932 -228 2794814 3199233 1829006 210717 -176143 1830628 5239087
12097 5239087 6186581 1969610 -4457812 -7108311 -4536120 -1586903 -2206903 -3729496
$$ packed form
12157G647994m326717l572890K710516N723175J246519m621854m549762M39487
12149F96468L900417K826554n3933j031822K67737J029032j011625l946465l410973
12140g34610Q28906L093843j69858m136224k728705J305878J033503k103203j31195
12131c741665O686594P897643n57187q167819n047681L155010M358430j900809
12123B682516n483631j758226L111937K911933p96697l222328k625194k8455K986661
12114b221484M502977L430154J324065M31416O8991j916183m472560m028014j87294
12105c067932L067704K795042M04419j370227j618289l86860K006771L408459
12097E239087R47494m216971o427422k650499K572191K949217o20000j522593
$$ plain form
12089 -3729496 -1270620 4371916 7338001 4827132 324054 -2392514 -4224384 -7029360
12081 -7029360 -8766378 -6898715 -4070554 -4587879 -6338970 -3062851 4576305 7762871
12073 7762871 2633107 -2654511 348069 7572084 8952934 3580352 -543789 84719
12065 84719 733187 -1441417 -2472798 643393 4684106 6097634 6123620 6756070 7181883
12056 7181883 7509726 10434577 15434472 16804397 11872467 6066872 4984086 6369021
12048 6369021 5495284 3775466 5322257 8584725 8714346 5995214 4805563 5638637 5124504
12039 5124504 3189800 3301702 5671680 6786200 5973807 5961906 6337779 3251445 -2910840
12030 -2910840 -6199068 -3796093 -67322 721937 57997 595946 1485188 1757298 3096474
$$ packed form
12089c729496K458876N642536K966085k510869m503078k716568j831870k804976
12081g029360j737018J867663K828161n17325j751091L276119P639156L186566
12073G762871n129764n287618L002580P224015J380850n372582m124141O28508
12065H4719O48468k174604j031381L116191M040713J413528K5986O32450M25813
12056G181883L27843K924851M999895J369925m931930n805595j082786J384935
12048F369021q73737j719818J546791L262468J29621k719132j189651Q33074n14133
12039E124504j934704J11902K369978J114520q12393j1901L75873l086334o162285
12030b910840l288228K402975L728771P89259o63940N37949Q89242K72110J339176
$$ plain form
12021 3096474 5306084 4176726 -1535685 -5958483 -4333092 -803500 -1564603 -4265480
12013 -4265480 -2144999 3747151 5422630 879985 -2736777 -836002 2079513 1396377
12005 1396377 475355 3852574 7980772 6176533 -242256 -3424901 -678361 2729774
11997 2729774 3259397 4202008 7949832 9650643 4261847 -4037224 -6166580 -574534
11989 -574534 4913949 4083541 -544744 -3312643 -3024078 -1846406 -614106 825195 1164739
11980 1164739 -525984 -2177436 -1478871 221205 367132 44457 2089297 5266308 5252011
11971 5252011 1643834 -985062 -306622 255871 -2349285 -5273902 -3830591 1543614
11963 1543614 5834714 5550753 1594480 -2826340 -4898682 -3798299 -1510108 -1178117
$$ packed form
12021C096474K209610j129358n712411m422798J625391L529592p61103k700877
12013d265480K120481N892150J675479m542645l616762J900775K915515o83136
12005A396377r21022L377219M128198j804239o418789l182645K746540L408135
11997B729774N29623R42611L747824J700811n388796q299071k129356N592046
11989e74534N488483q30408m628285k767899K88565J177672J232300J439301L39544
11980A164739j690723j651452O98565J700076J45927l22675K044840L177011j4297
11971E252011l608177k628896O78440N62493k605156k924617J443311N374205
11963A543614M291100k83961l956273m420820k072342J100383K288191L31991
$$ plain form
11955 -1178117 -3261472 -4728751 -3454679 -1363238 -1012605 -1088287 1500004 6077912 8238351
11946 8238351 5630291 987482 -1358165 -62179 2890440 4983170 5339463 4637108
11938 4637108 3541539 1732923 -930989 -2840473 -1987460 931443 2984448 3294170
11930 3294170 4185917 6608620 7481844 4302205 -252901 -1870213 -778589 -378190 -1149209
11921 -1149209 -627108 925627 -191338 -5053689 -9500747 -9400396 -5454090 -1180496
11913 -1180496 1126716 925503 -1409458 -4174991 -5189853 -4475764 -4151119 -4789733 -4473425
11904 -4473425 -2584636 -1485421 -2559650 -3476359 -1768061 1394496 3578578 4873693
11896 4873693 6376188 6979168 5078632 2150462 1260793 2647215 3596369 2183928 -1214389
$$ packed form
11955a178117k083355j467279J274072K091441L50633p5682K588291M577908K160439
11946H238351k608060m642809k345647J295986K952619K092730L56293p02355
11938D637108j095569j808616k663912j909484Q53013K918903K053005L09722
11930C294170Q91747K422703Q73224l179639m555106j617312J091624M00399p71019
11921a149209N22101J552735j116965m862351m447058J00351L946306M273594
11913a180496K307212k01213k334961k765533j014862P14089L24645o38614L16308
11904d473425J888789J099215j074229r16709J708298L162557K184082J295115
11896D873693J502495O02980j900536k928170q89669J386422R49154j412441l398317
$$ plain form
11887 -1214389 -5230928 -7938552 -7222753 -3508198 -891827 -2492854 -5916756 -6736516
11879 -6736516 -5011569 -4051238 -3968558 -2025148 730729 -497100 -6016071 -9618281 -7766471
11870 -7766471 -5149040 -6848198 -9843424 -7712187 -297893 7068192 11535049 13926083
11862 13926083 13581104 8609557 1452227 -1849073 660720 4688165 6424711 6594370
11854 6594370 6218409 3663440 -1009584 -3361371 -454719 3862364 4055409 953167
11846 953167 -105017 2120035 3073596 -442803 -5892294 -9102469 -9257924 -7993416 -6236680
11837 -6236680 -4208398 -2771845 -2400435 -1637673 1302746 5535603 7791345 6100734
11829 6100734 2154252 -478693 126669 2797182 4655457 3412082 -1137844 -6772273
$$ packed form
11887a214389m016539k707624P15799L714555K616371j601027l423902q19760
11879f736516J724947R60331Q2680J943410K755877j227829n518971l602210J851810
11870g766471K617431j699158k995226K131237P414294P366085M466857K391034
11862A3926083l44979m971547p157330l301300K509793M027445J736546J69659
11854F594370l75961k554969m673024k351787K906652M317083J93045l102242
11846I53167j058184K225052R53561l516399n449491l210175j55455J264508J756736
11837f236680K028282J436553L71410P62762K940419M232857K255742j690611
11829F100734l946482k632945O05362K670513J858275j243375m549926n634429
$$ plain form
11821 -6772273 -9832586 -7710359 -1368463 4963264 7454843 5894692 2719209 -342100
11813 -342100 -3120738 -4926601 -4043107 -397536 3072203 3505376 1689936 892849 2599142
11804 2599142 4959340 5273263 2582434 -2146669 -6909066 -9408401 -8323249 -4702845
11796 -4702845 -1454181 -812667 -2591503 -4942441 -6017513 -4603649 -292253 5766161
11788 5766161 10700682 11946109 9900911 7624290 7195954 7209419 5023408 865634 -2190736
11779 -2190736 -2526597 -2023793 -2587893 -2822856 -700381 1843445 529187 -4769953 -8479196
11770 -8479196 -5914711 778473 5251120 4258550 527519 -1179719 496157 2235364
11762 2235364 145889 -4776523 -6646941 -1971815 4462140 4713764 -1378910 -5260293
$$ packed form
11821f772273l060313K122227O341896O331727K491579j560151l175483l061309
11813c42100k778638j805863Q83494L645571L469739M33173j815440p97087J706293
11804B599142K360198L13923k690829m729103m762397k499335J085152L620404
11796d702845L248664O41514j778836k350938j075072J413864M311396O058414
11788E766161M934521J245427k045198k276621m28336J3465k186011m157774l056370
11779b190736l35861N02804n64100k34963K122475K543826j314258n299140l709243
11770h479196K564485O693184M472647r92570l731031j707238J675876J739207
11762B235364k089475m922412j870418M675126O433955K51624o092674l881383
$$ plain form
11754 -5260293 -1577081 3979197 3019893 -3097390 -5214650 480663 7429954 8014372
11746 8014372 3003131 -986023 -522409 1247254 -475015 -5871796 -9919363 -8117763
11738 -8117763 -2294271 1013233 -1288389 -4631669 -2953676 2908970 6381033 3810018
11730 3810018 -1657375 -4907131 -4223970 -1212306 1676581 2417410 379124 -2915847
11722 -2915847 -5243360 -5914992 -5285172 -3119742 95396 1341980 -1899415 -7132523
11714 -7132523 -9103457 -6685200 -3583997 -1832502 786465 5320995 8204708 6006865
11706 6006865 355833 -4507842 -6388612 -5195856 -1445333 2627239 3294401 -245050
11698 -245050 -3856524 -3639434 -887374 900767 1450901 2570543 3573067 2047597 -1605168
$$ packed form
11754e260293L683212N556278r59304o117283k117260N695313O949291N84418
11746H014372n011241l989154M63614J769663j722269n396781m047567J801600
11738h117763N823492L307504k301622l343280J677993N862646L472063k571015
11730C810018n467393l249756O83161L011664K888887P40829k038286l294971
11722b915847k327513o71632O29820K165430L215138J246584l241395n233108
11714g132523j970934K418257L101203J751495K618967M534530K883713k197843
11706F006865n651032m863675j880770J192756L750523M072572O67162l539451
11698b45050l611474K17090K752060J788141N50134J119642J002524j525470l652765
$$ plain form
11689 -1605168 -4255743 -4553320 -4075957 -3907961 -3203565 -1756258 -1270908 -2903952 -5317680
11680 -5317680 -6259489 -4982112 -2384085 353208 2456460 3218814 1779091 -2014964
11672 -2014964 -6371631 -8244128 -6374125 -2895910 -580611 415944 1094815 499861 -2432360
11663 -2432360 -4869074 -2652058 2706866 4524581 -149240 -6932786 -11220301 -13563104
11655 -13563104 -15190190 -13941475 -9173465 -5672967 -7099730 -9578951 -7768603 -3636939
11647 -3636939 -2472390 -3273466 -973978 3518200 3979342 -474731 -3607910 -2204614
11639 -2204614 -224159 -533512 46476 3774749 6626535 4714338 1047156 743025 3209507
11630 3209507 4158252 2681241 1350436 1031809 309475 -752204 -450157 1079026 1706098
$$ packed form
11689a605168k650575k97577M77363J67996P04396J447307M85350j633044k413728
11680e317680r41809J277377K598027K737293K103252P62354j439723l794055
11672b014964m356667j872497J870003L478215K315299R96555O78871n94954k932221
11663b432360k436714K217016N358924J817715m673821o783546m287515k342803
11655a3563104j627086J248715M768010L500498j426763k479221J810348M131664
11647c636939J164549q01076K299488M492178M61142m454073l133179J403296
11639b204614J980455l09353N79988L728273K851786j912197l667182l04131K466482
11630C209507R48745j477011j330805l18627p22334j061679L02047J529183O27072
$$ plain form
11621 1706098 887218 460751 1316538 1798424 502678 -1162340 -747249 1611860 2792298
11612 2792298 372017 -3982036 -5847710 -2937122 2304394 5429419 4240589 -197874
11604 -197874 -5059875 -7013138 -4033686 1691995 4273195 379561 -6147861 -8942990
11596 -8942990 -7146518 -5094395 -4931427 -4275706 -1635529 645811 571137 -297706 47579
11587 47579 831586 470330 -763493 -1863301 -2628158 -2681242 -1276265 774134 1520160
11578 1520160 1173861 1984195 3788006 3302483 -471230 -3912577 -4163702 -3191213 -3643623
11569 -3643623 -4190063 -2519657 21566 780062 500531 1627648 3582375 3760438 2213529
11560 2213529 1617536 3095355 5153148 6251858 5868064 3948432 1847258 2394799 6006503
$$ packed form
11621A706098q18880m26467Q55787M81886j295746j665018M15091K359109J180438
11612B792298k420281m354053j865674K910588N241516L125025j188830m438463
11604a97874m862001j953263K979452N725681K581200l893634o527422k795129
11596h942990J796472K052123J62968O55721K640177K281340p4674q68843L45285
11587D7579P84007l61256j233823j099808p64857n3084J404977K050399P46026
11578A520160l46299Q10334J803811m85523l773713l441347k51125R72489m52410
11569c643623n46440J670406K541223P58496k79531J127117J954727J78063j546909
11560B213529n95993J477819K057793J098710l83794j919632k101174N47541L611704
$$ plain form
11551 6006503 8182436 4559198 -2494109 -6286907 -4468549 -1273275 -856903 -2400491
11543 -2400491 -3021724 -2147838 -1154131 -922334 -1345240 -1731278 -874170 1551279 3066184
11534 3066184 140526 -6789090 -12056963 -10574607 -3862159 1740056 2466281 576029
11526 576029 -72373 402976 -907741 -3903003 -4409122 -294933 4544212 5344062 3195061
11517 3195061 2398341 2840402 761294 -3053798 -2713603 3022842 7174458 4845481 1043157
11508 1043157 2373123 5980238 4347428 -1986311 -5079448 -2373063 -503956 -4558298
11500 -4558298 -10433535 -11224767 -6342113 -692360 2039704 2069740 1273111 692380 -222016
11491 -222016 -2466713 -5045321 -4870033 -995248 2758503 2516653 -17644 -711684 -36165
$$ packed form
11551F006503K175933l623238p053307l792798J818358L195274M16372j543588
11543b400491o21233Q73886R93707K31797m22906l86038Q57108K425449J514905
11534C066184k925658o929616n267873J482356O712448N602215P26225j890252
11526E76029o48402M75349j310717k995262n06119M114189M839145P99850k149001
11517C195061p96720M42061k079108l815092L40195N736445M151616k328977l802324
11508A043157J329966L607115j632810o333739l093137K706385J869107m054342
11500d558298n875237p91232M882654N649753K732064L0036p96629n80731r14396
11491b22016k244697k578608J75288L874785L753751k41850k534297o94040O75519
$$ plain form
11482 -36165 -1387206 -3357735 -792258 5381305 6819334 -381001 -8845952 -9659929 -3993753
11473 -3993753 319075 57210 -1482823 -1728296 -1935055 -3032989 -3071047 -160272 4525654
11464 4525654 7731658 7203548 3874603 1281870 1759869 3237039 1992749 -1300246
11456 -1300246 -1759267 2327905 6306151 5745614 2425107 423657 -241348 -1732298 -2832934
11447 -2832934 -409715 4660664 7753860 6670374 3794755 1936166 1201646 277305
11439 277305 -1824305 -5500729 -9904969 -12651100 -12005559 -8956527 -5608627 -2687014
11431 -2687014 -391150 70835 -1579888 -2817745 -1465806 467468 -649786 -4471181
11423 -4471181 -6836854 -5182723 -1107380 1997101 1670472 -2153478 -6119820 -5579041
$$ packed form
11482c6165j351041j970529K565477O173563J438029p200335q464951q13977N666176
11473c993753M312828k61865j540033k45473k06759j097934l8058K910775M685926
11464D525654L206004n28110l328945k592733M77999J477170j244290l292995
11456a300246m59021M087172L978246n60537l320507k001450o65005j490950j100636
11447b832934K423219N070379L093196j083486k875619j858589p34520r24341
11439B77305k101610l676424m404240k746131O45541L049032L347900K921613
11431b687014K295864M61985j650723j237857J351939J933274j117254l821395
11423d471181k365673J654131M075343L104481l26629l823950l966342N40779
$$ plain form
11415 -5579041 -419331 3377426 1230934 -3636875 -5467034 -4622979 -5163008 -6143998 -2837347
11406 -2837347 3859611 7061875 4243197 712462 522018 815531 -1456105 -3534284
11398 -3534284 -2052511 704927 490362 -2504655 -5026942 -5541729 -4200661 -1104619
11390 -1104619 2162159 2410558 -543686 -2362632 -435575 1872544 729412 -2077352
11382 -2077352 -2682100 -1343619 -490028 416828 3012625 5369157 4347256 1020657 -919860
11373 -919860 -715033 -149798 577224 1911312 1659548 -2106610 -6137086 -5484144 -1268672
11364 -1268672 468825 -2439951 -5946033 -6554346 -5331018 -4341784 -3797564 -3885259 -5306820
11355 -5306820 -6863124 -6094311 -3063469 -137349 2055664 4568021 6209744 4383204
$$ packed form
11415e579041N159710L796757k146492m867809j830159Q44055n40029r80990L306651
11406b837347O696958L202264k818678l530735j90444K93513k271636k078179
11398c534284J481773K757438k14565k995017k522287n14787J341068L096042
11390a104619L266778K48399k954244j818946J927057K308119j143132k806764
11382b077352o04748J338481Q53591R06856K595797K356532j021901l326599j940517
11373i19860K04827N65235P27022J334088k51764l766158m030476O52942M215472
11364a268672J737497k908776l506082o08313J223328R89234N44220q7695j421561
11355e306820j556304P68813L030842K926120K193013K512357J641723j826540
$$ plain form
11347 4383204 239992 -1919514 -1266445 -1450651 -3799905 -4890730 -2973678 -1570534
11339 -1570534 -3679781 -6966866 -8137673 -8167656 -9492248 -11232637 -10996644 -8999541 -6989137
11330 -6989137 -5091806 -2763210 -1021511 -845518 -861652 831560 3776403 6069230 6871548
11321 6871548 6542575 5791115 5713597 6690766 6563480 2705321 -3213536 -6010276 -3934445
11312 -3934445 -1014446 -613867 -932286 296077 964416 -1622181 -5640531 -7659030 -7758515
11303 -7758515 -7576787 -6107512 -2140764 1549181 1648432 263596 2072364 6371498 7359802
11294 7359802 2574517 -3738805 -6575727 -5565088 -3380070 -2121107 -2559881 -4436215
11286 -4436215 -6300247 -6698777 -5986470 -5536715 -5323060 -4014007 -1365477 1093427 1786590
$$ packed form
11347D383204m143212k159506O53069j84206k349254j090825J917052J403144
11339a570534k109247l287085j170807k9983j324592j740389K35993J997103K010404
11330f989137J897331K328596J741699J75993j6134J693212K944843K292827Q02318
11321F871548l28973p51460p7518R77169j27286l858159n918857k796740K075831
11312c934445K919999M00579l18419J228363O68339k586597m018350k018499r9485
11303g758515J81728J469275L966748L689945R9251j384836J808768M299134R88304
11294G359802m785285o313322k836922J010639K185018J258963m38774j876334
11286d436215j864032l98530P12307M49755K13655J309053K648530K458904O93163
$$ plain form
11277 1786590 524580 -1359038 -1797514 -139545 1115182 -1114460 -5564192 -7350924
11269 -7350924 -4881636 -2199978 -2252233 -2237068 737591 3717049 2669845 -243379 74254
11260 74254 3635093 6513417 7919097 9725261 10420635 6566366 37569 -3057503 -1307603
11251 -1307603 613188 434419 1510469 5585391 8627999 6958038 2478378 -1252722
11243 -1252722 -3728154 -5287844 -4460411 -1037478 1516443 243257 -3087240 -4852758
11235 -4852758 -4617712 -4610048 -5734741 -6566735 -5677347 -3572370 -2489231 -4046907 -6399698
11226 -6399698 -5345173 -273745 3341976 1065917 -3245783 -2655594 2021845 3386635
11218 3386635 -795951 -4630726 -4319721 -3591431 -5746412 -7500653 -5413050 -2435754
$$ packed form
11277A786590j262010j883618m38476J657969J254727k229642m449732j786732
11269g350924K469288K681658n2255J5165K974659K979458j047204k913224L17633
11260G4254L560839K878324J405680J806164O95374l854269o528797l095072J749900
11251a307603J920791j78769J076050M074922L042608j669961m479660l731100
11243a252722k475432j559690Q27433L422933K553921j273186l330497j765518
11235d852758K35046P664j124693q31994Q89388K104977J083139j557676k352791
11226f399698J054525N071428L615721k276059m311700N90189M677439J364790
11218C386635m182586l834775L11005P28290k154981j754241K087603K977296
$$ plain form
11210 -2435754 -2640231 -4085901 -2424093 1997791 5722538 7788168 9042167 8785684
11202 8785684 6726168 5548298 7009587 8148899 5912718 2693604 2189226 2438687
11194 2438687 -1086917 -7126073 -9529677 -6133323 -1237825 938451 408462 -1246985
11186 -1246985 -2901935 -2487612 1882174 7955078 10348405 7204599 2622588 743177
11178 743177 510389 -1265645 -4073190 -4265134 -797521 2734137 2838882 779053 291658
11169 291658 1633857 1142484 -2440578 -4819698 -2233245 2254518 2999270 415754 -158203
11160 -158203 2466388 3714850 1484395 -517929 171809 583936 -1719441 -4258291 -4820073
11151 -4820073 -5354696 -6569312 -4614286 1528322 5236097 1679527 -2927685 361528
$$ packed form
11210b435754k04477j445670J661808M421884L724747K065630J253999k56483
11202H785684k059516j177870J461289J139312k236181l219114n04378K49461
11194B438687l525604o039156k403604L396354M895498K176276n29989j655447
11186a246985j654950M14323M369786O072904K393327l143806m582011j879411
11178G43177k32788j776034k807545j91944L467613L531658J04745k059829m87395
11169B91658J342199m91373l583062k379120K586453M487763P44752k583516n73957
11160a58203K624591J248462k230455k002324O89738M12127k303377k538850n61782
11151d820073n34623j214616J955026O142608L707775l556570m607212L289213
$$ plain form
11143 361528 9227828 13326373 9727558 5927381 7198027 9565177 7647021 2607432
11135 2607432 -887551 -918919 1150057 3024531 2707221 163180 -1640134 -231921 2039121
11126 2039121 762853 -3687164 -6221226 -4309207 -1165741 -782584 -3058951 -4651117
11118 -4651117 -2272813 4541933 11578773 12407984 6119545 515504 2896335 9651280
11110 9651280 11049848 5129085 -431317 -504521 1184206 140141 -1662752 -508018
11102 -508018 2527690 4074041 3710929 2941321 1848576 -2495 -1632554 -2145251 -2228467
11093 -2228467 -2542809 -2719933 -2915865 -3795876 -4402581 -3166083 -1452547 -2326947 -5192825
11084 -5192825 -5979362 -3650894 -1918991 -3086427 -4910823 -5161570 -4239266 -1480030 5280825
$$ packed form
11143C61528Q866300M098545l598815l800177J270646K367150j918156n039589
11135B607432l494983l1368K068976J874474l17310k544041j803314J408213K271042
11126B039121j276268m450017k534062J912019L143466L83157k276367j592166
11118d651117K378304O814746P036840Q29211o288439n604041K380831O754945
11110I651280J398568n920763n560402p3204J688727j044065j802893J154734
11102e08018L035708J546351l63112p69608j092745j851071j630059n12697q3216
11093b228467l14342j77124j95932q80011o06705J236498J713536q74400k865878
11084e192825p86537K328468J731903j167436j824396k50747R22304K759236O760855
$$ plain form
11075 5280825 13570688 15762817 8998447 418962 -2260421 -518211 -8457 -596276
11067 -596276 1556720 5123410 4700397 35516 -2898898 -982405 1635911 126543
11059 126543 -4177571 -5981987 -2883510 1920993 3260232 -255460 -4456164 -4661470
11051 -4661470 -1979218 -1609530 -4505271 -5158575 37993 6772358 8973431 6988611
11043 6988611 4769944 2427000 -2251581 -7062534 -7095568 -2863468 -391292 -2434568
11035 -2434568 -5201393 -5060134 -3290004 -2253324 -1439395 225466 1749022 2174690 2516622
11026 2516622 3671615 4852262 5412696 5538019 4160009 -336918 -5880887 -7145376
11018 -7145376 -2686115 2069558 2184084 114961 1070077 4239435 4068107 -664634 -4498499
$$ packed form
11075E280825Q289863K192129o764370q579485k679383J742210N09754n87819
11067e96276K152996L566690m23013m664881k934414J916493K618316j509368
11059A26543m304114j804416L098477M804503J339239l515692m200704k05306
11051d661470K682252L69688k895741o53304N196568O734365K201073j984820
11043F988611k218667k342944m678581m810953l3034M232100K472176k043276
11035b434568k766825J41259J770130J036680Q13929J664861J523556M25668L41932
11026B516622J154993J180647N60434J25323j378010m496927n543969j264489
11018g145376M459261M755673J14526k069123R55116L169358j71328m732741l833865
$$ plain form
11009 -4498499 -2908050 2135109 5915899 6788579 6027536 4578143 2671419 1158598
11001 1158598 731914 518670 -654807 -2229326 -2849533 -2638510 -2654098 -2689319 -1872177
10992 -1872177 -1140547 -2332080 -4382706 -3598489 618576 3236694 -214372 -6742276
10984 -6742276 -8918432 -4406372 1265144 2267148 -605047 -2564212 -1756693 -533706
10976 -533706 -924422 -2000189 -2175605 -1744746 -1821689 -2148673 -1609644 -491597 -558213 -2348484
10966 -2348484 -3709996 -2350460 675181 1691667 -1001339 -4659195 -5114399 -1340192
10958 -1340192 3866102 6852998 5794985 1406611 -3610824 -6452276 -6872908 -7348158
10950 -7348158 -9239962 -9908375 -6047913 557458 3796699 837086 -3715727 -3472837
$$ packed form
11009d498499J590449N043159L780790Q72680p61043j449393j906724j512821
11001A158598m26684k13244j173477j574519o20207K11023j5588l5221Q17142
10992a872177P31630j191533k050626P84217M217065K618118l451066o527904
10984f742276k176156M512060N671516J002004k872195j959165Q07519J222987
10976e33706l90716j075767j75416M30859p6943l26984N39029J118047o6616j790271
10966b348484j361512J359536L025641J016486k693006l657856m55204L774207
10958a340192N206294K986896j058013m388374n017435k841452m20632m75250
10950g348158j891804o68413L860462O605371L239241k959613m552813K42890
$$ plain form
10942 -3472837 1517399 4965489 2513425 -3028384 -5820324 -4304942 -1885071 -1057374
10934 -1057374 -317610 1769324 2788442 271313 -2833825 -1468245 3085460 3780165
10926 3780165 -1515982 -5726548 -2673240 3597859 5018960 1232779 -1517375 -1027139
10918 -1027139 -1222867 -3739275 -4656165 -1475431 2622825 4124483 3976389 4324739 4644069
10909 4644069 4000594 3638175 4511050 5294504 5260766 5945025 7524700 7003296 2953757
10900 2953757 -1193660 -1899006 -505027 104645 863556 4178967 8441743 9611777 7156209
10891 7156209 4129139 2146930 422739 -808677 -284351 776797 -681932 -4709437
10883 -4709437 -7768639 -7754761 -6104802 -4102662 -943728 2942396 4480732 2514664
$$ packed form
10942c472837M990236L448090k452064n541809k791940J515382K419871Q27697
10934a057374P39764K086934J019118k517129l105138J365580M553705O94705
10926C780165n296147m210566L053308O271099J421101l786181k750154M90236
10918a027139j95728k516408r16890L180734M098256J501658j48094L48350L19330
10909D644069o43475l62419Q72875P83454l3738O84259J579675n21404m049539
10900B953757m147417p05346J393979O09672P58911L315411M262776J170034k455568
10891G156209l027070j982209j724191j231416N24326J061148j458729m027505
10883d709437l059202J3878J649959K002140L158934L886124J538336j966068
$$ plain form
10875 2514664 692225 2513142 5757616 5599053 1923861 -599850 313054 1375430
10867 1375430 -1061459 -5901483 -9382684 -9754558 -7639088 -3909010 -20279 1208564
10859 1208564 -1494022 -5123117 -6129657 -6187614 -9871582 -16447290 -19220723 -14927614
10851 -14927614 -8706266 -6516530 -7271355 -6949314 -6390953 -8968594 -12994193 -13082688 -8439096
10842 -8439096 -3827616 -2246251 -2223595 -2724315 -4928943 -7957802 -8369921 -5741985 -3754972
10833 -3754972 -3931700 -3448383 -1325153 -1269834 -5162914 -8874100 -8535680 -6371737 -5821239
10824 -5821239 -5149027 -1296800 3230721 3343954 -555329 -3031482 -1250419 2749966
10816 2749966 6749996 10413592 12623488 11345301 7150402 3479056 2413685 2628985
$$ packed form
10875B514664j822439J820917L244474j58563l675192k523711R12904J062376
10867A375430k436889m840024l481201l71874K115470L730078L888731J228843
10859A208564k702586l629095j006540n7957l683968o575708k773433M293109
10851a4927614O221348K189736p54825L22041N58361k577641m025599q8495M643592
10842h439096M611480J581365K2656n00720k204628l028859m12119K627936J987013
10833c754972j76728M83317K123230N5319l893080l711186L38420K163943N50498
10824e821239O72212L852227M527521J13233l899283k476153J781063M000385
10816B749966M000030L663596K209896j278187m194899l671346j065371K15300
$$ plain form
10808 2628985 1919872 -382708 -3421169 -5251790 -4049086 -1125223 -1251261 -6600033
10800 -6600033 -11751187 -9371127 -633649 5181823 2635132 -3378531 -5495090 -3564692
10792 -3564692 -2445868 -3487625 -3499863 -1257162 -22498 -2431383 -6299398 -7453154
10784 -7453154 -4843025 -1147951 615788 -248775 -2132009 -2740642 -1200281 894978
10776 894978 1365462 753945 2026064 5756078 7766661 4252036 -2222140 -5473051 -3986189
10767 -3986189 -2295411 -3459341 -4598052 -1990174 3208338 7135266 8024171 6066902
10759 6066902 1617358 -3252305 -4475236 -1033699 2466442 2116442 497992 1565544
10751 1565544 3141358 695089 -3928312 -4845739 -2017388 -1116997 -3503346 -4217199 -1368217
$$ packed form
10808B628985p09113k302580l038461j830621J202704K923863j26038n348772
10800f600033n151154K380060Q737478N815472k546691o013663k116559J930398
10792c564692J118824j041757j2238K242701J234664k408885l868015j153756
10784g453154K610129L695074J763739q64563j883234o08633J540361K095259
10776H94978M70484o11517J272119L730014K010583l514625o474176l250911J486862
10767c986189J690778j163930j138711K607878N198512L926928Q88905j957269
10759F066902m449544m869663j222931L441537L500141l50000j618450J067552
10751A565544J575814k446269m623401r17427K828351R00391k386349p13853K848982
$$ plain form
10742 -1368217 211087 -2509388 -5460476 -4422896 -1570295 -1111464 -3080153 -5182895
10734 -5182895 -6760836 -7560114 -6308038 -3434501 -1554597 -966908 1040904 4270502
10726 4270502 4291789 -38705 -3447079 -2514542 -1294927 -3689047 -5802972 -2389965 3428716
10717 3428716 4170456 -906801 -5691338 -6632965 -5631733 -4258081 -1535628 1980750
10709 1980750 3380293 1977441 732873 1997968 4912162 7617584 9249284 9317653
10701 9317653 7750274 6007553 5826958 6361790 4678060 -39836 -4277691 -3485311 2516752
10692 2516752 8289720 8118343 2797348 -920554 921080 3986337 2171247 -2998263
10684 -2998263 -4814573 -1886341 354752 -1034290 -2582251 -1656617 -1021537 -3028278
$$ packed form
10742a368217J579304k720475k951088J037580K852601M58831j968689k102742
10734e182895j577941p99278J252076K873537J879904N87689K007812L229598
10726D270502K1287m330494l408374R32537J219615k394120k113925L413007N818681
10717C428716P41740n077257m784537r41627J001232J373652K722453L516378
10709A980750J399543j402852j244568J265095K914194K705422J631700O8369
10701I317653j567379j742721j80595N34832j683730m717896m237855P92380O002063
10692B516752N772968j71377n320995l717902J841634L065257j815090n169510
10684b998263j816310K928232K241093j389042j547961R25634O35080k006741
$$ plain form
10676 -3028278 -5062181 -4504326 -3292288 -3819509 -4679470 -3907269 -2249288 -279351 3072605
10667 3072605 6316138 5239195 384342 -1327688 3097019 6843294 3350191 -3225004
10659 -3225004 -4341005 302112 3583695 1791798 -2009424 -4159156 -4494857 -4726089
10651 -4726089 -6289196 -9014058 -10109402 -6847238 -1475157 541682 -1465944 -2506460
10643 -2506460 -935652 -1512399 -6209024 -9366876 -6767523 -2426329 -829227 542035
10635 542035 4605464 7557101 5659958 2844341 3750648 5015605 1673213 -3195226
10627 -3195226 -3897932 -2428120 -4322649 -8164688 -8185423 -4357614 -1631160 -1678858 -2651586
10618 -2651586 -4070757 -5155638 -2155532 5602555 11284179 9403935 4409163 2928590
$$ packed form
10676c028278k033903N57855J212038n27221q59961P72201J657981J969937L351956
10667C072605L243533j076943m854853j712030M424707L746275l493103o575195
10659c225004j116001M643117L281583j791897l801222k149732l35701k31232
10651d726089j563107k724862j095344L262164N372081K016839k007626j040516
10643b506460J570808n76747m696625l157852K599353M341194J597102J371262
10635E42035M063429K951637j897143k815617R06307J264957l342392m868439
10627c195226p02706J469812j894529l842039k0735L827809K726454m7698r72728
10618b651586j419171j084881L000106P758087N681624j880244m994772j480573
$$ plain form
10610 2928590 2902069 -957734 -6272461 -7292712 -5575625 -6469505 -8776880 -7625865 -4143478
10601 -4143478 -2948132 -3552940 -3105843 -3435482 -6451305 -7626763 -3621980 -706745 -5133147
10592 -5133147 -11155985 -10149087 -5471484 -5537047 -8160014 -5955592 -1899660 -4046334
10584 -4046334 -8993847 -6851318 314294 1590576 -3178830 -3804740 993873 1770883
10576 1770883 -3546169 -6306732 -3765258 -3399325 -7974234 -10843237 -9110006 -8194006
10568 -8194006 -10648118 -12569337 -12676958 -13326212 -12532156 -7209763 -3085624 -7856792 -16169866
10559 -16169866 -16169150 -9195172 -6973642 -10947831 -11859604 -8684086 -9102258 -11299880 -5344769
10550 -5344769 5929496 7913399 -1054610 -6163816 -1000286 4175026 3301939 3311293 6636095
$$ packed form
10610B928590k6521l859803n314727j020251J717087q93880k307375J151015L482387
10601d143478J195346o04808M47097l29639l015823j175458M004783K915235m426402
10592e133147o022838J006898M677603o5563k622967K204422M055932k146674
10584d046334m947513K142529P165612J276282m769406o25910M798613P77010
10576A770883n317052k760563K541474L65933m574909k869003J733231R16000
10568h194006k454112j921219j07621o49254P94056N322393M124139m771168q313074
10559a6169866P16O973978K221530l974189r11773L175518m18172k197622N955111
10550e344769J1274265J983903q968009n109206N163530N175312q73087R354L324802
$$ plain form
10541 6636095 4965798 -3121835 -7272732 -4363943 -3962759 -9216503 -11179448 -7636048
10533 -7636048 -8063711 -14139821 -15178535 -8826210 -6087839 -9956167 -9850335 -3166920
10525 -3166920 -908875 -5993285 -8055365 -5417988 -8934300 -18426962 -20038613 -12852578
10517 -12852578 -12134420 -20256020 -22142810 -15530562 -15704356 -23774706 -22831966 -12798850
10509 -12798850 -13692283 -26038677 -26697826 -13640023 -12483329 -27035908 -30145249 -17873219
10501 -17873219 -20872627 -43914700 -51440688 -35839395 -36168669 -60499065 -62631928 -34316774
10493 -34316774 -36898572 -87501839 -110475868 -84222933 -131199890 -329558651 -515483030
10486 -515483030 -447971546 -146873586 109700122 142891847 59970816 35356198 70356506
$$ packed form
10541F636095j670297q087633m150897K908789M01184n253744j962945L543400
10533g636048m27663o076110j038714O352325K738371l868328J05832O683415
10525c166920K258045n084410k062080K637377l516312r492662j611651P186035
10517a2852578P18158q121600j886790O612248j73794q070350R42740J0033116
10509a2798850q93433j2346394o59149J3057803J156694j4552579l109341J2272030
10501a7873219k999408k3042073p525988J5601293l29274k4330396k132863K8315154
10493c4316774k581798n0603267k2974029K6252935m6976957j98358761j85924379
10486e15483030O7511484L01097960K56573708L3191725q2921031k4614618L5000308
$$ plain form
10479 70356506 70232964 31500066 21386491 43166348 44112443 21014426 16584178 32561061
10471 32561061 32398910 16199867 17510109 34927050 34618850 15379561 9877190 23707312
10463 23707312 29001344 18368176 14015396 21559234 21699051 11082611 8694281 17608709
10455 17608709 19484823 10990392 9047840 15905105 14105592 1181253 -3732076 6101720
10447 6101720 14704788 13004099 10650131 12659317 10972321 5081630 6018317 14133556
10439 14133556 16322304 10192220 8230756 13639394 14867902 8878846 7160264 12976049
10431 12976049 14632320 7988929 4807582 11195898 16968062 14333698 9728745 9428859
10423 9428859 9420680 6769107 6224046 8908031 8232537 2845527 433297 3631584 5119292
$$ packed form
10479G0356506j23542l8732898j0113575K1779857R46095k3098017m430248J5976883
10471C2561061j62151j6199043J310242J7416941l08200j9239289n502371J3830122
10463B3707312N294032j0633168m352780P543838J39817j0616440k388330Q914428
10455A7608709J876114q494431j942552O857265j799513j2924339m913329R833796
10447F101720Q603068j700689k353968K009186j686996n890691R36687Q115239
10439A4133556K188748o130084j961464N408638J228508n989056j718582N815785
10431A2976049J656271o643391l181347O388316N772164k634364m604953k99886
10423I428859q179k651573n45061K683985o75494n387010k412230L198287J487708
$$ plain form
10414 5119292 1288269 -1852178 -461492 1796439 3490006 7917689 12964489 11393774
10406 11393774 4186774 599433 2350596 1462961 -3444698 -3631664 2825233 5572184
10398 5572184 -619363 -6873048 -5379660 -772407 846145 2293052 6778745 9561067
10390 9561067 6560720 2757945 4101011 7992385 8690156 6285347 4457493 4163084
10382 4163084 4004212 2841208 -275772 -4483365 -5192599 411584 6683678 5698730 -738080
10373 -738080 -3838889 -1694024 -286990 -788645 2678375 10728366 15427143 12744778
10365 12744778 8360046 7350101 7153829 4557899 1496354 326710 344172 1249765 3305091
10356 3305091 3419117 -1097768 -5163789 -1694340 5567277 5981394 -713461 -3366650
$$ packed form
10414E119292l831023l140447J390686K257931J693567M427683N046800j570715
10406A1393774p207000l587341J751163q87635m907659j86966O456897K746951
10398E572184o191547o253685J493388M607253J618552J446907M485693K782322
10390I561067l000347l802775J343066L891374O97771k404809j827854k94409
10382D163084j58872j163004l116980m207593p09234N604183O272094r84948o436810
10373g38080l100809K144865J407034n01655L467020Q049991M698777k682365
10365A2744778m384732j009945j96272k595930l061545j169644J7462R05593K055326
10356C305091J14026m516885m066021L469449P261617M14117o694855k653189
$$ plain form
10348 -3366650 2223944 6756836 3392705 -1848522 -1354966 2919088 5577584 6028580
10340 6028580 5181445 2192250 -890131 587098 5124047 5286363 94908 -2429877
10332 -2429877 1145343 4019549 1822875 109589 3171436 5780570 3163420 -331395
10324 -331395 -22107 551999 -2288933 -4039230 -119465 4987328 5160723 2913693 4041557
10315 4041557 7435340 8007795 5224498 1966219 -673997 -1661994 1771959 8373024
10307 8373024 10693595 4828752 -2664684 -3417666 2105133 8000267 11516032 12596146
10299 12596146 10477753 6883437 7310799 12960679 16515492 12106345 4279702 690064
10291 690064 1150349 879037 -295969 438884 1926475 1161226 -417179 643587 3395215
$$ packed form
10348c366650N590594M532892l364131n241227M93556M274054K658496M50996
10340F028580q47135k989195l082381J477229M536949J62316n191455k524785
10332b429877L575220K874206k196674j713286L061847K609134k617150l494815
10324c31395L09288N74106k840932j750297L919765N106793J73395k247030J127864
10315D041557L393783N72455k783297l258279k640216r87997L433953O601065
10307H373024K320571n864843p493436p52982N522799N895134L515765J080114
10299A2596146k118393l594316M27362N649880L554813m409147p826643l589638
10291F90064M60285k71312j175006P34853J487591p65249j578405J060766K751628
$$ plain form
10282 3395215 4129642 2102333 -1049444 -4703671 -7893326 -8108006 -5435262 -3785551
10274 -3785551 -4322295 -2919062 1782439 4193091 990817 -2175365 187497 3966854
10266 3966854 2701217 -1640476 -3550183 -4233242 -7512838 -9831303 -4707936 5158985
10258 5158985 10138461 7163685 2401981 1035626 2271503 4151806 6000113 6252187
10250 6252187 4345987 4074301 8734305 14157335 13339465 6901028 1899228 1144254 1055535
10241 1055535 -342515 -970353 -596089 -1818662 -4187170 -4151066 -1963068 -1983881 -4790393
10232 -4790393 -5648555 -2750388 -499119 -1907269 -3564966 -1498588 2784466 5518161
10224 5518161 5962151 5165649 2864399 -908569 -3569274 -2700166 261162 1585289 -175649
$$ packed form
10282C395215P34427k027309l151777l654227l189655k14680K672744J649711
10274c785551n36744J403233M701501K410652l202274l166182K362862L779357
10266C966854j265637m341693j909707o83059l279596k318465N123367R866921
10258E158985M979476k974776m761704j366355J235877J880303J848307K52074
10250F252187j906200k71686M660004N423030q17870o438437n001800p54974q8719
10241A055535j398050o27838L74264j222573k368508L6104K187998k0813k806512
10232d790393q58162K898167K251269j408150j657697K066378M283054K733695
10224E518161M43990p96502k301250l772968k660705Q69108K961328J324127j760938
$$ plain form
10215 -175649 -2878167 -3651362 -2031086 -279290 -642958 -2195819 -1416068 3148078 8075013
10206 8075013 8745732 5112723 1882266 3010980 7337315 9850862 7001331 1045539
10198 1045539 -1604400 2066470 6908373 5637102 -1031194 -5034294 -2307430 2205469
10190 2205469 3014406 1654707 2018506 3419312 3293597 2726785 4137037 6682124 8627909
10181 8627909 10935430 13861982 13768087 8567557 2646355 631782 -5020 -3803984 -8624311
10172 -8624311 -9596636 -8539088 -10867755 -15111055 -14585312 -8944450 -5105725 -6093008 -7434084
10163 -7434084 -5947179 -3986654 -3003900 -642154 3128169 4104811 1066952 -1585501
10155 -1585501 -1357490 -1494906 -4090526 -5580840 -2924989 1350662 4173703 6605718
$$ packed form
10215a75649k702518p73195J620276J751796l63668j552861P79751M564146M926935
10206H075013O70719l633009l230457J128714M326335K513547k849531n955792
10198A045539k649939L670870M841903j271271o668296m003100K726864M512899
10190B205469Q08937j359699L63799J400806j25715n66812J410252K545087J945785
10181H627909K307521K926552r3895n200530n921202k014573o36802l798964m820327
10172h624311r72325J057548k328667m243300N25743N640862L838725r87283j341076
10163g434084J486905J960525R82754K361746L770323R76642l037859k652453
10155a585501K28011j37416k595620j490314K655851M275651K823041K432015
$$ plain form
10147 6605718 9447460 9623915 5889695 3315536 6398504 11326206 10891444 4628780
10139 4628780 -1364040 -3041744 -1936846 -1128704 -1947452 -4071070 -5577425 -3815917
10131 -3815917 919053 4107892 2496513 -911914 -1007296 1928841 3305318 2008010
10123 2008010 2167808 6332403 11182755 12203109 9769340 8008667 8961411 10316925
10115 10316925 9040963 5567072 3138891 3354201 4122835 3176692 1890800 2841118 4375074
10106 4375074 1756095 -5179952 -9745694 -6695634 463712 4298524 3262371 2153681
10098 2153681 3963460 6317504 6539660 5695215 5765683 6181242 5472083 4175889 4058162
10089 4058162 5925219 9580931 14254957 17781560 17425762 13364247 9454124 8435573
$$ packed form
10147F605718K841742J76455l734220k574159L082968M927702m34762o262664
10139D628780n992820j677704J104898Q08142q18748k123618j506355J761508
10131c815917M734970L188839j611379l408427r5382K936137J376477j297308
10123B008010J59798M164595M850352J020354k433769j760673R52744J355514
10115A0316925j275962l473891k428181K15310P68634r46143j285892R50318J533956
10106D375074k618979o936047m565742L050060P159346L834812j036153j108690
10098B153681J809779K354044K22156q44445P0468M15559p09159j296194j17727
10089D058162J867057L655712M674026L526603l55798m061515l910123j018551
$$ plain form
10081 8435573 8298059 6071141 3260031 3636394 6627146 7553835 4880436 2467970 2861614
10072 2861614 3019003 136095 -2192338 1265717 8453777 11517670 7325954 1455535
10064 1455535 259117 3261741 5846729 5983309 4919526 3417651 1099035 -1196862
10056 -1196862 -1859611 -1613787 -3199469 -6816165 -8401244 -4660189 1603381 4062570
10048 4062570 848456 -2885980 -1779064 2890318 5877290 5617057 5087365 5553127 4571513
10039 4571513 1681678 799139 3480512 4510417 -538036 -6861312 -6219970 583504
10031 583504 4407740 1134945 -3055887 -1765027 3116979 6507521 7893514 9275985
10023 9275985 9838025 8006934 5832867 6029385 6661285 3990897 -570504 -1660381 1874330
$$ packed form
10081H435573j37514k226918k811110L76363K990752R26689k673399k412466L93644
10072B861614J57389k882908k328433L458055P188060L063893m191716n870419
10064A455535j196418L002624K584988J36580j063783j501875k318616k295897
10056a196862o62749K45824j585682l616696j585079L741055O263570K459189
10048D062570l214114l734436J106916M669382K986972k60233n29692M65762r81614
10039D571513k889835q82539K681373J029905n048453o323276O41342O803474
10031E83504L824236l272795m190832J290860M882006L390542J385993J382471
10023I275985N62040j831091k174067J96518O31900k670388m561401j089877L534711
$$ plain form
10014 1874330 4910554 3271449 -1040128 -3640941 -3531025 -2584507 -1546836 393076
10006 393076 2783635 3609187 2453505 1655111 2668509 2964379 -659188 -6168871 -7293404
9997 -7293404 -1746762 4825394 5712296 1345684 -2629758 -3265036 -2077585 -284614 2810572
9988 2810572 6505937 8147856 6883211 4741490 3473846 3209268 3996910 5329415 4761159
9979 4761159 986280 -2549480 -1915459 354453 -1397092 -6109331 -6869769 -2475058 62518
9970 62518 -2828725 -5367943 -2519444 1594812 1108017 -2234907 -3583075 -3434533 -4728753
9961 -4728753 -5889354 -3845871 -708556 -614578 -2407694 -1821370 1015811 2079295 -201603
9952 -201603 -4059353 -7771629 -9379890 -5955028 1849339 7731561 7609887 5970577 8377904
$$ packed form
10014A874330L036224j639105m311577k600813J09916R46518J037671J939912
10006C93076K390559Q25552j155682p98394J013398K95870l623567n509683j124533
9997g293404N546642O572156Q86902m366612l975442o35278J187451J792971L095186
9988B810572L695365J641919j264645k141721j267644k64578P87642J332505n68256
9979D761159l774879l535760O34021K269912j751545m712239p60438M394711K537576
9970F2518k891243k539218K848499M114256m86795l342924j348168J48542j294220
9961d728753j160601K043483L137315R3978j793116N86324K837181J063484k280898
9952b01603l857750l712276j608261L424862P804367N882222j21674j639310K407327
$$ plain form
9943 8377904 11745934 9571176 3321056 -158457 -288611 -2446589 -7013133 -8298388
9935 -8298388 -4849729 -1739340 -1252888 18234 2855541 2795300 -1153610 -3172824 87100
9926 87100 4027014 4282975 3826298 6659711 9984063 8741146 4173229 1766237 2725871
9917 2725871 2940168 -197118 -4283393 -5644866 -3679023 -571015 1847967 3869711
9909 3869711 6376596 8192431 6769296 2380712 -624814 1025573 4971699 6490196
9901 6490196 4625809 2123504 1011266 1529803 3664777 6228462 6377859 3766275 2715320
9892 2715320 5942931 9159601 7457701 4005836 5248357 9619645 9351531 3007423
9884 3007423 -2097065 -748428 4402611 8826946 10650854 8532852 2546539 -2249442
$$ packed form
9943H377904L368030k174758o250120l479513j30154k157978m566544j285255
9935h298388L448659L110389M86452J271122K837307o0241l948910k019214L259924
9926H7100L939914K55961m56677K833413L324352j242917m567917k406992R59634
9917B725871K14297l137286m086275j361473J965843L108008K418982K021744
9909C869711K506885J815835j423135m388584l005526J650387L946126J518497
9901F490196j864387k502305j112238N18537K134974K563685J49397k611584j050955
9892B715320L227611L216670j701900l451865J242521M371288k68114o344108
9884C007423n104488J348637N151039M424335J823908k118002n986313m795981
$$ plain form
9876 -2249442 -1430976 -999390 -11497749 -30036793 -39286285 -29664956 -12666147 -5225522
9868 -5225522 -9328564 -14952333 -15811604 -12982281 -8070747 -2190341 896293 -1561443
9860 -1561443 -6052411 -7067459 -4447085 -1385625 1729670 5759419 8175747 6258007
9852 6258007 2659526 1886318 3303745 3310681 2191179 2693781 3720197 1917118 -1606036
9843 -1606036 -2553441 -911724 -967736 -3796598 -5648658 -4632243 -3642199 -5085645 -6984256
9834 -6984256 -6178757 -2524824 1423368 3099125 2055693 756980 2221085 5445350
9826 5445350 5532502 720264 -3870926 -3196138 220720 672732 -1735186 -2682760 -2241294
9817 -2241294 -4525905 -8973725 -9507192 -4014702 1996837 3726606 3090095 3267584 2885628
$$ packed form
9876b249442Q18466M31586j0498359j8539044r249492R621329J6998809P440625
9868e225522m103042n623769q59271K829323M911534N880406L086634k457736
9860a561443m490968j015048K620374L061460L115295M029749K416328j917740
9852F258007l598481p73208J417427O936j119502N02602J026416j803079l523154
9843a606036r47405J641717n6012k828862j852060J016415R90044j443446j898611
9834f984256Q05499L653933L948192J675757j043432j298713J464105L224265
9826E445350Q7152m812238m591190O74788L416858M52012k407918r47574M41466
9817b241294k284611m447820n33467N492490O011539J729769o36511J77489l81956
$$ plain form
9808 2885628 97325 -1947227 855534 6478980 8935956 6621545 3902958 4174592
9800 4174592 5247028 3029317 -2833374 -8840036 -11774442 -11199712 -8304810 -4063314
9792 -4063314 647675 4043453 4087573 651937 -3720226 -5825846 -4339352 -330846 3838983
9783 3838983 5678101 3754036 -881488 -4630284 -3979750 1073600 6450554 7398526 2913597
9774 2913597 -3276203 -6544097 -5945226 -4016506 -2370505 138074 3841134 5603569
9766 5603569 2442199 -3877568 -8802219 -10333761 -9540364 -7307146 -4335009 -3101840
9758 -3101840 -5240627 -7464961 -4971693 1059646 4481920 3172614 1510378 2710192
9750 2710192 4502320 4620812 4973004 7290308 9551380 9942370 9831294 9727808 7059380
$$ packed form
9808B885628k788303k044552K802761N623446K456976k314411k718587K71634
9800D174592J072436k217711n862691o006662k934406N74730K894902M241496
9792d063314M710989L395778M4120l435636m372163k105620J486494M008506M169829
9783C838983J839118j924065m635524l748796O50534N053350N376954R47972m484929
9774B913597o189800l267894N98871J928720J646001K508579L703060J762435
9766E603569l161370o319767m924651j531542P93397K233218K972137J233169
9758c101840k138787k224334K493268O031339L422274j309306j662236J199814
9750B710192J792128J18492L52192K317304K261072L90990j11076j03486k668428
$$ plain form
9741 7059380 1426265 -2712126 -2487334 -1231665 -2695788 -5247428 -5920068 -5376806 -4423165
9732 -4423165 -916417 4655648 6215163 1158898 -3073776 864339 8324813 9436051
9724 9436051 3672328 -1742494 -4569778 -8060885 -10714793 -7083737 946582 4786416
9716 4786416 2633724 1724391 4764372 5106941 -424457 -4668690 -2329000 478226 -3137039
9707 -3137039 -8332778 -5915055 2979465 8960583 8167554 5196464 3598719 1602299
9699 1602299 -2279836 -6024807 -7730678 -7506587 -4908947 907202 7485504 9916194
9691 9916194 7094040 3633372 3718759 5969036 6371637 3768371 -25557 -3749297 -7411584
9682 -7411584 -9996793 -9242136 -4661154 757117 3165813 1701347 -1108793 -2386265
$$ packed form
9741G059380n633115m138391K24792J255669j464123k551640o72640N43262R53641
9732d423165L506748N572065J559515n056265m232674L938115P460474J111238
9724I436051n763723n414822k827284l491107k653908L631056Q030319L839834
9716D786416k152692r09333L039981L42569n531398m244233K339690K807226l615265
9707c137039n195739K417723Q894520N981118p93029k971090j597745j996420
9699A602299l882135l744971j705871K24091K597640N816149O578302K430690
9691I916194k822154l460668Q5387K250277M02601k603266l793928l723740l662287
9682g411584k585209P54657M580982N418271K408696j464466k810140j277472
$$ plain form
9674 -2386265 -1523150 -63220 97886 -1468672 -2856685 -1220948 3677692 7943474 7693476
9665 7693476 4499175 3809521 7428423 10975450 10470895 8002501 7969856 10402353 11536577
9656 11536577 9337922 5115533 923853 -1584750 -1018053 1945310 3827348 2445609
9648 2445609 333482 980839 3474959 4572755 4181624 4276497 4009561 1215984 -2124294
9639 -2124294 -1693967 1944607 3676415 1781640 -430076 -1886138 -6000445 -13059599
9631 -13059599 -16587127 -11614541 -2201351 3680186 3679976 1605301 984102 1947935 2988498
9622 2988498 2681665 601979 -1472755 -530405 4008962 9150117 11937605 12207798 10824157
9613 10824157 7819009 3710075 207402 -1740163 -2331693 -831254 3495923 7549888
$$ packed form
9674b386265Q63115J459930J61106j566558j388013J635737M898640M265782k49998
9665G693476l194301o89654L618902L547027n04555k468394l2645K432497J134224
9656A1536577k198655m222389m191680k508603N66697K963363J882038j381739
9648B445609k112127O47357K494120J097796l91131R4873k66936k793577l340278
9639b124294M30327L638574J731808j894775k211716j456062m114307p059154
9631a3059599l527528M972586R413190N881537k10k074675o21199R63833J040563
9622B988498l06833k079686k074734R42350M539367N141155K787488K70193j383641
9613A0824157l005148m108934l502673j947565n91530J500439M327177M053965
$$ plain form
9605 7549888 5974295 -1236501 -6921029 -5508584 98060 3555345 3313698 2008854
9597 2008854 914514 -449900 -1362558 -978560 -990031 -3299698 -6083390 -5693398 -1744526
9588 -1744526 2605538 4619858 3879907 1557133 -5247 1206509 3571497 2470078
9580 2470078 -3115893 -7582617 -5831420 -552962 1889435 269655 -1727393 -2330477
9572 -2330477 -2620051 -2043172 912489 3917750 2695603 -1809386 -3856534 -1450996 1130854
9563 1130854 828205 167508 1669556 3008815 1223059 -2084988 -3282035 -1723698 588858
9554 588858 1902027 936928 -3031371 -7866086 -9071543 -5232153 -388738 1547872 1844619
9545 1844619 3367453 5034454 3999338 1157698 -167808 138663 -800529 -3522507 -5509697
$$ packed form
9605G549888j575593p210796n684528J412445N606644L457285k41647j304844
9597B008854j094340j364414r12658L83998j1471k309667k783692L89992L948872
9588a744526M350064K014320p39951k322774j562380J211756K364988j101419
9580B470078n585971m466724J751197N278458K442397j619780j997048o03084
9572b330477k89574N76879K955661L005261j222147m504989k047148K405538K581850
9563A130854l02649o60697J502048J339259j785756l308047j197047J558337K312556
9554E88858J313169r65099l968299m834715j205457L839390M843415J936610K96747
9545A844619J522834J667001j035116k841640j325506L06471r39192k721978j987190
$$ plain form
9536 -5509697 -5844554 -6244386 -6830786 -5166011 -969439 2084890 1451450 -558497 -572253
9527 -572253 957317 1423451 603160 485308 1653250 2550711 1880658 -247057 -2835164
9518 -2835164 -3869049 -965120 5289674 9716861 7588454 1117658 -2514657 -143887
9510 -143887 3832718 4135438 1294033 -750837 -795624 -626339 -690082 740288 4117825
9501 4117825 7269551 8122519 6849815 4832789 3000794 1529767 12262 -2096611
9493 -2096611 -4249147 -4668843 -2832411 -1073761 -1585132 -2809191 -1752705 787057 1187982
9484 1187982 -645136 -563311 2617325 4147369 934401 -2415801 -304408 4387582 4158708
9475 4158708 -1109954 -3461050 690460 4650233 1598251 -5200140 -7595998 -3976910
$$ packed form
9536e509697l34857l99832n86400J664775M196572L054329o33440k009947j3756
9527e72253J529570M66134q20291j17852J167942Q97461o70053k127715k588107
9518b835164j033885K903929O254794M427187k128407o470796l632315K370770
9510a43887L976605L02720k841405k044870m4787J69285o3743J430370L377537
9501D117825L151726Q52968j272704k017026j831995j471027j517505k108873
9493b096611k152536m19696J836432J758650n11371j224059J056486K539762M00925
9484A187982j833118Q1825L180636J530044l212968l350202K111393M691990k28874
9475D158708n268662k351096M151510L959773l051982o798391k395858L619088
$$ plain form
9467 -3976910 491242 2699701 4303951 6171032 6250320 3972642 1608025 -206734 -3444973
9458 -3444973 -7388877 -7505044 -2630975 1584177 662596 -1467413 1404847 7516940 9302293
9449 9302293 4393756 -1768556 -4140030 -3104375 -875234 1516289 2496196 428643
9441 428643 -2659158 -2658403 -59728 77710 -3677946 -6814390 -6890592 -7252869 -9376025 -8689389
9431 -8689389 -3331597 -64055 -4063004 -8747124 -4934109 4157756 7476209 3284082
9423 3284082 346965 2069410 1441192 -5124582 -10059758 -6633328 251260 2525887
9415 2525887 1395825 3257517 7972811 9644731 6584619 2769402 454476 -1679450
9407 -1679450 -3237554 -1634296 2097322 2879021 -1046867 -5068601 -4910953 -2405645 -1649506
$$ packed form
9467c976910M468152K208459J604250J867081P9288k277678k364617j814759l238239
9458c444973l943904j16167M874069M215152r21581k130009K872260O112093J785353
9449I302293m908537o162312k371474J035655K229141K391523R79907k067553
9441D28643l087801P55K598675J37438l755656l136444p6202l62277k123156O86636
9431h689389N357792L267542l998949m684120L813015R091865L318453m192127
9423C284082k937117J722445o28218o565774m935176L426430O884588K274627
9415B525887j130062J861692M715294J671920l060112l815217k314926k133926
9407a679450j558104J603258L731618P81699l925888m021734J57648K505308P56139
$$ plain form
9398 -1649506 -2547455 -1777766 1464265 4193019 3838551 1056646 -1985542 -4057489 -4884031
9389 -4884031 -4323834 -2653956 -752864 1038333 3494647 6743311 8547611 6133030
9381 6133030 -34606 -5814391 -7376802 -4607683 -261003 2908998 3718508 2822608 2149833
9372 2149833 2695541 2569215 -692253 -5454983 -6674278 -2652313 2128892 3110766 1257208
9363 1257208 -363343 -2031925 -5191790 -7757115 -6742114 -3676795 -2258499 -2203513 -853857
9354 -853857 658271 -776727 -3099101 -882941 5264879 8330329 5471066 2003435
9346 2003435 2496704 4701517 5517304 6419514 8769550 9583601 6777257 3682040 3545661
9337 3545661 4117351 2619847 1574751 4078371 7245824 6510766 3383543 2678360 4389704
$$ packed form
9398a649506q97949P69689L242031K728754l54468k781905l042188k071947q26542
9389d884031N60197J669878J901092J791197K456314L248664J804300k414581
9381F133030o167636n779785j562411K769119M346680L170001Q09510q95900o72775
9372B149833N45708j26326l261468m762730j219295M021965M781205R81874j853558
9363A257208j620551j668582l159865k565325J015001L065319J418296N4986J349656
9354h53857J512128j434998k322374K216160O147820L065450k859263l467631
9346B003435M93269K204813Q15787R02210K350036Q14051k806344l095217j36379
9337C545661N71690j497504j045096K503620L167453p35058l127223p05183J711344
$$ plain form
9328 4389704 4648207 3050994 2599782 3170599 1377629 -2855540 -5302061 -3903561 -1399500
9319 -1399500 -450789 -500902 -771110 -2324893 -5201955 -6624364 -4355780 -53229 2561430
9310 2561430 1924594 -244552 -1635809 -2141744 -3281943 -4952884 -4474157 -600163 3190040
9301 3190040 2818290 125391 743908 5460700 9060710 8725318 7483932 7248660 5168148
9292 5168148 489543 -1829180 532103 1765880 -2919518 -8613531 -8428893 -4449542
9284 -4449542 -2670732 -1963565 2260753 7198445 6241253 1299363 490709 4230837 4759329
9275 4759329 79313 -2865511 -901221 443432 -2021908 -3610567 -1650417 -1080203
9267 -1080203 -4710622 -6983254 -3861151 -702517 -2945428 -6192684 -3841464 1238093
$$ packed form
9328D389704K58503j597213m51212N70817j792970m233169k446521J398500K504061
9319a399500R48711n0113k70208j553783k877062j422409K268584M302551K614659
9310B561430o36836k169146j391257n05935j140199j670941M78727L873994L790203
9301C190040l71750k692899O18517M716792L600010l35392j241386k35272k080512
9292E168148m678605k318723K361283J233777m685398n694013J84638L979351
9284d449542J778810P07167M224318M937692r57192m941890q08654L740128N28492
9275D759329m680016k944824J964290J344653k465340j588659J960150N70214
9267a080203l630419k272632L122103L158634k242911l247256K351220N079557
$$ plain form
9259 1238093 1507314 -2843756 -5111931 -3320349 -2064847 -4098276 -7133000 -8844430
9251 -8844430 -9190343 -7831047 -4381806 -1194800 -1299124 -3607903 -4295554 -2715596 -1864915
9242 -1864915 -3046583 -4152764 -3685204 -2777185 -2307136 -1086732 1737553 4534762 4789001
9233 4789001 2056001 -1249767 -1978069 419188 2880149 2331518 -139139 -1073135 -266867
9224 -266867 -877643 -3338251 -3904765 -1370064 -280289 -3767273 -7545860 -5962588 -668688
9215 -668688 2379172 2344787 3796899 8218011 11092479 8468524 2039805 -3703526 -6329125
9206 -6329125 -6439021 -6068266 -6698604 -7399262 -5536470 -987199 1979328 -184672 -4836568
9197 -4836568 -6402618 -4139727 -2524561 -4021664 -5752129 -4433831 -1028295 1391892
$$ packed form
9259A238093K69221m351070k268175J791582J255502k033429l034724j711430
9251h844430l45913J359296L449241L187006j04324k308779o87651J579958Q50681
9242a864915j181668j106181M67560R08019M70049J220404K824285K797209K54239
9233D789001k733000l305768p28302K397257K460961n48631k470657r33996Q06268
9224b66867o10776k460608n66514K534701J089775l486984l778587J583272N293900
9215f68688L047860l4385J452112M421112K874468k623955o428719n743331k625599
9206f329125j09896L70755o30338p00658J862792M549271K966527k164000m651896
9197d836568j566050K262891J615166j497103j730465J318298L405536K420187
$$ plain form
9189 1391892 1971892 2312508 3597845 4926092 4323250 1172772 -2419110 -3618939 -2582471
9180 -2582471 -2498136 -5038280 -8000134 -9014033 -8973630 -9413073 -9222687 -7283342 -5913554
9171 -5913554 -7571566 -9893472 -8495717 -3625580 449036 1902737 2600079 3335240 2676605
9162 2676605 787856 -183382 -15678 -368562 -520963 2048094 6075732 6585530 2056896
9153 2056896 -3219987 -5708154 -6793511 -8279496 -8623937 -6667113 -4708710 -4391102 -3379244
9144 -3379244 144185 3176720 2171751 -1252307 -2993788 -2467481 -1898592 -1805756 -1359602
9135 -1359602 -1394709 -2784542 -3373976 -1011655 1560280 -327875 -5863802 -9120205 -7153902
9126 -7153902 -3233841 -1111726 -343304 1051865 2848929 3635728 3102212 1709753 139436
$$ packed form
9189A391892N80000L40616J285337J328247o02842l150478l591882j199829J036468
9180b582471Q4335k540144k961854j013899M0403m39443J90386J939345J369788
9171e913554j658012k321906J397755M870137M074616J453701O97342P35161o58635
9162B676605j888749r71238J67704l52884j52401K569057M027638N09798m528634
9153B056896n276883k488167j085357j485985l44441J956824J958403L17608J011858
9144c379244L523429L032535j004969l424058j741481N26307N68889R2836M46154
9135a359602l5107j389833n89434K362321K571935j888155n535927l256403J966303
9126g153902L920061K122115P68422J395169J797064P86799n33516j392459j570317
$$ plain form
9117 139436 23809 2750652 6520221 7377235 4577027 2116309 3196520 6036946 7352925
9108 7352925 6987061 6093745 3551541 -1664734 -6328868 -5931668 -1405835 1529381 -29485
9099 -29485 -3548282 -6627245 -10211026 -14180615 -14641490 -9475852 -3036366 -727711 -1408440
9090 -1408440 -261264 2434505 1425411 -4483264 -9552969 -9236403 -5991861 -3915451
9082 -3915451 -2074738 2367405 7422585 7949237 3194312 -1866200 -3022776 -1122278
9074 -1122278 729995 1078309 11150 -2361895 -5591471 -8295564 -9187329 -8182935 -5988001
9065 -5988001 -3148973 204427 3979706 7295381 7992061 4314876 -1897223 -5252339
9057 -5252339 -2118192 4837922 9378705 8319511 3490549 -1869235 -5794991 -7038110
$$ packed form
9117A39436j15627K726843L769569Q57014k800208k460718J080211K840426J315979
9108G352925l65864q93316k542204n216275m664134L97200M525833K935216j558866
9099b9485l518797l078963l583781l969589m60875N165638O439486K308655o80729
9090a408440J147176K695769j009094n908675n069705L16566L244542K076410
9082c915451J840713M442143N055180N26652m754925n060512j156576J900498
9074a122278J852273L48314j067159k373045l229576k704093q91765J004394K194934
9065e988001K839028L353400L775279L315675O96680l677185o212099l355116
9057e252339L134147O956114M540783j059194m828962n359784l925756j243119
$$ plain form
9049 -7038110 -5118255 -1721738 425993 869707 1573300 3448415 5126519 5584980 5319611
9040 5319611 4263213 1454505 -2126639 -3290013 -733220 3051076 5204814 5111740 2501909
9031 2501909 -3266328 -9791709 -11425573 -6065408 922281 3473611 2616125 2867169 3667856
9022 3667856 767351 -4961013 -7282140 -4448698 -2721223 -6971928 -13104457 -14113985
9014 -14113985 -9904960 -6249839 -6248716 -7716698 -8177398 -7804180 -6931752 -4576473 -994806
9005 -994806 1022252 -561174 -3903975 -5290430 -3644370 -1501553 -1402174 -2559215 -2102003
8996 -2102003 687517 2906943 1924218 -435365 -80408 2910658 3256803 -2272307 -9355313
8987 -9355313 -11119834 -6937098 -2319233 -826982 -628617 428529 1268574 1232237 2750145
$$ packed form
9049g038110J919855L396517K147731M43714P03593J875115J678104M58461k65369
9040E319611j056398k808708l581144j163374K556793L784296K153738r3074k609831
9031B501909n768237o525381j633864N360165O987689K551330q57486K51044Q00687
9022C667856k900505n728364k321127K833442J727475m250705o132529j009528
9014a4113985M209025L655121J123j467982m60700L73218Q72428K355279L581667
9005i94806K017058j583426l342801j386455J646060K142817R9379j157041M57212
8996b102003K789520K219426r82725k359583L54957K991066L46145n529110p083006
8987i355313j764521M182736M617865J492251J98365J057146Q40045l6337J517908
$$ plain form
8978 2750145 6812890 9339658 6633762 2062176 2097948 6794027 9608309 6915125 2429027
8969 2429027 755786 1282478 887930 -1088660 -3423201 -5632275 -7280804 -7058270 -5085515
8960 -5085515 -3972794 -5226502 -6825132 -6695512 -6114532 -6944302 -7948980 -6967842 -4593772
8951 -4593772 -2646258 -1260489 -496363 -1858950 -4476514 -3300506 3700521 9840347
8943 9840347 7774321 723236 -2091618 398706 666856 -3609493 -5510730 -1424308
8935 -1424308 2210995 -145454 -3976605 -3133603 -268901 -1094522 -3825590 -2871928 782901
8926 782901 1550486 -673201 -724575 2474796 4508457 3398236 1975311 1800790 1065732
8917 1065732 -528194 -515792 1595017 3333051 3743059 4007107 3301938 -508227 -5362363
$$ packed form
8978B750145M062745K526768k705896m571586L5772M696079K814282k693184m486098
8969B429027j673241N26692l94548j976590k334541k209074j648529K22534J972755
8960e085515J112721j253708j598630J29620N80980q29770j004678R81138K374070
8951d593772J947514J385769P64126j362587k617564J176008P001027O139826
8943I840347k066026p051085k814854K490324K68150m276349j901237M086422
8935a424308L635303k356449l831151Q43002K864702q25621k731068R53662L654829
8926G82901P67585k223687n1374L199371K033661j110221j422925j74521p35058
8917A065732j593926J2402K110809J738034M10008K64048p05169l810165m854136
$$ plain form
8908 -5362363 -5972640 -1736901 1821542 1277945 -439726 -151844 628906 -204936 -1037645
8899 -1037645 351052 2971037 4585649 4160749 669873 -6255380 -12627676 -12143948 -4623329
8890 -4623329 2699733 5308548 7048341 11570078 14465132 10337410 2787794 -316327
8882 -316327 1492028 2102699 -377054 -1536547 676803 2578220 1486575 -305942 -515441
8873 -515441 -822927 -3147931 -5635462 -5153040 -1682715 1685164 1910487 -1445557 -5466370
8864 -5466370 -5876514 -1553154 3527781 4866656 2896780 1250328 930284 -68954 -2025760
8855 -2025760 -2698919 -1684238 -1524969 -3287883 -4407883 -2493603 1233129 3672468 3273628
8846 3273628 1077117 -189100 1709595 5474297 6418109 2239940 -2596588 -1812377 4248360
$$ packed form
8908e362363o10277M235739L558443n43597j717671K87882P80750q33842q32709
8899a037645J388697K619985J614612m24900l490876o925253o372296M83728P520619
8890d623329P323062K608815J739793M521737K895054m127722p549616l104121
8882c16327J808355O10671k479753j159493K213350J901417j091645j792517k09499
8873e15441l07486k325004k487531M82422L470325L367879K25323l356044m020813
8864e466370m10144M323360N080935J338875j969876j646452l20044r99238j956806
8855b025760o73159J014681J59269j762914j120000J914280L726732K439339l98840
8846C273628k196511j266217J898695L764702R43812m178169m836528P84211O060737
$$ plain form
8837 4248360 9268531 9586308 7578602 6369575 6166962 6757116 8698644 10455950 8899817
8828 8899817 4487171 1713284 2722128 4878690 6378075 9149362 13564563 15412146
8820 15412146 11858612 6190196 2865626 1710882 691128 393852 1525486 1700376
8812 1700376 -672440 -2573023 -960291 2081073 3365871 4154958 6381235 7068348 3075297
8803 3075297 -1514215 -138957 5823510 8904050 6912827 4785158 5149032 4989689 2838512
8794 2838512 1618587 2266167 1693015 -366579 387032 4470067 5708535 1150005 -2856770
8785 -2856770 -194070 5337734 6686452 5022917 6494671 10615606 10753180 5591249
8777 5591249 1690857 3091837 5565579 4222280 1028583 563555 2234486 1489532 -2816182
$$ packed form
8837D248360N020171L17777k007706j209027k02613N90154J941528J757306j556133
8828H899817m412646k773887J008844K156562J499385K771287M415201J847583
8820A5412146l553534n668416l324570j154744j019754k97276J131634J74890
8812A700376k372816j900583J612732L041364J284798P89087K226277O87113l993051
8803C075297m589512J375258N962467L080540j991223k127669L63874j59343k151177
8794B838512j219925O47580n73152k059594P53611M083035J238468m558530m006775
8785b856770K662700N531804J348718j663535J471754M120935J37574n161931
8777E591249l900392J400980K473742j343299l193697m65028J670931p44954m305714
$$ plain form
8768 -2816182 -6264566 -4191212 3076725 10540082 12968146 9220992 3015363 -707032
8760 -707032 -355074 1884010 3790806 5409393 6990511 6902730 3727033 -680550 -2629322
8751 -2629322 -976235 1952123 3939986 5243670 6712740 7771844 7822504 7880059 8640404
8742 8640404 8174500 4378191 -651373 -1900519 2027029 6480200 6516247 2780401 -473983
8733 -473983 -1244292 -843164 -358570 648969 1988336 2368929 1794292 2059990 3918081
8724 3918081 5701038 5847859 5143721 5229415 6191081 6861546 6499379 5014527 2417748
8715 2417748 -704844 -2777806 -2577626 -823061 542292 620567 319849 752185 1575054
8706 1575054 1384507 -468730 -2931855 -4276955 -3731751 -1760033 808626 3083805 3864030
$$ packed form
8768b816182l448384K073354P267937P463357K428064l747154o205629l722395
8760g07032L51958K239084J906796J618587J581118q7781l175697m407583j948772
8751b629322J653087K928358J987863J303684J469070J059104N0660N7555P60345
8742H640404m65904l796309n029564j249146L927548M453171L6047l735846l254384
8733d73983p70309M01128M84594J007539J339367L80593n74637K65698J858091
8724C918081J782957J46821p04138Q5694R61666O70465l62167j484852k596779
8715B417748l122592k072962K00180J754565J365353P8275l00718M32336Q22869
8706A575054j90547j853237k463125j345100N45204J971718K568659K275179P80225
$$ plain form
8697 3864030 2509020 402380 123895 2452953 5477035 7326874 8069012 7814196 5153603
8688 5153603 -254063 -5091515 -5240199 -831843 3760466 4701233 1773476 -2531423 -5099476
8679 -5099476 -4255152 -1667890 -1060769 -3192447 -4299273 -2292707 -1476649 -6223833 -12386415
8670 -12386415 -11828033 -4908844 -761376 -3746618 -7519243 -5954612 -2400521 -2500365 -4149130
8661 -4149130 -1915084 2815729 4181022 2126297 2268887 5809743 7290945 3931299
8653 3931299 397632 1092087 2902065 -3305 -7066285 -11392363 -8274082 -601963
8645 -601963 4779076 4447578 1085312 -714253 301838 2281276 4413221 7569803 10531303
8636 10531303 9750182 5110014 1941827 3640667 5788278 2543700 -3935211 -6609756
$$ packed form
8697C864030j355010k106640k78485K329058L024082J849839P42138k54816k660593
8688E153603n407666m837452j48684M408356M592309R40767k927757m304899k568053
8679e099476Q44324K587262O07121k131678j106826K006566Q16058m747184o162582
8670a2386415N58382O919189M147468k985242l772625J564631L554091r9844j648765
8661d149130K234046M730813J365293k054725J42590L540856J481202l359646
8653C931299l533667O94455J809978k905370p062980m326078L118281P672119
8645f01963N381039l31498l362266j799565J016091J979438K131945L156582K961500
8636A0531303p81121m640168l168187J698840K147611l244578o478911k674545
$$ plain form
8628 -6609756 -4471202 -3229344 -4999718 -4775259 555900 6291000 6764525 3035028 -328913
8619 -328913 -1976913 -3028046 -3042763 -1291731 385941 205799 -24703 2164515 5347816
8610 5347816 6413406 5414663 4143266 1848731 -2732483 -6470537 -4577259 1860714
8602 1860714 6472767 6344805 4930135 5093896 4844844 2535509 1191047 3735543 7612461
8593 7612461 8410286 6313008 4884669 5296986 5635388 4544949 1992973 -2129497 -6401250
8584 -6401250 -6536226 -480392 6010638 4512987 -4675842 -11756451 -9838480 -2920646
8576 -2920646 1430832 2380674 4097511 7170883 7606238 3668447 -1039249 -2057223 1238320
8567 1238320 5723019 7266829 3903554 -1582351 -3161898 1803613 8486706 10142758
$$ packed form
8628f609756K138554J241858j770374K24459N331159N735100M73525l729497l363941
8619c28913j648000j051133j4717J751032J677672j80142k30502K189218L183301
8610E347816J065590r98743j271397k294535m581214l738054J893278O437973
8602A860714M612053j27962j414670J63761k49052k309335j344462K544496L876918
8593G612461P97825k097278j428339M12317L38402j090439k551976m122470m271753
8584f401250j34976O055834O491030j497651r188829p080609J917971O917834
8576b920646M351478R49842J716837L073372M35355l937791m707696j017974L295543
8567A238320M484699J543810l363275n485905j579547M965511O683093J656052
$$ plain form
8559 10142758 6643034 3760838 4700649 6899584 7553541 7460324 7759520 7201877 5120282
8550 5120282 3614608 4144545 4934955 4416552 4393091 6782923 9710746 10172772 8631839
8541 8631839 7559841 6987421 5091486 2221252 770004 1355532 2251217 2502117 2696929
8532 2696929 2581528 811997 -2290539 -4176009 -3254819 -1011117 -99414 -1429712 -3637415
8523 -3637415 -4612795 -3256727 -205747 3116937 6032396 8403469 9242172 7478456 4398463
8514 4398463 2734251 2448311 586432 -3056151 -3991597 149604 4638760 4041170 543568
8505 543568 204766 2954368 3068844 -869579 -3677316 -2544691 -1443104 -3634848 -5830134
8496 -5830134 -4155389 -1293865 -2459700 -7055211 -9409361 -6544140 -1002364 3378119
$$ packed form
8559A0142758l499724k882196R39811K198935O53957r3217K99196n57643k081595
8550E120282j505674N29937P90410n18403k3461K389832K927823M62026j540933
8541H631839j071998n72420j895935k870234j451248N85528Q95685K50900J94812
8532B696929j15401j769531l102536j885470R21190K243702R11703j330298k207703
8523c637415r75380J356068L050980L322684K915459K371073Q38703j763716l079993
8514D398463j664212k85940j861879l642583r35446M141201M489156n97590l497602
8505E43568l38802K749602J14476l938423k807737J132625J101587k191744k195286
8496e830134J674745K861524j165835m595511k354150K865221N541776M380483
$$ plain form
8488 3378119 4887141 3497314 404062 -1605867 -19854 4297779 7463247 6584149
8480 6584149 2446132 -1747210 -3229603 -1364540 2327935 5429557 6368388 5199603
8472 5199603 2983955 977881 219980 878893 1890300 2122178 1730032 1308446 366834
8463 366834 -1502234 -2578618 -837419 2330451 3456865 2413932 2676128 5102051 5986030
8454 5986030 3787081 3064712 7339015 11949750 10070078 3607207 1141239 5163654
8446 5163654 8510420 5526813 217038 -902032 993759 -196727 -5181698 -7996490
8438 -7996490 -4925114 673602 3946089 4792889 6153348 8982176 11727493 13022787
8430 13022787 12268915 8819664 3290735 -1150956 -1685707 202792 467611 -1783573 -3401014
$$ packed form
8488C378119J509022j389827l093252k009929J586013M317633L165468q79098
8480F584149m138017m193342j482393J865063L692475L101622R38831j168785
8472E199603k215648k006074p57901O58913J011407K31878l92146m21586r41612
8463C66834j869068j076384J741199L167870J126414j042933K62196K425923Q83979
8454E986030k198949p22369M274303M610735j879672o462871k465968M022415
8446E163654L346766k983607n309775j119070J895791j190486m984971k814792
8438g996490L071376N598716L272487Q46800J360459K828828K745317J295294
8430A3022787p53872l449251n528929m441691n34751J888499K64819k251184j617441
$$ plain form
8421 -3401014 -2539014 -1357165 -1773072 -1913981 453299 3584056 4205566 2581445 1689454
8412 1689454 2473059 3343631 3615464 3772268 2610997 -1918154 -8328679 -11631015 -9237036
8403 -9237036 -4256445 -1509061 -2208678 -3640645 -2483506 2043451 6685551 6014945 -1779745
8394 -1779745 -11187361 -14581516 -11218513 -7342562 -6873409 -6723837 -3402809 499730 398504
8385 398504 -2893485 -4461713 -2590099 -613902 -1607453 -4435809 -5737032 -3919071 -562159
8376 -562159 1345905 454470 -1609612 -2516206 -2303298 -2515986 -2905583 -1895105 -395940
8367 -395940 -1502714 -5342057 -7979769 -7147184 -5275222 -4687480 -3843310 -1392259 7618
8358 7618 -2054441 -4878341 -4374046 -1082230 1667788 2981062 3374456 1390389 -3421417
$$ packed form
8421c401014Q62000J181849m15907j40909K367280L130757O21510j624121q91991
8412A689454P83605Q70572K71833J56804j161271m529151o410525l302336K393979
8403i237036M980591K747384o99617j431967J157139M526957M642100o70606p794690
8394a779745r407616l394155L363003L875951M69153J49572L321028L902539j01226
8385C98504l291989j568228J871614J976197r93551k828356j301223J817961L356912
8376e62159J908064q91435k064082r06594K12908k12688l89597J010478J499165
8367c95940j106774l839343k637712Q32585J871962N87742Q44170K451051J399877
8358G618k062059k823900N04295L291816K750018J313274L93394j984067m811806
$$ plain form
8349 -3421417 -6490805 -3290281 3017362 5254424 2682663 1147842 2929332 3624207
8341 3624207 416028 -3492705 -5158271 -6300036 -8171868 -7718035 -2985402 2210908
8333 2210908 3437851 1859741 1103924 1194468 171786 -822069 1023541 5022075 7581702
8324 7581702 7246825 5551047 3614285 1450338 163943 1276190 3754448 4740951 3460586
8315 3460586 1758770 722897 -377876 -1469868 -1013928 1007109 2100277 820765
8307 820765 -790295 -213049 1663253 1866532 -273662 -2462054 -3226520 -3976669 -6010002
8298 -6010002 -7276809 -4621410 1008025 4242002 1436092 -4739851 -8718914 -8659399 -7201246
8289 -7201246 -6462426 -5540698 -3480122 -1562188 -1013530 -833459 127674 949025 812784
$$ packed form
8349c421417l069388L200524O307643K237062k571761j534821J781490O94875
8341C624207l208179l908733j665566j141765j871832M53833M732633N196310
8333B210908J226943j578110p55817R0544j022682r93855J845610L998534K559627
8324G581702l34877j695778j936762k163947j286395J112247K478258R86503j280365
8315C460586j701816j035873j100773j091992M55940K021037J093168j279512
8307H20765j611060N77246J876302K03279k140194k188392p64466p50149k033333
8298f010002j266807K655399N629435L233977k805910o175943l979063N9515J458153
8289g201246P38820R21728K060576J917934N48658J80071R61133Q21351j36241
$$ plain form
8280 812784 1597086 5262963 9698436 10682406 8005066 6093834 7543962 9430774 8200197
8271 8200197 5336473 4778914 6333743 5790562 1722584 -1775640 -844641 2599093 3605324
8262 3605324 637212 -3411240 -5551143 -5342514 -3774577 -2227147 -2398183 -4552834 -5753860
8253 -5753860 -2770342 2790497 5492994 3245932 -34020 -735109 -713872 -2883557 -4944899
8244 -4944899 -2362292 3928518 7938507 6917180 4651795 5248433 7511604 7654003 4752661
8235 4752661 963857 -1947742 -3804107 -4568410 -3945886 -2567359 -2080457 -3325593 -4861722
8226 -4861722 -4026794 74271 4906863 6776872 4989155 2557359 2160191 2887551 2340434
8217 2340434 623311 242234 2567785 6140035 8288418 7301692 3647161 102529 -484450
$$ packed form
8280H12784P84302L665877M435473R83970k677340j911232J450128J886812j230577
8271H200197k863724n57559J554829n43181m067978l498224R30999L443734J006231
8262C605324k968112m048452k139903K08629J567937J547430j71036k154651j201026
8253e753860K983518N560839K702497k247062l279952p01089K1237k169685k061342
8244d944899K582607O290810M009989j021327k265385N96638K263171J42399k901342
8235D752661l788804k911599j856365p64303O22524J378527M86902j245136j536129
8226d861722Q34928M101065M832592J870009j787717k431796l97168P27360n47117
8217B340434j717123l81077K325551L572250K148383r86726l654531l544632n86979
$$ plain form
8208 -484450 1147664 945574 -2678436 -5491921 -2938691 2727576 4836770 1160108 -3861331
8199 -3861331 -5928189 -5644567 -5316873 -4930423 -3546621 -2037057 -2079663 -3775025 -5641530
8190 -5641530 -6013414 -4103515 -1040175 369567 -1170558 -2993920 -1773828 1293954
8182 1293954 1998666 -364989 -1984470 -546737 2007998 3919114 6324476 9495476
8174 9495476 10599628 8101436 4903188 4123401 4888455 5256587 5951716 7555721 7160550
8165 7160550 2448886 -2977132 -3299805 1317192 4810145 3462120 -105564 -1874825
8157 -1874825 -1626901 -1561127 -2340497 -2602262 -1261038 1312868 4132720 6547528 8000960
8148 8000960 7383985 3804247 -1318899 -4122801 -2058665 2706972 5641718 5314954 4262847
$$ packed form
8208d84450J632114k02090l624010k813485K553230N666267K109194l676662n021439
8199c861331k066858K83622L27694L86450J383802J509564m2606j695362j866505
8190e641530l71884J909899L063340J409742j540125j823362J220092L067782
8182A293954P04712k363655j619481J437733K554735J911116K405362L171000
8174I495476J104152k498192l198248p79787P65054L68132O95129J604005l95171
8165G160550m711664n426018l22673M616997L492953j348025l567684j769261
8157a874825K47924O5774p79370k61765J341224K573906K819852K414808J453432
8148H000960o16975l579738n123146k803902K064136M765637K934746l26764j052107
$$ plain form
8139 4262847 4613766 5647095 5992996 5375883 3598195 630884 -1769608 -1586026 -84670
8130 -84670 -317104 -1702199 -470929 3535779 5494624 2869574 -942013 -2538397 -2879653
8121 -2879653 -3000332 -1131353 2202947 2260344 -1906995 -3563970 1525517 6919324 5043755
8112 5043755 -362094 -497342 3814677 4248049 -217560 -1877942 1897190 4436933 1934713
8103 1934713 -185594 2516134 5408357 2637452 -3327530 -5983806 -4145390 -1553735
8095 -1553735 -369826 97690 291335 -67654 -669113 -1211106 -1735850 -1128501 2152788
8086 2152788 6706182 8708652 7076686 4641053 2974024 227012 -4100273 -6743196
8078 -6743196 -5616372 -3057793 -1439840 243936 2412783 2079281 -1983730 -5325833
$$ packed form
8139D262847L50919J033329L45901o17113j777688k967311k400492J83582J501356
8130h4670k32434j385095J231270M006708J958845k625050l811587j596384l41256
8121b879653j20679J868979L334300N7397m167339j656975N089487N393807j875569
8112E043755n405849j35248M312019M33372m465609j660382L775132K539743k502220
8103A934713k120307K701728K892223k770905n964982k656276J838416K591655
8095a553735J183909M67516J93645l58989o01459n41993n24744O07349L281289
8086B152788M553394K002470j631966k435633j667029k747012m327285k642923
8078f743196J126824K558579J617953J683776K168847l33502m063011l342103
$$ plain form
8070 -5325833 -3780307 -40799 697896 -1069597 -722948 2585504 5170206 5238343 4883840
8061 4883840 5464740 5562354 4474212 4011580 5402732 7052649 6843360 5086055 4085250
8052 4085250 5422344 8032206 8899582 6254068 2037689 -206873 120965 578110 408170
8043 408170 1939298 5760759 8237879 6660770 3660886 2933505 3219512 774583 -3907564
8034 -3907564 -6292978 -4113599 333066 3961284 5720095 5811315 4976938 4468594 4480013
8025 4480013 3348192 537972 -1109298 837951 3934683 4052323 1911085 1917894 4869674
8016 4869674 6760381 5590559 4503621 6238846 8650625 8496280 6497273 5468912
8008 5468912 5505977 4237102 893633 -2678922 -4919041 -6185276 -6939892 -5947723 -1739343
$$ packed form
8070e325833J545526L739508P38695j767493L46649L308452K584702O8137l54503
8061D883840N80900R7614j088142m62632J391152J649917k09289j757305j000805
8052D085250J337094K609862Q67376k645514m216379k244562L27838M57145j69940
8043D08170J531128L821461K477120j577109k999884p27381K86007k444929m682147
8034c907564k385414K179379M446665L628218J758811R1220q34377n08344J1419
8025D480013j131821k810220j647270J947249L096732J17640k141238O809K951780
8016D869674J890707j169822j086938J735225K411779j54345j999007j028361
8008E468912L7065j268875l343469l572555k240119j266235p54616R92169M208380
$$ plain form
7999 -1739343 4325671 7921295 5956463 391353 -3935093 -5307765 -6459352 -8990050
7991 -8990050 -9727023 -5518879 783335 3236488 742156 -2079696 -1905140 -367422 259219
7982 259219 969775 3380556 6167140 6909682 5711387 4498226 3962421 3565319 3674232
7973 3674232 5061314 6331749 4463944 -947228 -5766639 -5471151 -553129 4115653
7965 4115653 5333930 4841938 5577830 6907306 5983904 2542166 -738480 -2327191 -3146167
7956 -3146167 -3544560 -2318783 288182 1822493 1253192 379624 199991 -820918 -3098034
7947 -3098034 -4184287 -3072024 -2502815 -4011811 -4535767 -1732730 1130427 291450 -1958550
7938 -1958550 -1361151 568714 -744835 -4417648 -5184178 -2278317 -397558 -1508009 -2207232
$$ packed form
7999a739343O065014L595624j964832n565110m326446j372672j151587k530698
7991h990050p36973M208144O302214K453153k494332k821852J74556J537718O26641
7982B59219P10556K410781K786584P42542j198295j213161n35805l97102J08913
7973C674232J387082J270435j867805n411172m819411K95488M918022M668782
7965D115653J218277m91992P35892J329476r23402l441738l280646j588711q18976
7956c146167l98393J225777K606965J534311n69301q73568j79633j020909k277116
7947c098034j086253J112263N69209j508996n23956K803037K863157q38977k250000
7938a958550N97399J929865j313549l672813p66530K905861J880759j110451o99223
$$ plain form
7929 -2207232 -337136 1812614 2532357 3472602 5462517 6313099 4694213 2111987 -253540
7920 -253540 -2636311 -4064060 -3386278 -3264528 -7452321 -13357079 -13852881 -8096702 -3448701
7911 -3448701 -3962198 -4446303 -199622 4569477 3985390 323859 -166390 2953023 5340864
7902 5340864 5568067 5449361 4989845 2941417 840667 1286229 3500853 5055427 6319532
7893 6319532 8830218 11092175 10531661 8061041 6514467 6180791 5638408 4750984 3043355
7884 3043355 -1721994 -8708327 -11404497 -5845390 1831744 3021038 -920595 -1913306
7876 -1913306 1155971 1488943 -2757518 -4611402 -116030 4655700 2983307 -2809466
$$ packed form
7929b207232J870096K149750P19743R40245J989915Q50582j618886k582226k365527
7920b53540k382771j427749O77782J21750m187793n904758m95802N756179M648001
7911c448701n13497m84105M246681M769099n84087l661531m90249L119413K387841
7902E340864K27203j18706m59516k048428k100750M45562K214624J554574J264105
7893F319532K510686K261957n60514k470620j546574l33676n42383q87424j707629
7884C043355m765349o986333k696170N559107P677134J189294l941633r92711
7876a913306L069277L32972m246461j853884M495372M771730j672393n792773
$$ [...]
##END NTUPLES=NMR SPECTRUM
##END=
