##TITLE=31Pdec_SR95_oil
 D2O, 124 sc
 28.10.2021
##JCAMPDX= 6.0         $$ Bruker NMR JCAMP-DX V2.0
##DATA TYPE= NMR SPECTRUM
##DATA CLASS= NTUPLES
##ORIGIN= UXNMR, Bruker Analytische Messtechnik GmbH
##OWNER= root
$$ XWIN-NMR		Version 3.5
$$ Thu Oct 28 10:32:59 2021 Russian Standard Time (UT+4h)  she@DPX200
##.OBSERVE FREQUENCY= 81.013821
##.OBSERVE NUCLEUS= ^31P
##.ACQUISITION MODE= SIMULTANEOUS
##.ACQUISITION SCHEME= undefined
##.AVERAGES= 124
##.DIGITISER RES= 16
##SPECTROMETER/DATA SYSTEM= spect
##.PULSE SEQUENCE= zgpg30
##.SOLVENT NAME= CDCl3
##.SHIFT REFERENCE= (INTERNAL, CDCl3, 0, 248.564)
##AUDIT TRAIL= $$ (NUMBER, WHEN, WHO, WHERE, WHAT)
$$ ##TITLE= Audit trail, XWIN-NMR		Version 3.5
$$ ##JCAMPDX= 5.01
$$ ##ORIGIN= Bruker BioSpin GmbH
$$ ##OWNER= she
$$ F:/spectra/data/she/nmr/P31/1/pdata/1/auditp.txt
$$ ##AUDIT TRAIL=  $$ (NUMBER, WHEN, WHO, WHERE, WHAT)
(   1,<2021-10-28 10:31:43.65 +0400>,<she>,<DPX200>,
      <continue with go, POWCHK disabled, PULCHK disabled
       configuration hash MD5:
       00 E9 B6 7A A2 85 ED C7 34 08 36 98 17 FE 4E 26
       data hash MD5: 32K
       0E BE 42 94 30 44 B4 61 1F 86 0B F6 ED 22 14 32>)
(   2,<2021-10-28 10:31:47.42 +0400>,<she>,<DPX200>,
      <Start of raw data processing
       efp BC_mod = 2 LB = 1 FT_mod = 6 PKNL = 1 PHC0 = -8982.473 PHC1 = 390.8694 SI = 64K 
       data hash MD5: 64K
       34 D1 A1 3C 41 C7 70 58 2A 60 DA 2F 1C FB A8 CF>)
(   3,<2021-10-28 10:32:18.95 +0400>,<she>,<DPX200>,
      <pk PHC0 = -2.308559 PHC1 = 18.4 
       data hash MD5: 64K
       07 9C 1F C6 2C B5 D4 0A 04 33 24 D9 44 49 08 20>)
(   4,<2021-10-28 10:32:22.95 +0400>,<she>,<DPX200>,
      <abs ABSG = 5 
       data hash MD5: 64K
       B8 06 23 F5 46 87 31 01 E9 29 E7 D8 21 04 B1 82>)
$$ ##END=
$$ 
$$ hash MD5
$$ 47 D5 76 59 21 BE DE 15 F7 3A 91 AC 27 89 AA C9
##$RELAX= 
##$RELAX= 
##$RELAX= 
##$RELAX= 
##$RELAX= 
##$RELAX= 
##$RELAX= 
##$RELAX= 
$$ Bruker specific parameters
$$ --------------------------
##$DU= <F:/spectra>
##$EXPNO= 1
##$NAME= <P31>
##$PROCNO= 1
##$TYPE= <nmr>
##$USER= <she>
##$AMP= (0..31)
100 100 100 100 100 100 100 100 100 100 100 100 100 100 100 100 100 100 
100 100 100 100 100 100 100 100 100 100 100 100 100 100 
##$AQSEQ= 0
##$AQ_mod= 1
##$AUNM= <au_zg>
##$AUTOPOS= <>
##$BF1= 81.014009
##$BF2= 200.13
##$BF3= 200.13
##$BF4= 200.13
##$BF5= 200.13
##$BF6= 200.13
##$BF7= 200.13
##$BF8= 200.13
##$BYTORDA= 1
##$CFDGTYP= 0
##$CFRGTYP= 5
##$CHEMSTR= <none>
##$CNST= (0..31)
1 1 145 1 1 1 1 1 1 1 1 1 1 1 1 1 1 1 1 1 1 1 1 1 1 1 1 1 1 1 1 1 
##$CPDPRG= <waltz16>
##$CPDPRG1= <>
##$CPDPRG2= <waltz16>
##$CPDPRG3= <>
##$CPDPRG4= <mlev>
##$CPDPRG5= <mlev>
##$CPDPRG6= <mlev>
##$CPDPRG7= <mlev>
##$CPDPRG8= <mlev>
##$CPDPRGB= <>
##$CPDPRGT= <>
##$D= (0..31)
0 1 0 0 0 0 0 0 0 0 0 0.03 2e-05 3e-06 0 0 0 0 0 0 0 0 0 0 0 0 0 0 0 0 
0 0 
##$DATE= 1635402502
##$DBL= (0..7)
120 120 120 11 120 120 24 19 
##$DBP= (0..7)
150 150 150 150 150 150 150 150 
##$DBP07= 0
##$DBPNAM0= <>
##$DBPNAM1= <>
##$DBPNAM2= <>
$$ [...]
##$SUBNAM3= <"">
##$SUBNAM4= <"">
##$SUBNAM5= <"">
##$SUBNAM6= <"">
##$SUBNAM7= <"">
##$SUBNAM8= <"">
##$SUBNAM9= <"">
##$SW= 501.771253377433
##$SWIBOX= (0..15)
0 1 3 0 0 0 0 0 0 0 0 0 0 0 0 0 
##$SW_h= 40650.406504065
##$TD= 32768
##$TD0= 1
##$TE= 0
##$TE2= 300
##$TE3= 300
##$TEG= 300
##$TL= (0..7)
0 120 53 12 22 120 120 120 
##$TP= (0..7)
150 150 150 150 150 150 150 150 
##$TP07= 0
##$TPNAME0= <>
##$TPNAME1= <>
##$TPNAME2= <>
##$TPNAME3= <>
##$TPNAME4= <>
##$TPNAME5= <>
##$TPNAME6= <>
##$TPNAME7= <>
##$TPOAL= (0..7)
0.5 0.5 0.5 0.5 0.5 0.5 0.5 0.5 
##$TPOFFS= (0..7)
0 0 0 0 0 0 0 0 
##$TUNHIN= 0
##$TUNHOUT= 0
##$TUNXOUT= 0
##$USERA1= <user>
##$USERA2= <user>
##$USERA3= <user>
##$USERA4= <user>
##$USERA5= <user>
##$V9= 5
##$VALIST= <valist>
##$VCLIST= <CCCCCCCCCCCCCCC>
##$VD= 0
##$VDLIST= <DDDDDDDDDDDDDDD>
##$VPLIST= <PPPPPPPPPPPPPPP>
##$VTLIST= <TTTTTTTTTTTTTTT>
##$WBST= 1024
##$WBSW= 4
##$XGAIN= (0..3)
0 0 0 0 
##$XL= 0
##$YL= 0
##$YMAX_a= 9083
##$YMIN_a= -6574
##$ZGOPTNS= <>
##$ZL1= 120
##$ZL2= 120
##$ZL3= 120
##$ZL4= 120
##$ABSF1= 248.5645
##$ABSF2= -253.2056
##$ABSG= 5
##$ABSL= 3
##$ALPHA= 0
##$AQORDER= 0
##$ASSFAC= 0
##$ASSFACI= 0
##$ASSFACX= 0
##$ASSWID= 0
##$AUNMP= <proc_1d>
##$AZFE= 0.1
##$AZFW= 0.5
##$BCFW= 0
##$BC_mod= 2
##$BYTORDP= 0
##$COROFFS= 0
##$CY= -3
##$DATMOD= 1
##$DC= 0
##$DFILT= <>
##$DTYPP= 0
##$F1P= 0
##$F2P= 0
##$FCOR= 1
##$FTSIZE= 65536
##$FT_mod= 6
##$GAMMA= 0
##$GB= 0
##$INTBC= 1
##$INTSCL= 5.30512e-09
##$ISEN= 30
##$LB= 1
##$LEV0= 0
##$LPBIN= 0
##$MAXI= 10000
##$MC2= 0
##$MEAN= 0
##$ME_mod= 0
##$MI= 50
##$NCOEF= 0
##$NC_proc= -7
##$NLEV= 6
##$NOISF1= 182.463
##$NOISF2= 159.3651
##$NSP= 0
##$NTH_PI= 0
##$NZP= 0
##$OFFSET= 248.5645
##$PC= 4
##$PHC0= -8984.781
##$PHC1= 409.2694
##$PH_mod= 1
##$PKNL= yes
##$PPARMOD= 0
##$PSCAL= 0
##$PSIGN= 0
##$REVERSE= no
##$SF= 81.014009
##$SI= 65536
##$SIGF1= 159.3651
##$SIGF2= -187.1042
##$SINO= 113.3802
##$SIOLD= 16384
##$SREGLST= <1H.CDCl3>
##$SSB= 0
##$STSI= 65536
##$STSR= 0
##$SW_p= 40650.406504065
##$SYMM= 0
##$S_DEV= 0
##$TDeff= 32768
##$TDoff= 0
##$TI= <>
##$TILT= no
##$TM1= 0
##$TM2= 0
##$TOPLEV= 0
##$USERP1= <user>
##$USERP2= <user>
##$USERP3= <user>
##$USERP4= <user>
##$USERP5= <user>
##$WDW= 1
##$XDIM= 65536
##$YMAX_p= 339376122
##$YMIN_p= -437257451
$$ End of Bruker specific parameters
$$ ---------------------------------
##NTUPLES= NMR SPECTRUM
##VAR_NAME=  FREQUENCY,     SPECTRUM/REAL,   SPECTRUM/IMAG
##SYMBOL=    X,             R,               I
##VAR_TYPE=  INDEPENDENT,   DEPENDENT,       DEPENDENT
##VAR_FORM=  AFFN,          ASDF,            ASDF
##VAR_DIM=   65536,         65536,           65536
##UNITS=     HZ,            ARBITRARY UNITS, ARBITRARY UNITS
##FACTOR=    0.620285442955139, 1,           1
##FIRST=     20137.2065510759, 0,            0
##LAST=      -20513.1999529892, 0,           0
##MIN=       -20513.1999529892, -437257451,  0
##MAX=       20137.2065510759, 339376122,    0
$$ Real data points
##PAGE= N=1
##DATA TABLE= (X++(R..R)), XYDATA
$$ [...]
39550E184851l528393q52474J866546M89450k508119k107853J433841L457881
39542C435730K308755Q52314N01706r62983l851384l977614P34629N085304L044434
39533G170891l036176n267211j468035K230387Q99910k497393k464298J191276
39525c240649M280870M280243K071148o28198k476397k250411j16203J558185
39517C478588R66846l57612J48708J834942J647346j059534l314927k651651j80100
39508E12606J324565Q12692m25098n70825Q01474K129507J420015j053228k559481
39499B392227j465825M09974P45858L74459J276715K397114J286847p98012r5932
39490F523425K953032L264889r04285m542959l400425k51915M11181k74544J096803
$$ y = [5184851, 1656458, 803984, 2670530, 3159980, 651861, -1455992, -22151, 3435730, 5744485, 6596799, 7098505, 6135522, 2284138, -1693476, -958847, 4126457, 7170891, 4134715, -1132496, -2600531, -370144, 529766, -1967627, -4431925, -3240649, 1040221, 5320464, 7391612, 6763414, 4287017, 2036606, 1920403, 3478588, 4445434, 4087822, 4236530, 6071472, 7718818, 6659284, 3344357, 692706, 512606, 1837171, 2649863, 2224765, 1653940, 2455414, 4584921, 6004936, 4951708, 2392227, 926402, 1336376, 2082234, 2456693, 3733408, 6130522, 7417369, 6619357, 6523425, 9476457, 12741346, 11837061, 7294102, 3893677, 3641762, 4052943, 3778399, 4875202]
39481D875202K751717L29663m500155n093499m5338M169683K670748j437262k962627
39472G58132j933462j284146j139565K72408K426529L233148K575289J890642
39464F798975J330570o098k065127m141013n736774n439816j418407M633399P088381
39455A044090L322548j851035k815722j240477k189932m771773l668417J031555
39447a1139163L310120J330093L45388L162328N100796K337151j328333j047407
39439B070973J252793J232649k54262Q2808J355421Q27425k43422O34989J451796
39430H411170n88921k317852P46959N029289L027972l808284n994916j036735
39422C468682K408909j149051n025797j486139N878127Q175313M184645o2015
$$ y = [4875202, 7626919, 7956582, 3456427, -1637072, -1682410, 2487273, 5158021, 3720759, 758132, -1175330, -2459476, -3599041, -3326633, -900104, 2333044, 4908333, 6798975, 8129545, 8123447, 6058320, 1917307, -3819467, -9259283, -10677690, -6044291, 1044090, 4366638, 2515603, -300119, -1540596, -3730528, -8502301, -12170718, -11139163, -7829043, -6498950, -6153562, -2991234, 2109562, 4446713, 3118380, 2070973, 3323766, 4556415, 4302153, 4384961, 5740382, 6567807, 6324385, 6959374, 8411170, 7822249, 5504397, 6251356, 11280645, 14308617, 10500333, 4505417, 3468682, 5877591, 4728540, -297257, -1783396, 4094731, 12270044, 16454689, 16392674]
39414A6392674j022676j60754Q20261J339731M57534j179174m16160K963035L564805
39405B2759276j465848n920711l209286K372017J834179l782926n076723J70137
39397G680115L971382J940840o57852K09997P44131j674674k527307O23815J895187
39388A2205634k427489n385462m88431N726266L267282m252261m546650L612452
39380G711341Q421094L556542l407391m346186j617920n71549j31872K317255
39372A1931314L597287K0351m496507l211616L046996P098109N686940K326972
39364B5999846L67165p66394j641529n52972K659749M499912K265609j816201
39356C1015185l415323j542837J066965K104080K048820K529700M105951O132534
$$ y = [16392674, 15369998, 15209244, 16029505, 17369236, 17826770, 16647596, 16231436, 19194471, 22759276, 21293428, 15372717, 12163431, 14535448, 16369627, 12586701, 7509978, 7680115, 11651497, 13592337, 12934485, 13144482, 13888613, 12213939, 9686632, 10310447, 12205634, 9778145, 4392683, 3904252, 9630518, 12897800, 8645539, 4098889, 7711341, 16132435, 19688977, 16281586, 11935400, 10317480, 9745931, 9614059, 11931314, 15528601, 15548952, 11052445, 7840829, 10887825, 17985934, 23672874, 25999846, 26367011, 25600617, 23959088, 23406116, 26065865, 30565777, 32831386, 31015185, 27599862, 26057025, 27123990, 29228070, 31276890, 33806590, 37912541, 44045075]
39348D4045075P615583P654822O093086M484802N342813R144872J3002351J4193180
39340A11576584J4373374J7443029K2896455K4765948J9128389R641292K555195
39333B22380266j466513o622436j4364525k0995383k3160737k1907489k0141268
39326A13721915j8914647j7435250j4638626r975322m414577p58508q61329k735759
39318D3987897k888844j143219j98267r24168j774324k572051m440358n718347
39310B4328319l055675K221908M129102N07010l622428l845350k314730k482204
39302A5865952l032819j634926k54570j430874k815763r17412K601349L826049
39294A2206986L219168L778878M934406M156388K584025K779647K667228j330631
$$ y = [44045075, 51660658, 59315480, 65408566, 69893368, 75236181, 84381053, 97383404, 111576584, 125949958, 143392987, 166289442, 191055390, 210183779, 219825071, 222380266, 220913753, 214291317, 199926792, 178931409, 155770672, 133863183, 113721915, 94807268, 77372018, 62733392, 52758070, 48343493, 47584985, 46723656, 43987897, 41099053, 39955834, 39757567, 38833399, 37059075, 34487024, 30046666, 24328319, 21272644, 23494552, 27623654, 28130664, 24508236, 20662886, 18348156, 15865952, 12833133, 11198207, 10943637, 9512763, 6697000, 5779588, 8380937, 12206986, 15426154, 19205032, 24139438, 28295826, 30879851, 33659498, 36326726, 34996095]
39286C4996095o243159n352188Q06106M143646J265530j656643P85396M974989
39278C3719772M634198L9470l828186m462898k936307r36632l96897l187640p701864
39269A4943016q565082l338974L075949M466446J405465o92462K68170J318968
39261A2881496O0613k204340l277855k737906j230739M28525J011557j61988j660330
39252C109033j204511J171408K906798K152605l40768k717042l567535j712193
39244b02205L114912P977131P546027J48680q115714r006664k304028L466972
39236B625111K126394k430825l056637j4752J013814p32331l16322L273428M783479
39227G271359K158233L48180J789034J113246m693723q421350l119956N555146
$$ y = [34996095, 28752936, 23400748, 24206854, 28350500, 29616030, 27959387, 28744783, 33719772, 38353970, 38393440, 34565254, 30102356, 27166049, 26229417, 25832520, 22644880, 14943016, 6377934, 3038960, 6114909, 10581355, 11986820, 11294358, 11562528, 12881496, 12942109, 10737769, 7459914, 4722008, 3491269, 3919794, 4931351, 4769363, 3109033, 1904522, 3075930, 5982728, 8135333, 7794565, 5077523, 1509988, -202205, 2912707, 10889838, 18435865, 18584545, 10468831, 1462167, -841861, 2625111, 4751505, 2320680, -735957, -750709, 263105, -469226, -785548, 2487880, 7271359, 9429592, 9777772, 11566806, 12680052, 7986329, -435021, -3554977, 2000169]
39219B000169P081677J848514j122546O75956J427209q60733j640911K66582P93064
39210A0468981j08145K046337N727859L590839l764401n903602P34497N706338
39202A8498703Q58695o806269o873662j011694K538091K402877K338663K135863
39194A4081267j72029j881360k73481Q96208j970269m229774o91397L643130R34503
39185A0336798n503024n961751n14847J429658k931664n823393k051251L986653
39177g032821O529221N180024J580355k893850m615690m11879N747646O026508
39169A0109514J0979m579474l766840k129532l634177n325962l479774L21881
39161a2473385K716191L160435K416715R20187L27254K183799M128776K299435
$$ y = [2000169, 9081846, 10930360, 9807814, 10483770, 11910979, 11050246, 9409335, 9675917, 10468981, 10360836, 12407173, 18135032, 21725871, 17961470, 12057868, 12792365, 18498703, 19357398, 12551129, 5677467, 4665773, 7203864, 9606741, 11945404, 14081267, 13909238, 12027878, 11754397, 12650605, 10680336, 6450562, 5759165, 9402295, 10336798, 4833774, -1127977, -1642824, -213166, -3144830, -8968223, -11019474, -7032821, -503600, 4676424, 6256779, 3362929, -1252761, -1664640, 4083006, 10109514, 10120493, 5541019, 1774179, -355353, -3989530, -9315492, -12795266, -12473385, -9757194, -6596759, -4180044, -3259857, -2932603, -748804, 3379972, 5679407]
39153E679407k064728l841414j987766k73253q4518O70343J323173j174811m849711
39144f603278l932896R95779K694466o64113k093546K132091N894623L388759
39136A811885k067311m442103l150206o3496M561230Q320872O027452j869849
39128I128474p171892n547340k959384m715030o078136j289097N370793O385473
39120f876139L093046J883881K992324K233610J84672M29581J354611j324600
39112C970986n601053n283691j98517L470983K728718P92417O46808J515305J772014
39103C813970P04413j814045l655758j021128N050412O751096n0659p681138o474462
39094d377299R39123M010150M41516j954875R36475L901364K335095q36217j261914
$$ y = [5679407, 3614679, -226735, -2214501, -2487754, -2572272, -1901929, -578756, -1753567, -6603278, -10536174, -9540395, -6845929, -7510042, -9603588, -7471497, -1576874, 1811885, -255426, -4697529, -7847735, -7911231, -3350001, 4970871, 10998323, 9128474, 1956582, -3590758, -6550142, -11265172, -17343308, -18632405, -13261612, -6876139, -3783093, -1899212, 1093112, 3326722, 3511394, 3940975, 5295586, 3970986, -1630067, -6913758, -7112275, -3641292, -912574, -120157, 526651, 2041956, 3813970, 4518383, 2704338, -951420, -1972548, 3077864, 9828960, 9778301, 2097163, -4377299, -3438176, 571974, 1013490, -941385, -4910, 3896454, 6231549, 5395332, 4133418]
39085D133418M73206J782597K400799L170935M104339M986820N015292K197491
39077B8264897l458017p564297o468289k916991j724939k245159j173001o9935
39069B644269k386604n043417j981961M588620O021021Q75445k936424j354045
39061D26904L07680j809569l283423k38968L300253K674764L78614N29341J196034
39052C481630j419103n280070n113601l32206M365870M838593J018657l698439
39044b138669m963455j649775J951243J321276j337486k65508M190503N744180
39036B852309K495733o23147j240920k780359n512453l756203L238206O855488
39028A528654K107942l462412j778647K716760J524777k986581k292766K947977
$$ y = [4133418, 4606624, 6389221, 8790020, 11960955, 16065294, 21052114, 26067406, 28264897, 24806880, 17242583, 10774294, 7857303, 6132364, 3887205, 2714204, 2644269, 257665, -4785752, -6767713, -2179093, 3841928, 4717373, 1780949, 426904, 734584, -1074985, -4358408, -4597376, -1297123, 1377641, 1756255, 2285596, 3481630, 2062527, -3217543, -8331144, -8663350, -4297480, 541113, 1559770, -2138669, -7102124, -8751899, -6800656, -5479380, -6816866, -7082374, -2891871, 2852309, 5348042, 4724895, 3483975, 703616, -4808837, -8565040, -5326834, 1528654, 3636596, 174184, -1604463, 1112297, 2637074, -349507, -2642273, 305704]
39020C05704M115685m87193l382790j070888R72010j195235l410306j197742K728528
39011b622227L230499L77686j885141j862879j368176k119541l309161k792827
39003a2351767K3884K974722L704068L006492L247951L682877J416018k278606
38995C425639k255466J529879K012445l506950o890898j275772O567681N479093
38987E085651k808287o574773k218899K145824J383236l3521J409148J961562
38979C49941o97858j979242R33342L184535J036928j059676R87320K390333k171969
38970B973654p413266m424599M502159Q182266K890175l162066k989073J53809
38962G13059J61384k538514l652331k210560j22603K281237N305468O356171K463192
$$ y = [305704, 4421389, 3934196, 551406, -519482, 452528, -742707, -4153013, -5350755, -2622227, 608272, 985958, -899183, -2762062, -4130238, -6249779, -9558940, -12351767, -12327883, -9353161, -5649093, -2642601, 605350, 4288227, 5704245, 3425639, 1170173, 2700052, 4712497, 1205547, -5685351, -6961123, -393442, 5085651, 2277364, -4297409, -6516308, -4370484, -2987248, -3020769, -1611621, 349941, -347917, -2327159, -1393817, 1790718, 2827646, 1767970, 2755290, 5145623, 2973654, -4439612, -8864211, -4362052, 3820214, 6710389, 3548323, 559250, 713059, 874443, -1664071, -5316402, -7526962, -7649565, -5368328, -62860, 6293311, 8756503]
38953H756503l862609n991147j711704L400492L466781K1233j280576M37001N96803
38944C832777k594961m625766j899553K015458J727716j348161j189893L102206
38936i80177N588644K333806l187743n589211m306784k254402j133537r30958
38928a0460362j437036j554468N57770M131161N116062J689759k140124j736371
38920e833609J827445M361486M954954N101413L691280j082426n806363m691442
38912B522738R60873L061770j298373n001174j849888L939287M775581J124821
38904H235635j054593q61881k538825o305849p038454k899880J552169K632220
38896h279458J960175J602268N33418j341668j072353K002725L682403J449691
$$ y = [8756503, 4893894, -1097253, -2808957, 591535, 4058316, 4079549, 2798973, 3235974, 3832777, 1237816, -3387950, -5287503, -3272045, -1544329, -2892490, -4082383, -980177, 4608467, 6942273, 3754530, -1834681, -6141465, -8395867, -9529404, -10460362, -11897398, -13451866, -12894096, -8762935, -3646873, -1957114, -4097238, -5833609, -4006164, 355322, 5310276, 10411689, 14102969, 13020543, 7214180, 2522738, 3483611, 6545381, 5247008, 245834, -1604054, 2335233, 7110814, 8235635, 7181042, 6319161, 3780336, -2525513, -9563967, -12463847, -10911678, -8279458, -6319283, -4717015, -4183597, -5525265, -6597618, -4594893, -912490, 537201]
38888E37201j054950l62749P03692j407036l513702n37657M952089N409270l59982
38879D366176n436915m694544m25800K729309L007091N98883l370357n531399
38871h757556k581423L516812O687073M334909m6329k552453k797692j487961
38863c684620R89164K387747J46939l396489k682841K409318N389516L016019
38855D574753k3466K09533J91119l753594p202810l713823M418651Q537169N137515
38846H375047r43509m056905l452373j679310j097251k009473k272254M0770K647832
38837d447426J137054l441374m229798J041482N274695K635312k059766j511670
38829e601491J922880J054800l146370l458427O82862K591354M33660l30900K164134
$$ y = [537201, -517749, -880498, -176806, -1583842, -5097544, -5635201, -683112, 4726158, 4366176, -1070739, -5765283, -6191083, -3461774, -454683, 144200, -3226157, -8757556, -11338979, -7822167, -1135094, 3199815, 3153486, 601033, -2196659, -3684620, -2695456, -307709, -160770, -3557259, -6240100, -3830782, 1558734, 4574753, 4551287, 4760820, 4951939, 1198345, -6004465, -9718288, -5299637, 3237532, 8375047, 7431538, 3374633, -77740, -1757050, -2854301, -4863774, -7136028, -7095258, -4447426, -3310372, -6751746, -10981544, -9940062, -4665367, -2030055, -4089821, -5601491, -3678611, -2623811, -5770181, -9228608, -8545746, -5954392, -5520732, -5851632, -3687498]
38820c687498K869411J6876q94915K642882M637419O65674m119807l400174O8583
38811a201549k91769l855221m388428j89660M150451N227008M366909L569918
38803G387659K390630k27402l779144o498865o432190k748564K615977N663573
38795a628326M353719J026688o65067j98013J04064j022745k024163q42110K072984
38786A177031L839740K613845M34597Q13508L129858K433201l148314q181774
38778C111692o942378j768513P75467j27656R7992K225070K048182r17335j529648
38769c027127J733592L238501k27187l400222j261168K362923J288379k746076
38761b038385l355787J59564K868368K744195K343941K626344J418568j458330
$$ y = [-3687498, -818087, -801211, -1696126, 946756, 5584175, 6249849, 2130042, -1270132, -1201549, -1493318, -5348539, -9736967, -9926627, -5776176, -549168, 3817741, 7387659, 9778289, 9550887, 5771743, -727122, -7159312, -9907876, -7291899, -1628326, 2725393, 3752081, 3087014, 2889001, 2993065, 1970320, -53843, -895953, 1177031, 5016771, 7630616, 8065213, 8878721, 12008579, 14441780, 11293466, 3111692, -3830686, -5599199, -4823732, -4951388, -4853396, -2628326, -580144, -1497479, -3027127, -1293535, 1944966, 1717779, -1682443, -2943611, -580688, 707691, -2038385, -5394172, -5234608, -2366240, 377955, 2721896, 5348240, 6766808, 5308478]
38753E308478k871520j362873O14821N48618j225829l118012l914995k479084
38745h500396J287601M778773M841984K196001R33515K699435M034826J241313
38737A3513052l976169o100470k790106J746111J702186k774402n349525j848848
38729e878171L727301M560619O18066j758518K90876K189867k59300m234519m664354
38720e408133j766139M42132N05252J55648L76283P75467J576666K725120K351236
38711A733532m03062k440638m37007L548558M324584J028404j791752r19049J460664
38702F104234J502458j365080m475046m917352j785671K842030M867085K047900
38694D820558k683787l823271l2852L626012J775716m097786o814272k355739
$$ y = [5308478, 2436958, 1074085, 1688906, 2237524, 1011695, -2106317, -6021312, -8500396, -7212795, -2434022, 2407962, 4603963, 5537478, 8236913, 12271739, 13513052, 9536883, 3436413, 646307, 2392418, 4094604, 1320202, -4029323, -5878171, -2150870, 2409749, 3027815, 1269297, 1560173, 3750040, 3490740, -743779, -5408133, -7174272, -6732140, -6226888, -6071240, -5694957, -4919490, -3342824, -617704, 1733532, 1330470, -1110168, -1547175, 2001383, 6325967, 7354371, 5562619, 4643570, 6104234, 7606692, 6241612, 1766566, -3150786, -4936457, -2094427, 2772658, 4820558, 2136771, -1686500, -1719352, 1906660, 3682376, -415410, -7229682, -9585421]
38686i585421M513868N860457R83422k649100r4448M040264L149883r37909j524913
38677C756103J474933J816856j603398k578301J099061L147147l41982l922987
38669B847432k210789J265413J132166p80979p35243q99640l624504m101278J633343
38660e474079O804650L065666m647869m712196K358145N005585p5549l758579
38652a434226j409735P7861l298078m387235J836826P904632N457401j508758
38644C238688m037217j896568p86141j423759o71645M26662j249127l295686p27404
38635a0422197M820411O479726K380363k101423k486682l8931J852953J517019
38627B001239r80383l837386l787396K24478M348918M091816K16660k747911k345441
$$ y = [-9585421, -5071553, 788904, 1772326, -876774, -971222, 3069042, 6218925, 5281016, 3756103, 5231036, 7047892, 5444494, 2866193, 3965254, 7112401, 6770419, 2847432, 636643, 1902056, 3034222, 2253243, 1518000, 618360, -3006144, -7107422, -5474079, 1330571, 4396237, -251632, -4963828, -2605683, 2399902, 2324353, -1434226, -2843961, -2766100, -6064178, -10451413, -8614587, -709955, 4747446, 3238688, -798529, -2695097, -3481238, -4904997, -5576642, -5149980, -6399107, -9694793, -10422197, -5601786, 877940, 3258303, 1156880, -1329802, -1368733, 484220, 2001239, 1020856, -2816530, -6603926, -6379448, -2030530, 2061286, 2277946, -469965, -2815406]
38618b815406O83946M873084P724831N510799j726856p258788n400600k07447
38610A383563R6227m057476m280094J882743O380629K995778l357252m687505
38602c643387j556050n37212l520042n775369l548537J514147N621028O715278
38594d730144M558538k8942m709869o153474k719866L216128O391789L423450
38586g52390k865650n383917q38172N602825O557739J992501j722490j681418
38578I09028j533599l435963l483245R18201M783318K468497l100643m658364
38570g132770j439186J159180J188424J867495L810135L347387J37614r79815
38562A958464J529302K552120p97975l683651j863060P18175j063027m238305
$$ y = [-2815406, -2131460, 2741624, 10466455, 15977254, 14250398, 6991610, 1591010, 1383563, 1479790, -2577686, -6857780, -4975037, 1405592, 4401370, 1044118, -3643387, -5199437, -5736649, -9256691, -15032060, -18580597, -17066450, -11445422, -4730144, -171606, -200548, -4910417, -11063891, -13783757, -10567629, -4175840, -752390, -3618040, -9001957, -9840129, -4237304, 2320435, 4312936, 2590446, 909028, -624571, -4060534, -7543779, -6625578, -1842260, 626237, -2474406, -7132770, -8571956, -7412776, -6224352, -4356857, -546722, 2800665, 2938279, 1958464, 3487766, 6039886, 5241911, 1558260, -304800, 413375, -649652, -4887957]
38554d887957k994538Q88902J296394j142339l50147L749769M543335M48566j890737
38545c38752J094343L887478J522720k079524r89596L149334M392064J340005
38537A1978072k785867n724785o771964m681659L5738L163460J866437n89475
38529c510043J58427K397122J473919k017567l181318r54971O96877j39535n86779
38520e663868J526225L942564L522807M86670k332026k640757n52364J552299
38512a58450J504895L34012P67424K053848K89106m043517m391361J595592N972023
38503C923572J676349n267547m050808L748322O334995K06571n240712l452541
38495b121799L75567L90388l73546K059580L811596J96196m740767l918454J619216
$$ y = [-4887957, -7882495, -6993593, -5697199, -6839538, -7189685, -3439916, 1103419, 1551985, -338752, 755591, 4643069, 6165789, 4086265, 3096669, 6246003, 10638067, 11978072, 9192205, 3467420, -3304544, -7986203, -7950465, -4787005, -2920568, -3510043, -3351616, -954494, 519425, -1498142, -4679460, -5634431, -4937554, -5077089, -5663868, -4137643, -195079, 3327728, 3814398, 1482372, -1158385, -1710749, -158450, 1346445, 1680457, 2447881, 4501729, 4790835, 747318, -3644043, -2048451, 3923572, 5599921, 332374, -3718434, 29888, 6364883, 6571454, 1330742, -2121799, -1746232, -1355844, -1729390, 330190, 4141786, 4337982, -402785, -4321239, -2702023]
38486b702023M708551K544591j317980l407385l105783p01147K301709K586975
38478I07508p07790l058766m32788M062975M505463J278977P7784K569756M083017
38469A3286136J403669k427504l224495j698433j569700l662895m684296j923728
38461d501246K481821L492544l52146m238433k956057J919877M178045J695822
38453A720227j456125k028219j468005j065785J183895N492989P076003K691064
38445A2146044l369963m762214j749003M54605k45110j291566o04032J212561
38437A791322K981047L749758K420363n62711k609532k590785k808319m642663
38429b271520n179485j725595L158994N122244L925003J960323k74223k931494
$$ y = [-2702023, 2006528, 4551119, 3233139, -174246, -3280029, -3981176, -1679467, 907508, 199718, -2859048, -3291836, 771139, 5276602, 6555579, 6633363, 9203119, 13286136, 14689805, 12262301, 9037806, 7339373, 5769673, 2106778, -2577518, -4501246, -2019425, 1473119, 1120973, -3117460, -6073517, -4153640, 24405, 1720227, 264102, -1764117, -3232122, -4297907, -3114012, 2378977, 9454980, 12146044, 8776081, 4013867, 2264864, 2719469, 2474359, 1182793, 578761, 1791322, 4772369, 8522127, 10942490, 10379779, 7770247, 5179462, 2371143, -2271520, -7451005, -9176600, -6017606, -895362, 3029641, 4989964, 4715741, 1784247]
38421A784247l950166k068070R5111M56051J421357M316258M333158j941774q029383
38412c583211n385586K929463O115030J903473j409028M34117J874163r75384
38404A903037l253726n12554L386740L069507j67270k214824k653670k484231
38396b926991m45589L497321N483589L222448k0747j113186k160064n312182p271444
38387g046845m665053p73523m88904j787249P81835O110455P385605K647990k271113
38378a06802k458968J56161J436537P69127l33113j520335k470935j279205K528214
38369c279319N003456J810325m675139o362552J88512P568845O030746l099281
38361C185593q332737l602952L485120L282299j856873k541503K304083M554962
$$ y = [1784247, -2165919, -4233989, -4138878, -3682827, -2261470, 2054788, 6387946, 4446172, -3583211, -8968797, -6039334, 75696, 1979169, 570141, 1004258, 2878421, 1903037, -1350689, -1863243, 1523497, 4593004, 4425734, 2210910, -442760, -2926991, -3372580, 124741, 5608330, 8830778, 8810031, 7696845, 5536781, 224599, -7046845, -11711898, -12485421, -12974325, -14761574, -13979739, -7869284, -483679, 2164311, -106802, -2565770, -2409609, -973072, -203945, -537058, -2057393, -4528328, -5807533, -3279319, 1724137, 3534462, -1140677, -7503229, -7314717, 254128, 6284874, 3185593, -5147144, -8750096, -5264976, -1982677, -3839550, -6381053, -4076970, 477992]
38353D77992R03085k145099R9333K895240J047255j929514j89435M204104M592619
38344I955580J20822l911467m397619l119188j829462M6633K543331L988878L264851
38335F662359P91786k400083m714581m397687j911954j66968l74050p3472K318541
38326d266109M032835K366010l88357o01565O10082k62448k527267k223238J144857
38317b115200L689206L000217Q50058k22035K34504J172717R74115j459766m295693
38308A828123l390096J747611N278364K433145l040749l989838k22832K243181
38300B886909Q83290r62994j025108q22926r99798j29355J016657q0261k156674
38291a390260j087703K737985M153281J428410j620366k791699l713790l655893
$$ y = [477992, 1381077, -764022, -664689, 2230551, 3277806, 1348292, 1158857, 5362961, 9955580, 10076402, 6164935, 1767316, -1351872, -3181334, -3134701, -591370, 3397508, 6662359, 7454145, 5054062, 339481, -4058206, -5970160, -6137128, -6511178, -6584650, -4266109, -233274, 2132736, 1744379, 1142814, 1752896, 1490448, -1036819, -3260057, -2115200, 1574006, 4574223, 5424281, 5202246, 5436750, 6609467, 7583582, 6123816, 1828123, -1561973, 185638, 5464002, 7897147, 4856398, 866560, 643728, 2886909, 3770199, 2807205, 1782097, 959171, -40627, -169982, 846675, 766414, -1390260, -2477963, 260022, 4413303, 5841713, 4221347, 1429648, -2284142, -5940035]
38283e940035O04568O365838N594625k055101o235709j577132L229036k16967
38275b30877n860622l770948K857555L874497K6363O46958N956413O198786r24291
38266H773834n910830l605740p27498k293617k722230K237544N501395K79037
38258A531895o548446m018311M930935O946584j605905q996874m756658O426447
38250f090333J1614622N549589m557483q279568l056548M157712N446591R74845
38242E759427k270561l73934K679398J865566j226097j537417J332700K878126
38234I107208N96862k988582m180859j979776J717462L580087J361639l053931
38226D160110m718576j876852J242592O79570j276703m11433K086593J938135
$$ y = [-5940035, -5335467, 1030371, 6624996, 4569895, -1665814, -3242946, -13910, -230877, -6091499, -9862447, -7004892, -3130395, -3104032, -2457074, 3499339, 9698125, 8773834, 2863004, -742736, -1470234, -3763851, -6486081, -4248537, 1252858, 1531895, -5016551, -9034862, -4103927, 2842657, 1236752, -7760122, -12516780, -6090333, 5524289, 11073878, 6516395, -1763173, -4819721, -662009, 4784582, 5759427, 3488866, 3114932, 5794330, 7659896, 6433799, 4896382, 6229082, 9107208, 9704070, 6715488, 2534629, 554853, 2272315, 5852402, 7214041, 4160110, -558466, -2435318, -1192726, -513156, -1789859, -2201292, -114699, 1823436]
38218A823436p29605k106867j508874j205415l82551L731505Q538313P215458
38210A5375400j069065q629668r352195n584706k552127j456153r46858m62254
38202a4677626O94476L216262M850031K562995j007987K99704N562480N971448
38194G471783j711556q861575p453163j241459K052310K543075M229405N564734
38186B593554L145880n9245L82642J345275k156695o005464k755707M242709M661851
38177E394800j664455m161048O92045L899592j14720m452199k551206Q70556n42170
38168b628805l212466p51309M071781M029048k64514j989376L66681J692938k99353
38159A014625j873455k89688J879075J125019k112126m353985k808269K063052
$$ y = [1823436, 1093831, -1013036, -2521910, -3727325, -4109876, -378371, 8159942, 15375400, 14306335, 5676667, -3675528, -9260234, -11812361, -13268514, -14215372, -14677626, -13983150, -10766888, -5916857, -3353862, -4361849, -4062145, 1500335, 7471783, 5760227, -3101348, -10554511, -11795970, -9743660, -7200585, -2971180, 2593554, 5739434, 5680189, 6062831, 7408106, 5251411, -754053, -3509760, 732949, 5394800, 3730345, -430703, 261342, 4160934, 4046214, -405985, -2957191, -2086635, -2628805, -5841271, -6592580, -2520799, 1508249, 1243735, -745641, -378960, 1313978, 1014625, -858830, -1148518, 730557, 1855576, -256550, -4610535, -7418804, -5355752]
38151e355752O375468O163312K138042p77033r9434R41005q70452l178118k043188
38142C293850J316763K455003N85639j293503k080113l301287m444094k861348
38134f329090O60638J266003k660727n636155k048671N565212R223648N612397
38126E653255l59157k665651j244224J95335N69951J610407K624728J36119n630599
38117H90164q493810m154783K999739N439157K515918k24621k18904j94357j316570
38108b758067o08466K786257M447163J053921m205718n908568l097429R52807
38100g338100L036164J949453j239687l111777q61040L342658M277958J099221
38092A154850j377077m21028N79523j400876l544436k154556J125704K500736
$$ y = [-5355752, 1019716, 7183028, 9321070, 8544037, 8444603, 9385608, 8515156, 5337038, 3293850, 4610613, 7065616, 7651255, 6357752, 4277639, 976352, -3467742, -6329090, -5668452, -4402449, -7063176, -12699331, -14748002, -9182790, 40858, 5653255, 5294098, 2628447, 1384223, 1579558, 2149509, 3759916, 6384644, 6520763, 890164, -7603646, -11758429, -8758690, -3319533, -803615, -1028236, -1247140, -1441497, -2758067, -3366533, -580276, 3866887, 4920808, 715090, -5193478, -8290907, -7338100, -4301936, -2352483, -3592170, -6703947, -7564987, -4222329, 55629, 1154850, -222227, -643255, -63732, -1464608, -5009044, -7163600, -6037896, -3537160]
38084c537160K043343K129646K661139K030437N38882o89688j786407k247333
38076A142859k71249L000758K781103k006019n283894k569746J559595P73744
38068h72849k636314k081664J882620K734039r03501l463895j723206J373711
38060e691059K804795K947724K059794q63526m476019n268147k426203J454860
38052i457781M432909N927965M489390k1263l166627q34981L427542K643177k500615
38043D939716m375461p71815J791398o59667l240871j298348J419303o03434n050953
38034g850132n082514O01003O415220P399966M115117N36940l88983P09748O07916
38025G064281k294153n160590m203479k75094K217547J607151L71628K91907M24468
$$ y = [-3537160, -1493817, 635829, 3296968, 5327405, 5866287, 5176599, 3390192, 1142859, 871610, 3872368, 6653471, 4647452, -636442, -3206188, -1646593, -872849, -3509163, -5590827, -3708207, -974168, -1877669, -5341564, -7064770, -5691059, -2886264, 61460, 2121254, 1257728, -3218291, -8486438, -10912641, -9457781, -5024872, 903093, 5392483, 5371220, 2204593, 1369612, 4797154, 7440331, 4939716, 564255, -207560, 1583838, 924171, -2316700, -3615048, -2195745, -2799179, -7850132, -12932646, -12331643, -5916423, 1483543, 5598660, 6135600, 5746617, 6456365, 7064281, 4770128, -390462, -4593941, -4869035, -2651488, -1044337, -672709, -380802, 43666]
38016D3666K84510P10522R50089o74786k522610q23351L871472O306366L946956
38007A2092834N9838j938391k303648j788896Q7452J889797P19477k287433k372706
37998D158324J005527K680602M17236j419252P9843J302633q38363l160955k235405
37989A990190k64781j6272L07320J906846J197082l122474m885933L30290O253538
37980C695806M517360k220393m833184k034246l32604j547157o57317L485866
37972G4131M875753J91170n623122o561353k712017K055533M736055L855012N717
37963H96879k951259j431716K388796L070483K10233j076353J129921K272050
37955D509034r79720n147838n403138k377306J26713J106766K342708M286501
$$ y = [43666, 328176, 1038698, 1988787, 1314001, -1208609, -2031960, 1839512, 8145878, 12092834, 12152672, 10214281, 7910633, 6121737, 6209189, 8098986, 8818463, 6531030, 4158324, 5163851, 7844453, 8261689, 6842437, 6922280, 8224913, 7386550, 4225595, 1990190, 1725409, 1709137, 2016457, 3923303, 5120385, 1997911, -2888022, -2557732, 3695806, 8213166, 5992773, 1159589, -874657, -1207261, -2754418, -3411735, 74131, 4949884, 5141054, -482068, -7043421, -9755438, -7699905, -2963850, 891162, 896879, -2054380, -3486096, -1097300, 1973183, 2183416, 1107063, 2236984, 4509034, 3529314, -1618524, -7021662, -9398968, -9272255, -8165489, -5822781, -1536280]
37947a536280N195154L706849M27779k538342k960727m92542K333892K521005
37939F656788J19444k231608k918706k350738q06294J734302L447162J695356
37931E345706k658511m888230k174369K345263L370121J62353k572732o89058
37923a759457L864059M946504J8466n820515n950570j116456J903635L89681j156702
37914d681355L49054J330663q77981j698836K766611O826098K893362n390348
37906A517268p569342k399829R91334j491503l098962J089401N588716M033964
37898a338953n22278j317383J583658K790873J24459l603403m991459k629504
37890i903990K261395N419854L164395j703476k179158K656746N403862J585109
$$ y = [-1536280, 3658874, 7365723, 7793502, 5255160, 2294433, 1801891, 4135783, 6656788, 6776232, 4544624, 1625918, -724820, -1531114, 203188, 3650350, 5345706, 2687195, -2201035, -4375404, -2030141, 1339980, 1502333, -1070399, -1759457, 2104602, 7051106, 7069572, 1249057, -4701513, -5817969, -3914334, -3524653, -4681355, -4332301, -3001638, -3879619, -5578455, -2811844, 4014254, 6907616, 1517268, -6052074, -8451903, -7460569, -8952072, -12051034, -10961633, -5372917, -1338953, -1861231, -3178614, -1594956, 1195917, 1320376, -2283027, -7274486, -9903990, -7642595, -2222741, 941654, -761822, -2940980, -284234, 5119628, 6704737]
37882F704737l365051l221883p71544j900903n058498m376691M1748K706502J673467
37873g568116j04564r17603j276366j12728L508280O050187L479036j361004k167840
37864d70718P59753J368704j276173j301388L095952N383787J094197m515678
37856D138436m369946k8871J466157j858587m953926l323937J557050M707214
37848b666410L372860j99580j466905P68343K712763J222136j029349L09988L660808
37839F684654L384763j142590m397855l487560j738792j649734q25852J904753
37831a268213K775885n9769j818127J287145M783298K609128l095866n690950
37823d77469m233789k713948j564973K095832O711866O713773J335412l809661
$$ y = [6704737, 3339686, 117803, -653741, -2554644, -7613142, -11989833, -11948085, -9241583, -7568116, -7672680, -8590283, -9866649, -9979377, -6471097, -420910, 3058126, 1697122, -470718, 289035, 1657739, 381566, -919822, 2176130, 7559917, 8654114, 4138436, -231510, -260381, 1205776, -652811, -5606737, -8930674, -7373624, -2666410, 706450, 506870, -960035, -191692, 2521071, 3743207, 2713858, 3023846, 6684654, 10069417, 8926827, 4528972, 1041412, -697380, -2347114, -3172966, -1268213, 1507672, 1447903, -370224, 916921, 5700219, 8309347, 5213481, -477469, -4711258, -7425206, -8990179, -6894347, -182481, 6531292, 7866704, 4057043]
37815D057043m886316l354732o82944L647919P398700N824136o70984n394678
37807E938144m821540l025613l361455k406400K806429P481345N462214j177793
37799F895331n370773m840545k582415l13514K144078K980774M30468k609818
37791c266414k161647J8131k69782j162673K433485Q065444P260006m60394m892977
37782E563179o37644M076238O80933n695744m628647K627505N145567o81021o360161
37773I0205m448536K056784N957972M711115L1730n723670r307710p231167m10965
37764a4274242N043508M862844J666256L44539J538701K771072K932145J928575
37756F813398j308210o036840p246934j340492O805761Q234924J770215m087805
$$ y = [4057043, -829273, -4184005, -4866949, -1219030, 6179670, 12003806, 11332822, 5938144, 1116604, -1909009, -5270464, -7676864, -4870435, 2610910, 8073124, 6895331, 1524558, -3315987, -5898402, -6211916, -4067838, -1087064, -656596, -3266414, -5428061, -5409930, -5679712, -6842385, -4408900, 3656544, 10916550, 10456156, 5563179, 4925535, 9001773, 9682706, 3986962, -641685, 1985820, 7131387, 6450366, 90205, -4358331, -2301547, 3656425, 8367540, 8399270, 2675600, -6632110, -13863277, -14274242, -9230734, -4367890, -2701634, -2357095, -818394, 1952678, 4884823, 6813398, 5505188, -531652, -7778586, -9119078, -2313317, 5921607, 7691822, 3604017]
37748C604017k716270K482347M392430J911736r79712k390610l383027l490081
37740e69170j127153J688923O88596l334143l977259J301379O166870M189672
37732E027715j414606k776613M19736J134087k751691m512043L6954M649121K081252
37723A893912l928477l913109K775704P152187M205109r78527k683513k336093
37715B187193k840876k134758J667393M074969M36802n101672m641311J293914
37707e058346M650371K438128l7284K81645p08071n044339o813796j512846N134827
37698f669711N112537L83450q10151K856145M847557K194541o84223o95547o75765
37689E858833k556635k926406N06662L674455K182585j736576l257072k400509
$$ y = [3604017, 887747, 3370094, 7762524, 9674260, 8694548, 6303938, 2920911, -569170, -1696323, -7400, 681196, -2652947, -6630206, -5328827, 838043, 5027715, 3613109, 836496, 1256232, 2390319, -361372, -4873415, -4836461, -187340, 1893912, -2034565, -5947674, -3171970, 3980217, 8185326, 7206799, 4523286, 2187193, -653683, -2788441, -1121048, 2953921, 3390723, -1710949, -6352260, -5058346, -407975, 2030153, 1992869, 2274514, 1566443, -3477896, -10291692, -11804538, -6669711, -1557174, -1173724, -1983875, 872270, 5719827, 7914368, 7230145, 6534598, 5858833, 3302198, 375792, 882454, 4556909, 6739494, 5002918, 1745846, -654663]
37681f54663k146651j984000N64128L495325J932100l527836o152960k604530
37673a1079087K130288K377617r815M38695L414140L084729k092735n316035m55594
37664g507797Q170512J0058532K260712o233554o222147k02502K063170k440432
37656e3506o530194l817941K772223O238017M766545K020620J234206K894545
37648I524515O122692Q547349O474959q96090q411195r759844m856066N83840
37640G330160K042862j89946l275777m255027j241692M053302N896644Q32761
37632A1193287o221142o941162o59294M694854L577245o40879k267437j350266
37624A385206j444684k811225k251430J353940M616673L277135k575946p186357
$$ y = [-654663, -2801314, -4785314, -4221186, -725861, 1206239, -2321597, -8474557, -11079087, -8948799, -6571182, -6580997, -6142302, -2728162, 356567, -1736168, -7052203, -7507797, 662715, 10721247, 12981959, 6748405, 526258, 323756, 2386926, -53506, -6583700, -10401641, -7629418, -1391401, 3375144, 5395764, 6629970, 9524515, 15647207, 24194556, 30669515, 29773425, 21362230, 11602386, 6746320, 7330160, 9373022, 9183076, 5907299, 1652272, 410580, 4463882, 10360526, 11193287, 4972145, -1969017, -2628311, 2066543, 5643788, 5002909, 2735472, 1385206, -59478, -2870703, -5122133, -3768193, 848480, 4125615, 1549669, -5636688]
37616e636688m316675M772567J0587330O061625l789690p782274l026992K827778
37608c03019L847115K611634K564719J556279k265750m928795l117652p49506
37600g84975k338681m366562r47246N180709N794866j8308m457446k700246J457190
37591c180699L048593K366740J580948M62474j506175k771524k193740r86702
37583c180085k89216N33422J805583K461324K148275J737460J048459q46984k487546
37574B930692j023656K463930K861726j566906n644467m263627M14922K538417
37566a288969Q76301p37662L5220J518820K126120K832901M113320L675958j51218
37557A3000791m616933n255929k109540o4842j793071l402483k32219N094353
$$ y = [-5636688, -9953363, -5180796, 5406534, 11468159, 7678469, -103805, -3130797, -303019, 3544096, 6155730, 8720449, 10276728, 8010978, 3082183, -35469, -784975, -3123656, -7490218, -8437464, -3256755, 2538111, 2519803, -1937643, -4637889, -3180699, -132106, 2234634, 3815582, 4278056, 2771881, 357, -2193383, -3180085, -3469301, -2935879, -1130296, 1331028, 3479303, 5216763, 6265222, 5418238, 2930692, 1907036, 4370966, 7232692, 5665786, 21319, -4242308, -3827386, -1288969, -412668, -1150330, -1115110, 403710, 2529830, 5362731, 9476051, 13152009, 13000791, 8383858, 3127929, 1018389, 953547, -839524, -4242007, -4474226, 620127]
37549F20127N390312k04677l902894o60125L653751J037524n676014o461814M68971
37540e734839N628506K663744k495936j899612J852776R91962l567094l217333
37532e777826L756502P995975K983064m559637m501256J640575L717745j067545
37524D187597m480599j132420K848618K23787n163257m371607K396267O332054
37516H40440L681715J12343K22306R01303j524340m379136l499089n483K326846
37507a323095K560314J505978r91812l823005l618311M8016K571179J436019N41439
37498a093278K582922K816697k734225q108175n262822K545175N075958Q43851
37490c333897j849876N85273K213074o57680k895051k1240L788497K540903k379085
$$ y = [620127, 6010439, 5805762, 1902868, 1242743, 4896494, 5934018, 258004, -6203810, -5734839, -106333, 2557411, 61475, -1838137, 14639, 1006601, -2560493, -5777826, -2021324, 5974651, 8957715, 4398078, -103178, 1537397, 5255142, 4187597, -293002, -1425422, 1423196, 1646983, -3516274, -7887881, -5491614, 840440, 4522155, 4634498, 4856804, 5758107, 4233767, -145369, -3644458, -3649941, -1323095, 1237219, 2743197, 1751385, -2071620, -5689931, -5641915, -3070736, -1634717, -1093278, 1489644, 4306341, 1572116, -6536059, -11798881, -9253706, -4177748, -3333897, -5183773, -4598500, -2385426, -3043106, -5938157, -5959397, -2170900, 370003, -2009082]
37481b009082m869494k292936K680660N707476M208928j98559k286932M54282
37473A394343L121563P3493n356627n199117K3907J899790j362849j804634L649398
37464c560733O561333J051240n557073m298995J487983L039991M71319K14106
37456e90829K652162K393009j367972l701108k279885L27437J912490K280454
37448A625758J011829j217376j244008J645280K606971j337848m842749k141406
37440c893549K712187J987473k753229l626438j82997O81700j822905n28113O044422
37431a381449R168883L451113m399127n953848k666813q44014j129429l3224K053547
37422a734361J464612j702358l028789l59403L150299L436585O11715j471760
$$ y = [-2009082, -6878576, -9171512, -6490852, -783376, 3425552, 3226993, 940061, 1394343, 4515906, 4589399, -767228, -5966345, -5942438, -4042648, -5405497, -7210131, -3560733, 3000600, 4051840, -1505233, -5804228, -4316245, -1276254, -804935, -590829, 2061333, 4454342, 3086370, -614738, -2894623, -2567186, -654696, 1625758, 2637587, 1420211, 176203, 1821483, 4428454, 3090606, -1752143, -3893549, -1181362, 806111, -1947118, -5573556, -5756553, -5074853, -6897758, -7425871, -1381449, 7787434, 11238547, 6839420, 885572, -1781241, -2625255, -3754684, -3787908, -1734361, -269749, -1972107, -5000896, -5360299, -2210000, 1226585, 1838300, 366540]
37414C66540j12392K621589K278858j689290m306703j698623L041558L969278
37406D470815M45219k929656l298159j987195o74288L38155M06380n32050J5404
37397c745375L535257O103714L109462k676738m397358j867984j212072l415733
37389d566827k425655K964701M995597l67307n414959k380538M006660M106127
37381I17799j534848l901447J43786M163182K817074j171856k447983l18868J539564
37372B06403L0303l877120n650206j982274M241579O425741L132852M04261K328322
37363E259861M218140M39182n285128m804553J528058N138933K354105r76106
37355G872492R5653K146653K65742l634663m578579k529717j121567q54181P88005
$$ y = [366540, 254148, 2875737, 5154595, 3465305, -841398, -2540021, 501537, 4470815, 4916034, 1986378, -1311781, -3298976, -3973264, -3635109, -3228729, -3760779, -3745375, -210118, 5893596, 9003058, 6326320, 1928962, 60978, -1151094, -4566827, -6992482, -4027781, 967816, 600509, -4814450, -7194988, -3188328, 917799, -617049, -4518496, -4374710, -211528, 2605546, 1433690, -1014293, -1333161, 206403, 236706, -3640414, -9290620, -11272894, -7031315, -605574, 2527278, 2931539, 5259861, 9478001, 9917183, 4632055, -172498, 1355560, 6494493, 8848598, 7872492, 7968145, 10114798, 10380540, 6745877, 2167298, -362419, -1483986, -2338167, -1550162]
37346a550162L279774K706063j499882m238547j765903K453635K610846q34243
37338A161581k049917R53424L190201P43116k859331k380564O79562J103136p26828
37329a85620L79311M278194L918736l323578r733728p575397K2075M313469L021175
37320d885363O76645k21735j081003j394633J432681N616666N165829j119525
37312D189562o411838m824140P69699L529206J910640J3573O36452K173582K139408
37303D126144M90701j284880k312343k544131j905026k44213J973597L482916
37295A782765L124497J047844j181064j800901j36971K947117N220910M190174
37287A5194371m88241n597522p047306m392040r57841P27934J072137M81054j940065
$$ y = [-1550162, 1729612, 4435675, 2935793, -1302754, -3068657, -615022, 1995824, 1161581, -888336, 65088, 3255289, 3998405, 1139074, -1241490, -561928, 541208, -185620, 193691, 4471885, 8390621, 5067043, -4666685, -12242082, -12220007, -7906538, -4885363, -4208718, -4430453, -5511456, -6906089, -5473408, 143258, 5309087, 4189562, -2222276, -7046416, -6276717, -2747511, -836871, -823298, -186846, 1986736, 4126144, 4616845, 3331965, 1019622, -1524509, -3429535, -3673748, -1700151, 1782765, 4907262, 5955106, 4774042, 2973141, 2836170, 5783287, 11004197, 15194371, 14706130, 9108608, 2061302, -2330738, -3288579, -2560645, -1488508, -1007454, -2947519]
37278b947519m785999l584365K611798P376026M768475j466156k721757J719217
37270I69720L908183q2574m099538j777579L689573M737167M60867l119356k098084
37261B588379R89702J780262o48919l710735m232683j083864L595630N770235
37253E048007L276838j907461n768966n909924k681171J779434M589461L847729
37245B273947Q37702q61354J42293J204226M4868j221604N03568L505263L008782
37236I437691j402881m421899k497176R87882P00199l005390m885612k209067
37228g296253K133101M147852L208090Q32850k066747m393724l677604P32591
37220f379844M436752K367998l265883m366990J606205O629326K981753m949385
$$ y = [-2947519, -7733518, -11317883, -8706085, -1330059, 3438416, 1972260, -749497, 969720, 4877903, 4795329, 695791, -1081788, 2607785, 7344952, 7805819, 4686463, 2588379, 3578081, 5358343, 4709424, 998689, -3233994, -4317858, -722228, 5048007, 8324845, 6417384, 648418, -5261506, -7942677, -6163243, -1573782, 2273947, 3111649, 2250295, 2392588, 3596814, 3641682, 2420078, 2923646, 6428909, 9437691, 8034810, 3612911, 1115735, 2103617, 2803816, -201574, -5087186, -7296253, -5163152, -1015300, 2192790, 3025640, 958893, -3434831, -7112435, -6379844, -1943092, 424906, -2840977, -7207967, -5601762, 1027564, 4009317, -940068]
37212i40068o343010M48526N732899K842937k946260l479994N34029K482671O39749
37203a028521m71282J641862L511617J127714m249958p266240m189295K937645
37195g986458P597952N374083n62130k998916l58416J228102k243931n680354
37187e630068k607116M116761O060908J654510k558170k762106k241194l320933
37179g287408k466891K675646P228486N315661j137437m829325k507739K130378
37171h78629M064126K210943p31374j570147K84200K238535J662453m84145r38887
37162E857075J051450K824026K457670Q12796j037129k986125l905686k423480
37154B650597n33557j844330m999899m307891R53734M060604J175456k305706
$$ y = [-940068, -7283078, -6834552, -1101653, 1741284, -1204976, -4684970, -4150941, -1668270, -1028521, -1499803, 142059, 3653676, 4781390, 531432, -6734808, -10924103, -7986458, -388506, 4985577, 4423447, 1424531, 1066115, 2294217, 50286, -5630068, -8237184, -4120423, 1940485, 3594995, 1036825, -1725281, -3966475, -7287408, -9754299, -7078653, 149833, 5465494, 4328057, -501268, -3009007, -878629, 3185497, 5396440, 4665066, 3094919, 3379119, 5617654, 7280107, 6795962, 5857075, 6908525, 9732551, 12190221, 13003017, 11965888, 8979763, 5074077, 2650597, 2117040, 272710, -4727189, -9035080, -8081346, -4020742, -2845286, -5150992]
37146e150992q51994J996820L98761l061504j725176L616574O313373M822983
37138F358845L333814K681863l15856m553567m739037r50738N15993k225015l460049
37129c353747P5393L935371M054472K525478J522320j086371n508565o582012
37121d417661j989252K516417J922006j01606J502905L809578J531799k735322
37113B038864k519123J318172K100423j355753l268933o98327K592023K973575
37105C180921J397225j86473j523951k033002p09442J068256Q52847l87240M38240
37096B097381K491660J343795l525018o581744l714264K270209N969461N781685
37088F133165L569757R11999j457201k301125o93786K274617M085570L030474
$$ y = [-5150992, -6002986, -4006166, -3607405, -6668909, -8394085, -4777511, 1535862, 6358845, 9692659, 12374522, 12058666, 7505099, 2766062, 1815324, 2331317, 106302, -3353747, -3278354, 657017, 4711489, 7236967, 8759287, 7672916, 2164351, -4417661, -6406913, -3890496, -1968490, -2070096, -567191, 3242387, 4774186, 2038864, -480259, 837913, 2938336, 1582583, -1686350, -2384677, 207346, 3180921, 4578146, 4391673, 2867722, 834720, 125278, 1193534, 2046381, 1659141, 2097381, 4589041, 5932836, 2407818, -4173926, -7888190, -5617981, 351480, 6133165, 9702922, 10614921, 9157720, 6856595, 6162809, 8437426, 12522996, 15553470]
37080A5553470l80820l791610n019123m268416l557772l352526j554788K667628
37072c703957O185528N616215K111498m49448p67545n90791r48391j153096r96131
37063E303882j030817j047638n79473j50740p1708N09227J406590O50767j662154
37054C327936j941844J296666M069543L102751J096855Q50788p09068n571802
37046E521825p017225J141681J1412625J0735906M92241m621373J053550O523325
37038B5242555L071482k518350j206638L184935K156051k251724j181752O757828
37030C3254387J4389486J6466681J3968520J0525215J0680901J8591239L2560802
37023A50437231M3972673M6661185M3004943L5614349J9685741p660399l5710514
$$ y = [15553470, 15172650, 11381040, 6361917, 2093501, -1464271, -4816797, -6371585, -3703957, 2481571, 8097786, 10209284, 9759836, 8992291, 8401500, 7453109, 6300013, 5303882, 4273065, 3225427, 2645954, 2495214, 2423506, 2932733, 4339323, 4990090, 3327936, 1386092, 2682758, 6752301, 9855052, 10951907, 11802695, 11093627, 5521825, -1495400, -353719, 11058906, 21794812, 22287053, 17665680, 18719230, 25242555, 28314037, 25795687, 24589049, 27773984, 29930035, 27678311, 26496559, 33254387, 47643873, 64110554, 78079074, 88604289, 99285190, 117876429, 150437231, 194409904, 241071089, 284076032, 319690381, 339376122, 331715723, 296005209]
37016B96005209m8878389m5320374l6964798l1921043k6988218j8404154r978939
37009G7549294o905574q526336j0823103j1203877q665192l759029J37578j06914
37001B7696847k337069j873811N23073o45962o065151r279795o260723j254018
36993E03391K62361p27389j56187K147391L289723K483762J329171M40066q29598
36984H742691k026335j592731P95349L365875L885276J811444r99641k040715
36976A1941213j021908j14693p86259k049166k756746l155020k685416L77110
36968b50885M621230M873190l01840m667618k955383Q69027N12209j752027K77768
36959A225671M437827L086551k925330m601598Q9950L183119J228954O75400M293265
$$ y = [296005209, 247126820, 201806446, 164841648, 132920605, 105932387, 87528233, 77549294, 70643720, 62117384, 51294281, 40090404, 31425212, 27666183, 27803761, 27696847, 25359778, 23485967, 24009040, 23363078, 17297927, 8018132, 1757409, 503391, 765752, 38363, -117824, 2029567, 5319290, 7803052, 9132223, 9572289, 8742691, 6716356, 5123625, 5918974, 9284849, 13170125, 14981569, 13981928, 11941213, 10919305, 10804612, 10018353, 7969187, 5212441, 2057421, -627995, -250885, 4370345, 9243535, 8941695, 4274077, 1318694, 2187721, 2699930, 947903, 1225671, 5663498, 8750049, 5824719, 1223121, 1313071, 4496190, 5725144, 6400544, 10693809]
36950A0693809M642928j848588o013720o58101O158489M049857k155443j250445
36942A3618786M409327L048706n538166q906860k319593M662579M999525L880220
36934A7854524O330994P583727L489394J84036L955534R325926P633950K156140
36926E8514225L732333J3942983K3408829K6810063K9439544L5931682M0627784
36919B32407443L4222554J5427747q161876k7632619l7766808l7628178l0580020
36912A40288243k2768637j8306408j6060097j2855987q569381n772076n534668
36905E0420989o360981o768136o336036m598344j648639K97609j039577m062325
36897A9904560m522474j497612J020866j35885l066394m143221k716841k32325
$$ y = [10693809, 15336737, 13488149, 7474429, 6816328, 12974817, 17024674, 14869231, 13618786, 18028113, 21076819, 15538653, 6631793, 4312200, 8974779, 13974304, 17854524, 24185518, 31769245, 35258639, 35442675, 39398209, 48724135, 56358085, 58514225, 62246558, 76189541, 99598370, 126408433, 155847977, 191779659, 232407443, 266629997, 282057744, 273895868, 246263249, 208496441, 170868263, 140288243, 117519606, 99213198, 83153101, 70297114, 61727733, 55955657, 50420989, 44060008, 37291872, 30955836, 26357492, 24708853, 25006462, 23966885, 19904560, 15382086, 13884474, 14905340, 14769455, 11703061, 7559840, 4842999, 4610674]
36889D610674K589968M963290M900859J977055q14054j008087l79759j487298
36881A5352648k945094k159862m98060r06112k192001j099351J217696P65330
36873G535194j957292k634000r93299r80791k571172j281466K433814J921257
36865A472245m005419o843199j368021N322493N055943J504406K492886N318562
36857H949896J394583p346993r326360j379051N783143L802241j780829k025062
36849a928432J621947J911374j176658j021928L596241N451062j99817p651627
36841F02162p776876j42701O369353M968317r49965l356928n38058J793062r3431
36832H74935k610612j314496J771282J787568p79412j071919J846654L302637
$$ y = [4610674, 7200642, 12163932, 17064791, 19041846, 18227792, 17219705, 16839946, 15352648, 12407554, 10247692, 9749632, 8843520, 6651519, 5552168, 6769864, 7535194, 5577902, 2943902, 1950603, 969812, -1601360, -2882826, -449012, 1472245, -2533174, -9376373, -10744394, -5421901, -365958, 1138448, 3631334, 8949896, 10344479, 2997486, -6328874, -7707925, -1924782, 1877459, 96630, -1928432, -306485, 1604889, 428231, -593697, 3002544, 8453606, 8253789, 602162, -7174714, -7317415, -948062, 4020255, 3070290, -286638, -824696, 968366, 874935, -1735677, -3050173, -1278891, 508677, -270735, -1342654, 504000, 3806637]
36824C806637N76546k727202k192013J056129K426860L14317k325723k313970
36816a378419j76375Q41158q72747k890724j820987J656369L311228J595358J5777
36807B80638J166387K081483n73641l844582k428872K543932M686047J821686
36799E733078j644453k161047r91502K31488K081575L753834K514765r22789j737986
36790F856963J543076L972601J742263j997095k599255q45371k84652j397027
36782F991503k573100l609524m197940k202417K353198M761659J617898l514557
36774c73280n002552k948805j272585p19678P09746K431762K163340Q40171J120347
36765c051534K032088O79749j592966p45257K433870K507511k038341o082372
$$ y = [3806637, 4383183, 1655981, -536032, 520097, 2946957, 3261274, 935551, -1378419, -1554794, -713636, -1586383, -4477107, -6298094, -4641725, -1330497, 264861, 280638, 1447025, 3528508, 2954867, -889715, -3318587, -774655, 3911392, 5733078, 4088625, 1927578, 936076, 1167564, 3249139, 7002973, 9517738, 8594949, 6856963, 8400039, 12372640, 14114903, 12117808, 9518553, 8673182, 8388530, 6991503, 4418403, 808879, -3389061, -5591478, -3238280, 1523379, 3141277, -373280, -5375832, -8324637, -9597222, -10316900, -9607154, -7175392, -5012052, -4171881, -3051534, -1019446, -339697, -1932663, -2677920, -244050, 2263461, 225120, -5857252]
36757e857252n311018j501980J453328K626716L216590L928827M759176M973655
36749H288042K985926j150059l888460k365086P30467Q98382r75272q40521M64663
36740D148082j232517m219659k181173L802974M404860k856315p547543j946656
36732g627947O168286N391797j657230l529353J489249M003888k51222m403252
36724d15784k787595O25364L43941j871092j616283M31701J064747R79375K885615
36715c60011N258466L641994j935545n697287l730836P27317K149153M38997R0505
36706E82753K288687K485132k102888o666783m901412J446771M708121K248766
36698H9147q36205o88050K24819o88861j276770K79974J380343M99888J088891
$$ y = [-5857252, -11168270, -12670250, -11216922, -8590206, -5373616, -1444789, 3314387, 8288042, 11273968, 10123909, 6235449, 3870363, 4600830, 5499212, 4523940, 3683419, 4148082, 2915565, -1304094, -3485267, 317707, 4722567, 1866252, -5681291, -7627947, -1459661, 3932136, 2274906, -1254447, 234802, 4238690, 3987468, -415784, -3203379, -2578015, -2234074, -4105166, -5721449, -5289748, -4225001, -3245626, -360011, 4898455, 8540449, 6604904, 907617, -2823219, -2095902, 53251, 492248, 582753, 2871440, 5356572, 3253684, -3413099, -8314511, -6867740, -2159619, 89147, -747058, -1435108, -1210289, -1899150, -3175920, -2895946, -1515603, -1015715, 73176]
36689G3176M616498N481917l04042o614564n620100l27435P76326j777027l43901
36680d039152M958927N503573n56132m361200j301745J502826j657088m845484
36672d795475j206982M568372L929105j333910k588842J281986K883043j087083
36664A650214m956930l271836J722332M282589K584685n18740j788696q12147
36656a108529K84996k57314j337262m35843K384696M023467K537935n94477l230725
36647B266944m800626m827740k508789P61075J782156J15068j092689k41062P02949
36638g842714P72274J784185L504466K460081j512187l290131p25573J230415
36630c619184p38284k037257J281566M307713J613785k044992Q05863O528334
$$ y = [73176, 4689674, 10171591, 9867549, 3252985, -2367115, -2694550, -1918224, -3695251, -4039152, 919775, 6423348, 5867216, 1506016, 204271, 1707097, 50009, -4795475, -6002457, -1434085, 2495020, 1161110, -1427732, -145746, 2737297, 1650214, -3306716, -6578552, -4856220, -573631, 2011054, 1492314, -296382, -1108529, -823533, -1080847, -2418109, -2853952, -469256, 3554211, 6092146, 5497669, 2266944, -2533682, -7361422, -9870211, -9109136, -7326980, -7211912, -8304601, -8545663, -7842714, -7070440, -5286255, -1781789, 678292, -833895, -4124026, -4849599, -3619184, -4357468, -6394725, -5113159, -805446, 808339, -1236653, -430790, 6097544]
36622F097544N277362k372427n690778j186884K058788k250650p373670m406089
36614i846804M170639Q499968M575226k254891m923202j855111K648118L469940
36606D483883N60416j030816J387895L381168J83625m663148m009238J273106
36598A566891L312716k07810l124640j934228j050536l603560n266812k218869
36590a2526848J703136J526592q14440p99300J020810J571932J532199L095516
36582c690403M529550K800273n94412j826716j055300j455732l211410l340843
36574g844993r39457J648445K685300K530372J474605p10839k943603l161773
36566g261943r16713J934109L227694K411367R47338J090871L191455M393283
$$ y = [6097544, 11374906, 9002479, 3311701, 2124817, 4183605, 1932955, -5440715, -9846804, -5676165, 2823803, 7399029, 5144138, 220936, -1634175, 1013943, 4483883, 5044299, 4013483, 5401378, 8782546, 8966171, 4303023, 293785, 1566891, 4879607, 4671797, 1547157, -387071, -1437607, -5041167, -10307979, -12526848, -10823712, -9297120, -10111560, -10910860, -9890050, -8318118, -6785919, -3690403, 839147, 3639420, 3045008, 1218292, 162992, -1292740, -4504150, -7844993, -8784450, -7136005, -4450705, -1920333, -445728, -1156567, -4100170, -7261943, -8178656, -6244547, -3016853, -605486, 341852, 1432723, 4624178, 9017461]
36558I017461J974889k302606m048605k448955j073737k029084l352376l272717
36550g535730k747939k155565J11730L582507M582356J829335q32086j07348K003675
36541a269065J895813n89126l170945l861651j140943M414751P554191L090751
36533F923776n075395o635623N51905O410311L551601k167962k353667R26125
36525B131071J312075J18668J972959M014044N10983n443206o014651j971967
36517c370024q41505l296808k830118J358857K775747K822o46404K865168M424483
36508D42218J178034j434888j54497M39622k233605k725737K279859O262041K846359
36499F899406l450097m487399r89269N06465j008536j158458R34708K015352J754757
$$ y = [9017461, 10992350, 8689744, 4641139, 2192184, 1118447, -910637, -4263013, -7535730, -10283669, -12439234, -12327504, -8744997, -4162641, -2333306, -3165392, -3272740, -1269065, 626748, 37622, -3133323, -6994974, -8135917, -3721166, 3833025, 6923776, 1848381, -4787242, -4235337, 2174974, 5726575, 3558613, 1204946, 2131071, 3443146, 3561814, 5534773, 9548817, 10059800, 4616594, -1398057, -3370024, -4211529, -7508337, -10338455, -8979598, -6203851, -6201029, -6847433, -3982265, 442218, 1620252, 185364, 30867, 470489, -1763116, -4488853, -2208994, 4053047, 6899406, 3449309, -1038090, -2027359, -1520894, -2529430, -3687888, -2753180, -737828, 1016929]
36490A016929L041235N315850M320843n18971m165793l223103o05756o17522k656607
36481A907105k653529Q20517M481826M441483Q81437k379060k715099j688181
36473C096499k241679m162957m372451j303675L126114N895566N424401K126877
36465G588695j544045k302742K12513J814352q99379m666208l503979J777655
36457a523138L603745j350655o635224m763671K621998P341946N032667q34950
36449C492718m246782k999036L00151K000760J449301P24752N35031j007486l836131
36440c586722l828217P06587M062060R19684l831239j509817N542207O029115
36432D503658k153971p256638j736343N812588M364284k847978n035398r47830
$$ y = [1016929, 4058164, 9374014, 13694857, 13175886, 9010093, 5786990, 5181234, 4563712, 1907105, -746424, 74093, 4555919, 8997402, 9878839, 7499779, 4784680, 3096499, 854820, -3308137, -7680588, -8984263, -5858149, 37417, 5461818, 7588695, 6044650, 3741908, 3954421, 5768773, 4869394, 203186, -3300793, -1523138, 2080607, 729952, -5905272, -10668943, -8046945, -704999, 4327668, 3492718, -754064, -3753100, -3452949, -1452189, -2888, 721864, 1256895, 249409, -3586722, -7414939, -6708352, -2646292, -1726608, -5557847, -7067664, -1525457, 4503658, 2349687, -4906951, -6643294, -830706, 3533578, 685600, -4349798, -5297628]
36424e297628J386588j282644l764757k042052J746617M201423M236133J856567
36416A040247j479307k255205N33088K196379r34847m392523j904615L666368
36408c530415L970858j372981l992600j57032L915525K676565p46917j056190
36400b93187J080154J862329O94048m32607n43708M12779K287311L212350P80956
36391I060425l383287m206806m97419K615897J356029j078619l94960J408070
36383D879330k99556m362475m861714m7542M776526M391243J72941k319055l88284
36374A941414K948140K877817j360074n266757m193140R69193M653925L210254
36366E780772j123678l550335k412532k04211K66446q04822j054399N84213K241873
$$ y = [-5297628, -3911040, -5193684, -8958441, -11000493, -9253876, -5052453, -816320, 1040247, -439060, -2694265, -2161177, 35202, -899645, -5292168, -7196783, -3530415, 440443, -932538, -4925138, -5082170, -1166645, 1509920, 763003, -293187, 786967, 2649296, 3343344, 2910737, 2367029, 2779808, 5067119, 8279469, 9060425, 5677138, 1470332, 972913, 3588810, 4944839, 3866220, 3471260, 4879330, 4579774, 217299, -4644415, -4691957, 84569, 4475812, 4648753, 2329698, 1941414, 4889554, 7767371, 6407297, 1140540, -3052600, -2083407, 2570518, 5780772, 4657094, 1106759, -1305773, -1509984, -1243538, -2048360, -3102759, -2518546, -276673]
36357b76673J656433m00438j146471k29072l96851k730110m402858l282655j378723
36348a2587418o02829J312076O092767R369041N992553j046686l926549j428725
36340C174230K89065j439479k208903L15379J790460o04802k654805o16425K064736
36331A09456J032503j480166j394179j82514j068028k074022L9887K387013K52438
36322b377612l658740k558910K903445M898927O36657l740944l226833m49974
36314g573984P83484J740551M400348O101006L433261j759342m570859l256954
36306g02489j19426K032443J755380q46542l515202l220319j44228J773974K59275
36297b727134j833267j072994J056880Q32646j269287j134429K205601M542446
$$ y = [-276673, 1379760, 979322, -167149, -396221, -793072, -3523182, -7926040, -11208695, -12587418, -13190247, -11878171, -5785404, 3583637, 9576190, 8529504, 4602955, 3174230, 3463295, 2023816, -185087, 130292, 1920752, 1315950, -1338855, -1955280, 109456, 1141959, -338207, -1732386, -1914900, -2982928, -5056950, -5017063, -2630050, -2377612, -6036352, -8595262, -5691817, -792890, -156233, -3897177, -7124010, -7573984, -6790500, -5049949, -649601, 5451405, 8884666, 7125324, 2554465, -702489, -821915, 1210528, 2965908, 2119366, -1395836, -4616155, -4760383, -2986409, -2727134, -4560401, -5633395, -4576515, -3743869, -5013156, -6147585, -3941984, 600462]
36289F00462K603253r77909j280332J888476L536002M17456m052794m093442K43716
36280a115112K694621k26342l666188j508308L846002M536280o86589m271170
36272c96806j474093K582447J504955k489322l137854l62721J047517N24264J936408
36263b65205N280724N553237J107839l267577l558199j247914J050019L031078
36255G684002L539087R2950n211824n668837k54976K527811k789481q566651m999345
36246a3647264L924226O201403R15021q95394M813252Q203665K199048n725580
36238E988377o096011k204523k461511n176894k575116M129541N929693J309546
36230a156898j364146J814161M298461Q98970l835139m005100j394443m87603
$$ y = [600462, 3203715, 2225806, 945474, 2833950, 6369952, 6787408, 2734614, -1358828, -1115112, 1579509, 1353167, -2313021, -3821329, 24673, 4560953, 3874364, -396806, -1870899, 711548, 2216503, -272819, -3410673, -3773394, -2725877, -2201613, -265205, 5015519, 10568756, 11676595, 8409018, 4850819, 3602905, 4652924, 7684002, 11223089, 11316039, 6104215, 435378, 180402, 2708213, -81268, -8647919, -13647264, -9723038, -3521635, -2606614, -3502008, 1311244, 9514909, 11713957, 5988377, -107634, -2312157, -4773668, -9950562, -12525678, -8396137, -2466444, -1156898, -2521044, -706883, 3591578, 4490548, 655409, -3349691, -4744134, -5231737]
36222e231737q18225r4614N10515N4697J641970O220934P598621J157437o664380
36213D375218o271756N48978L404628o95954m103302j952436J185476R08726J38819
36204b461603K151065M088346K781082P33042P28805R9443l588982o167117l009245
36195d645164K431488L471017O04663m57122R19490P1144l436987m201300j58516
36186e401287L764105L437857R42487l90950r30464j716455j271406J037398K261499
36177A732784Q4765l108400l525958r14284K348543M529880M522225J498735k598295
36168D569995l170298J119170N162034L766761j117640l478487j559772J228996
36160F520759K284114K015609P27825k008170m657433m663797k666437j834039
$$ y = [-5231737, -6049962, -6144576, -5634061, -5579364, -3937394, 2283540, 9882161, 11039598, 4375218, -1896538, -1347560, 2057068, 1361114, -2742188, -4694624, -3509148, -2600422, -2461603, -310538, 3777808, 6558890, 7291932, 8020737, 8120180, 4531198, -1635919, -4645164, -2213676, 1257341, 1862004, 1404882, 2324372, 2395516, -1041471, -5242771, -5401287, -1637182, 1800675, 2743162, 2352212, 1421748, -294707, -1566113, -528715, 1732784, 1817549, -1290851, -4816809, -5731093, -3382550, 1147330, 5669555, 7168290, 4569995, 1399697, 2518867, 7680901, 11447662, 10330022, 6851535, 5291763, 6520759, 8804873, 10820482, 11548307, 9540137, 4882704, 218907, -2447530, -4281569]
36152d281569k393623j090747K675157M642584J971073k116085l029249j063711
36144d686170M44829O86350J244382K140272K068649J587563J994293J631617
36136G111785k026669o315613m783444L080980Q486010L987617n836937r715264
36128f011535m212842K754177L373324n48227k007719J266231N015859M818418
36120D447686J058813k225862j815572J306433K855920N20660k438937j618750
36112B090391J160173k25122n973473q220203k478753M898938O108160L127834
36104D87945K317162K708179p84778n620499m359883J498578K376103k947658
36096d324851m077820L432227R344335M836415l341402m303835J30502J054368
$$ y = [-4281569, -6675192, -7765939, -5090782, -448198, 1522875, -593210, -3622459, -4686170, -4241341, -3554991, -2310609, -170337, 1898312, 3485875, 5480168, 7111785, 5085116, -1230497, -6013941, -2932961, 5553049, 9540666, 3703729, -6011535, -10224377, -7470200, -4096876, -4645103, -6652822, -5386591, -370732, 4447686, 5506499, 3280637, 1465065, 2771498, 5627418, 6148078, 3709141, 2090391, 3250564, 3025442, -2948031, -11168234, -13646987, -8748049, -2639889, 487945, 2805107, 5513286, 4728508, -891991, -5251874, -3753296, -1377193, -4324851, -8402671, -4970444, 4373891, 9210306, 5868904, 1565069, 1695571, 2749939]
36088B749939j719735j527227J662246J791469j245650j586958J238029J776289
36080C138402l72608K63300L695117K880039l910453q821276o152322M5791L775191
36071e458819M632438L891951Q90682k481506j222520M201503N958358N48899
36063A0960986m815517l328577R61730Q13025k324184k244666P47863J065976
36055A836636k247690m567801l362530n00199K016243L375419K513181r239q04662
36046a750642J254457J866652j766862m726468j551243M020741M321709N5829
36038A724173j444186J194869J938360j366710l640524k220743j055832k397898
36030g268491k443419Q95688L207504J220278j128045N64336L728116L632087
$$ y = [2749939, 1030204, -497023, 1165223, 2956692, 1711042, 124084, 1362113, 3138402, 2765794, 3029094, 6724211, 9604250, 5693797, -3127479, -9279801, -9234010, -5458819, -826381, 3065570, 3956252, 1474746, 252226, 4453729, 10412087, 10960986, 6145469, 2816892, 3778622, 4591647, 2267463, 22797, 770660, 1836636, -411054, -4978855, -8341385, -8841584, -6825341, -3449922, -936741, -945980, -1750642, -496185, 1370467, -396395, -5122863, -6674106, -2653365, 1668344, 1724173, 279987, 1474856, 3413216, 2046506, -1594018, -3814761, -4870593, -7268491, -9711910, -8816222, -5608718, -4388440, -5516485, -4952149, -1224033, 2408054]
36022B408054J186840K73897Q15951K05081j073310q45632k13112j576427l205836
36013b024494j475737K160151K241505k130094n246022l021150J386683K825640
36005e283518J359877P89627K214990K901548J124378j057526p65298J836527
35997C120605L805239K706619j133311n037425o009565l067519J537478L947915
35989a29964K599137J9654n41578M13811k01568k566483k888150P18171M399464
35980A822494L473324r54048l690665k549104j63480O96539n3980j689850l633145
35971f741915l947616o48297M223241N499999J818814j786237q74876J986396
35963d70491J492600k069435l489879r61922J261751j04215j964904L04477N079622
$$ y = [2408054, 3594894, 3868791, 4684742, 4889823, 3816513, 2970881, 2757769, 1181342, -2024494, -3500231, -1340080, 901425, -1228669, -6474691, -9495841, -8109158, -5283518, -3923641, -3134014, -919024, 1982524, 3106902, 2049376, 1284078, 3120605, 6925844, 9632463, 8499152, 3461727, -2547838, -5615357, -4077879, -129964, 2469173, 2488827, 1947249, 2361060, 2159492, -406991, -3295141, -2576970, 1822494, 5295818, 4341770, 651105, -1897999, -2061479, -1364940, -1418920, -3108770, -6741915, -10689531, -11337828, -7114587, -1614588, 204226, -1582011, -2456887, -470491, 1022109, -1047326, -4537205, -5499127, -4237376, -4341591, -6306495, -6002018, -922396]
35954i22396N886795O24938m606751l202535K975431O000412K591267j895024
35946G452137j682046J257949R76449l045438n376774l198957j45761J13626m02286
35937d051101J968501N806681O128283J505189m035653o174411m441357j064326
35929d358194J567760J767955n16191k649388j462696K395212M569117K971123
35921D284698J025271K295551M246655J629687m751480p773450l806061J884320
35913i64809K502252j249258l605113k497233p97194p1891J300904L330430L048368
35904I96456j88865k474610r77630J836797K337182P98686o28767j863307l229464
35895c393522k653124J207316N009497M453232P31709j299394n72118m18074j723271
$$ y = [-922396, 4964399, 5589337, 982586, -2219949, 755482, 6755894, 9347161, 7452137, 5770091, 7028040, 8004489, 4959051, -417723, -3616680, -3762441, -3648815, -4051101, -2082600, 3724081, 9852364, 11357553, 7321900, 1147489, -3293868, -4358194, -2790434, -1022479, -1538670, -4188058, -5650754, -3255542, 1313575, 4284698, 5309969, 7605520, 11852175, 13481862, 8730382, 956932, -2849129, -964809, 1537443, 288185, -3316928, -5814161, -6611355, -6683246, -5382342, -2051912, 996456, 807591, -1667019, -2644649, -807852, 1529330, 2328016, 1699249, -164058, -3393522, -6046646, -4839330, 170167, 4623399, 5355108, 4055714, 3483596, 3065522, 1342251]
35886A342251r57968L226311O227603L467545l008724p233550o745624m254438
35878g936594k905452k766778k061118K36897L632067O663043P586470N389435
35870G837970J094816k242895k186596j55785n04647m579132p088746k014666
35862i839681P743150J1396804L694141o804759p730124J177005Q144957N272182
35854A3053675j861929l145585K229228N699105J539297n735352p818359l511604
35846D48476M04516q76151l446936j073271M521729N576113L73942l486829p97953
35837A643636K929578N19188m757107m115903K364453N274454J31853o111911
35829b121759n446771P76953N436217N003230J608154j189563j553351j61061
$$ y = [1342251, 384283, 3610594, 9838197, 13305742, 10297018, 3063468, -3682156, -7936594, -10842046, -13608824, -15669942, -15433045, -11800978, -5137935, 2448535, 7837970, 8932786, 6689891, 4503295, 4347510, 3842863, -736269, -7825015, -9839681, -2096531, 9300273, 12994414, 6189655, -1540469, -363464, 7781493, 13053675, 11191746, 8046161, 10275389, 15974494, 17513791, 11778439, 3960080, 448476, 852992, -23159, -3470095, -4543366, -21637, 5554476, 5928418, 2441589, 1643636, 4573214, 5092402, 335295, -3780608, -1416155, 3858299, 3990152, -2121759, -7568530, -6791577, -1355360, 3647870, 5256024, 4066461, 2513110, 2352049]
35821B352049L55648j541443l383212j532400K904578M705142J788206k104816
35813C543752l088136j474947Q13735K847492K987678q62613o830820r034232
35805a1098091m778087J788488N615002O348918N405262K163876k891865n294842
35797b741339j819706L934174N612975J865699l585520p304161p779689m169021
35789a5986588K170447O545134N512601J449148q92765o69754k18414j59801M92086
35780a757906J075399N99787P28839K788224L573291k53755m912436l432417L045092
35771A454118N231946q86557p455221n688264J957397N904381K434268l038672
35763h6604m323347j169089K390405K672564j084012n886844o504787p02339O678278
$$ y = [2352049, 2707697, 1166254, -2216958, -3749358, -844780, 3860362, 5648568, 3543752, 455616, -1019331, -205596, 2641896, 5629574, 4766961, -2063859, -11098091, -15876178, -14087690, -8472688, -2123770, 3281492, 5445368, 2553503, -2741339, -4561045, -626871, 4986104, 6851803, 3266283, -4037878, -11817567, -15986588, -13816141, -7271007, -1758406, -309258, -1202023, -1871777, -2090191, -2249992, -1757906, -682507, -82720, 646119, 3434343, 7007634, 6753879, 1841443, -1590974, 1454118, 6686064, 5799507, -1655714, -7343978, -5386581, 517800, 2952068, -86604, -4409951, -5579040, -3188635, -516071, -1600083, -7486927, -13991714, -14694053, -8015775]
35754h015775Q049757K436433k966727k426370J010787J447284k06514J331758
35746F60633N078131L423265n538434j2557768q880975J939794R502067R632319
35738C259032N791368J131541l214499m246955R793M431129K112344m122587m624587
35729E26579J521705M006617k243864q386816n470009K064326M527848J468624
35721a984990p57816m79734o16645q23237J294801L437353J412235k857259l765223
35712e140515j132690M62223J78085J197544L358180L068371L18796j419719j959771
35703a069496l715320m782541j028222M667631M396230j876761m715304K27888
35695g895895N139005K559630l178100l759685K53130K169456O65631N02261L345772
$$ y = [-8015775, 33982, 2470415, -496312, -2922682, -1911895, -464611, -671125, 660633, 5738764, 9162029, 3623595, -8934173, -17815148, -15875354, -6373287, 3259032, 9050400, 10181941, 6967442, 2720487, 2730280, 7161409, 9273753, 5151166, 526579, 2048284, 6054901, 3811037, -4575779, -10045788, -7981462, -3453614, -1984990, -2742806, -3222540, -3839185, -4662422, -3367621, 69732, 1481967, -1375292, -5140515, -6273205, -5810982, -5632897, -4435353, -1077173, 1991198, 2309994, 890275, -1069496, -4784816, -9567357, -10595579, -5927948, -1531718, -3408479, -8123783, -7895895, -2756890, -197260, -3375360, -7135045, -6881915, -4712459, -4046828, -3544567, -198795]
35686a98795N030994K532871j607309l387040k549402j870197k800730l503526
35678h353134j539939K221187M081689K606379Q01867J007013N18646l506264
35670b162556p291587m758003K320304N595390K387695p25208J063573L578209
35662G817J810595j210276J76589M378546M724816m97311n905150o395492k488486
35653e398352J618789K529715K80477k001535j649548J58573M86849l61169L57891
35644c978310K139650J565060q43775m43646K771852K488943l017043n940824
35636e258093r22376N179071L521551k617786l663693M90088J492836k410801
35628d189203l701733R37674M815057K200803l214363m987445k612334N80284
$$ y = [-198795, 4832199, 7365070, 5757761, 2370721, -178681, -2048878, -4849608, -8353134, -9893073, -7671886, -3590197, -983818, -181951, 825062, 1343708, -2162556, -9454143, -14212146, -11891842, -6296452, -3908757, -4633965, -3570392, 7817, 1818412, 608136, 784725, 5163271, 9888087, 9390776, 3485626, -2909866, -5398352, -3779563, -1249848, -969371, -2970906, -4620454, -4461881, -3975032, -4336201, -3978310, -1838660, -273600, -1117375, -1561021, 1210831, 3699774, 682731, -5258093, -6180469, -1001398, 2520153, -97633, -3761326, -3271238, -1778402, -4189203, -7890936, -6953262, -2138205, 62598, -3151765, -8139210, -10751544, -10171260]
35620a0171260L109105M990439N429491L953631J200750k604027o683856p451142
35612h226869k411205L670052L290078k118360l106408K721111N826227Q1430
35604b73944o312245l576804L671451M070887j919415l608021J505513L938710
35596b503868j143511n595171j926863M558008M836923K66961j212845J363213
35588a357153J717830j649025k416192K623117P186180M434097k776267o008953
35580A753634k990772M77102q5374k091368j383807J024944J321763p60225k258352
35571d992455k264274k224076j301519L118982Q887016Q791534O29869p103731
35563C541346n238454L203448O717016J041216n697211m987118J063069M209812
$$ y = [-10171260, -7062155, -2071716, 3357775, 7311406, 8512156, 5908129, -775727, -8226869, -10638074, -6968022, -3677944, -5796304, -8902712, -6181601, -355374, -273944, -6586189, -10162993, -6491542, -2420655, -4340070, -7948091, -6442578, -2503868, -3647379, -9242550, -11169413, -6611405, -1774482, -1507521, -2720366, -1357153, 360677, -1288348, -3704540, -1081423, 6104757, 10538854, 7762587, 1753634, -1237138, -760036, -845410, -2936778, -4320585, -3295641, -1973878, -2734103, -4992455, -7256729, -9480805, -10782324, -7663342, 1223674, 10015208, 10645077, 3541346, -1697108, 1506340, 8223356, 9264572, 3567361, -1419757, -356688, 3853124]
35555C853124J407360k661774k694461J095406M018156K546368j499966k973859
35547C090354k24780K166905P5548l284707k170313J719438J240904m021869o002637
35538g411157j165100L472252K242735J89535L098964N850017P85178p653499
35530e91075q266336n74538M684955K241876j704860j531468L23112P40633J298142
35521c379559K654624K000210k96879L66424L736040L206294k422174m904657
35513I60323J75384N254032K914803k483634l543539k037557k731670k450457
35505c942315L192999P939791K769021p575709r283114n0808P680190N302632
35497F032687j821116n468220n162049l687482j159953J655477J497088j349743
$$ y = [3853124, 5260484, 2598710, -95751, 999655, 5017811, 7564179, 6064213, 3090354, 2865574, 5032479, 5108027, 1823320, -346993, 1372445, 2613349, -1408520, -7411157, -8576257, -5104005, -2861270, -2671735, 427229, 6277246, 7062424, -591075, -8857411, -9431949, -4746994, -2505118, -4209978, -5741446, -5418334, -4677701, -3379559, -724935, 1275275, 978396, 1344820, 5080860, 8287154, 5864980, 960323, 1135707, 6389739, 9304542, 6820908, 3277369, 1239812, -1491858, -3942315, -749316, 7190475, 9959496, 2383787, -6899327, -6950135, 730055, 6032687, 4211571, -1256649, -6418698, -10106180, -11266133, -9610656, -8113568, -9463311]
35489i463311j439159L318466P401829N974677J941541M74611J335688J061537
35481A0605879j017713l009426l921813l888872l240496k953555l398991k382870
35473a3207857J682381N062019K801740k461332k931656K057619M415807M81374
35465b099905l012394n79975L058980J847382j551485j923090r17828k101636
35457g279951k597599J210017M680692J708407l341861j512104N206776O122746
35449D197123m22253l927292P80025M697247n44048q525730p427816K191503Q341313
35440f39928M328218l704803o709055l648256K72582J830030J969228J473842
35432d828142r01676m726151n865598j443422M895462O683719L208246j3259J00159
$$ y = [-9463311, -10902470, -7584004, -182175, 5792502, 7734043, 8208654, 9544342, 10605879, 9588166, 6578740, 2656927, -1231945, -4472441, -7425996, -10824987, -13207857, -11525476, -6463457, -3661717, -6123049, -9054705, -6997086, -2581279, -2099905, -5112299, -5692274, -2633294, -785912, -2337397, -4260487, -5178315, -7279951, -9877550, -8667533, -3986841, -2278434, -5620295, -7132399, -1925623, 4197123, 3774870, -152422, 627603, 5324850, 4780802, -3744928, -11172744, -8981241, -639928, 3688290, -16513, -6725568, -10373824, -10101242, -8271212, -6301984, -4828142, -5729818, -10455969, -16321567, -17764989, -12869527, -6185808, -2977562, -2990821, -2890662]
35423b890662K35306k333480m117909j128576L866611N197290K730171Q65024
35415B423775Q65045j6065k507603m043220l570605k577776j112994K176886N530270
35406b832287M823506J25895l348015k545251k99595K02104P1386J026236J239272
35397a536749j259993l931403k714563J629971L942512J476730k402466k300283
35389g096244K522191O663892M495279k670358p296851m802440M88591J590947
35381f104993j304750k214051N17994J918585o04103k521585J02539L691161K942107
35372c577096m20339m97594L340838N705639L374377q98104l277183l267993k121486
35363a638941l51109J545371K375043J791224R05579M59328m1613p65187r13531
$$ y = [-2890662, -2655356, -4988836, -9106745, -10235321, -6368710, -1171420, 1558751, 2423775, 3288820, 3272755, 765152, -3278068, -6848673, -9426449, -10539443, -8362557, -2832287, 1991219, 2117114, -1230901, -3776152, -4075747, -3873643, -3802257, -2776021, -1536749, -2796742, -6728145, -9442708, -7812737, -3870225, -2393495, -4795961, -7096244, -4574053, 2089839, 6585118, 3914760, -3382091, -8184531, -7695940, -6104993, -7409743, -9623794, -9105800, -7187215, -7791318, -10312903, -10210364, -6519203, -3577096, -3997435, -4495029, -1154191, 4551448, 7925825, 7027721, 3750538, 482545, -1638941, -1990050, -444679, 1930364, 3721588, 4627167, 5086495, 5044882, 4279695, 3366164]
35354C366164l94216l46462j028596q59511J184694L604489M183253K686679M34572
35345A2831066j759674l578621l939108j880824J177219K033114m95352l591187
35337G96633l510961j66056K589509J520877j994352l486260r41287K333563J679619
35328a178715k571250m985756k234450J961915J734873k549948m665672j375119
35320a5864122L323105M517119K970317K188789K145637M69797j913639j482439
35312c645436J712959L396309J468047j176766j590194n80857J96865J155562
35304I36489K430573K139519j55536j382434L92427K073589L4151l865422m963185
35295b359829k768158p47602k25132P36046K538706K820803O96417j822910l384905
$$ y = [3366164, 2971948, 2625486, 1596890, 737379, 1922073, 5526562, 9709815, 12396494, 12831066, 11071392, 7492771, 3553663, 1672839, 2850058, 4883172, 4387820, 796633, -2714328, -2880384, -290875, 1230002, -764350, -4250610, -5191897, -2858334, -1178715, -3749965, -8735721, -10970171, -9008256, -7273383, -9823331, -14489003, -15864122, -12541017, -8023898, -5053581, -2864792, -719155, -249358, -2162997, -3645436, -1932477, 1463832, 2931879, 1755113, 164919, -415938, -219073, 936489, 3367062, 5506581, 5351045, 3968611, 4361038, 6434627, 6468778, 2603356, -2359829, -5127987, -5875589, -6100721, -5364675, -2825969, -5166, 691251, -1131659, -4516564]
35286d516564m323978l524153R47875O476961O470868l28424n833193k827661
35278g458269M388707N793894J51087l553106J82600N422067M034388k589489
35270F371879o321397l737370Q51112K799831K296581J477235O96722o37025k398035
35261A399533m337334o060980n698473j539306L943848N160183M99861m783345
35253a1416013n222606j649458J688423L231519L682772K607990J11444n80052
35245g545981K515754N124754K020320l957482m974889j27097L090419N74809
35237c279393k591332j181563K200615K706347J151793R39056J327754l93428
35229H79849k780063k003121J517978L167398O26032l291660m440813j727963
$$ y = [-4516564, -8840542, -12364695, -11416820, -4939859, 1531009, 1202585, -4630608, -7458269, -3069562, 2724332, 2875419, -677687, -495087, 4926980, 8961368, 6371879, 50482, -3686888, -2835776, -35945, 2260636, 3737871, 4434593, 3797568, 1399533, -2937801, -8998781, -14697254, -16236560, -12292712, -7132529, -6632668, -11416013, -16638619, -18288077, -16599654, -13368135, -9685363, -7077373, -6965929, -7545981, -5030227, 94527, 2114847, -1842635, -6817524, -6944621, -3854202, -3279393, -5870725, -7052288, -4851673, -2145326, -993533, -54477, 1273277, 879849, -1900214, -3903335, -2385357, 782041, 1408073, -1883587, -6324400, -8052363]
35221h052363K173019L370851Q69262j713700o01204K397371K443001j96417l48017
35212C41803K565317K488767k439965m828138K55145N661542K604388m782340
35204A866519n414207J283054M743433j10014n888539m789430P25028L142511
35196d441645P4727m390477m991239L2098O820506Q379372K575131l496677j981785
35187a419989M289449N397728j065753o735913n118693K85747L356247L611170
35179B599993L010042Q44097l035778m753696j598016K686211K724987q12479
35171A665361k735050p38483K465449L278790P40477l065303m544882k082853
35163e016494J310904J392126j082087j566529L50725M5777l161619l074878K917201
$$ y = [-8052363, -5879344, -2508493, -1639231, -3352931, -3954135, -1556764, 886237, 689820, 341803, 2907120, 5395887, 2955922, -1872216, -1617071, 4044471, 6648859, 1866519, -3547688, -2264634, 2478799, 2368785, -3519754, -8309184, -7584156, -4441645, -4366918, -8757395, -13748634, -13716536, -6896030, 1483342, 4058473, 561796, -1419989, 2869460, 8267188, 7201435, 465522, -4653171, -4367424, -1011177, 2599993, 5610035, 6454132, 3418354, -1335342, -2933358, -247147, 2477840, 1665361, -1069689, -1808172, 657277, 3936067, 4676544, 1611241, -2933641, -5016494, -3705590, -2313464, -3395551, -4962080, -4611355, -4565578, -7727197, -10802075, -7884874]
35154g884874P169361K463904n807298o681237J93741M710782J837261k443282
35146f441642k260353r5765j50542q85342M72047J530737r67954m175015k881163
35137a5854992J851762M064354K006660k00482l1334M30214j2780O66694K370090
35128d709814J401998k182056k112191L900174P631132J789831o794080n564068
35120f639074M454886R323194K986309m537468l792351N65983q1819m037434m394289
35111f152063j659705j251315k710871j221933K630688L710308J493816J60623
35103e000452O14742J94861o24735J007562L503849K396350j618162l466804k023176
35094e015965m02525J021758L866904N109984M11631o300877o542483j020602
$$ y = [-7884874, -715513, 1748391, -4058907, -10740144, -10546403, -5835621, -3998360, -6441642, -8701995, -8797760, -8948302, -9833644, -9361597, -7830860, -8798814, -12973829, -15854992, -14003230, -9938876, -7932216, -8132698, -8164032, -7733818, -7746598, -7079904, -4709814, -3307816, -5489872, -7602063, -3701889, 3929243, 5719074, -1075006, -6639074, -2184188, 7139006, 10125315, 5587847, 1795496, 2361479, 2279660, -1757774, -6152063, -7811768, -9063083, -11773954, -12995887, -10365199, -6654891, -5161075, -5000452, -4385710, -4190849, -4815584, -3808022, -304173, 2092177, 474015, -2992789, -5015965, -5418490, -4396732, -529828, 4580156, 4991787, -1309090, -7851573, -8872175]
35086h872175R65200k788897l943825J084211M518730J307940j720476J738900
35078g710392O066868L698116j825549k541987O58962J419013k52771M72918K876961
35069B862139J452875l944513o793614l193850L195211N885715J856387n813223
35061d492873r389720l607623O367779Q908931J150809n861174k404807N960274
35053c368404P175227K94235m813901k701806J806287K659921q7458k852950k989825
35044d878674o6643L575968M106962R18577k025687k323594k760962m986999m678952
35035a3120004J067179O391309M370947j620599k775064J407301L309174J47955
35027h21802k398827l58203K793073K551027o46294l668114m152438j084035L674153
$$ y = [-8872175, -7906975, -10695872, -14639697, -13555486, -9036756, -7728816, -9449292, -7710392, -1643524, 2054592, 229043, -2312944, -1653982, -234969, -487740, -14822, 2862139, 4315014, 370501, -6423113, -9616963, -6421752, -536037, 1320350, -4492873, -13882593, -17490216, -11122437, -2213506, -1062697, -6923871, -9328678, -3368404, 3806823, 4101058, -712843, -3414649, -1608362, 1051559, 964101, -1888849, -4878674, -4945317, -1369349, 2737613, 3656190, 1630503, -693091, -3454053, -8441052, -13120004, -12052825, -5661516, -1290569, -2911168, -5686232, -4278931, -969757, -821802, -3220629, -3578832, -785759, 1765268, 1118974, -2549140, -6701578, -7785613, -4111460]
35018d111460M939815K14383n034991l872156J677640L619446N54263q90981K104028
35009h00013L836715Q5760m571091l864705R92563L802412J806260k086930l654569
35000d453598j576401J676752K473520M55244p80033Q27663K162931J80576k212890
34991a246236p05815K484109J766159k165790l151967J30734K260957N74604q32165
34982h85410J000769K694772P38437k421594k417850N96957K953403K439307j28259
34973D570532k490454k794562j286884j57878k61462L57613K285669K086477j975599
34964C33452m841193j370066M467649M551028q14638l624261j138647Q25984j153790
34955b764482k769709o32125J554204l13886l806523l861680N08043O068020Q384709
$$ y = [-4111460, 828355, 1042738, -3992253, -7864409, -6186769, -2567323, -2013060, -2904041, -800013, 3036702, 3122462, -1448629, -5313334, -4320771, -518359, 1287901, -799029, -4453598, -6029999, -4353247, -1879727, -1424483, -2204516, -1376853, 786078, 966654, -1246236, -1952051, 532058, 2298217, 132427, -3019540, -2888806, -627849, -53245, -885410, 115359, 2810131, 3548568, 1126974, -1290876, -693919, 2259484, 4698791, 4570532, 2080078, -714484, -2001368, -2159246, -2420708, -2063095, 222574, 2309051, 333452, -4507741, -5877807, -1410158, 3140870, 2326232, -1298029, -2436676, -1610692, -2764482, -5534191, -6166316, -4612112, -4925998, -8732521, -12594201, -12086158, -6018138, 2366571]
34946B366571M225218m566688r754554n161978L758923N873746j02500m464112
34938g825374j861261J912176J451291L38401L029688O260782M673376q56124
34930G122955n603568o817334l746450K608586P131918M446701k459277m765878
34922b082347r86380J380927k41972P91498O189414O700947k081215r660996o326762
34913f316886J473501K714254n34612L04835L866735K883711r75246l89413L335738
34904F362617K920842p47868n79898K536746J025273m694121o153813j808840
34896a139062Q56500o62960m32019L303879M308080K67882k853658j846152q76603
34887I25887j642724K06339M829939N396580L71675k292466J065343K794599k328703
$$ y = [2366571, 6591789, 2025101, -7729453, -12891431, -9132508, -3258762, -3361262, -7825374, -9686635, -7774459, -6323168, -5984767, -2955079, 3305703, 7979079, 7122955, 1519387, -5297947, -9044397, -6435811, 696107, 5142808, 2683531, -2082347, -3068727, -1687800, -1929772, -1138274, 5051140, 11752087, 9670872, 9876, -6316886, -4843385, -2129131, -2663743, -2358908, 1507827, 4391538, 3416292, 3026879, 6362617, 9283459, 8535591, 7955693, 10492439, 11517712, 6823591, 669778, -1139062, -282562, -945522, -1377541, 1926338, 6234418, 6502300, 3648642, 1802490, 925887, -716837, -510498, 4319441, 9716021, 10087696, 7795230, 8860573, 11655172, 9326469]
34878I326469p058674m068192J344119J078022j654522M89335M418480J935667
34870E810704m621814n136348J494955N704154K798110j285695j728598j713444
34862A322024l894726m341317k57213L605405K164813j802557k459839L58626
34854e304784K842498M064837N153755M314384o48613o014927n267058Q64652
34846D744L981099k21938n672532n044978j62651J900526l01597j853302l04230
34837g674859J162397J49680r64136L40055K426275K621980J426196P78504N69968
34828H36060l81719j664536j961117j063168M64811K092625K646580J000970j438395
34819E32111j722382o2752K3649k008039j841246K268050N011644J718773l655952
$$ y = [9326469, 2267795, -1800397, -456278, 621744, -1032778, -543443, 3875037, 5810704, 1188890, -3947458, -2452503, 3251651, 6049761, 4764066, 3035468, 1322024, -2572702, -6914019, -7171232, -3565827, -1401014, -3203571, -5663410, -5304784, -2462286, 1602551, 6756306, 11070690, 10422077, 4407150, -859908, 4744, 3985843, 3763905, -1908627, -6953605, -7116256, -5215730, -5517327, -7370629, -7674859, -6512462, -6362782, -7326918, -6986863, -4560588, -1938608, -512412, 266092, 836060, 454341, -1210195, -3171312, -4234480, -3769669, -1677044, 969536, 1970506, 532111, -1190271, -1253023, -1229374, -3237413, -5078659, -2810609, 2201035, 3919808, 263856]
34810B63856m175274l89633J508922j21225j255079l62525j91235r66807Q08878
34801d880122M981140N973811J351850l635680l680547p78684P1961j299758j228565
34792c124594J298781L442115L032116J150610J33058P45586J555256O94504j543497
34783G383935k588488j217128O9112j354933l691193l322686r41569m32826j753775
34774g849551m45726M276848O519080K072728m614746o157275k131296J230366
34766g099572L1601k685229j746853L371242P810943O769219R61222m133302m742870
34757a463599k760709j648056q23120K121250N259018L886548j370993l706734
34749e06395L25072N236352M049816k157754o094666l721917J694933M463841
$$ y = [263856, -3911418, -4301051, -2792129, -2913354, -4168433, -4530958, -4722193, -5689000, -4880122, 101018, 6074829, 7426679, 3790999, 110452, -668232, -596271, -1896029, -3124594, -1825813, 1616302, 4648418, 5799028, 5932086, 6677672, 8232928, 8927432, 7383935, 4795447, 3578319, 3647431, 2292498, -1398695, -4721381, -5662950, -6095776, -7849551, -8295277, -4018429, 2500651, 4573379, -41367, -6198642, -8329938, -7099572, -7067971, -9753200, -11500053, -8128811, -317868, 6451351, 7412573, 3279271, -1463599, -4224308, -5872364, -6695484, -4574234, 684784, 4571332, 3200339, -506395, -181323, 5055029, 9104845, 6947091, 852425, -2869492, -1174559, 3289282]
34741C289282K858057R9508l57406K88742k028235o787148p167041J71928P455235
34732b177078N114120l399382n446889J831595P040931K437068m480853m016323
34724c096811N77135M62509l353085l038556J805413M210353K363232J279815
34716A210005K157046N07844l685346m020699R54065L607207o83757n168042j922493
34707g044170N395391O578138l06640o503235m810342J658902M785328J876184
34699A629556k011921j273148L053363M762155P05096m874722n865183k095574
34691e970378J435797J929166J288809J158362R045k861411m185364r16404M416012
34682c696366N983184J965518l044113l618105J37372L144026J969631q05633
$$ y = [3289282, 6147339, 6246847, 5889441, 6178183, 4149948, -2637200, -9804241, -9632313, -2177078, 2937042, -462340, -5909229, -4077634, 2963297, 5400365, 919512, -3096811, -2519676, -2057167, -5410252, -8448808, -6643395, -2433042, -69810, 1210005, 3367051, 3874895, 189549, -3831150, -2877085, 730122, 46365, -5121677, -7044170, -1648779, 4929359, 4622719, -1880516, -6690858, -5031956, -246628, 1629556, -382365, -1655513, 1397850, 6160005, 6865101, 1990379, -3874804, -5970378, -4534581, -2605415, -1316606, -158244, -149199, -3010610, -7195974, -8112378, -3696366, 2286818, 4252336, 1208223, -2409882, -2272510, 871516, 2841147, 2035514]
34674B035514l60669L180744M450889O36225l870303l422589Q87841L059863N31872
34665G129387l378695m727093k710172J445409N397248N692861J082909m079264
34657E852590m183065l34867J053420j682920k891009O77876L887900J325752
34649C705677l749959m356309l90987J997772K97943j182424J291465N089904
34641B703082N012448L81353l908532l149124J431244L768874M82318m374045
34633B347618m724102j216593J83102j787171j554024L114072N802386J445817
34625C611105m348306l194526L031481N423749J988431p33204K81152J92308l745702
34616B506488o288731k663293L357194M969051J652589j856441k802903k071994
$$ y = [2035514, 1674845, 4855589, 9306478, 9942703, 6072400, 2649811, 3537652, 6597515, 7129387, 3750692, -976401, -3686573, -2241164, 3156084, 8848945, 9931854, 5852590, 1669525, 1334658, 2388078, 705158, -2185851, -1507975, 2379925, 3705677, -44282, -4400591, -4791578, -2793806, -2495863, -3678287, -2386822, 2703082, 7715530, 8096883, 4188351, 1039227, 2470471, 6239345, 6721663, 2347618, -2376484, -3593077, -3409975, -5197146, -6751170, -3637098, 2165288, 3611105, -737201, -3931727, -900246, 4523503, 6511934, 5778730, 6059882, 6252190, 2506488, -3782243, -6445536, -3088342, 1880709, 3533298, 1676857, -1126046, -3198040]
34608c198040p22309R49644J902952J125578o16634j799525j941618j000631J280293
34599d020290L768122L685647J10923l844626m432079j608792J627222K840779
34591a873094J662740o78014j885041l64875K264998K497785R191j296280Q58532
34582A195942L246351J933968j624979k806691m94767J937482J528437j261512
34574C654231l959520m344001j948696J091226J783230N2975j099199l18675K43640
34565d844789l85502O24141M514131O719818K807897m091121o965729m214509
34557e835663k34712J680465J807531O46445j389602j722653J475520M687018
34549A114349K943675k167630m369227k300584o46970j320475q53699J771218
$$ y = [-3198040, -3920349, -2970705, -1067753, 57825, -558809, -2358334, -4299952, -5300583, -4020290, -252168, 3433479, 3544402, -300224, -4732303, -6341095, -4713873, -1873094, -210354, -888368, -2773409, -3138284, -873286, 1624499, 1633690, 337410, 1195942, 4442293, 6376261, 4751282, 1944591, 1449824, 3387306, 4915743, 3654231, -305289, -4649290, -6597986, -5506760, -3723530, -3670555, -4769754, -5088429, -4844789, -5230291, -4606150, -92019, 6627799, 9435696, 5344575, -1621154, -5835663, -6070375, -4389910, -2582379, -1935934, -3325536, -5048189, -3572669, 1114349, 4058024, 1890394, -2478833, -4779417, -5426387, -6746862, -7600561, -5829343]
34541e829343K204091j163292l001401O32547N431150N349516J615355n2695J702074
34532F888002K764513j22529n499032q891894o667646K61497N868385M829892
34524e68812o74170l653462k020153m89020j835701k567609P8444K931749K363542
34515f435192k60703k100946k713113j452472K916560O907005M085121l633695
34507b687435n200565K928538Q919291L180804n574833m018650L924565M085060
34499E556775l818985o139573J244707O521563K190929l894123l649922j225228
34491c213857k468252l526501O98691N757772N025306J056075L18835K074365
34483E722434J475982p27442m79802J053008r5365k374864j341620J367021L84974
$$ y = [-5829343, -3625252, -4788544, -7789945, -7157398, -1726248, 3623268, 5238623, 5185928, 6888002, 9652515, 9529986, 4030954, -4860940, -11528586, -11267089, -5398704, -568812, -1242982, -4896444, -6916597, -7405617, -9241318, -11808927, -11730483, -8798734, -6435192, -6695895, -8796841, -11509954, -12962426, -10045866, -3138861, 946260, -2687435, -7888000, -4959462, 3959829, 7140633, 1565800, -2452850, 1471715, 5556775, 1737790, -4401783, -3157076, 3364487, 5555416, 1661293, -1988629, -3213857, -5682109, -9208610, -8509919, -2752147, 2273159, 3329234, 3648069, 5722434, 7198416, 6470974, 5991172, 7044180, 6948815, 4573951, 3232331, 4599352, 4984326]
34474D984326l073297k255220L313262N907800J668411l484904l559161j026054
$$ y = [4984326, 1911029, -344191, 2969071, 8876871, 10545282, 7060378, 3501217, 2475163]
$$ [...]
##END NTUPLES=NMR SPECTRUM
##END=
