##TITLE=31Pdec_SR94_rm3
 , 24 sc
 26.10.2021
##JCAMPDX= 6.0         $$ Bruker NMR JCAMP-DX V2.0
##DATA TYPE= NMR SPECTRUM
##DATA CLASS= NTUPLES
##ORIGIN= UXNMR, Bruker Analytische Messtechnik GmbH
##OWNER= root
$$ XWIN-NMR		Version 3.5
$$ Tue Oct 26 09:59:26 2021 Russian Standard Time (UT+4h)  she@DPX200
##.OBSERVE FREQUENCY= 81.013821
##.OBSERVE NUCLEUS= ^31P
##.ACQUISITION MODE= SIMULTANEOUS
##.ACQUISITION SCHEME= undefined
##.AVERAGES= 24
##.DIGITISER RES= 16
##SPECTROMETER/DATA SYSTEM= spect
##.PULSE SEQUENCE= zgpg30
##.SOLVENT NAME= CDCl3
##.SHIFT REFERENCE= (INTERNAL, CDCl3, 0, 248.564)
##AUDIT TRAIL= $$ (NUMBER, WHEN, WHO, WHERE, WHAT)
$$ ##TITLE= Audit trail, XWIN-NMR		Version 3.5
$$ ##JCAMPDX= 5.01
$$ ##ORIGIN= Bruker BioSpin GmbH
$$ ##OWNER= she
$$ F:/spectra/data/she/nmr/P31/1/pdata/1/auditp.txt
$$ ##AUDIT TRAIL=  $$ (NUMBER, WHEN, WHO, WHERE, WHAT)
(   1,<2021-10-26 09:58:00.09 +0400>,<she>,<DPX200>,
      <created by zg, POWCHK disabled, PULCHK disabled
       configuration hash MD5:
       00 E9 B6 7A A2 85 ED C7 34 08 36 98 17 FE 4E 26
       data hash MD5: 32K
       1F 56 35 63 EC 96 93 5C D9 81 95 69 59 CA 12 B0>)
(   2,<2021-10-26 09:58:09.76 +0400>,<she>,<DPX200>,
      <Start of raw data processing
       efp BC_mod = 2 LB = 1 FT_mod = 6 PKNL = 1 PHC0 = -8747.123 PHC1 = -87.53109 SI = 64K 
       data hash MD5: 64K
       22 05 80 05 65 89 93 60 21 EA AC 4D 8E B9 FF 77>)
(   3,<2021-10-26 09:58:36.73 +0400>,<she>,<DPX200>,
      <pk PHC0 = 42.47438 PHC1 = -170.6 
       data hash MD5: 64K
       EB C9 71 61 F2 DD B6 EA 4E FF 6C 4E 79 C3 EC D2>)
(   4,<2021-10-26 09:58:56.92 +0400>,<she>,<DPX200>,
      <pk PHC0 = -206.1375 PHC1 = 536.0004 
       data hash MD5: 64K
       6D 81 59 94 EA AD 62 CF 29 B3 25 5C 75 17 43 3E>)
$$ ##END=
$$ 
$$ hash MD5
$$ 4A B8 00 B6 27 A8 C1 97 61 CB EA 99 25 B7 4A 97
##$RELAX= 
##$RELAX= 
##$RELAX= 
##$RELAX= 
##$RELAX= 
##$RELAX= 
##$RELAX= 
##$RELAX= 
$$ Bruker specific parameters
$$ --------------------------
##$DU= <F:/spectra>
##$EXPNO= 1
##$NAME= <P31>
##$PROCNO= 1
##$TYPE= <nmr>
##$USER= <she>
##$AMP= (0..31)
100 100 100 100 100 100 100 100 100 100 100 100 100 100 100 100 100 100 
100 100 100 100 100 100 100 100 100 100 100 100 100 100 
##$AQSEQ= 0
##$AQ_mod= 1
##$AUNM= <au_zg>
##$AUTOPOS= <>
##$BF1= 81.014009
##$BF2= 200.13
##$BF3= 200.13
##$BF4= 200.13
##$BF5= 200.13
##$BF6= 200.13
##$BF7= 200.13
##$BF8= 200.13
##$BYTORDA= 1
##$CFDGTYP= 0
##$CFRGTYP= 5
##$CHEMSTR= <none>
##$CNST= (0..31)
1 1 145 1 1 1 1 1 1 1 1 1 1 1 1 1 1 1 1 1 1 1 1 1 1 1 1 1 1 1 1 1 
##$CPDPRG= <waltz16>
##$CPDPRG1= <>
##$CPDPRG2= <waltz16>
##$CPDPRG3= <>
##$CPDPRG4= <mlev>
##$CPDPRG5= <mlev>
##$CPDPRG6= <mlev>
##$CPDPRG7= <mlev>
##$CPDPRG8= <mlev>
##$CPDPRGB= <>
##$CPDPRGT= <>
##$D= (0..31)
0 1 0 0 0 0 0 0 0 0 0 0.03 2e-05 3e-06 0 0 0 0 0 0 0 0 0 0 0 0 0 0 0 0 
0 0 
##$DATE= 1635227879
##$DBL= (0..7)
120 120 120 11 120 120 24 19 
##$DBP= (0..7)
150 150 150 150 150 150 150 150 
##$DBP07= 0
##$DBPNAM0= <>
$$ [...]
##$SUBNAM2= <"">
##$SUBNAM3= <"">
##$SUBNAM4= <"">
##$SUBNAM5= <"">
##$SUBNAM6= <"">
##$SUBNAM7= <"">
##$SUBNAM8= <"">
##$SUBNAM9= <"">
##$SW= 501.771253377433
##$SWIBOX= (0..15)
0 1 3 0 0 0 0 0 0 0 0 0 0 0 0 0 
##$SW_h= 40650.406504065
##$TD= 32768
##$TD0= 1
##$TE= 0
##$TE2= 300
##$TE3= 300
##$TEG= 300
##$TL= (0..7)
0 120 53 12 22 120 120 120 
##$TP= (0..7)
150 150 150 150 150 150 150 150 
##$TP07= 0
##$TPNAME0= <>
##$TPNAME1= <>
##$TPNAME2= <>
##$TPNAME3= <>
##$TPNAME4= <>
##$TPNAME5= <>
##$TPNAME6= <>
##$TPNAME7= <>
##$TPOAL= (0..7)
0.5 0.5 0.5 0.5 0.5 0.5 0.5 0.5 
##$TPOFFS= (0..7)
0 0 0 0 0 0 0 0 
##$TUNHIN= 0
##$TUNHOUT= 0
##$TUNXOUT= 0
##$USERA1= <user>
##$USERA2= <user>
##$USERA3= <user>
##$USERA4= <user>
##$USERA5= <user>
##$V9= 5
##$VALIST= <valist>
##$VCLIST= <CCCCCCCCCCCCCCC>
##$VD= 0
##$VDLIST= <DDDDDDDDDDDDDDD>
##$VPLIST= <PPPPPPPPPPPPPPP>
##$VTLIST= <TTTTTTTTTTTTTTT>
##$WBST= 1024
##$WBSW= 4
##$XGAIN= (0..3)
0 0 0 0 
##$XL= 0
##$YL= 0
##$YMAX_a= 7087
##$YMIN_a= -17365
##$ZGOPTNS= <>
##$ZL1= 120
##$ZL2= 120
##$ZL3= 120
##$ZL4= 120
##$ABSF1= 0
##$ABSF2= 0
##$ABSG= 0
##$ABSL= 0
##$ALPHA= 0
##$AQORDER= 0
##$ASSFAC= 0
##$ASSFACI= 0
##$ASSFACX= 0
##$ASSWID= 0
##$AUNMP= <proc_1d>
##$AZFE= 0.1
##$AZFW= 0.5
##$BCFW= 0
##$BC_mod= 2
##$BYTORDP= 0
##$COROFFS= 0
##$CY= -3
##$DATMOD= 1
##$DC= 0
##$DFILT= <>
##$DTYPP= 0
##$F1P= 0
##$F2P= 0
##$FCOR= 1
##$FTSIZE= 65536
##$FT_mod= 6
##$GAMMA= 0
##$GB= 0
##$INTBC= 1
##$INTSCL= 5.30512e-09
##$ISEN= 30
##$LB= 1
##$LEV0= 0
##$LPBIN= 0
##$MAXI= 10000
##$MC2= 0
##$MEAN= 0
##$ME_mod= 0
##$MI= 50
##$NCOEF= 0
##$NC_proc= -7
##$NLEV= 6
##$NOISF1= 182.463
##$NOISF2= 159.3651
##$NSP= 0
##$NTH_PI= 0
##$NZP= 0
##$OFFSET= 248.5645
##$PC= 4
##$PHC0= -8910.786
##$PHC1= 277.8693
##$PH_mod= 1
##$PKNL= yes
##$PPARMOD= 0
##$PSCAL= 0
##$PSIGN= 0
##$REVERSE= no
##$SF= 81.014009
##$SI= 65536
##$SIGF1= 159.3651
##$SIGF2= -187.1042
##$SINO= 113.3802
##$SIOLD= 16384
##$SREGLST= <1H.CDCl3>
##$SSB= 0
##$STSI= 65536
##$STSR= 0
##$SW_p= 40650.406504065
##$SYMM= 0
##$S_DEV= 0
##$TDeff= 32768
##$TDoff= 0
##$TI= <>
##$TILT= no
##$TM1= 0
##$TM2= 0
##$TOPLEV= 0
##$USERP1= <user>
##$USERP2= <user>
##$USERP3= <user>
##$USERP4= <user>
##$USERP5= <user>
##$WDW= 1
##$XDIM= 65536
##$YMAX_p= 125948498
##$YMIN_p= -238466244
$$ End of Bruker specific parameters
$$ ---------------------------------
##NTUPLES= NMR SPECTRUM
##VAR_NAME=  FREQUENCY,     SPECTRUM/REAL,   SPECTRUM/IMAG
##SYMBOL=    X,             R,               I
##VAR_TYPE=  INDEPENDENT,   DEPENDENT,       DEPENDENT
##VAR_FORM=  AFFN,          ASDF,            ASDF
##VAR_DIM=   65536,         65536,           65536
##UNITS=     HZ,            ARBITRARY UNITS, ARBITRARY UNITS
##FACTOR=    0.620285442955139, 1,           1
##FIRST=     20137.2065510759, 0,            0
##LAST=      -20513.1999529892, 0,           0
##MIN=       -20513.1999529892, -238466244,  0
##MAX=       20137.2065510759, 125948498,    0
$$ Real data points
##PAGE= N=1
##DATA TABLE= (X++(R..R)), XYDATA
$$ [...]
##PAGE= N=2
##DATA TABLE= (X++(I..I)), XYDATA
13123b698278N38882P20378P20004p12925k084825q38539J992607K337273q44843
13114h70266l404949j745053K075849L479615J597661n03599o87837P2021J93315
13105B06757k91454n08562j53676M05972N70944m7335r82801j060898L0453Q89999
13095i40601K08487j101779r66926Q44015K205126J364134r57137k622025k423493
13086d390199r15357N46614J115613R81899Q58890J037297J105157O41487j29516
13077H51885o12693n93626n08813r34982j717920j722563r5716K016203K152049
13068a166176j40654j934522o23135K031568K105999o09954k093285j16305K399453
13059a47011J852497q05769j845196j67437J723459J544197k10021j562279j409282
$$ plain form
13123 -2698278 -2159396 -1439018 -719014 -1431939 -3516764 -4355303 -2362696 -25423 -870266
13114 -870266 -4275215 -6020268 -3944419 -464804 1132857 629258 -58579 13442 206757
13105 206757 -84697 -593259 -746935 -340963 229981 182646 -800155 -1861053 -1830600 -940601
13095 -940601 -732114 -1833893 -2800819 -1956804 248322 1612456 655319 -1966706 -4390199
13086 -4390199 -5305556 -4758942 -3643329 -2661430 -1802540 -765243 339914 981401 851885
13077 851885 239192 -354434 -863247 -1798229 -3516149 -5238712 -5334428 -3318225 -1166176
13068 -1166176 -1306830 -3241352 -3864487 -1832919 273080 -336874 -2430159 -2546464 -147011
13059 -147011 1705486 899717 -945479 -1112916 610543 2154740 1944719 382440 -1026842
13050a026842l24680L37859J12639M9935R61212J577736K33593j897185j866539
13041a842272M02736J656827N18548l34699R33040J905095L09534j576242p93429
13032A179138Q28021l05030l019592l003587l6531J632675K23984j232833m26559
13023d160314Q60276N15117n00307m05746O35780J661625K374784K239926N53210
13014C774351j561456j787197k07229M90621n95288j112105J77976Q82997r20465
13005h57795l011003k281394M98067K093638J458921K34167k97631k19768K91201
12996b091597J005231R71835k47962j234784l94785J520675K301510J281158j63319
12987B947962q16597q05859o70093n47455m17592l56581n08165j050656j735611
$$ plain form
13050 -1026842 -1351522 -1013663 -901024 -851089 110123 1687859 1921452 24267 -1842272
13041 -1842272 -1439536 217291 735839 401140 1334180 3239275 3548809 1972567 1179138
13032 1179138 2007159 1702129 -1317463 -4321050 -4357581 -2724906 -2500922 -3733755 -4160314
13023 -4160314 -3300038 -2784921 -3285228 -3690974 -3055194 -1393569 981215 3221141 3774351
13014 3774351 2212895 425698 218469 709090 113802 -998303 -820327 62670 -857795
13005 -857795 -3868798 -6150192 -5652125 -3558487 -2099566 -1865399 -2163030 -2382798 -2091597
12996 -2091597 -1086366 -114531 -362493 -1597277 -1992062 -471387 1830123 3111281 2947962
12987 2947962 2131365 1325506 655413 107958 -309634 -666215 -1174380 -2225036 -3960647
12978c960647j453823N77693K945535L025275O02842j338345p09524P44144M82467
12969I15617o75050j40758J813615K220053J66730j650874j013471O57667P03881
12960B997410r22474j987438j264503K18797J050235J111362R73376O13408l75121
12951B415052j577745j737732l58571J297090J556237M15237n85293n52442l23395
12942E48438r46388j925522j809027k26648J442044J611961L06387r15155q11732
12933b725642J37834N23185j26309r59064j170516p85094M1697J317905K442874
12924a303130K456053J592369J078738P72609r07259l556470l922467o88502K418426
12915b059633J535414j380226j519262J275291K685859J135149k60494L93038
$$ plain form
12978 -3960647 -5414470 -4836777 -1891242 1134033 1736875 398530 -310994 433150 915617
12969 915617 240567 99809 1913424 4133477 4300207 2649333 1635862 2293529 2997410
12960 2997410 2074936 87498 -1177005 -958208 92027 1203389 2176765 2790173 2415052
12951 2415052 837307 -900425 -1258996 38094 1594331 2009568 1424275 871833 548438
12942 548438 -397950 -2323472 -4132499 -4359147 -2917103 -1305142 -998755 -1913910 -2725642
12933 -2725642 -2587808 -2064623 -2190932 -3149996 -4320512 -5105606 -5063909 -3746004 -1303130
12924 -1303130 1152923 2745292 3824030 4596639 3689380 132910 -3789557 -4478059 -2059633
12915 -2059633 -524219 -1904445 -3423707 -2148416 537443 1672592 1412098 1805136
12907A805136Q96893l16032j126710J50998J425758M17396j527664k023074j394189
12898a691488j134973r90236k07252M41889L20862M84683J325229J076014q88087
12889a263359j884520K3773K311871J663764q23673j692954n55008K71117J15862
12880a833127J97168N30007J72567k45650M48570J287575P32735j21567O59548
12871A827826J944324J182083r31393j443343k05501J92037p62104r90005j29895
12862F84029o9770q83730n22070Q99614Q43265q01988j034181Q98046J874737
12853A887952K76725j350302j015182m32856j029990r41850R72374J914034m33559
12844a52654l389391l045461r7193J929636K200412K331735K235192M44594k087992
$$ plain form
12907 1805136 2702029 2385997 1259287 1410285 2836043 3253439 1725775 -297299 -1691488
12898 -1691488 -2826461 -3816697 -4023949 -3582060 -3261198 -2776515 -1451286 -375272 -1263359
12889 -1263359 -3147879 -3124106 -812235 851529 27856 -1665098 -2220106 -1948989 -1833127
12880 -1833127 -1635959 -1105952 -933385 -1179035 -730465 557110 1289845 1168278 1827826
12871 1827826 3772150 4954233 4022840 2579497 2373996 2566033 1803929 813924 684029
12862 684029 614259 -269471 -791541 108073 951338 149350 -884831 13215 1887952
12853 1887952 2164677 814375 -200807 -633663 -1663653 -2605503 -1633129 280905 -152654
12844 -152654 -3542045 -6587506 -6684699 -4755063 -2554651 -222916 2012276 2456870 368878
12835C68878k462513j72329K185792K668705J706867Q3205j957699l242875k064263
12826b886232J056178L128494K246220j99919j695248j554464p28657J73854J322680
12817H62906K408246K149543j74987k923450l011694L29150L554534K506932j999998
12808C701182m726923k807351O98326J633280M35908K88587J597903J852058J78114
12799B851084j441830j579071r25589n2147J464326K855512J982491j148790l114925
12790H91061j361280J965880K745185L83930j790340j356622K81654M26108j191389
12781I94187k480126k007213o04807R5579k73127p88928p12575j46808O44820
12772e278998J628008K378616J952125J57175j553767j454343K40422J406847
$$ plain form
12835 368878 -2093635 -2265964 -80172 2588533 4295400 4378605 2420906 -821969 -2886232
12826 -2886232 -1830054 1298440 3544660 3344741 1649493 95029 -633628 -459774 862906
12817 862906 3271152 5420695 5245708 2322258 -689436 -360286 3194248 5701180 3701182
12808 3701182 -1025741 -3833092 -3134766 -1501486 -1065578 -776991 820912 2672970 2851084
12799 2851084 1409254 -169817 -1095406 -1147553 316773 3172285 5154776 4005986 891061
12790 891061 -470219 1495661 4240846 4624776 2834436 1477814 1759468 2185576 994187
12781 994187 -1485939 -3493152 -4097959 -4002380 -4275507 -5064435 -5777010 -5923818 -5278998
12772 -5278998 -3650990 -1272374 679751 836926 -716841 -2171184 -1930762 -523915
12764e23915N55607j295933j852090m06875J183420P55563j315322k360941p51336
12755f011822J927781K872278J524249k56796j059489j211136j100733k13905
12747c529573J318856K009785J162451K42110N50636Q98570m22366k374172k306009
12738b449712l7892J625730Q24594j031814j636311p45220K71864N71027M05916
12729b201818L20402O35008J255859J533059R01962p2233j64456O04204N63533
12720C375520j343135l695311l961035j431081J865786L075563J157871k034381
12712b990203l280081j187473K138494L393826J889090j41040r44429j093753
12704b215569j369258r52262P98771K519151K681136J929212J584602J129269
$$ plain form
12764 -523915 31692 -1264241 -3116331 -3523206 -2339786 -1584223 -2899545 -5260486 -6011822
12755 -6011822 -4084041 -1211763 312486 55690 -1003799 -2214935 -3315668 -3529573
12747 -3529573 -2210717 -200932 961519 1203629 1754265 2652835 2230469 -143703 -2449712
12738 -2449712 -2487604 -861874 -37280 -1069094 -2705405 -3450625 -3178761 -2607734 -2201818
12729 -2201818 -1881416 -1246408 9451 1542510 2444472 2372239 2207783 2811987 3375520
12720 3375520 2032385 -1662926 -5623961 -7055042 -5189256 -2113693 -955822 -2990203
12712 -2990203 -6270284 -7457757 -5319263 -1925437 -36347 -177387 -1121816 -2215569
12704 -2215569 -3584827 -4537089 -3738318 -1219167 1461969 3391181 4975783 6105052
12696F105052m22359j823703j270285m2746r45218l166634k693833J199927L958106
12687H98307K273213j101027j975894r16041j045936k173419j570809P37555K013329
12678b860722J630759J469262J494037m76695l805022m404356q39382K965234
12670d826885L377281J829080J307273J407379J75348j734050k274301j517475
12662b256350p00094M79897K308136K605314k92830l452232k531112J572698L652608
12653A386035J757490o31210o47987K01671j08461o15281o2171K59990q58880
12644F81196j706632l92819J524391J202649r29930j730280M3904K202001K247881
12635C142361J51010k201427k965163j608489P70065K258803J846339K74613r85166
$$ plain form
12696 6105052 5682693 3858990 2588705 2545959 1600741 -1565893 -4259726 -3059799 898307
12687 898307 3171520 2070493 94599 -821442 -1867378 -4040797 -5611606 -4874051 -2860722
12678 -2860722 -1229963 239299 1733336 1256641 -2548381 -6952737 -7792119 -4826885
12670 -4826885 -1449604 379476 1686749 3094128 3269476 1535426 -738875 -2256350
12662 -2256350 -2956444 -2476547 -168411 2436903 2144073 -1308159 -3839271 -2266573 1386035
12653 1386035 3143525 2512315 1864328 2065999 1957538 1342257 1280086 1540076 681196
12644 681196 -1025436 -1418255 106136 1308785 378855 -1351425 -1307521 894480 3142361
12635 3142361 3293371 1091944 -1873219 -3481708 -2711643 -452840 1393499 1668112 682946
12626F82946j099510j25179J181737J562683L70546j179739j149693L60894J155787
12617A760472K09082q78842o68858j22563n24071j002739j59597J207526J215697
12608A036107j41929j213423j250131q70040m87676m1197J88397Q0698L89093
12599b310101J396197J728741L24217j396653j474844n51788m87202p32908O67391
12590b836950K807771K428107p03075k715009j449380K07394q46332k860808k193939
12581h162221Q48239K772379K346170J602260J653603J103208o59631j733996
12573b29989p69547O80818P19774J24448O05030J398794K93370k331488l254306
12564b763096r04170K173830K734422J029566k43814q8299l2264j027409j797669
$$ plain form
12626 682946 -416564 -541743 639994 2202677 2573223 1393484 243791 604685 1760472
12617 1760472 1969554 1090712 421854 299291 -224780 -1227519 -1387116 -179590 1036107
12608 1036107 894178 -319245 -1569376 -2439416 -2927092 -2968289 -2779892 -2699194 -2310101
12599 -2310101 -913904 814837 1139054 -257599 -1732443 -2284231 -2771433 -3504341 -2836950
12590 -2836950 -29179 2398928 1695853 -1019156 -2468536 -2261142 -3107474 -5968282 -8162221
12581 -8162221 -7313982 -4541603 -2195433 -593173 1060430 2163638 1504007 -229989
12573 -229989 -999536 -318718 401056 525504 1130534 2529328 2822698 491210 -2763096
12564 -2763096 -3667266 -1493436 1240986 2270552 2026738 1938439 1906175 878766 -918903
12555i18903j013718N67245J242639N81634n28495j253620j259944m60738O91489
12546b352411J162286N20713k53831m1491P56443P91901k66816j277654j025868
12537a986728N70203K376553K663879N33117k475135l188086n78503K203342J511899
12528A630541j729787l173185j200671J080315R51390N0479R66408K427316J315094
12519B317900j789181k958615r32109R73009K30432j000430K45617K616133K569535
12510B272291J44403j214688k91684L67324o53880j110354N08872J517165p76430
12501G63019l890181l248856P85447L251650J844330l99030n06378L86023K35546
12492g78430k05707M26435R22742l69159j994732j178381J712982L369474J969988
$$ plain form
12555 -918903 -1932621 -1365376 -122737 458897 -69598 -1323218 -2583162 -3043900 -2352411
12546 -2352411 -1190125 -669412 -923243 -964734 -208291 583610 316794 -960860 -1986728
12537 -1986728 -1416525 960028 3623907 4157024 1681889 -1506197 -2084700 118642 1630541
12528 1630541 -99246 -3272431 -4473102 -3392787 -2441397 -2390918 -1424510 1002806 2317900
12519 2317900 528719 -2429896 -3362005 -2388996 -2158564 -3158994 -2913377 -297244 2272291
12510 2272291 2416694 1202006 910322 1277646 623766 -486588 22284 1539449 763019
12501 763019 -3127162 -6376018 -5590571 -2338921 -494591 -893621 -1399999 -1013976 -778430
12492 -778430 -984137 -557702 365040 -4119 -1998851 -3177232 -1464250 1905224 3875212
12483C875212q30047k262821j136102J507383L039965J328440k400712l991310
12475h69992j498624J595153Q83829k606653l950300j497414J370344J866675
12467d706982J188163J092574Q04797n44669j346682j2067J955154J983862K51100
12458F65250q79954m08479M34176M49805j62387o25081n25061K5448M47935K06397
12448c71951l35928k46315M45386O06054j00935n03156P6025N10370k56722j301485
12438a478657j093864K23954J360976J804196J780304J110132l13620j484548
12430A908873j293325k44356K15530k24984o04587l00990M38480J227670J641979
12421B764290J048772m48420j466998j101521n25001j148293j901176o51884J905707
$$ plain form
12483 3875212 3045165 782344 -353758 1153625 4193590 5522030 3121318 -869992
12475 -869992 -2368616 -773463 110366 -2496287 -6446587 -7944001 -6573657 -4706982
12467 -4706982 -3518819 -2426245 -1621448 -2166117 -3512799 -3524866 -1569712 414150 665250
12458 665250 -214704 -623183 -189007 260798 98411 -526670 -1051731 -1026283 -578348 -371951
12448 -371951 -707879 -954194 -508808 97246 -3689 -506845 -430820 79550 -177172 -1478657
12438 -1478657 -2572521 -2348567 -987591 816605 2596909 3707041 3393421 1908873
12430 1908873 615548 371192 586722 361738 -242849 -543839 -105359 1122311 2764290
12421 2764290 3813062 3364642 1897644 796123 271122 -877171 -2778347 -3430231 -1524524
12412a524524K540975L11328j596684m06361K077367K142221l48390j920742p30404
12403E44786R08267K70305j598013j490951J024247K648554Q17727k755514m317936
12394c948528k638050L31445K566540L639323L419797J524263j137558k330849
12386A426383j316195p6501l51081j051996l56607J119879J429809M84715k48721
12377A059685m96271j061064j421331k93950J353242Q87659j657884k805132o16394
12368e051440K188886K177531J36387n64857P83244J578677K65296j395702j212407
12359a094385K38184O70952o17585j946776j653855j93770P09134M12824n4819
12350c530096K46168Q28597P35336J1219n93685p38933m35398M07632J328304
$$ plain form
12412 -1524524 1016451 1327779 -268905 -675266 1402101 3544322 3195932 1275190 544786
12403 544786 1453053 1723358 125345 -1365606 -341359 2307195 3124922 369408 -3948528
12394 -3948528 -6586578 -6255133 -3688593 -49270 3370527 4894790 3757232 1426383
12386 1426383 110188 33687 -317394 -1369390 -1725997 -606118 823691 1308406 1059685
12377 1059685 563414 -497650 -1918981 -2212931 -859689 27970 -1629914 -4435046 -5051440
12368 -5051440 -2862554 -685023 -548636 -1113493 -330249 1248428 1513724 118022 -1094385
12359 -1094385 -856201 -185249 -802834 -2749610 -4403465 -4597235 -3888101 -3475277 -3530096
12350 -3530096 -3283928 -2455331 -1719995 -1708776 -2302461 -3041394 -3476792 -3069160 -1740856
12341a740856J087260m74851j327277J9839J579839M12628k379881k622470N41024
12332d904745K986035J792536o03557q52375J27937k20529j084796j07612J585272
12323a281834Q35395j775864k293295J66474J806773K24901j908956j302242J027579
12314d501069J792128K13833j632703j829004p2008K641061M266893K974089m20897
12305C432323k625821j809081J96544J020305J097990J810772K186681M00327
12297E710040k488044l422260j768976l8298R649o06352n04081k8643K7013p3342
12287c183294J49001M18477M42523M58092M49883N8853k81491L50495J312095
12278A74634M83248k419331m365586k635338J316311L643359K994219J440334
$$ plain form
12341 -1740856 -653596 -1128447 -2455724 -2435885 -856046 -443418 -2823299 -5445769 -4904745
12332 -4904745 -1918710 -126174 -729731 -1582106 -1454169 -1674698 -2759494 -2867106 -1281834
12323 -1281834 -446439 -2222303 -4515598 -4349124 -2542351 -2317450 -4226406 -5528648 -4501069
12314 -4501069 -2708941 -2495108 -4127811 -5956815 -6028823 -3387762 879131 3853220 3432323
12305 3432323 806502 -1002579 -806035 214270 1312260 3123032 5309713 5710040
12297 5710040 3221996 -200264 -1969240 -2007538 -1997889 -2604241 -3108322 -3136965 -3109952 -3183294
12287 -3183294 -3034293 -2615816 -2173293 -1715201 -1265318 -1206465 -1487956 -1137461 174634
12278 174634 657882 -1761449 -6127035 -8762373 -7446062 -3802703 -808484 631850
12270F31850Q32357O28720j21100q04208n62812r9113n28759j252768p12347R41681
12260a046499J651347L53108j370397j471532k34360L83979l26632j009953l89822
12251c460761J057491K007946J851991Q20347n42003j387616r27637L98023R06341
12242G24122j75902j286826n74569J141075J149881j271780l436306k553061O47484
12233e635882K779017J913006k53186o47714J343872L056711J830650j499312
12225B887162l418889k049274O49497J651708N96962m88711k91185N50878R06445
12216I94593L95724o53007j319360n87831J052252J315720q36324k792320j422469
12207c853022J978552L050152P44391j282925o36572L00746j031333k716842j533543
$$ plain form
12270 631850 1464207 2092927 1971827 1167619 604807 505694 -23065 -1275833 -1988180 -1046499
12260 -1046499 604848 957956 -412441 -1883973 -2118333 -1734354 -2060986 -3070939 -3460761
12251 -3460761 -2403270 -395324 1456667 2277014 1735011 347395 -580242 -182219 724122
12242 724122 548220 -738606 -1313175 -172100 977781 -293999 -3730305 -6283366 -5635882
12233 -5635882 -2856865 -943859 -1197045 -1844759 -500887 2555824 4386474 2887162
12225 2887162 -531727 -2581001 -1931504 -279796 317166 -171545 -462730 88148 994593
12216 994593 1390317 737310 -582050 -1169881 -117629 1198091 361767 -2430553 -3853022
12207 -3853022 -1874470 1175682 1920073 637148 576 301322 -730011 -3446853 -4980396
12198d980396J671175L332590K369290O42034o76936j809704k177370r17997O60244
12189a887070L79390j101482j050842P91214J777337Q68913R7079N95687O56893
12180A127119p64896j875880j320974o52618j191702j182173J039572L314017
12172a507535K491973m37839j551976K58311J986682J075168j451407k955120
12164b091743k247934j45026J570246J501409J07775m77591O99336J658616M41426
12155A016514j315536o39614J576993J381020j761784l382148p76945K420264
12147a481236J656691j439871j674458J468014L042817M37903k642569j984853
12139b617562R39036J750899q0334j061961L94286J679480N27550j314614j013114
$$ plain form
12198 -4980396 -3309221 23369 2392659 3034693 2357757 548053 -1629317 -2547314 -1887070
12189 -1887070 -1507680 -2609162 -3660004 -2868790 -1091453 -222540 -125461 470226 1127119
12180 1127119 362223 -1513657 -2834631 -3487249 -4678951 -5861124 -4821552 -1507535
12172 -1507535 984438 546599 -1005377 -747066 1239616 2314784 863377 -2091743
12164 -2091743 -4339677 -4484703 -2914457 -1413048 -1305273 -1782864 -1083528 575088 1016514
12155 1016514 -299022 -938636 638357 2019377 257593 -3124555 -3901500 -1481236
12147 -1481236 175455 -1264416 -2938874 -1470860 1571957 2009860 -632709 -2617562
12139 -2617562 -1678526 72373 -7961 -1069922 -675636 1003844 1531394 216780 -796334
12130g96334Q81550J539676L43847o19843m46725q32254k654576l756953k065213
12121h406825Q81599J884739N92954l81159M93477J919885K321204J896522J354376
12112B556772M76597r08188j891015j619071n45372L72058Q41982Q51225J39200
12103B74188j036989j606579j118975n03548m36638j06722J142708K126703J440097
12094A74245j49908p97516m05059l43839p62381l76611J021351J968482J595958
12085A924722O02840l75608j427538j984846r78417Q47913J073721o87627j476964
12076b481804P53405L547924L092315l51503k915946k491480q63330k98522n60565
12067b569506l14941M18138O98473N16092P18499J324277J103634p05099k835892
$$ plain form
12130 -796334 85216 1624892 1968739 1348896 902171 69917 -2584659 -6341612 -8406825
12121 -8406825 -7525226 -5640487 -5047533 -5428692 -4935215 -3015330 -694126 1202396 2556772
12112 2556772 3033369 2125181 234166 -1384905 -1930277 -1558219 -716237 134988 274188
12103 274188 -762801 -2369380 -3488355 -3991903 -4428541 -4535263 -3392555 -1265852 174245
12094 174245 24337 -773179 -1178238 -1522077 -2284458 -2661069 -1639718 328764 1924722
12085 1924722 2527562 2151954 724416 -1260430 -2238847 -1390934 -317213 -1004840 -2481804
12076 -2481804 -1728399 1819525 4911840 4560337 1644391 -847089 -1710419 -2008941 -2569506
12067 -2569506 -2884447 -2466309 -1767836 -1251744 -533245 791032 1894666 1189567 -1646325
12058a646325k993744o62306J839011J980966K03527r13487m55255j47750j015800
12049c811163j414813M6377J702368J326582p1435J57318J729587J720562n14597
12040H70786k006979p71892J135479Q89915r65667j772421p35942N64492J010760
12031a781469J223643J872614K260655J300817p67835k329786k096853n36736
12023h54950P41763Q98660M75575K1257p10786j515207j096329Q84981K333351
12014A178315J267596j023791j686491n47223K8137p33588j083076k63768K40496
12005b623393j59357M0253J166728J086861r32272k126156m36573J903474J845201
11996b35234K36023j55893N99196L51234r37867j371421p19845m04492l81298
$$ plain form
12058 -1646325 -4640069 -5302375 -3463364 -1482398 -1278871 -2192358 -2647613 -2795363 -3811163
12049 -3811163 -5225976 -5179599 -3477231 -2150649 -2222084 -2064766 -335179 1385383 870786
12040 870786 -1136193 -1908085 -772606 117309 -848358 -2620779 -3356721 -2792229 -1781469
12031 -1781469 -557826 1314788 3575443 4876260 4108425 1778639 -318214 -854950
12023 -854950 -113187 785473 1261048 1282305 571519 -943688 -2040017 -1155036 1178315
12014 1178315 2445911 1422120 -264371 -811594 -783457 -1517045 -2600121 -2863889 -2623393
12005 -2623393 -2782750 -2742497 -1575769 -488908 -1421180 -3547336 -3983909 -2080435 -235234
11996 -235234 789 -155104 444092 795326 -142541 -1513962 -2233807 -2638299 -3019597
11987c019597N45634J562233N48095j846820k345830k9603K051705J428428m45144
11978a550899q36711N91334K206629K626773J299911j389413l531365k929542
11970c513283N2774K511644K649885J554214O32605l38655j406572j261234K30909
11961A112287O65672j277309k877108j066182K363069K811044l39453k689475
11953a297455j220758J670687K222499O90283J14348J231925J599491k75819k514113
11944B221088k618011r57527M8046n75389j331862o84092R41749K077158K067907
11935A189067J287330K48562o80004j118744r62702n85811l12933l3043L55169
11926f13109O67401Q96264J180338J017016l48179k191714k430478n14567J299694
$$ plain form
11987 -3019597 -2473963 -911730 -363635 -2210455 -4556285 -4585888 -2534183 -1105755 -1550899
11978 -1550899 -2387610 -1796276 410353 3037126 4337037 2947624 -583741 -3513283
11970 -3513283 -3460509 -948865 1701020 3255234 3887839 3549184 2142612 881378 1112287
11961 1112287 1777959 500650 -2376458 -3442640 -1079571 1731473 1392020 -1297455
11953 -1297455 -2518213 -847526 1374973 2065256 2179604 3411529 5011020 4735201 2221088
11944 2221088 -396923 -1354450 -1306404 -1881793 -3213655 -3897747 -2955998 -878840 1189067
11935 1189067 2476397 2724959 2044955 926211 -36491 -622302 -935235 -968278 -613109
11926 -613109 54292 950556 2130894 3147910 2799731 608017 -1822461 -2337028 -1037334
11917a037334J047346n5048K15682J355351J129665m90715j236736k50015Q27404
11908A505600P37486R1334m43842j049563j331132l82075J063741R63967p04759
11899D50757j427943q8373J079680M9042j746887j702991J30402J533206J229132
11890d93975k27020j697964k158612j081686O73222J337876N33728j34565M12266
11881b836730J227087J273356R73366O65161l51707j749613j517997O23073J568084
11872a25920p58285l490351k596026J031212K884204J361781o98156q01667L30611
11863b862597J021136Q24631n7523j132578j131405N55234K046250J092589j227515
11854h71778j902472q59626q02780j908293j000388K556771M480255J739311k513818
$$ plain form
11917 -1037334 10012 -45036 170646 1525997 2655662 2164947 928211 678196 1505600
11908 1505600 2243086 2334420 1890578 841015 -490117 -872192 191549 1155516 450757
11899 450757 -977186 -1065559 14121 63163 -1683724 -3386715 -3256313 -1723107 -493975
11890 -493975 -720995 -2418959 -4577571 -5659257 -4986035 -3648159 -3114431 -3248996 -2836730
11881 -2836730 -1609643 -336287 637079 1302240 950533 -799080 -2317077 -1694004 -125920
11872 -125920 -884205 -4374556 -6970582 -5939370 -3055166 -1693385 -2391541 -3193208 -2862597
11863 -2862597 -1841461 -1016830 -1074353 -2206931 -3338336 -2783102 -736852 355737 -871778
11854 -871778 -2774250 -3633876 -4436656 -6344949 -7345337 -4788566 -308311 1431000 -1082818
11845a082818l497771j382846L70892Q63177J661096K394234J149792j077349
11837f01593r32439J624256K446121m43077l402979k486187Q27377K222733P99558
11828E3770o06747l07200L53021k8367q72228j204313j138783r36667k25467R77600
11818c935381J737055J460620O74902M5293l02528j63476O68457J293170L51397
11809A829509j532969j878740m6748J252172r4390k092583j504395J267091K977908
11800A76855K294699P82121l38773j304882j738336o26541J158149J274691m31210
11791A246773j475587p06319J81868P2159K42667J309695J500168n52q90053N69653
11781B050472K230418J201241j725914l572840l317286j813745O19310L488340
$$ plain form
11845 -1082818 -4580589 -5963435 -5592543 -4729366 -3068270 -674036 475756 -601593
11837 -601593 -1534032 90224 2536345 2093268 -1309711 -3795898 -2968521 -745788 53770
11828 53770 -552977 -860177 -507156 -535523 -1407751 -2612064 -3750847 -4687514 -4912981 -3935381
11818 -3935381 -2198326 -737706 -62804 -17511 -320039 -483515 184942 1478112 1829509
11809 1829509 296540 -1582200 -1628948 -376776 -471166 -2563749 -4068144 -2801053 176855
11800 176855 2471554 3253675 2914902 1610020 -128316 -754857 403292 1677983 1246773
11791 1246773 -228814 -935133 -753265 -681106 -438439 871256 2371424 2370872 1480819 2050472
11781 2050472 4280890 5482131 3756217 183377 -3133909 -4947654 -4328344 -840004
11773h40004M539542K187937j464570l072593k517747j923110j401381N70964
11765c920962L190081L612241J339999j066908j917302j901462j553039m65534
11757b682886O54819M21437l66473L81767J944539J347631j264402k010485M77471
11748a096582K410615Q08752j765648j528779P39210J812921J357479J255121
11740C993089J389046J08991k011348k630906j563798r01214j184399o29806J316978
11731b113367K556109J562756k03491m93472O52580J391791P60777l36044n56186
11722C221453K32753Q62088K39529j331407k446811k177376q95213M40824J102731
11713g51429O71157o73359j694188j112324N08263J166183K19041p11503l22081
$$ plain form
11773 -840004 3699538 5887475 4422905 1350312 -1167435 -3090545 -4491926 -3920962
11765 -3920962 -730881 2881360 4221359 3154451 1237149 -664313 -2217352 -2682886
11757 -2682886 -2028067 -1606630 -1973103 -1591336 353203 1700834 436432 -1574053 -1096582
11748 -1096582 1314033 2122785 357137 -1171642 -432432 1380489 2737968 3993089
11740 3993089 5382135 5491126 3479778 848872 -714926 -1616140 -2800539 -3430345 -2113367
11731 -2113367 442742 2005498 1802007 1308535 1961115 3352906 4113683 3777639 3221453
11722 3221453 3454206 4316294 4555823 3224416 777605 -1399771 -2294984 -1854160 -751429
11713 -751429 -80272 -753631 -2447819 -3560143 -3051880 -1885697 -1666656 -2378159 -2700240
11704b700240O01943J008003J281205J687393J060307r74780k249842r85909R95905
11695b76015Q15549q50262q95933J088667K278986J268066j26902l35984j67036
11686B799136m74681n91581k73876m81664r74889k0799J972961J752339j533752
11677B173194l577236p87987L667304L967630J81520k119361m34480J518584L57140
11668D946308j904746j851343j14994N08699N418M91316J764731J196118j818063
11659C223444m336138l690183o62831K108169L129886K384404K54412k319683
11651I1480l528247k202687N14362K201089J858510O29873j16667k57298j54263
11642i63848L53399J275549J608073M52538j258216j550228j40574J018265N66532
$$ plain form
11704 -2700240 -2098297 -1090294 190911 1878304 2938611 1963831 -286011 -1271920 -276015
11695 -276015 539534 -310728 -1206661 -117994 2160992 3429058 3302156 2966172 2799136
11686 2799136 2324455 1732874 1458998 977334 2445 -18354 1954607 3706946 2173194
11677 2173194 -1404042 -2192029 1475275 5442905 5624425 3505064 3070584 4589168 4946308
11668 4946308 3041562 1190219 1075225 1583924 1589342 2080658 3845389 5041507 3223444
11659 3223444 -1112694 -4802877 -5465708 -3357539 -227653 2156751 2411163 91480
11651 91480 -3436767 -5639454 -5125092 -2924003 -1065493 -435620 -552287 -809585 -963848
11642 -963848 -610449 665100 2273173 2725711 1467495 -82733 -223307 794958 1361490
11633A361490l06093O6744J058317Q78673l24627p45858n8965K24751j75322L50803
11623B329913J894777J843843r82142l590727k870278l02569N40846m07424l41387
11614a885148J132218J480141J1870r39002l21063M9576o15508m52483J104420
11605d34979J583972k1090p79409J113818K360689l31058m048229l470111Q23515
11596c202882L043072P61002k221360k226117l74625O46133P17677J003660J270007
11587e83433P90817J76935L81981J030847J090784K76711j015519k120634k015832
11578a987343k42933J675816J490682n06117j430467K9798J495889M98396j622061
11569e98340j592496R86164K958750J731504j581007l617856k537222J94978J615243
$$ plain form
11633 1361490 1055397 1122141 2180458 3059131 2734504 1988646 1929681 2154432 1979110 2329913
11623 2329913 4224690 6068533 5086391 1495664 -1374614 -1677183 -1136337 -1543761 -1885148
11614 -1885148 -752930 727211 739081 -199921 -520984 -471408 -1086916 -1539399 -434979
11605 -434979 1148993 1127903 348494 1462312 3823001 3491943 -556286 -4026397 -3202882
11596 -3202882 -159810 601192 -1620168 -3846285 -4220910 -3574777 -2857100 -1853440 -583433
11587 -583433 207384 384319 766300 1797147 2887931 3164642 2149123 28489 -1987343
11578 -1987343 -2230276 -554460 936222 430105 -1000362 -970564 525325 1023721 -598340
11569 -598340 -2190836 -1204672 1754078 3485582 1904575 -1713281 -4250503 -4055525 -2440282
11560b440282N64988j227496j538662l37556P75622J059401J073370R97869L05097
11551g67649p47247r83460o7957J051177J727001K131697K018892P70967r45135
11542D188286j472528o38295K1160J4422N33432J507275P59879k228904m269990
11533a585263k544121J168843K884715J609950m07337j430081j483977o14078
11525b401349J244217K769427K187137m5969j577705j354656n06617M7258O55259
11516A017002J161612L72767j669765k799393j517130O93374J314682J04306j034358
11507b356903r09248k43526r3138m04254n44811l39474O909M20482P61283N38062
11497c164618m08127j164199o54186O57998J117671L52075Q8779J519294L077352
$$ plain form
11560 -2440282 -1875294 -3102790 -4641452 -4979008 -4203386 -3143985 -2070615 -1072746 -767649
11551 -767649 -1514896 -2498356 -2566313 -1515136 211865 2343562 4362454 5133421 4188286
11542 4188286 2715758 2077463 2098623 2113045 2646477 4153752 4913631 2684727 -1585263
11533 -1585263 -4129384 -2960541 -75826 1534124 1126787 -303294 -1787271 -2401349
11525 -2401349 -1157132 1612295 3799432 3753463 2175758 821102 314485 361743 1017002
11516 1017002 2178614 2551381 881616 -1917777 -3434907 -2741533 -1426851 -1322545 -2356903
11507 -2356903 -3266151 -3509677 -3602815 -4007069 -4551880 -4891354 -4884445 -4463963 -3702680 -3164618
11497 -3164618 -3572745 -4736944 -5391130 -4733132 -3615461 -3263386 -3174607 -1655313 1422039
11488A422039K438312p9612j988106k063586j301260o35180M7084M40662k28461
11479a948108j206008n79478J438072K097438L31788j177012j17738J637196R77314
11470A453464j490378k475008r47811R70926J614303J415483R90242J98677n48425
11461A181473l16136N35824M94061o87803j457022p83678N77704J467627J405728
11452B417778J53491j997900l269436j809543J317028K665883R28533j125641
11444g19807o11023J464161K089241P47836l65487p9000K22258p72883k017640
11435d2344j596914M07546J782530R44126r84762j480715J69312J839035J318771
11426B356585o58843j459899m13395J73906j368941l169009k293477Q07963K662302
$$ plain form
11488 1422039 3860351 3780739 1792633 -270953 -1572213 -2207393 -2160309 -1719647 -1948108
11479 -1948108 -3154116 -3733594 -2295522 -198084 133704 -1043308 -1161046 476150 1453464
11470 1453464 -36914 -2511922 -3459733 -2488807 -874504 540979 1531221 1729898 1181473
11461 1181473 865337 1401161 1895222 1207419 -249603 -1033281 -455577 1012050 2417778
11452 2417778 2571269 573369 -2696067 -4505610 -3188582 -522699 405834 -719807
11444 -719807 -1330830 133331 2222572 2970408 2604921 2525921 2748179 1975296 -42344
11435 -42344 -1639258 -1231712 550818 1494944 510182 -970533 -801221 1037814 2356585
11426 2356585 1697742 237843 -175552 -1646 -1370587 -4539596 -6833073 -6025110 -3362808
11417c362808J660984K36741J007794K685328J991561j223327l369204k012537
11409b385468Q59685J754494K34516j241190j125306l43979j34238k77333j06889
11400b765708K07559L25727O55005J524742K046332R52770j445657l030847k059194
11391c589271O87128K419429J301103j364470k540347j078722R87998J206993
11383a970159l18195j609534j462839j48772J647450L003567K593123K20468j915847
11374C9262j517849M97737J163427j36812r21076L32634J912301J611435l73764
11365B607295k327564l008152j950306M00392K171183J625955j85669n34678P84717
11356d16827J117845m62934j513874n21252N86261J80483k23708O74575J123793
$$ plain form
11417 -3362808 -1701824 -1465083 -457289 2228039 4219600 2996273 -372931 -2385468
11409 -2385468 -1525783 228711 463227 -777963 -1903269 -2247248 -2381486 -2658819 -2765708
11400 -2765708 -2558149 -2232422 -1577417 -52675 1993657 2946427 1500770 -1530077 -3589271
11391 -3589271 -2902143 -482714 818389 -546081 -3086428 -4165150 -3177152 -1970159
11383 -1970159 -2288354 -3897888 -5360727 -5509499 -3862049 -858482 1734641 1955109 39262
11374 39262 -1478587 -980850 182577 45765 -875311 -542677 1369624 2981059 2607295
11365 2607295 279731 -2728421 -4678727 -4278335 -2107152 -481197 -666866 -1201544 -416827
11356 -416827 701018 238084 -1275790 -1797042 -1210781 -1030298 -1254006 -579431 544362
11347E44362j92970j064315M00426J885876P65250r98190l37808J120835j00048
11338B023418k732495k685567k54763N91930m74114J25814K561652K564002q06636
11329I13241k602328K02749L769815L459612K69588k160582k974126k998675j751087
11320c871793P17852J880460K91867j391122m42557J321310P20869j189360r43237
11311b905711J356063K272781P55854m87491L45767J610190J210557n05964j871323
11302A780723k021657j064427M76721J703633J765135O66909q08474j890106k151491
11293a543034j549202n71731K28183J003854J970304K164150O21547j220407q79577
11284B24087R36004P24377j941341k838091J50517K778792Q86080k514954j924683
$$ plain form
11347 544362 351392 -712923 -312497 1573379 2338629 1340439 1002631 2123466 2023418
11338 2023418 -709077 -3394644 -3649407 -3057477 -3531591 -3405777 -844125 1719877 913241
11329 913241 -1689087 -1486338 2283477 5743089 6012677 3852095 877969 -2120706 -3871793
11320 -3871793 -3153941 -1273481 -981614 -2372736 -2815293 -1493983 -773114 -1962474 -2905711
11311 -2905711 -1549648 723133 1478987 991496 1337263 2947453 4158010 3652046 1780723
11302 1780723 -240934 -1305361 -828640 874993 2640128 3307037 2498563 608457 -1543034
11293 -1543034 -3092236 -3663967 -3435784 -2431930 -461626 1702524 2324071 1103664 224087
11284 224087 1160091 1884468 -56873 -2894964 -2744447 34345 920425 -1594529 -3519212
11275c519212J487967J867685j327897k416282P25245L006583P60392k275571
11267a691090j545635R54144Q51591r78363o36454J414861J187079j488078k276229
11258d208174L70996K430651O69939k387053k542307R056J748598J162107m9414
11249b795601l39267j68480l29297m72938j429P86831J120254P08449r1984o50659
11239b234121m79047L04892Q87508N63256l90819j102254j251520j179011r07522
11230e788638p673J260904J706851Q74507R6275P16935J839158J413868m67999
11221A644188j259279K73882J777088N63395k053763k197137R24169L513040K364426
11212E550009q33407k315895j533670r03236j248933q04910R54604J729386N6690
$$ plain form
11275 -3519212 -2031245 -163560 -1491457 -3907739 -3182494 -175911 584481 -1691090
11267 -1691090 -3236725 -2282581 -1430990 -2409353 -3045807 -1630946 -443867 -1931945 -4208174
11258 -4208174 -3837178 -1406527 -736588 -3123641 -5665948 -5656892 -3908294 -2746187 -2795601
11249 -2795601 -3134868 -3303348 -3632645 -4105583 -4107012 -3320181 -2199927 -1491478 -1583462 -2234121
11239 -2234121 -2713168 -2408276 -1520768 -957512 -1348331 -2450585 -3702105 -4881116 -5788638
11230 -5788638 -5796311 -4535407 -2828556 -1954049 -1857774 -1140839 698319 2112187 1644188
11221 1644188 384909 658791 2435879 2999274 945511 -1251626 -327457 3185583 5550009
11212 5550009 4716602 2400707 867037 -36199 -1285132 -2090042 -1135438 593948 650638
11203F50638k034438k000463l75373Q52861J663099L000885L645784J472426k411851
11194D463568m120026k160762O94733J574540Q30460K3093p59062j757525j868903
11185c079884k79315J609405J820481M10907j025496j449342p90034M50928R19040
11176a413310o03286k714543k083576J638675M122954K167467j300139j561548
11168a747306O80891R81185j191051j812642M42774J760111k41911k310774q87293
11159d326016K134373K603497M87965q02950l7527O32981k44590j331857j001266
11150a885390L44331J251077J078702K09056p03754j164025r89020l54684L77904
11141a835803P90741M54227o25347j541691j174045M21356J902604K059797P82754
$$ plain form
11203 650638 -1383800 -3384263 -3759636 -2906775 -1243676 1757209 5402993 6875419 4463568
11194 4463568 343542 -1817220 -1122487 452053 1282513 1305606 546544 -1210981 -3079884
11185 -3079884 -3359199 -1749794 70687 481594 -543902 -1993244 -2783278 -2332350 -1413310
11176 -1413310 -2016596 -4731139 -6814715 -5176040 -1053086 1114381 -185758 -1747306
11168 -1747306 -1066415 -85230 -1276281 -3088923 -2646149 -886038 -1127949 -3438723 -4326016
11159 -4326016 -2191643 411854 899819 96869 59342 692323 447733 -884124 -1885390
11150 -1885390 -1541059 -289982 788720 997776 294022 -870003 -1859023 -2213707 -1835803
11141 -1835803 -1045062 -590835 -1216182 -2757873 -3931918 -3510562 -1607958 451839 1234593
11132A234593j191708k630203k255472j53750J552619J059283l92478k82650R10616
11123b149150K67811k152697k248095J639215M782298K356949k849921l804736
11115d158326O35446M098476K022633k207002k938865l09179J175999J1239p47492
11106b417071Q28536K327855J089630j375037j672929K71128J291880K6940j086993
11097g16061J54031K183889K080629j49955k024208k340012j985780j419830n2112
11088d269409J578190J666043J23484o41446P26105K266732J711120j6060m27034
11079B717725O18710J005335j43669j301489j019283J52964O47247l30722k198367
11070A48451l361780k351684M32322K399507J424898j324958k623362j272909
$$ plain form
11132 1234593 42885 -2587318 -4842790 -4996540 -3443921 -2384638 -2777116 -3059766 -2149150
11123 -2149150 -1881339 -4034036 -6282131 -4642916 139382 2496331 -353590 -4158326
11115 -4158326 -3522880 575596 2598229 391227 -2547638 -2856817 -1680818 -1669579 -2417071
11106 -2417071 -1588535 739320 1828950 453913 -1219016 -947888 343992 370932 -716061
11097 -716061 -562030 1621859 3702488 3552533 1528325 -811687 -2797467 -4217297 -4269409
11088 -4269409 -2691219 -1025176 -901692 -1543138 -817033 1449699 3160819 3144759 2717725
11079 2717725 3336435 4341770 4198101 2896612 1877329 2030293 2677540 2346818 148451
11070 148451 -3213329 -5565013 -5132691 -2733184 -1308286 -2633244 -5256606 -6529515
11062f529515O46717J040675N33051P51191J302970M07487j893946l188248j910446
11053h840064M24906J326315O69022M64462J666099K883515K675750J615398J006870
11044C892273O05877q41039l090149m014811k215864J004067L014818K694162
11036A049334J176332q249o65625j376755j864432j138402M89020R45221p95468
11027b189024k491837j220909K216813L909909K187830k41206n59298L52882K17375
11018B182535p86071r37876j81110J88285J7084R4932K80450J3879j61049L11587
11008A022646M56529m73304j026554Q0886J111517n9868j863874j287914R12544
10999a127392J455160K45823J70855J377548Q81724j527889k273841k73951R42960
$$ plain form
11062 -6529515 -5882798 -4842123 -4309072 -3557881 -2254911 -1847424 -3741370 -6929618 -8840064
11053 -8840064 -8415158 -7088843 -6419821 -5955359 -4289260 -1405745 1270005 2885403 3892273
11044 3892273 4498150 3657111 566962 -3447849 -5663713 -4659646 -1644828 1049334
11036 1049334 2225666 2217417 1551792 175037 -1689395 -2827797 -2338777 -1393556 -2189024
11027 -2189024 -4680861 -5901770 -3684957 224952 2412782 2171576 1612278 1965160 2182535
11018 2182535 1396464 458588 277478 465763 482847 577779 858229 872108 711059 1022646
11008 1022646 1479175 1005871 -20683 60203 1171720 1111852 -752022 -2039936 -1127392
10999 -1127392 327768 573591 744446 2121994 3003718 1475829 -798012 -1071963 -129003
10990a29003n05312j505946L34631K320683J488818l28429j77801P97777R761
10981B305179j592987j461376p9071M44138M26115J242011J732019J42379j847708
10972A310699j316170P71617R17318j085416j974125n45073P75368L48972m05774
10963a202584p6885N36824M20036O8300J15093J12688m01441r69584q88681Q0897
10953b205337J572869K356288R95759k054941m072945l244917j027828K96466
10945g384586Q75084J892947K487292R93959j567583k250979k72818K070586K489563
10936f66535Q19245j504691k429871o73003K206848K609322k61325k415609o37580
10927b953199K343534J991596q24396j516740N86571J622518J6403j406632q30852
$$ plain form
10990 -129003 -634315 -2140261 -1805630 515053 2003871 1675442 1497641 2295418 2305179
10981 2305179 712192 -749184 -828255 -384117 41998 1284009 3016028 3158407 1310699
10972 1310699 -5471 766146 1683464 598048 -1376077 -1921150 -1145782 -796810 -1202584
10963 -1202584 -1279469 -742645 -322609 -254309 -139216 -26528 -427969 -1397553 -2286234 -2205337
10953 -2205337 -632468 1723820 2719579 664638 -3408307 -6653224 -7681052 -7384586
10945 -7384586 -6509502 -4616555 -2129263 -1135304 -2702887 -4953866 -5226684 -3156098 -666535
10936 -666535 152710 -1351981 -3781852 -4454855 -2248007 361315 99990 -2315619 -2953199
10927 -2953199 -609665 1381931 557535 -959205 -372634 1249884 1266287 -140345 -971197
10918i71197L4808O8080O09436J617362N92940k486336l570710o60326K438391
10909b327552J786649o65360n78868J823098K555965L14033j928646j695358j92110
10900i08149N3032j248287k007377n85327J886650K568138O61837j026862R9983
10891e06362K171191J269106k302800l934559j623884J029488O34015r61980l88859
10882d614644J580806J771332k2277j194947p39074K0589M70997J194339J641675
10873A08796M52503j686155k304022p79980P49792P63231L47846Q89295J753136
10864B94442J551863L53762o16403o67398j51561J16317n55293k058825l081557
10855d814653k237220L6023J681665J605007R66697J161591J624087Q83208r22126
$$ plain form
10918 -971197 -936389 -868309 -258873 1358489 1951429 -534907 -4105617 -4765943 -2327552
10909 -2327552 -540903 -1206263 -1785131 37967 2593932 2907965 979319 -716039 -908149
10900 -908149 -855117 -2103404 -4110781 -4696108 -2809458 -241320 420517 -606345 -506362
10891 -506362 1664829 2933935 631135 -3303424 -4927308 -3897820 -3263805 -4225785 -4614644
10882 -4614644 -3033838 -1262506 -1284783 -2479730 -3218804 -3198215 -2727218 -1532879 108796
10873 108796 561299 -1124856 -3428878 -4208858 -3459066 -2695835 -2347989 -1458694 294442
10864 294442 1846305 2200067 1583664 916266 764705 881022 325729 -1733096 -4814653
10855 -4814653 -7051873 -7015850 -5334185 -3729178 -2762481 -1600890 23197 906405 -15721
10846a5721k079599j697439o97765k32488k88024k66402L5349N07783R37356P41613
10836c055337m73309j601130o62669K224620L930428K063966j447046k690516
10828a710993j010217O39084M30892j63068L34033Q27607L2569q62219j23850
10819a606162J402988J382514n31876k242191j934291J56246K415110L185212
10811B227550J820820o51145k296462k280719j467404p29412M7288P50367N58223
10802b020894l08754j49917J497977K491805J211685o32664n23633R23692J059683
10793C548980o33405k026606j675848m23222L51790L29021L2303K31805J305070
10784A039888K324563J628100p26136k364444j746911l90376l08064q94453m74756
$$ plain form
10846 -15721 -2095320 -3792759 -4490524 -4723012 -5011036 -5277438 -5242089 -4734306 -3796950 -3055337
10836 -3055337 -3528646 -5129776 -5792445 -3567825 362603 2426569 979523 -1710993
10828 -1710993 -2721210 -2082126 -1651234 -1814302 -1480269 -652662 -620093 -1482312 -1606162
10819 -1606162 -203174 1179340 647464 -1594727 -3529018 -3372772 -957662 2227550
10811 2227550 4048370 3397225 1100763 -1179956 -2647360 -3376772 -3329484 -2579117 -2020894
10802 -2020894 -2329648 -2479565 -981588 1510217 2721902 2089238 1565605 2489297 3548980
10793 3548980 2915575 888969 -786879 -1210101 -858311 -529290 -496987 -265182 1039888
10784 1039888 3364451 4992551 4266415 1901971 155060 -235316 -543380 -1437833 -1912589
10775a912589N73711P25572J30332M485J97550j64008n63360r7803L99323k19778
10765i26565r52128l24866N91555r6347j396334q58276R84919J250553m52707
10756b180196j453514m66304Q38401J126940R98257P31040m06667j839339j640944
10747d292326K63432J502632P55995n96083j092218j036735q88718j48146J108456
10738d423711J544866M59809j055460j476747k83584J890268L363086K341910
10730B360437o74221k472869j122603R53633N21505j333997j121599J089611J798360
10721a743n7324j617179j005997K31846N33220N39531P61092K86824q96314j184044
10711b410088j48871N65037J34202k07121K97541O88474M45265M19173P86429
$$ plain form
10775 -1912589 -1338878 -613306 -482974 -478489 -280939 -444947 -1008307 -1106110 -706787 -926565
10765 -926565 -1878693 -2203559 -1612004 -1708351 -3104685 -3962961 -2978042 -1727489 -2180196
10756 -2180196 -3633710 -4100014 -3261613 -2134673 -1136416 -405376 -812043 -2651382 -4292326
10747 -4292326 -4028894 -2526262 -1770267 -2366350 -3458568 -4495303 -5384021 -5532167 -4423711
10738 -4423711 -2878845 -2419036 -3474496 -4951243 -5234827 -3344559 18527 2360437
10730 2360437 1686216 -786653 -1909256 -955623 -434118 -1768115 -2889714 -1800103 -1743
10721 -1743 -59067 -1676246 -2682243 -2450397 -1917177 -1377646 -616554 -329730 -1226044 -2410088
10711 -2410088 -2558959 -1993922 -1859720 -2066841 -1769300 -1080826 -635561 -216388 570041
10702E70041M54570o73474j099405j96877P22346M59459o63339j740338k091453
10693d258470j277862K41500J113558J105878J660272K842866K191561r28395
10685B690908k862244j113577R84048l38614k516570j176406J504721K39144l461576
10676f050166l003652K110899N165811L062582J88848j55010l77176k203075k902283
10667d163222q95294J181138J674986K179168K528334J37254l494246k866707
10659c718589K113111M328385N78702l097387j532510J652424J412552n09516
10651A227172n54009o3162q98444l85454K915364M118825l67871n351127m313430
10642c672136K45574J588753k05388j85138J553505N34911k959953l614628K4485
$$ plain form
10702 570041 1024611 351137 -748268 -945145 -222799 236660 -426679 -2167017 -4258470
10693 -4258470 -5536332 -5294832 -4181274 -3075396 -1415124 1427742 3619303 2690908
10685 2690908 -171336 -1284913 -300865 -639479 -3156049 -4332455 -2827734 -2588590 -6050166
10676 -6050166 -9053818 -6942919 -1777108 1285474 1474322 1319312 942136 -1260939 -4163222
10667 -4163222 -5058516 -3877378 -2202392 -23224 2505110 2642364 -851882 -3718589
10659 -3718589 -1605478 2722907 3301609 204222 -1328288 324136 1736688 1227172
10651 1227172 673163 610001 -288443 -673897 2241467 6360292 5992421 641294 -3672136
10642 -3672136 -3426562 -1837809 -2043197 -2228335 -674830 -139919 -3099872 -6714500 -6690015
10633f690015L284327K745003L21235r22059o29695l142L9303p68857j465499
10624d089399m52100J762499K416085P93122k60847P80188J357550l53768j861626
10615I1704r26778L55299j83373n86558R39343J726350n86944k951389j773121
10606c895467P29254M59179j555522j653135o3598O20522P58953J924391K479688
10597a95735M57637j662583o85365J262368K50689k227151j766718J032665J617941
10588a916252n77474j553606P9747J174618o7666j209934J08602K457986K639087
10579A135108k86966l617556l464250N11842L487781J320417k888012k689826
10571f491462J694021L629657R30522j192105L4202O06279j440912j750532J202469
$$ plain form
10633 -6690015 -3405688 -660685 -339450 -1261509 -1891204 -1894346 -1855043 -2623900 -4089399
10624 -4089399 -4541499 -2779000 -362915 430207 169360 949548 2307098 1953330 91704
10615 91704 -835074 -479775 -663148 -1249706 -310363 1415987 829043 -2122346 -3895467
10606 -3895467 -3166213 -2707034 -4262556 -5915691 -5979289 -5358767 -4599814 -2675423 -195735
10597 -195735 261902 -1400681 -2086046 -823678 -572989 -2800140 -4566858 -3534193 -1916252
10588 -1916252 -2493726 -4047332 -3967585 -2792967 -2860633 -4070567 -3961965 -1503979 1135108
10579 1135108 848142 -2769414 -6233664 -5721822 -2234041 -913624 -3801636 -6491462
10571 -6491462 -4797441 -1167784 -237262 -1429367 -1395165 -788886 -2229798 -3980330 -2777861
10562b777861J734669k404045m183609O69173M822908J320949l969755k136979
10554f924550L648448M011220r80860l423423j191641P42413K40758j77614L37892
10545c717357O34949J371114K722628J719356k233818m021710j003312J581553
10537b946597j80678j634570J107179K907311o04653l629590m79241L350018J099209
10528a011612k852507j833937O26051r43625k304921J279644L700807p25360m632920
10519h698380n61906M081926N02928m302820p95063M372896J342777l302477J35640
10510g224479M202719r24738n979002J04563O075925j512543r743912j685355
10502a6686822R056586J655500j0628164l653019R312166O24764j5360231n637692
$$ plain form
10562 -2777861 -1043192 -3447237 -7630846 -6961673 -2138765 -817816 -4787571 -6924550
10554 -6924550 -3276102 735118 -245742 -3669165 -4860806 -4118393 -3877635 -4055249 -3717357
10545 -3717357 -3082408 -1711294 1011334 2730690 496872 -3524838 -4528150 -2946597
10537 -2946597 -3127275 -4761845 -3654666 -747355 -1352008 -4981598 -5460839 -2110821 -1011612
10528 -1011612 -3864119 -5698056 -5072005 -6015630 -8320551 -7040907 -3340100 -4065460 -8698380
10519 -8698380 -9260286 -5178360 -4675432 -8978252 -9773315 -5400419 -4057642 -7360119 -7224479
10510 -7224479 -3021760 -3946498 -9925500 -9820937 -3745012 -5257555 -15001467 -16686822
10502 -16686822 -7630236 -5974736 -16602900 -20255919 -10943753 -10318989 -25679220 -31316912
10494c1316912J3878493J509119k6211676j5126006J6839441j1809387r7339040
10487a49575968j15056933J682993J37401795J42140228L7091087l3713669j4424309
10480E545224J7227648K466044j9253077n365227J5314493O429378j1244978o150835
10472D968670P349093L153845p785395l985892M799298M2591q624835l451567
10464c534192P036771N219003l082488k179419L735356J319125n338610l807499
10456f31953K607100K524516j811693r81080K561579O58880l593758k224574J951033
10447A060050J585246q35775Q27140L463386J400424j734653m72333J240131j542251
10438D991365l600944P38260N234996J918231m300708m112241L89202J139343
$$ plain form
10494 -31316912 -17438419 -15929300 -42140976 -57266982 -40427541 -52236928 -149575968
10487 -149575968 -264632901 -262949908 -125548113 16592115 53683202 19969533 5545224
10480 5545224 22772872 25238916 5985839 620612 15935105 22364483 11119505 4968670
10472 4968670 12317763 15471608 7686213 3700321 8499619 8542210 -82625 -3534192
10464 -3534192 3502579 8721582 5639094 3459675 7195031 8514156 3175546 -631953
10456 -631953 1975147 4499663 2687970 1706890 4268469 4927349 1333591 -890983 1060050
10447 1060050 2645296 1809521 2636661 6100047 7500471 5765818 5293485 6533616 4991365
10438 4991365 1390421 2128681 7363677 9281908 4981200 868959 1258161 2397504
10430B397504j344812j298988M90802Q3337k58627K658763M348584K98175m065344
10421C309394k169150J485356m93812m481027k548255K699211K996226o03177
10413A94766p08861K177950J433875k361149k512722J027922J895578p07626j385524
10404i45791P59573J281596k00119L07356K330067J320097k121209k545114N28859
10395G15315J743771n77265k135478p23871P70588L87369l55385n87425j025752
10386a788133p74825J334409K815506N97482k827887k261943J899047M174283
10378C167939K361100l48105j316528j096282k93244J179762J856246J39654k426124
10369C224418l093682k008197q35841O81389K904419L568280J269677r81560l05431
$$ plain form
10430 2397504 1052692 -246296 244506 327843 69216 2727979 7076563 7374738 3309394
10421 3309394 1140244 2625600 2131788 -2349239 -4897494 -2198283 797943 194766
10413 194766 -514095 1663855 3097730 736581 -1776141 -748219 1147359 439733 -945791
10404 -945791 -186218 1095378 895259 1202615 3532682 4852779 2731570 186456 715315
10395 715315 2459086 1881821 -253657 -977528 -206940 180429 -174956 -762381 -1788133
10386 -1788133 -2562958 -1228549 1586957 2184439 -643448 -2905391 -1006344 3167939
10378 3167939 5529039 5180934 3864406 2768124 2474880 3654642 5510888 5650542 3224418
10369 3224418 130736 -1877461 -2713302 -2031913 872506 4440786 5710463 4728903 4423472
10360D423472R32150m84492k459276j547780K21420j002216l258369j821251K272141
10351b724201L870276K297701J273878J503941L72623j795668k019222o86581
10343B092747q06427j812150o00803J818303J409643j418299k123006J36081J513633
10334B09722N44419k48572q7504p78580j448657P74800M063592K927310k525486
10325C431044n343409k112684J983680J611864j132104j463958O07332J836468
10317e81767J386802Q96178R70455P77136m0805j024776j575512j148934P3974
10308b67249O92188j80431j191584p48108J87347j69608j019986m27964Q90324
10299b235071P87378j98126J64858J379205R91049n78041l64226J863063K954833
$$ plain form
10360 4423472 5355622 4871130 2411854 864074 1085494 83278 -3175091 -4996342 -2724201
10351 -2724201 1146075 3443776 4717654 6221595 6594218 4798550 2779328 2092747
10343 2092747 1286320 -525830 -1126633 691670 2101313 683014 -1439992 -1303911 209722
10334 209722 754141 505569 418065 -360515 -1809172 -1034372 3029220 5956530 3431044
10325 3431044 -1912365 -4025049 -2041369 -429505 -1561609 -3025567 -2418235 -581767
10317 -581767 805035 1701213 2671668 3448804 3407999 2383223 807711 -341223 -267249
10308 -267249 424939 244508 -947076 -1695184 -1507837 -1677445 -2697431 -3125395 -2235071
10299 -2235071 -1447693 -1645819 -1480961 -101756 889293 311252 -52974 1810089 4764922
10290D764922J480615n09090j321680j427869j028108L50151J416841K18605j823734
10281B120653j072029K331082L771455Q04182l296488m293881k122081L59149
10273a397958J099030j9160j594291j412788J229281L722050K967985k04826k203379
10264B185944j836832j008617n48934O97101K293738J853255o68244k040879n54798
10255C71734J511794J665131M33899o65196j600776k565891k564300r61876J197067
10246c178414K593859K958237K425610J149589j07891o04818q96732j827224k567209
10237e4993j682678K19304J158658P44281J76590j92113p82238q83799L33513
10228i63475J449756N37268j167583p66679J300936J526131r94869k922842j790061
$$ plain form
10290 4764922 6245537 5736447 4414767 2986898 1958790 2308941 3725782 3944387 2120653
10281 2120653 1048624 3379706 7151161 7955343 4658855 364974 -1757107 -1397958
10273 -1397958 -298928 -318088 -1912379 -3325167 -2095886 1626164 4594149 4389323 2185944
10264 2185944 349112 -659505 -1208439 -511338 1782400 3635655 2967411 926532 371734
10255 371734 1883528 3548659 3982558 3317362 1716586 -849305 -3413605 -4375481 -3178414
10246 -3178414 -584555 2373682 4799292 5948881 5840990 5236172 4339440 2512216 -54993
10237 -54993 -1737671 -1518367 -359709 384572 561162 369049 -413189 -1296988 -963475
10228 -963475 486281 1023549 -144034 -910713 390223 1916354 921485 -2001357 -3791418
10219c791418O14426J492473Q93220N74850J045298J436829J151106M35131j43072
10210C708843l98687r11839k123111k822893j189285J890279K927557Q14961j085564
10201H10261j25568J438190O19751j037379n45436Q61969O649k317241k789755
10192c078559j343423l49213M69728K774702M555004K442113j592507k220323
10184A657522O28448J634175r15195k674392j143685N09996k07000q94845P10447
10175f94529K511533J932022l2982j312688j787781j729121n98672R14607R79848
10166A82237j07079k52036K66464p99392k557978j344165K647836M428145J719233
10157D183265j719606k316885j212366l89657O23153J734613R65582j255184j385151
$$ plain form
10219 -3791418 -3176992 -1684519 -791299 -216449 828849 2265678 3416784 3851915 3708843
10210 3708843 3310156 2398317 275206 -2547687 -3736972 -1846693 1080864 1895825 810261
10201 810261 684693 2122883 2742634 1705255 1159819 2021788 2028437 -288804 -3078559
10192 -3078559 -4421982 -4771195 -4301467 -1526765 3028239 5470352 3877845 1657522
10184 1657522 2285970 3920145 3004950 330558 -813127 -303131 -510131 -1404976 -694529
10175 -694529 1817004 3749026 3716044 2403356 615575 -1113546 -1712218 -797611 182237
10166 182237 75158 -176878 89586 -709806 -3267784 -4611949 -1964113 2464032 4183265
10157 4183265 2463659 146774 -1065592 -1455249 -832096 902517 1868099 612915 -772236
10148g72236J066928J831108q69497k833168j016393J383842R99441M2949J279019
10139A111993K248829q8952l145577k767659j37724Q61947K83581P29705J785039
10130H81182J128853o43957j156482o08335o67231p36498M77576J476275K58381
10121D09764j622304j445812r5560k82847j596059j509903N7840J247027J932054
10112b905800K898248K776308R742l272381l553689j238131L16197K13984M62864
10103d292658J647579K151517J457300O85432N7293j030803j848191j259041j87376
10094b618948k37017p22024o5529R29145M80930n45767Q0034J870316K302668
10085A473808R46973m14814j083579j584107j387054Q0166J066097k48599k054279
$$ plain form
10148 -772236 294692 2125800 1256303 -1576865 -2593258 -1209416 -209975 -167026 1111993
10139 1111993 3360822 3271870 126293 -2641366 -2779090 -1917143 -1633562 -903857 881182
10130 881182 2010035 1366078 209596 -398739 -1065970 -1802468 -1324892 151383 409764
10121 409764 -1212540 -2658352 -2753912 -3036759 -4632818 -6142721 -6084881 -4837854 -2905800
10112 -2905800 -7552 2768756 2778498 -493883 -4047572 -5285703 -4969506 -4755522 -4292658
10103 -4292658 -2645079 -493562 963738 1649170 1706463 675660 -1172531 -2431572 -2618948
10094 -2618948 -2855965 -3577989 -3643518 -2714373 -2233443 -2779210 -2699176 -828860 1473808
10085 1473808 2420781 2005967 922388 -661719 -2048773 -1968607 -902510 -1151109 -3205388
10076c205388j304628J115063J786683N19009P5477O27702l41478k344718j617624
10067d689902K108346L856620Q50520k872774k456799Q15492K174754M09975j491642
10058a295410j373145j40234P14979J075053J246523R15018q2057q67426m09992
10049b16691P61885P18864j180920k579450r04254K395655L098057L83922j508325
10040I68743K74938K538425J161153k065943k333877L19010J361825n82593j952052
10031c10371p74787L02017o97549j472805J90446K297269K040311L55682k10474
10022A719739J14088m81364j456270p72450J090865J432919l10450j583956p72202
10013a019081M18979p5266j452431j594025m45533L05319L14258J019146K731152
$$ plain form
10076 -3205388 -4510016 -3394953 -1608270 -1089261 -1013784 -386082 -727560 -3072278 -4689902
10067 -4689902 -2581556 1275064 2125584 -747190 -3203989 -2388497 -213743 196232 -1295410
10058 -1295410 -2668555 -2808789 -2093810 -1018757 227766 1142784 1060727 193301 -216691
10049 -216691 545194 1264058 83138 -2496312 -3400566 -1004911 2093146 2477068 968743
10040 968743 1243681 3782106 4943259 2877316 543439 862449 2224274 1641681 -310371
10031 -310371 -1085158 -783141 -1480690 -2953495 -2763049 -465780 1574531 1930213 1719739
10022 1719739 1833827 1352463 -103807 -876257 214608 1647527 1337077 -246879 -1019081
10013 -1019081 -600102 -675368 -2127799 -3721824 -4167357 -3862038 -3547780 -2528634 202518
10004B02518L494083J933429m98400j602562j334145r03568l63957O59234J001671
9995B588303m49650j943501r14188J443287J379428j313653k567137n61532J353403
9986i85240M19598j041508m4371J820273J464982k41011l80585P20123M71664
9977B203925j118911j847392j634938k233038l111424j844468J314462L190641
9969e081143K552037J611115J807741J475349p99478l178040k872700j480K419817
9960b066782J863815j006747k969620j797491R19368J732600K21352m03514J453172
9951b053847K898710J174591j662970j933988l1659Q01445j31167p11551k01925
9942a852361J33838J46869R32289J971573J400480q19749k686272k863724j356191
$$ plain form
10004 202518 3696601 5630030 5131630 3529068 2194923 1291355 927398 1586632 2588303
9995 2588303 2138653 195152 -719036 724251 2103679 790026 -1777111 -2338643 -985240
9986 -985240 -565642 -1607150 -1651521 168752 1633734 1392723 1012138 1732261 2203925
9977 2203925 1085014 -762378 -2397316 -4630354 -7741778 -9586246 -8271784 -5081143
9969 -5081143 -2529106 -917991 889750 2365099 1565621 -1612419 -4485119 -4486599 -2066782
9960 -2066782 -202967 -1209714 -4179334 -5976825 -5057457 -3324857 -3103505 -3507019 -2053847
9951 -2053847 844863 2019454 356484 -1577504 -1609163 -807718 -938885 -1650436 -1852361
9942 -1852361 -1718523 -1571654 -639365 1332208 2732688 1912939 -773333 -3637057 -4993248
9933d993248J473093M017528L255317j211317m683867k922754J416842K489320
9925a159086K8840r58702J341188L230999K130854l6111j284640k295411l159443
9916b161512k136456M86976J569568L4314j281838m23735Q71538Q86326O19874
9907a534945Q77046L22395j475667k335544q17916J541810K879994L064862K097536
9898D619571k86782k457507j903514N43720J217452o78445j917528q47700L09458
9889a401275J22126K58340J403195J492293p5344j006906o33114j044582k177184
9880c062451j274109J070657P20130k037941j790121J671956J044932n339114
9872h996061p347956J845753J2574460J1177482J10423o091312j942674L701487
$$ plain form
9933 -4993248 -3520155 497373 3752690 2541373 -2142494 -5065248 -3648406 -1159086
9925 -1159086 -1130246 -2088948 -747760 2483239 4614093 4577982 3293342 997931 -2161512
9916 -2161512 -4297968 -3810992 -2241424 -2207110 -3488948 -3912683 -3041145 -2154819 -1534945
9907 -1534945 -657899 -335504 -1811171 -4146715 -4964631 -3422821 -542827 2522035 4619571
9898 4619571 4332789 1875282 -28232 515488 1732940 1054495 -863033 -1710733 -1401275
9889 -1401275 -1279149 -1020809 382386 1874679 1799335 792429 159315 -885267 -3062451
9880 -3062451 -4336560 -3265903 -2545773 -4583714 -6373835 -4701879 -3656947 -8996061
9872 -8996061 -16344017 -14498264 -1923804 9253678 9364101 3272789 1330115 5031602
9864E031602K995814j317920l455862k562523l88110J952309K563808o6325l106733
9855A646060k163573J413842K134039m33708j134314J241050J742880j347091
9847C099185k876629L8846K730072J231171j028846n6281J317416r48038m113614
9838f06718l101440O77857J829370m1667n76508J314172K103102L32524j045587
9829H85105q139J436099R24655r09149k145302k071497r25686P58894J772616
9820b82404R80669r41301j971108j216794L80101J733513K487564K276287P76598
9811D223125j233816k206527j519503L3025J326646J593833M73067j430093k401944
9802a142187j344929O03384J411930P96503J71410K88608N28814N02086O64540
$$ plain form
9864 5031602 8027416 6709496 3253634 691111 303001 2255310 4819118 4752793 1646060
9855 1646060 -517513 896329 3030368 2596660 1462346 2703396 4446276 3099185
9847 3099185 222556 261402 2991474 4222645 3193799 3137518 4454934 3506896 -606718
9838 -606718 -3708158 -3030301 -1200931 -1242598 -1819106 -504934 1598168 1930692 885105
9829 885105 876966 2313065 3237720 2328571 183269 -1888228 -2813914 -2055020 -282404
9820 -282404 698265 -243036 -2214144 -3430938 -3050837 -1317324 1170240 3446527 4223125
9811 4223125 2989309 782782 -736721 -703696 622950 2216783 2689850 1259757 -1142187
9802 -1142187 -2487116 -1883732 -471802 324701 496111 784719 1313533 1815619 2480159
9793B480159J001921O47883n43793j340031q79657p3801k54207j088779r96704
9784a047009M98246J907187J688374K94482n09705j05349L23870q7683m03821
9775B558592L49286J032056n4210j920608j658369J103264L017090J566748j435381
9766D558468k742734k125699j508591j165749J74094K042843K251095N09429p88993
9757A204163k17740P33849M87093j33924J94092P96622L28406p65154j129439
9748A497968q96477j119328j400576l41384J630014K115448J90573j810868j264136
9739a398766J119118K186597N16286j787043j865660L48599K255020J865557p1788
9730C167920j475235j496621q51325k13757M12049P62728J83744j023821j334679
$$ plain form
9793 2480159 3482080 4129963 3586170 2246139 1366482 1292681 1038474 -50305 -1047009
9784 -1047009 -548763 1358424 3046798 3341280 2831575 2726226 3050096 2962413 2558592
9775 2558592 2907878 3939934 3885724 1965116 306747 1410011 4427101 5993849 4558468
9766 4558468 1815734 -309965 -1818556 -2984305 -2810211 -767368 1483727 1993156 1204163
9757 1204163 986423 1720272 2207365 2073441 2267533 3064155 3392561 2627407 1497968
9748 1497968 601491 -517837 -1918413 -2259797 -629783 1485665 1676238 -134630 -1398766
9739 -1398766 -279648 1906949 2423235 636192 -1229468 -880869 1374151 3239708 3167920
9730 3167920 1692685 196064 -655261 -869018 -456969 305759 489503 -534318 -1868997
9721a868997K9727J755437K014833O74684r57239j788310j382071K47146J958029
9712F83239J657952j027926l133372j678660J891764L269989J245034r10158o38153
9703A359709N37612L90873k81051K32182J041469K44796j413248j510718J10941
9694G12565J170698N29218m85140m47958M47258J201314R91334n00337k315511
9685A303441k344713Q2220K441061J882711p95425k318992j459858J81115J360847
9676C32407K129532J802467n53619l205040k842848M34918K585445J351952p81320
9667A253894r81221m4027K03098L00795J193869J553433J15359j469678j175930
9658I49592p6307j86968o96537K22761J433544N11304j611141j691968M91875
$$ plain form
9721 -1868997 -1839270 -83833 1931000 2605684 1648445 -139865 -1521936 -1274790 683239
9712 683239 2341191 1313265 -1820107 -3498767 -1607003 1662986 2908020 1997862 1359709
9703 1359709 1897321 2288194 2007143 2239325 3280794 3525590 2112342 601624 712565
9694 712565 1883263 2412481 1927341 1479383 1926641 3127955 4119289 3618952 1303441
9685 1303441 -1041272 -959052 1482009 3364720 2569295 250303 -1209555 -1028440 332407
9676 332407 2461939 4264406 3710787 505747 -2337101 -1902183 683262 2035214 1253894
9667 1253894 272673 228646 431744 732539 1926408 3479841 3595200 2125522 949592
9658 949592 873285 686317 -10220 212541 1646085 2157389 546248 -1145720 -653845
9649f53845J788271P93245m30256l44251n6092m06757k60125Q31152J169382j13140
9639B317584j089486o820J740062J611868n02309k489017k738058j263220Q89751
9630a529645K161079J451205l69585j083165j91523J73237j351807k847387j936816
9621e524407M14267J443503R35159J073361K219738K070565j45484j619567j0780
9612H56355K626313K480643o01068k992037k318399j05279J054978P24718m0965
9603A685259p28110j254181j153034m36866k36021j017994j249214K90968J942605
9594b156588J380853l71254k49561J660574J873238o83767k411545o86704J678555
9585C3801Q17764j962460k308673K92986K021658Q59072q47824p46346J56659
$$ plain form
9649 -653845 1134426 1927671 1497415 1153164 1097072 690315 430190 1261342 2430724 2317584
9639 2317584 1228098 1221278 2961340 4573208 4070899 1581882 -1156176 -2419396 -1529645
9630 -1529645 631434 2082639 1713054 629889 438366 611603 -740204 -3587591 -5524407
9621 -5524407 -5110140 -3666637 -2731478 -1658117 561621 2632186 2486702 867135 856355
9612 856355 3482668 5963311 5362243 2370206 51807 -53472 1001506 1726224 1685259
9603 1685259 957149 -297032 -1450066 -1886932 -2122953 -3140947 -4390161 -4099193 -2156588
9594 -2156588 -775735 -1146989 -1396550 264024 2137262 1453495 -958050 -1644754 33801
9585 33801 851565 -1110895 -3419568 -3126582 -1104924 -245852 -1093676 -1840022 -1683363
9576a683363J02831k29787O69717K104900K003803O4921j762519j847374o60474
9567a237345K00347k7593o74789p13185N187P87830J107873J046428Q21498N80553
9557A896804O34103R70788N97742j254486l157767k644709L9954J601768L32539
9548i83264j349627q85416M26228J90839n82912N45831K486924J932820q36225
9539I45198j869696K17482K062787R25403j356705j651115N7771J548764J552211
9530B432100L12368j356880k204949j249674O34149J333584L30655q12724j117664
9521a699035j105923p43333P45023K356205J768552n74593j224677Q35700K115134
9512B473053K74159j744300m61413K379658K711951M71118j175356j331249j777147
$$ plain form
9576 -1683363 -1580532 -1810319 -1140602 964298 2968101 3033022 1270503 -576871 -1237345
9567 -1237345 -1036998 -1064591 -1739380 -2452565 -2447378 -1659548 -551675 494753 1316251 1896804
9557 1896804 2530907 3501695 4099437 2844951 -312816 -2957525 -2917571 -1315803 -983264
9548 -983264 -2332891 -3218307 -2792079 -2601240 -3184152 -2638321 -151397 1781423 945198
9539 945198 -924498 -707016 1355771 2281174 924469 -726646 -668875 879889 2432100
9530 2432100 2744468 1387588 -817361 -2067035 -1432886 -99302 231353 -581371 -1699035
9521 -1699035 -2804958 -3548291 -2803268 -447063 1321489 746896 -477781 357919 2473053
9512 2473053 2747212 1002912 541499 2921157 5633108 6104226 4928870 3597621 1820474
9503A820474k699261k252995l52323Q78167P90662J003159J973486J932290J25155
9494C218814j619206j666766o88536O1880O33216J427692J920393J416475J01330
9485D805292j283392k023270j616275l67384L74825k16601r60100k11155J447697
9476e0363J850151M61875r62737j097428n53696l09285l52195m07749n50919o16249
9466b588595k31824L09178M03698L61299R31799J733321J672178P98991J28300
9457C518345j69036n98089p23223J05791P25666n17968k485307k319432j58011
9448b621264O44829j006655j901522J50221K410826J498407j171031j673339M61665
9439c207863K097110J419030j90790r69343p66601j31272N06168O47243K74770
$$ plain form
9503 1820474 -878787 -3131782 -3484105 -2605938 -1815276 -812117 1161369 3093659 3218814
9494 3218814 1599608 -67158 -755694 -693814 -60598 1367094 3287487 4703962 4805292
9485 4805292 3521900 1498630 -117645 -485029 -110204 -326805 -1286905 -1498060 -50363
9476 -50363 1799788 2261663 1298926 201498 -352198 -661483 -1013678 -1421427 -1972346 -2588595
9466 -2588595 -2820419 -2511241 -2107543 -1746244 -814445 918876 2591054 3390045 3518345
9457 3518345 3349309 2751220 2027997 2133788 2859454 2341486 -143821 -2463253 -2621264
9448 -2621264 -1976435 -2983090 -4884612 -4734391 -2323565 -825158 -1996189 -3669528 -3207863
9439 -3207863 -1110753 308277 117487 -851856 -1618457 -1749729 -1243561 -596318 -321548
9430c21548K99705J084482J290703j56836j916283k021320q76471k05366K7948
9421b794986R40208J741083O45224j429858j513667O51011J899318O37398p86375
9412a0644j88123J074181Q35790m05817j019904j038652j121053o76751O18103
9403a932870J236929J84899p66534J54504J457961R02542l69891J88092J635085
9394B690717P95266k040951l102947j222975M79635J13723j68516J167484J734414
9385D45850m68919k893327k167456N41006J640652P49069L70065J142498J264989
9376F24427J56570q52412j312233j842865j661041O07748L416698L248953l1838
9367B354007k258766q13307J798319K099777M69464o18304q20113j495134k493407
$$ plain form
9430 -321548 -21843 1062639 2353342 2196506 280223 -1741097 -2617568 -2822934 -2794986
9421 -2794986 -1854778 -113695 531529 -898329 -2411996 -1760985 138333 775731 -10644
9412 -10644 -198767 875414 1711204 1305387 285483 -753169 -1874222 -2550973 -1932870
9403 -1932870 -695941 -511042 -1277576 -1123072 334889 1237431 867540 1055632 2690717
9394 2690717 3485983 1445032 -1657915 -2880890 -2401255 -2287532 -2456048 -1288564 445850
9385 445850 -23069 -2916396 -5083852 -4542846 -2902194 -2153125 -1783060 -640562 624427
9376 624427 780997 -71415 -1383648 -3226513 -4887554 -4279806 -863108 2385845 2354007
9367 2354007 95241 -718066 1080253 3180030 3649494 3031190 2211077 715943 -1777464
9358a777464k249785n59990J025514J430386R97223M03724Q423M2644L42710K46806
9348h9809l33937l85410O78903J750065J474271K38264n73575o37826o38982p10748
9338G71216l82324K08749L57565p5645n67838p52323n80567j34828P7928n19385
9328a597452j228043l89467J873872K892086J161413q95944m05037J206720L46761
9319B964909k525050k896047Q46941M330165L084461j359857l877006k424776
9311a856260L60440J365092L51359q72353q92265J13390Q31326L57234m95502
9302g37539j1138J925682L104268J643359j387073l081907k020567M89012K176211
9293B100308J905559K05317j403286j557136k05751J220325J162192m70119k227004
$$ plain form
9358 -1777464 -4027249 -4587239 -3561725 -2131339 -1134116 -730392 -721969 -679325 -336615 -89809
9348 -89809 -423746 -809156 -130253 1619812 3094083 3332347 2758772 2120946 1481964 771216
9338 771216 388892 597641 955206 879561 311723 -440600 -1021167 -1155995 -1078067 -1597452
9328 -1597452 -2825495 -3214962 -1341090 1550996 2712409 1816465 1411428 2618148 2964909
9319 2964909 439859 -2456188 -1609247 2720918 5805379 4445522 568516 -1856260
9311 -1856260 -1495820 -130728 220631 -651722 -1543987 -1430597 -599271 -242037 -737539
9302 -737539 -748677 1177005 4281273 5924632 4537559 1455652 -564915 -75903 2100308
9293 2100308 4005867 4211184 2807898 1250762 1045011 2265336 3427528 2957409 730405
9284G30405k581331j374531M6997J65650r85061j652792m80490J508002K086802
9275b536349R57985K20864J138736K049626R06963j299581j699621K73791K035516
9266B047930J580294L6843n87330m82907j066619k015151j560368L89247J682775
9257B4714J085310j5748j35076q745p43195j355199m74466P37116K05528j177617
9247a857378n61538J923405K787453O83113j263938m28586J292161R64939p28682
9238B810949j430246j342140j984059k495772j026887J333055J902944R54780
9230a277376R66542J798235Q98111j541255k129107N0922J613894L80834j232936
9221d72136n85899Q94243N60044j002626j341605j45783Q06838N54730k94762
$$ plain form
9284 730405 -1850926 -3225457 -3178460 -3012810 -3997871 -5650663 -6131153 -4623151 -2536349
9275 -2536349 -1578364 -1357500 -218764 1830862 2737825 1438244 -261377 12414 2047930
9266 2047930 3628224 3665067 3077737 2594830 1528211 -486940 -2047308 -1658061 24714
9257 24714 1110024 1094276 959200 950455 207260 -1147939 -1622405 -885289 -679761 -1857378
9247 -1857378 -2418916 -495511 2291942 2975055 1711117 1282531 2574692 3539631 2810949
9238 2810949 1380703 38563 -1945496 -4441268 -5468155 -4135100 -2232156 -1277376
9230 -1277376 -310834 1487401 2385512 844257 -1284850 -1233928 379966 760800 -472136
9221 -472136 -1058035 -163792 396252 -606374 -1947979 -2093762 -1286924 -732194 -1026956
9212a026956q50161n65240M40189R19114j56057j380796l44001K211807K742056
9203A989955M90634r26368N38566J752551k48176k950573k423978K34948J104742
9194d37699k7838j95900J037904J345722M76917M87100J202408K31644k017437
9185B102821k064719P18989K372069M17108k251386k011355J77239R53477k88429
9176A25814j333234q34332M63285J434813J558159O86993o68503j252882m17666
9167b37553Q31588J071092L43429o0610N06309J125678M69077j385880k681993
9158a8863j939727M3786J096916N74130r9088r9926l77706j182148q70499R80278
9148a892847J784192m7584j702142j23847K467466J686901j707024k797175m95529
$$ plain form
9212 -1026956 -1877117 -2442357 -2002168 -1083054 -1239111 -2619907 -2963908 -752101 1989955
9203 1989955 2480589 1554221 2092787 3845338 3597162 646589 -1777389 -1542441 -437699
9194 -437699 -465537 -661437 376467 1722189 2199106 2686206 3888614 4120258 2102821
9185 2102821 38102 757091 3129160 3546268 1294882 -716473 -539234 414243 125814
9176 125814 -1207420 -2041752 -1578467 -143654 1414505 2101498 1432995 180113 -237553
9167 -237553 594035 1665127 2008556 1947946 2454255 3579933 4049010 2663130 -18863
9158 -18863 -1958590 -1914804 -817888 -243758 -342846 -442772 -820478 -2002626 -2873125 -1892847
9148 -1892847 -108655 -156239 -1858381 -1982228 485238 2172139 465115 -2332060 -2827589
9139b827589J016718l27786j285118M31481J924705M03322j650149o06445K221044
9130f99817K837848P75219j021329j177805j007349j274947j140278k87905M16412
9121b579951N07198L68444K44769J62193L49932N82175n9655j596622k422356
9112d443873j464236J15134P42043O51165Q05380J017970Q55851J019538J907672
9103A206644K091941L19482k036856k675583j625074o76842l60505K56997J245432
9094b254364J527180Q52683K12867K28649N68543Q82539J068591P88763j91408
9085C684043j375647j997627j703924m28359J411098K274497P25659k014494k775580
9076b200334q00063R01523J43222j001551K75473K787457L153724Q65356j419810
$$ plain form
9139 -2827589 -1810871 -2138657 -3423775 -2992294 -1067589 -664267 -2314416 -2920861 -699817
9130 -699817 2138031 2913250 1891921 714116 -293233 -1568180 -2708458 -2996363 -2579951
9121 -2579951 -2072753 -1704309 -1459540 -1297347 -947415 -365240 -424895 -2021517 -4443873
9112 -4443873 -5908109 -5792975 -5050932 -4399767 -3594387 -2576417 -1720566 -701028 1206644
9103 1206644 3298585 3618067 1581211 -1094372 -2719446 -3396288 -3756793 -3499796 -2254364
9094 -2254364 -727184 125499 338366 567015 1135558 2018097 3086688 3875451 3684043
9085 3684043 2308396 310769 -1393155 -1821514 -410416 1864081 2589740 575246 -2200334
9076 -2200334 -3000397 -2098874 -1955652 -2957203 -2681730 105727 3259451 4124807 2704997
9067B704997j725019l49447J485608K306043P83094k340218m011769k679971n96162
9058d422844j7849M42633K474247L711433J181318k789170l226530j07870J896270
9049h58362R12957k25022J61300K05926r66712j335623j70454M19331k55243p3967
9039b185869J318427J139449j215556k178759r4546J305744q99657l347605j606361
9030g764733K381859L164753J73395j839547k04782K347209K381505L12171j056675
9021a04845m80335O31911M31434q77707j259125J35512J213620j33500k245080
9012b688115j647884J397412K796861P28321j846994k122672j154041o68560J38976
9003e066696K012724L148688K210058Q86909O14961j64809k393419l382858j155310
$$ plain form
9067 2704997 979978 630531 2116139 4422182 5205276 2865058 -1146711 -3826682 -4422844
9058 -4422844 -4440693 -3998060 -1523813 2187620 3368938 579768 -2646762 -2754632 -858362
9049 -858362 54595 -170427 -9127 196799 -769913 -2105536 -2275990 -1856659 -2111902 -2185869
9039 -2185869 -867442 272007 -943549 -3122308 -3216854 -1911110 -2810767 -6158372 -7764733
9030 -7764733 -5382874 -2218121 -2044726 -3884273 -4089055 -1741846 639659 951830 -104845
9021 -104845 -585180 46731 478165 -399542 -1658667 -1523155 -309535 -443035 -2688115
9012 -2688115 -4335999 -2938587 -141726 586595 -1260399 -3383071 -4537112 -5205672 -5066696
9003 -5066696 -3053972 94716 2304774 3191683 3806644 3641835 1248416 -2134442 -3289752
8994c289752J379461Q60918q46209k05661J475443O34367j553249r82514J723957
8985h03239J902400q98392j905099O47179K534222Q01963j622128j334754L22544
8976c55304O04780n5451r4498j63182j165610j655706l20959J192100Q54719l69808
8966a528919n27544j16620o09743j244615m37415Q38065L40636j399009j505005
8957f190169P13654K481333J516162q66372j678514J1636K293997K760418R21931
8948A964076j567248k697566j896413p1585J580372K245386J501244k67306j641346
8939h50386j486730m30190Q2020p6269P0260N68620O05713N00449J372973K547253
8929B903713J801672r61267k794048j759868L66309J027271L89174N1437J60924
$$ plain form
8994 -3289752 -1910291 -1049373 -1895582 -2101243 -625800 8567 -1544682 -2527196 -803239
8985 -803239 1099161 200769 -1704330 -1057151 1477071 2279034 656906 -677848 -355304
8976 -355304 249476 194025 99527 -63655 -1229265 -2884971 -3205930 -2013830 -1159111 -1528919
8966 -1528919 -2056463 -2173083 -2782826 -4027441 -4464856 -3626791 -3286155 -4685164 -6190169
8957 -6190169 -5476515 -2995182 -1479020 -2345392 -4023906 -4012270 -1718273 1042145 1964076
8948 1964076 396828 -2300738 -4197151 -4268736 -2688364 -442978 1058266 790960 -850386
8939 -850386 -2337116 -2767306 -2685286 -2761555 -2691295 -2122675 -1516962 -1016513 356460 2903713
8929 2903713 4705385 3744118 950070 -809798 -443489 583782 972956 1024393 1185317
8920A185317j6420j36275L96558P84520R6644q35206p47210j46477j64503k60002
8910A56946O65132J711159J026888j029572k184403j565422n12104p6042J87779
8901a619639P62420J355782J739961J858314J204692l43464j480866j081979k70677
8892B124544o75668j308054p8064J971133J584706j141238k132951K91841K411945
8883C048194R14969j921561k282809j015454j414996k821416j491052K583828
8875d400297M681314K138652j969783l518440k277825l53674J204832J959241
8867b535980R56590j230989j551380J393678M037748K195869k402929l919251
8859c056644o33155K736311J986971j097114k376497j347900m41976l22875N54937
$$ plain form
8920 1185317 1168897 1032622 1429180 2213700 2310344 1475138 727928 581451 416948 156946
8910 156946 822078 2533237 3560125 2530553 346150 -1219272 -1731376 -1807418 -1619639
8901 -1619639 -857219 498563 2238524 4096838 5301530 4958066 3477200 2395221 2124544
8892 2124544 1448876 140822 62758 2033891 3618597 2477359 344408 636249 3048194
8883 3048194 3963163 2041602 -241207 -1256661 -2671657 -5493073 -6984125 -4400297
8875 -4400297 281017 2419669 449886 -3068554 -5346379 -5700053 -4495221 -2535980
8867 -2535980 -1579390 -2810379 -4361759 -2968081 1069667 3265536 862607 -3056644
8859 -3056644 -3689799 -953488 1033483 -63631 -2440128 -3788028 -4230004 -4552879 -3997942
8850c997942K276045K661609P35427j475966j703803l17272P38277P05523M12869
8841C4767N00067N25931l5293p24747n78926M22096R23983k13663k021610k084737
8831c252132L65724K954859K857252L99349j439690r35109N64895R98905J48204
8822B662257r69913j851003k392974k045670n67432R34101J242988R83978J619221
8813c84447K556463J445788j812539l614533j235205K675816L036574o85788l629715
8804a647586k346894P49582J581079J91129o28579m25753r55840j891037r00007
8795f273906J698103K507310N25099q52238O92526K552884J665060l77428l11821
8786A825589J145740Q44254j134918j778735n05752J00563r31715j521689n84099
$$ plain form
8850 -3997942 -1721897 939712 1675139 199173 -1504630 -1821902 -1083625 -378102 34767
8841 34767 534834 1060765 1025472 300725 -278201 143895 1067878 854215 -1167395 -3252132
8831 -3252132 -2886408 68451 2925703 3325052 1885362 950253 1515148 2514053 2662257
8822 2662257 1692344 -158659 -2551633 -4597303 -5164735 -4230634 -2987646 -2003668 -384447
8813 -384447 2172016 3617804 1805265 -1809268 -3044473 -368657 2667917 1982129 -1647586
8804 -1647586 -3994480 -3244898 -1663819 -1472690 -2101269 -2527022 -3482862 -5373899 -6273906
8795 -6273906 -4575803 -2068493 -1543394 -2395632 -1703106 849778 2514838 2137410 1825589
8786 1825589 2971329 3815583 2680665 901930 396178 496741 -434974 -1956663 -2540762
8777b540762K13035j65451l88787K62995M04198m23547l27841J437056K476685
8768I47581J032124q80054p15709M77905J56003j246371j161964P24688K020360
8759A354563J316858k11242r70296o77182J46318P14277M2311j972205l598817
8750c855415k890204k66008J841937J956009R58507M39514P14825Q31339K6397
8741b43099j063219q65996R40785K208251P89273j943948k385018J3665J626221
8732i23085K24401j520611o31296J106879L58624j802638j683582O11853J510360
8723b749095L66309L38462K142540K137588j324317m261945k823117R04421K271813
8714b997341N86866j243946j599955j151663k98204J047588J876395J257448M88485
$$ plain form
8777 -2540762 -2327727 -2493178 -2881965 -2618970 -2214772 -2638319 -2966160 -1529104 947581
8768 947581 1979705 1099651 383942 861847 1017850 -228521 -1390485 -665797 1354563
8759 1354563 2671421 2460179 1489883 812701 959019 1673296 1715607 -256598 -3855415
8750 -3855415 -6745619 -7011627 -5169690 -3213681 -2255174 -1815660 -1100835 -269496 -243099
8741 -243099 -1306318 -2172314 -1231529 976722 1765995 -177953 -2562971 -2549306 -923085
8732 -923085 -698684 -2219295 -2850591 -1743712 -1385088 -3187726 -4871308 -4259455 -2749095
8723 -2749095 -2382786 -2044324 98216 2235804 911487 -3350458 -6173575 -5269154 -2997341
8714 -2997341 -2410475 -3654421 -5254376 -6406039 -6704243 -5656655 -3780260 -2522812 -2034327
8705b034327J290529K510500J638136q11479j761141n28224J71203j002657j689870
8696b217330J9913K134008J893559R2539n82740r775l25664j858059k502714j360524
8686d716787j48158j27578j20958R83621J800600N26209j833899k514496p85114
8677f936560J265739J694919P35638l42522q46565o66638M7125O78413O35947
8668c734504L72843Q07042J554873J249513O731k73981J076200K124968J286515
8659D470200l15613j136627j761064k776310k237222J240401M388481K789554
8651D661800j910774l317135K75574L021185N61210l142958k273461J568180K299765
8642A743386o63287j871624Q38069K852979N11120l047106l078609l58325R47407
$$ plain form
8705 -2034327 -743798 1766702 3404838 2593359 832218 303994 475197 -527460 -2217330
8696 -2217330 -2197417 -63409 1830150 1922689 1339949 1330174 1004510 -853549 -3356263 -4716787
8686 -4716787 -4864945 -4992523 -5113481 -4129860 -2329260 -1803051 -3636950 -6151446 -6936560
8677 -6936560 -5670821 -3975902 -3240264 -3582786 -4429351 -5095989 -5048864 -4370451 -3734504
8668 -3734504 -3361661 -2554619 -999746 249767 256498 -17483 1058717 3183685 4470200
8659 4470200 4154587 3017960 1256896 -1519414 -3756636 -2516235 1872246 4661800
8651 4661800 2751026 -566109 -290535 2730650 3291860 148902 -2124559 -556379 1743386
8642 1743386 1080099 -791525 46544 2899523 3410643 363537 -2715072 -3073397 -2125990
8633b125990M2424j77317J450580K635476J623264k41714q93817l17730J22277
8624B117453k53017r08027q44635M42009K098248K217755N6757k355939k252729
8615C17875K77843K270555J641407n66627k039845j791702m20639Q26485P62240
8606A277592o34001j540782l30026J578285J132858j605925k993469j284599O48559
8597c751508L03794j22886K000605M039527J703747l153998m181777j28871L095677
8588a95690J641805o83595O28322L102765J528507l145222m808082j196775L155138
8579B7173L503391M00411k541878l201323j725073Q06411K744270K492427L32768
8570B838577j366041r20729N42875P50626o90776k018822j716443k56250O24404
$$ plain form
8633 -2125990 -2083566 -2260883 -810303 1825173 3448437 3206723 2312906 1995176 2117453
8624 2117453 1864436 956409 111774 553783 2652031 4869786 4926543 2570604 317875
8615 317875 595718 2866273 4507680 3941053 1901208 109506 -311133 515352 1277592
8606 1277592 643591 -897191 -1227217 351068 1483926 -121999 -3115468 -4400067 -3751508
8597 -3751508 -3447714 -3570600 -1569995 2469532 4173279 1019281 -3162496 -3291367 -195690
8588 -195690 1446115 762520 1390842 4493607 6022114 2876892 -1931190 -3127965 27173
8579 27173 3530564 3930975 1389097 -1812226 -3537299 -2730888 13382 2505809 2838577
8570 2838577 1472536 551807 1094682 1845308 1154532 -864290 -2580733 -2836983 -2212579
8561b212579o3050j444443j724942k66421J600922K125953J064473m12816j193607
8552b526510q58393N87562K498801L415033K365523L36020p44276n18915m49539
8543D105306j388089k321525k076703r99577j44953J81436K24497K262l68832
8534b786178k95701M41227J095135J087880J035434J580681J906951Q46597r35336
8525C976690j540783o29679J52205o9430j07415Q41888J331751j9548j784681
8516B150998j610950l0658K78874j103653j580770J81297K055149J896716N98974
8507B835977j29082n92663j377795j114531R86015K315470K75771k899339k913866
8498b614043j69119R51133n58206r50059J258269K376042O1264k295914j216064
$$ plain form
8561 -2212579 -2275629 -3720072 -5445014 -5711435 -4110513 -1984560 -920087 -1332903 -2526510
8552 -2526510 -3384903 -2797341 -298540 3116493 5482016 5818036 5073760 4554845 4105306
8543 4105306 2717217 395692 -1681011 -2680588 -2825541 -2644105 -2419608 -2417346 -2786178
8534 -2786178 -3081879 -2640652 -1545517 -457637 577797 2158478 4065429 4912026 3976690
8525 3976690 2435907 1806228 1958433 1889003 1781588 2623476 3955227 3935679 2150998
8516 2150998 540048 509390 788264 -315389 -1896159 -1714862 340287 2237003 2835977
8507 2835977 2706895 2114232 736437 -378094 607921 2923391 3199162 299823 -2614043
8498 -2614043 -2783162 -1832029 -2390235 -3340294 -2082025 294017 355281 -1940633 -3156697
8489c156697J154210J166452j17786L66925J651114P13790j441559j263469Q04807
8480a22213Q75153j423582k106349K09396J781307o869k454592k120040O9600
8471e298189J100806N40162J15084M79824Q48694O90672L3478r25546j370340
8462c785355k60537J893036L026100K128521M36258n98207q69420o11105K05242
8453A564533P78538o5148j495581j115571J152155K195061K80097k085298j964441
8444g55655l38342l2913j127522j400332k63708P20263Q62307J161708J917099
8435G42905J849173L12995j307392j395675l27704J01018q02798j582091o24755
8426c034324J275869J624963j77399j609825o83049R10000N54308q75553n86105
$$ plain form
8489 -3156697 -2002487 -836035 -953821 -586896 1064218 1778008 336449 -927020 -122213
8480 -122213 752940 -670642 -2776991 -2567595 -786288 -793157 -3247749 -5367789 -5298189
8471 -5298189 -4197383 -3657221 -3542137 -3062313 -2213619 -1522947 -1489469 -2415015 -3785355
8462 -3785355 -4045892 -2152856 873244 3001765 3438023 2839816 1970396 1359291 1564533
8453 1564533 2343071 2277923 782342 -333229 818926 3013987 3294084 1208786 -755655
8444 -755655 -1093997 -1126910 -2254432 -3654764 -3918472 -3198209 -2335902 -1174194 742905
8435 742905 2592078 2905073 1597681 202006 -125698 -24680 -827478 -2409569 -3034324
8426 -3034324 -1758455 -133492 -310891 -1920716 -2603765 -1693765 -1139457 -2015010 -2601115
8417b601115J048506R79671q97717j057881J574610L238158J188155j971947k597800
8408a097360j262087n61647o00202r2862M53684J83085M42383K360348L718241
8399C543583J896071j580194l072394k070214p95117M5369J160945J510349l99692
8390B38706k631727j717230J536622K533209k35824k960828k267248N34523K401336
8381b568461K533841J757362N47582p15516j436399j785171k334314k442973j072405
8372g516454Q10402J221501N58639J019742K454522K230146j14651j668749p58565
8363a763467O85853P94252M22090N24848K12298p03212n41030P71007M72449k282470
8353a407382l903809j656807J784084K644962J863794K354538L103200J099013
$$ plain form
8417 -2601115 -1552609 -572938 -1470655 -2528536 -953926 2284232 3472387 1500440 -1097360
8408 -1097360 -2359447 -2921094 -3521296 -3614158 -3160474 -2977389 -2535006 -174658 3543583
8399 3543583 5439654 3859460 787066 -1283148 -2078265 -2032896 -871951 638398 238706
8390 238706 -2393021 -4110251 -2573629 -40420 -276244 -3237072 -5504320 -4969797 -2568461
8381 -2568461 -34620 1722742 2270324 1554808 118409 -1666762 -4001076 -6444049 -7516454
8372 -7516454 -6706052 -5484551 -4925912 -3906170 -1451648 778498 663847 -1004902 -1763467
8363 -1763467 -1077614 -283362 138728 663576 875874 172662 -368368 402639 875088 -1407382
8353 -1407382 -5311191 -6967998 -5183914 -2538952 -675158 1679380 4782580 5881593
8345E881593k398688k976583j86808J556667j36974k410290k114916o8100J332934
8336a521165J479624P57775p95836k250242j720881O15829J782632K04444j576793
8327c024613o16746J963811K800173J128707q85879j746642j869948j652709q07162
8318d711008L32584R21625J098810J533025J612121J84776j849390k018576J74677
8309b721356K392579K802276K058750J141788l37500k332263l198463k078020
8301b272209m10735O19468J849502L388318K909323l67089k728906r61152K035853
8292D062373J411961j675797k061878M42787Q34346j898834k710521K96047J958914
8283F59398q67120l232074m28049L590133K707840j207657k059759J26605N14169
$$ plain form
8345 5881593 3482905 506322 319514 1876181 1739207 -671083 -2785999 -2854099 -1521165
8336 -1521165 -41541 716234 -79602 -2329844 -4050725 -3434896 -1652264 -1447820 -3024613
8327 -3024613 -3641359 -1677548 1122625 2251332 1365453 -381189 -2251137 -3903846 -4711008
8318 -4711008 -4378424 -3456799 -2357989 -824964 787157 971933 -877457 -2896033 -2721356
8309 -2721356 -328777 2473499 4532249 5674037 5336537 3004274 -194189 -2272209
8301 -2272209 -2682944 -2063476 -213974 3174344 6083667 5716578 2987672 2026520 4062373
8292 4062373 5474334 3798537 1736659 2179446 3013792 1114958 -1595563 -1299516 659398
8283 659398 -207722 -3439796 -3867845 -277712 2430128 1222471 -837288 -710683 -196514
8274a96514j201434r66576J158394R06009j724255j875901J249350K590588K04284
8265A43945j381520M97183J962267j76424k795140k169571J37915J263277J879580
8256f38488K840643J931103j407622k815911L75543L571960J587482k873904l553034
8247i82228m34721J315276J84040n21709N66840J128891J50717o12088m08494
8238C86524k30094J64961J683046K652331O00253k890967l616221j099123R41011
8229a408279O73114J66159P71462R89947l607p54432o23428q79782j687828j445630
8219d202304k921Q30800O70175R78665J616147P92413r22693p35027J273564J593568
8209A892387p49428k183506n07526J567332J269575M1031O8608L26126o72682
$$ plain form
8274 -196514 -1397948 -2364524 -1206130 -300121 -2024376 -3900277 -2650927 -60339 143945
8265 143945 -1237575 -740392 1221875 1045451 -1749689 -3919260 -3781345 -2518068 -638488
8256 -638488 2202155 4133258 2725636 -90275 285268 3857228 5444710 2570806 -982228
8247 -982228 -1416949 -101673 82367 -439342 127498 1256389 1407106 795018 386524
8238 386524 156430 321391 2004437 4656768 5257021 2366054 -1250167 -2349290 -1408279
8229 -1408279 -735165 -569006 202456 1192403 1188796 434364 -189064 -1068846 -2756674 -4202304
8219 -4202304 -4205225 -3374425 -2704250 -1725585 -109438 682975 -239718 -974745 298819 1892387
8209 1892387 1142959 -1040547 -1548073 19259 1288834 1329865 1398473 1724599 1051917
8200A051917j501315o31849K90283n32718j381315l941K005232J614465o24668
8191B86091j721014j077731n34275n29670K03673J542182J818808P87620O2404
8182H38088M32376Q86848M72555n02835j130581p16365N85679J291048k7262k183650
8172e4099k225675P4367J237197n64715k208492o03543J929205J296372j512818
8163b632201k016684L69294J598705k01725j976752r55076J445070K624421K400391
8154F55443J693247L56398j594116k652214j768322k10296J89474m88161r06567
8145d725114n67999O5549P06335J225569J055368k01351j685868j707470M44864
8136e390117L388817M680227L198263L31403j689101k351728k749535l132784
$$ plain form
8200 1051917 -449398 -1081247 -790964 -1323682 -2704997 -2708938 -703706 910759 286091
8191 286091 -1434923 -2512654 -3046929 -3576599 -3372926 -1830744 -11936 775684 838088
8182 838088 1270464 2157312 2629867 2127032 996451 280086 865765 2156813 2129551 -54099
8172 -54099 -2279774 -2205407 -968210 -1532925 -3741417 -4344960 -2415755 -1119383 -2632201
8163 -2632201 -4648885 -4279591 -2680886 -2882611 -4859363 -5814439 -4369369 -1744948 655443
8154 655443 2348690 2705088 1110972 -1541242 -3309564 -3519860 -3330386 -3818547 -4725114
8145 -4725114 -5293113 -5227564 -4521229 -3295660 -2240292 -2441643 -4127511 -5834981 -5390117
8136 -5390117 -2001300 2678927 5877190 6208593 4519492 2167764 -581771 -3714555
8128c714555k378585l67028J181240J356934J504068K469383K553575M16885j869569
8119A152348j464226Q49764J777763J69661k117004l244443k703721m73133K417626
8110c635365L401722J344006r78291m67907J401282R86102j371957k124844q54117
8101b299369o41146j846366j126783J931360K785528q10823m443473l394919O16490
8092i229501K822677K288117J445725J244807Q01338L29745P99620J571093J252149
8083C325770J06684o88514j135437j669328j579100k94903R60489Q44148O8339
8074f1852P6004P37166R85928M74375o98029k284087k919546j152484J506437
8065c336088J623572o30349q39531K498525M618257J890983j855822j452674J013632
$$ plain form
8128 -3714555 -6093140 -6460168 -5278928 -3921994 -2417926 51457 2605032 3021917 1152348
8119 1152348 -311878 537886 2315649 2485310 368306 -2876137 -5579858 -6052991 -3635365
8110 -3635365 -233643 1110363 132072 -335835 1065447 2051549 679592 -1445252 -2299369
8101 -2299369 -2940515 -4786881 -5913664 -3982304 -1196776 -2007599 -6451072 -9845991 -9229501
8092 -9229501 -6406824 -4118707 -2672982 -1428175 -626837 -297092 502528 2073621 3325770
8083 3325770 3432454 2743940 1608503 -60825 -1639925 -1934828 -974339 -130191 -61852
8074 -61852 14152 751318 1737246 2211621 1513592 -770495 -3690041 -4842525 -3336088
8065 -3336088 -1712516 -2342865 -3182396 -683871 3934386 5825369 3969547 2516873 3530505
8056C530505K1635l626908m044422k39068K360884Q69064j217757p08668O09937
8047b444798K91786o70974o50887l30449m29939J17419J538525J841805J01954
8038f35558j624417j440382j11283R69477J639030J595017J09582j649002j146804
8029b294340J305481K196983K34040j419689k89000J612413J605060N57751L40531
8020C849230J45376j291547k320315q01739J888430K588461P84268j453631k635348
8011G53185k470430q40939J367996J988541N34753l58194J012433K107823P9620
8002D174788l067690l173428l64752J426570O93168j76004L44932Q20809K44008
7993I22401j36095M39736P23472J0925m17472K18935O12750k29094j026592l75989
$$ plain form
8056 3530505 3552140 -74768 -4119190 -4358258 -1997374 -1128310 -2346067 -3054735 -2444798
8047 -2444798 -2153012 -2823986 -3474873 -3805322 -4235261 -4117842 -2579317 -737512 -635558
8038 -635558 -2259975 -3700357 -3811640 -2842163 -1203133 391884 501466 -1147536 -2294340
8029 -2294340 -988859 1208124 1442164 22475 -266525 1345888 2950948 3508699 3849230
8020 3849230 3994606 2703059 382744 -418995 1469435 4057896 4842164 3388533 753185
8011 753185 -1717245 -2558184 -1190188 798353 1333106 974912 1987345 4095168 4174788
8002 4174788 1107098 -2066330 -2431082 -1004512 -311344 -487348 -142416 678393 922401
7993 922401 786306 1226042 1949514 1960439 1542967 1761902 2374652 2145558 1118966 742977
7983G42977P35380M29633j031535j565610l49736R47153M01989j586288k731269
7974d007306j750942J8024N34666r8332q1110R88748J424154M53310j87175Q85249
7964a820714K048327R80491j565677k640181j253730N45805P81916j42810o48827
7955c715400j01985Q66802J439494J536696J709622K052314J629612j31060j868556
7946C417539j732521l40808j60567j595740k240890q85479N57995N20803K16961
7937b242707O91168M79864j208808j939917R2854K277142J359278j177823j531578
7928c200527L97609J610263J241401Q67980O56949l99682j223674q5959J379577
7919A243937K46920k169923j901536P55915J392582r57475k118552K3462K182902
$$ plain form
7983 742977 1478357 1907990 876455 -689155 -1038891 -91738 310251 -1276037 -4007306
7974 -4007306 -5758248 -5740224 -5205558 -5303890 -5385000 -4396252 -2972098 -2518788 -2705963 -1820714
7964 -1820714 227613 1208104 -357573 -2997754 -4251484 -3705679 -2923763 -3066573 -3715400
7955 -3715400 -3817385 -2950583 -1511089 25607 1735229 3787543 5417155 5286095 3417539
7946 3417539 1685018 1344210 1183643 -412097 -2652987 -3538466 -2980471 -2459668 -2242707
7937 -2242707 -1551539 -1071675 -2280483 -4220400 -4127546 -1850404 -491126 -1668949 -3200527
7928 -3200527 -2802918 -1192655 48746 916726 1573675 1173993 -49681 -135640 1243937
7919 1243937 1490857 -679066 -2580602 -1824687 -432105 -1389580 -3508132 -3484670 -1301768
7910a301768J639869L48144M06473K09698j661601k904548j427173O49530N21306
7901c520070o78455l08410J199665J616868P64053n1644o66297j272820p80803
7892c697913J205641K419129Q16806j878326k254038J56588K693648L181607J705242
7883D348384m16065j733166j475511m01777M3247j66874k9979n1368j571968l147872
7873d602949j441055K846549M215417K08676m054560k903451J715445L525669
7865d90259R53145j852228j735650J36044J339799J059030j71947j123697n31558
7856b417321J219035K062420J263687N79325R08094M90806j435845k353295o78538
7847c61632R96298L22781m89717J102341K738370J065006k005328k431085r72502
$$ plain form
7910 -1301768 338101 686245 1092718 1302416 -359185 -3263733 -4690906 -4041376 -3520070
7901 -3520070 -4198525 -4506935 -3307270 -1690402 -926349 -977993 -1644290 -2917110 -3697913
7892 -3697913 -2492272 -73143 743663 -1134663 -3388701 -3232113 -538465 2643142 4348384
7883 4348384 3932319 2199153 723642 321865 365112 198238 168259 116891 -1455077 -4602949
7873 -4602949 -6044004 -3197455 1017962 1226638 -2827922 -5731373 -4015928 -490259
7865 -490259 462886 -1389342 -3124992 -2988948 -1649149 -590119 -762066 -1885763 -2417321
7856 -2417321 -1198286 864134 2127821 2707146 3615240 4106046 2670201 316906 -361632
7847 -361632 634666 957447 467730 1570071 4308441 5373447 3368119 937034 -35468
7838c5468j041618j746280K45999L236525K133425k534577m365133q31913L213472
7829a725568L342058R83282p35349j277330j006217M4948L21930j737738l660797
7820e450781j642135K354997K584802o60635q41636L318528M676196j76035m245949
7811h2648j507383K946094J749746k297567j730390K375969K674277j457733l186865
$$ plain form
7838 -35468 -1077086 -2823366 -2577367 659158 2792583 258006 -4107127 -4939040 -1725568
7829 -1725568 1616490 2599772 1864423 587093 -419124 -374176 -52246 -1789984 -5450781
7820 -5450781 -7092916 -4737919 -2153117 -2813752 -3655388 -336860 4339336 4163301 -82648
7811 -82648 -1590031 1356063 3105809 808242 -922148 1453821 4128098 2670365 -516500
$$ [...]
##END NTUPLES=NMR SPECTRUM
##END=
