##TITLE=31Pdec_SR94_rm2
 , 124 sc
 25.10.2021
##JCAMPDX= 6.0         $$ Bruker NMR JCAMP-DX V2.0
##DATA TYPE= NMR SPECTRUM
##DATA CLASS= NTUPLES
##ORIGIN= UXNMR, Bruker Analytische Messtechnik GmbH
##OWNER= root
$$ XWIN-NMR		Version 3.5
$$ Mon Oct 25 11:21:34 2021 Russian Standard Time (UT+4h)  she@DPX200
##.OBSERVE FREQUENCY= 81.013821
##.OBSERVE NUCLEUS= ^31P
##.ACQUISITION MODE= SIMULTANEOUS
##.ACQUISITION SCHEME= undefined
##.AVERAGES= 124
##.DIGITISER RES= 16
##SPECTROMETER/DATA SYSTEM= spect
##.PULSE SEQUENCE= zgpg30
##.SOLVENT NAME= CDCl3
##.SHIFT REFERENCE= (INTERNAL, CDCl3, 0, 248.564)
##AUDIT TRAIL= $$ (NUMBER, WHEN, WHO, WHERE, WHAT)
$$ ##TITLE= Audit trail, XWIN-NMR		Version 3.5
$$ ##JCAMPDX= 5.01
$$ ##ORIGIN= Bruker BioSpin GmbH
$$ ##OWNER= she
$$ F:/spectra/data/she/nmr/P31/1/pdata/1/auditp.txt
$$ ##AUDIT TRAIL=  $$ (NUMBER, WHEN, WHO, WHERE, WHAT)
(   1,<2021-10-25 11:19:43.10 +0400>,<she>,<DPX200>,
      <continue with go, POWCHK disabled, PULCHK disabled
       configuration hash MD5:
       00 E9 B6 7A A2 85 ED C7 34 08 36 98 17 FE 4E 26
       data hash MD5: 32K
       A9 AE AE 04 70 16 45 6A 76 13 A8 5C DC C4 DB CE>)
(   2,<2021-10-25 11:19:45.67 +0400>,<she>,<DPX200>,
      <Start of raw data processing
       efp BC_mod = 2 LB = 1 FT_mod = 6 PKNL = 1 PHC0 = -8854.324 PHC1 = 115.669 SI = 64K 
       data hash MD5: 64K
       08 CE D3 A8 37 14 F9 D9 60 36 FA 07 0D C1 57 BC>)
(   3,<2021-10-25 11:20:11.87 +0400>,<she>,<DPX200>,
      <pk PHC0 = 14.51641 PHC1 = 0 
       data hash MD5: 64K
       3C 57 94 3C 71 1D 6B E6 F7 5C E4 AD FC C4 DD 86>)
$$ ##END=
$$ 
$$ hash MD5
$$ CA B8 EE F9 0C F0 B0 A2 C6 15 5D 51 B7 DB 0B C0
##$RELAX= 
##$RELAX= 
##$RELAX= 
##$RELAX= 
##$RELAX= 
##$RELAX= 
##$RELAX= 
##$RELAX= 
$$ Bruker specific parameters
$$ --------------------------
##$DU= <F:/spectra>
##$EXPNO= 1
##$NAME= <P31>
##$PROCNO= 1
##$TYPE= <nmr>
##$USER= <she>
##$AMP= (0..31)
100 100 100 100 100 100 100 100 100 100 100 100 100 100 100 100 100 100 
100 100 100 100 100 100 100 100 100 100 100 100 100 100 
##$AQSEQ= 0
##$AQ_mod= 1
##$AUNM= <au_zg>
##$AUTOPOS= <>
##$BF1= 81.014009
##$BF2= 200.13
##$BF3= 200.13
##$BF4= 200.13
##$BF5= 200.13
##$BF6= 200.13
##$BF7= 200.13
##$BF8= 200.13
##$BYTORDA= 1
##$CFDGTYP= 0
##$CFRGTYP= 5
##$CHEMSTR= <none>
##$CNST= (0..31)
1 1 145 1 1 1 1 1 1 1 1 1 1 1 1 1 1 1 1 1 1 1 1 1 1 1 1 1 1 1 1 1 
##$CPDPRG= <waltz16>
##$CPDPRG1= <>
##$CPDPRG2= <waltz16>
##$CPDPRG3= <>
##$CPDPRG4= <mlev>
##$CPDPRG5= <mlev>
##$CPDPRG6= <mlev>
##$CPDPRG7= <mlev>
##$CPDPRG8= <mlev>
##$CPDPRGB= <>
##$CPDPRGT= <>
##$D= (0..31)
0 1 0 0 0 0 0 0 0 0 0 0.03 2e-05 3e-06 0 0 0 0 0 0 0 0 0 0 0 0 0 0 0 0 
0 0 
##$DATE= 1635146216
##$DBL= (0..7)
120 120 120 11 120 120 24 19 
##$DBP= (0..7)
150 150 150 150 150 150 150 150 
##$DBP07= 0
##$DBPNAM0= <>
##$DBPNAM1= <>
##$DBPNAM2= <>
##$DBPNAM3= <>
##$DBPNAM4= <>
##$DBPNAM5= <>
##$DBPNAM6= <>
##$DBPNAM7= <>
##$DBPOAL= (0..7)
0.5 0.5 0.5 0.5 0.5 0.5 0.5 0.5 
##$DBPOFFS= (0..7)
0 0 0 0 0 0 0 0 
$$ [...]
##$SUBNAM2= <"">
##$SUBNAM3= <"">
##$SUBNAM4= <"">
##$SUBNAM5= <"">
##$SUBNAM6= <"">
##$SUBNAM7= <"">
##$SUBNAM8= <"">
##$SUBNAM9= <"">
##$SW= 501.771253377433
##$SWIBOX= (0..15)
0 1 3 0 0 0 0 0 0 0 0 0 0 0 0 0 
##$SW_h= 40650.406504065
##$TD= 32768
##$TD0= 1
##$TE= 0
##$TE2= 300
##$TE3= 300
##$TEG= 300
##$TL= (0..7)
0 120 53 12 22 120 120 120 
##$TP= (0..7)
150 150 150 150 150 150 150 150 
##$TP07= 0
##$TPNAME0= <>
##$TPNAME1= <>
##$TPNAME2= <>
##$TPNAME3= <>
##$TPNAME4= <>
##$TPNAME5= <>
##$TPNAME6= <>
##$TPNAME7= <>
##$TPOAL= (0..7)
0.5 0.5 0.5 0.5 0.5 0.5 0.5 0.5 
##$TPOFFS= (0..7)
0 0 0 0 0 0 0 0 
##$TUNHIN= 0
##$TUNHOUT= 0
##$TUNXOUT= 0
##$USERA1= <user>
##$USERA2= <user>
##$USERA3= <user>
##$USERA4= <user>
##$USERA5= <user>
##$V9= 5
##$VALIST= <valist>
##$VCLIST= <CCCCCCCCCCCCCCC>
##$VD= 0
##$VDLIST= <DDDDDDDDDDDDDDD>
##$VPLIST= <PPPPPPPPPPPPPPP>
##$VTLIST= <TTTTTTTTTTTTTTT>
##$WBST= 1024
##$WBSW= 4
##$XGAIN= (0..3)
0 0 0 0 
##$XL= 0
##$YL= 0
##$YMAX_a= 31725
##$YMIN_a= -72566
##$ZGOPTNS= <>
##$ZL1= 120
##$ZL2= 120
##$ZL3= 120
##$ZL4= 120
##$ABSF1= 0
##$ABSF2= 0
##$ABSG= 0
##$ABSL= 0
##$ALPHA= 0
##$AQORDER= 0
##$ASSFAC= 0
##$ASSFACI= 0
##$ASSFACX= 0
##$ASSWID= 0
##$AUNMP= <proc_1d>
##$AZFE= 0.1
##$AZFW= 0.5
##$BCFW= 0
##$BC_mod= 2
##$BYTORDP= 0
##$COROFFS= 0
##$CY= -3
##$DATMOD= 1
##$DC= 0
##$DFILT= <>
##$DTYPP= 0
##$F1P= 0
##$F2P= 0
##$FCOR= 1
##$FTSIZE= 65536
##$FT_mod= 6
##$GAMMA= 0
##$GB= 0
##$INTBC= 1
##$INTSCL= 5.30512e-09
##$ISEN= 30
##$LB= 1
##$LEV0= 0
##$LPBIN= 0
##$MAXI= 10000
##$MC2= 0
##$MEAN= 0
##$ME_mod= 0
##$MI= 50
##$NCOEF= 0
##$NC_proc= -6
##$NLEV= 6
##$NOISF1= 182.463
##$NOISF2= 159.3651
##$NSP= 0
##$NTH_PI= 0
##$NZP= 0
##$OFFSET= 248.5645
##$PC= 4
##$PHC0= -8839.808
##$PHC1= 115.669
##$PH_mod= 1
##$PKNL= yes
##$PPARMOD= 0
##$PSCAL= 0
##$PSIGN= 0
##$REVERSE= no
##$SF= 81.014009
##$SI= 65536
##$SIGF1= 159.3651
##$SIGF2= -187.1042
##$SINO= 113.3802
##$SIOLD= 16384
##$SREGLST= <1H.CDCl3>
##$SSB= 0
##$STSI= 65536
##$STSR= 0
##$SW_p= 40650.406504065
##$SYMM= 0
##$S_DEV= 0
##$TDeff= 32768
##$TDoff= 0
##$TI= <>
##$TILT= no
##$TM1= 0
##$TM2= 0
##$TOPLEV= 0
##$USERP1= <user>
##$USERP2= <user>
##$USERP3= <user>
##$USERP4= <user>
##$USERP5= <user>
##$WDW= 1
##$XDIM= 65536
##$YMAX_p= 349226222
##$YMIN_p= -13777591
$$ End of Bruker specific parameters
$$ ---------------------------------
##NTUPLES= NMR SPECTRUM
##VAR_NAME=  FREQUENCY,     SPECTRUM/REAL,   SPECTRUM/IMAG
##SYMBOL=    X,             R,               I
##VAR_TYPE=  INDEPENDENT,   DEPENDENT,       DEPENDENT
##VAR_FORM=  AFFN,          ASDF,            ASDF
##VAR_DIM=   65536,         65536,           65536
##UNITS=     HZ,            ARBITRARY UNITS, ARBITRARY UNITS
##FACTOR=    0.620285442955139, 1,           1
##FIRST=     20137.2065510759, 0,            0
##LAST=      -20513.1999529892, 0,           0
##MIN=       -20513.1999529892, -13777591,   0
##MAX=       20137.2065510759, 349226222,    0
$$ Real data points
##PAGE= N=1
##DATA TABLE= (X++(R..R)), XYDATA
$$ [...]
$$ plain form
44179 3288184 4711063 3616238 1782927 1578996 2166349 1155615 -1024721 -1847012 -1150172
44170 -1150172 -1197669 -2345523 -2470997 -1277304 -1358143 -3666908 -5355130 -3986898 -1110180
44161 -1110180 344381 -149956 -1500884 -3406890 -5813053 -7605319 -7832761 -6921356 -5202532
44152 -5202532 -1981131 2242121 4580714 3092848 -166338 -1752376 -1285626 -985792
44144 -985792 -1872741 -2982829 -3673333 -4187267 -4225493 -3196806 -1731442 -1013426 -905189
44135 -905189 -583539 -495112 -1549231 -2853953 -2657699 -1335438 -988804 -2091885 -3006659
44126 -3006659 -2935003 -2763509 -2697858 -1821617 -606149 -1012710 -3126965 -4512246 -4172864
44117 -4172864 -4250878 -6047196 -7319767 -6057082 -4359498 -5326957 -7840663 -7961664 -4651501
$$ packed form
44179C288184J422879j094825j833311k03931N87353j010734k180336q22291O96840
44170a150172m7497j147854j25474J193693q0839k308765j688222J368232K876718
44161a110180J454561m94337j350928j906006k406163j792266k27442R11405J718824
44152e202532L221401M223252K338593j487866l259186j586038M66750K99834
44144i85792q86949j110088o90504n13934l8226J028687J465364P18016J08237
44135i05189L21650Q8427j054119j304722J96254J322261L46634j103081r14774
44126c006659P1656J71494O5651Q76241J215468m06561k114255j385281L39382
44117d172864p8014j796318j272571J262685J697584r67459k513706j21001L310163
$$ plain form
44108 -4651501 -741017 1487652 2468314 2923217 2358633 834719 -296122 -531534 -1088642
44099 -1088642 -2592317 -3772680 -3657270 -3330426 -4026876 -4843374 -4021942 -1665173 358552
44090 358552 674271 -745257 -3412131 -6482811 -8286892 -7300083 -4067384 -1171261 -785907
44081 -785907 -2793950 -5397845 -6768341 -5905321 -3017603 96183 879211 -1435473 -4266037
44072 -4266037 -4017825 -363707 3002026 2687544 -358460 -2434352 -2016320 -1234927 -2282450
44063 -2282450 -4310880 -5050654 -4146006 -3218219 -3199697 -3333044 -2948048 -2746097 -3575094
44054 -3575094 -4811666 -4936364 -3521734 -1851345 -1301956 -1665147 -1755629 -1488958 -2194180
44045 -2194180 -4264047 -5720327 -4626281 -2148095 -1088267 -1581661 -905453 1825903
$$ packed form
44108d651501L910484K228669R80662M54903n64584j523914j130841k35412n57108
44099a088642j503675j180363J15410L26844o96450q16498Q21432K356769K023725
44090C58552L15719j419528k666874l070680j804081R86809L232699K896123L85354
44081g85907k008043k603895j370496Q63020K887718L113786P83028k314684k830564
44072d266037K48212L654118L365733l14482l046004k075892M18032P81393j047523
44063b282450k028430p39774R04648R27787J8522j33347L84996K01951q28997
44054c575094j236572j24698J414630J670389N49389l63191r0482K66671p05222
44045b194180k069867j456280J094046K478186J059828m93394O76208K731356
$$ plain form
44037 1825903 3761834 2801288 1176491 1854157 3607831 3192935 1004546 499197 2342119
44028 2342119 3278523 1470039 -879877 -1521244 -1282981 -1410221 -986016 590056 1220199
44019 1220199 -949354 -4104010 -5094826 -3776930 -2284392 -1163367 790601 3390050
44011 3390050 4660345 3770757 2116459 1191928 1189796 1891558 3283718 5000772 6427279
44002 6427279 7410989 7833174 6903902 4257964 1294358 -139452 -13232 492806 1225753
43993 1225753 2670550 3822207 2967371 678409 -528370 -43095 -137752 -2143498 -4123823
43984 -4123823 -3919546 -2469624 -2103947 -2907719 -2891103 -1122182 1132822 2245989 1919037
43975 1919037 1090471 989918 2092941 3447775 3503175 2128670 1023150 1292303 1501856
$$ packed form
44037A825903J935931r60546j624797O77666J753674m14896k188389n05349J842922
44028B342119R36404j808484k349916o41367K38263j27240M24205J576072O30143
44019A220199k169553l154656r90816J317896J492538J121025J953968K599449
44011C390050J270295q89588j654298r24531k132P01762J392160J717054J426507
44002F427279R83710M22185r29272k645938k963606j433810J26220N06038P32947
43993A225753J444797J151657q54836k288962j206779M85275r4657k005746j980325
43984d123823K04277J449922L65677q03772J6616J768921K255004J113167l26952
43975A919037q28566j00553J103023J354834N5400j374505j105520K69153K09553
$$ plain form
43966 1501856 -500178 -4224454 -6511543 -5113955 -1192807 2233294 3471969 3087907
43958 3087907 2264201 1427214 796712 1240221 3321465 5662817 5742603 3031223 146607
43949 146607 -253510 1205425 1839280 679662 -853231 -1667831 -2175964 -2571494 -2268754
43940 -2268754 -1832944 -3177019 -6405664 -8440777 -6778354 -3225595 -1665464 -2899284
43932 -2899284 -3998475 -2562145 534211 2897106 3249381 1716136 -961392 -3599955
43924 -3599955 -4998535 -5027537 -4650515 -4409471 -3760599 -2469674 -1611221 -2147274 -3282958
43915 -3282958 -3516910 -2873971 -2627778 -2941550 -2549157 -1261242 -913196 -2487405 -3843689
43906 -3843689 -2430306 558949 1266923 -1527183 -4722299 -5287894 -3951471 -3078979 -3007943
$$ packed form
43966A501856k002034l724276k287089J397588L921148L426101J238675l84062
43958C087907q23706q36987o30502M43509K081244K341352P9786k711380k884616
43949A46607m00117J458935O33855j159618j532893q14600n08133l95530L02740
43940b268754M35810j344075l228645k035113J662423L552759J560131j233820
43932b899284j099191J436330L096356K362895L52275j533245k677528k638563
43924c599955j398580k9002L77022K41044O48872J290925Q58453n36053j135684
43915c282958k33952O42939K46193l13772L92393J287915L48046j574209j356284
43906c843689J413383K989255P07974k794106l195116n65595J336423Q72492P1036
$$ plain form
43897 -3007943 -2563951 -1674037 -1084092 -453001 844761 1611724 28604 -3151331 -4942974
43888 -4942974 -3864339 -1334119 725622 1586383 943579 -1156399 -3153544 -3076743 -1519606
43879 -1519606 -1299869 -3387638 -5468904 -5474653 -4114873 -2752775 -1350088 -90358 -393621
43870 -393621 -2209121 -2780635 -661840 1312868 61964 -2789868 -3555864 -2446608 -2652180
43861 -2652180 -4324548 -4259073 -1915314 -853973 -2502146 -3051229 411236 4374232 3655534
43852 3655534 -624804 -2572537 -302474 1666825 -211920 -3124739 -2544699 806984
43844 806984 2341731 547214 -1359439 -868363 293469 -516690 -2749640 -4024187 -3795491
43835 -3795491 -3345908 -3241043 -3073338 -2995727 -3256845 -2760724 -482447 1997771 1967525
$$ packed form
43897c007943M43992Q89914N89945O31091J297762P66963j583120l179935j791643
43888d942974J078635K530220K059741Q60761o42804k099978j997145P6801J557137
43879a519606K19737k087769k081266n749J359780J362098J402687J259730l03263
43870c93621j815500n71514K118795J974708j250904k851832p65996J109256k05572
43861b652180j672368O5475K343759J061341j648173n49083L462465L962996p18698
43852C655534m280338j947733K270063J969299j878745k912819N80040L351683
43844H06984J534747j794517j906653M91076J161832q10159k232950j274547K28696
43835c795491M49583J04865J67705P7611k61118M96121K278277K480218l0246
$$ plain form
43826 1967525 -375272 -2026285 -1613903 -852277 -902674 -497870 866998 1046794 -1156081
43817 -1156081 -3158349 -2140223 664802 2227607 2515914 3562491 4881638 3745806
43809 3745806 67957 -2641860 -2149459 -369644 -7316 -765356 -722222 220716 399225
43800 399225 -784168 -1954762 -1855381 -1095354 -1152641 -2144946 -2457737 -892955 1440935
43791 1440935 2262936 1004845 -490986 -433389 756976 1292081 255232 -1533166 -2336028
43782 -2336028 -984917 1807958 3776141 3720784 3311187 4589960 6267887 5231679 1782976
43773 1782976 -99685 1199465 2302079 306854 -2649118 -3260575 -2307068 -2302152 -2525274
43764 -2525274 -797868 1624427 1687169 36476 43647 1653749 1103537 -2684876 -6039110
$$ packed form
43826A967525k342797j651013M12382P61626n0397M04804J364868J79796k202875
43817a156081k002268J018126K805025J562805K88307J046577J319147j135832
43809C745806l677849k709817M92401J779815L62328p58040M3134R42938J78509
43800C99225j183393j170594R9381P60027n7287r92305l12791J564782K333890
43791A440935Q22001j258091j495831N7597J190365N35105j036849j788398q02862
43782b336028J351111K792875J968183n5357m09597J278773J677927j036208l448703
43773A782976j882661J299150J102614j995225k955972o11457R53507M916k23122
43764b525274J727406K422295O2742j650693P171J610102n50212l788413l354234
$$ plain form
43755 -6039110 -6117232 -4549541 -3964046 -4411311 -4949172 -5615311 -5989664 -4594614 -1614303
43746 -1614303 187627 -985844 -3581608 -5192120 -5187480 -3697875 -684951 2383325 2727580
43737 2727580 220263 -1390193 433299 3132598 3027884 963807 527747 2070870
43729 2070870 2421403 355085 -1368642 -450997 1347414 892071 -1704204 -3226200 -1698212
43720 -1698212 1223851 2774107 2703504 2939609 4027018 3900061 1028322 -2956237 -5337986
43711 -5337986 -5685046 -5261114 -4340449 -2583236 -1167296 -1559078 -2529921 -1643251 183062
43702 183062 -805365 -5195529 -8452320 -6778096 -2063883 1078410 841549 -1371457 -3938100
43693 -3938100 -5909268 -6302749 -4882103 -3039598 -2363751 -2922671 -3809687 -4276253 -3643489
$$ packed form
43755f039110p8122J567691N85495m47265n37861o66139l74353J395050K980311
43746a614303J801930j173471k595764j610512M640J489605L012924L068276L44255
43737B727580k507317j610456J823492K699299j04714k064077m36060J543123
43729B070870L50533k066318j723727R17645J798411m55343k596275j521996J527988
43720a698212K922063J550256p0603K36105J087409j26957k871739l984559k381749
43711e337986l47060M23932R20665J757213J415940l91782r70843Q86670J826313
43702A83062r88427m390164l256791J674224M714213L142293k36861k213006k566643
43693c938100j971168l93481J420646J842505O75847n58920q87016m66566O32764
$$ plain form
43684 -3643489 -1687583 61597 -698666 -3699638 -5765278 -5082262 -3596135 -3504920 -3643066
43675 -3643066 -1662471 1889071 4113601 3338630 208546 -3693791 -6486592 -6386107
43667 -6386107 -3402071 96213 1917906 2229159 2160036 1805437 1042716 700589 1197251
43658 1197251 1459542 835676 578087 1777863 3411074 4109573 4177415 4161200 3366176
43649 3366176 1713820 998244 2110399 3113749 2414259 1540796 2095678 2454833 815953
43640 815953 -920033 -330115 589416 -1617981 -5418288 -6062838 -3368007 -2290525 -5028358
43631 -5028358 -7643826 -6307520 -2621601 -371438 -295050 -639676 -561989 -542970 -837880
43622 -837880 -1326509 -2014959 -2682514 -2915253 -2898645 -3072970 -2983455 -1920334 -582348 -369818
$$ packed form
43684c643489J955906J749180p60263l000972k065640O83016J486127R1215j38146
43675c643066J980595L551542K224530p74971l130084l902337k792801J00485
43667f386107K984036L498284J821693L11253o9123l54599p62721l42127M96662
43658A197251K62291o23866k57589J199776J633211O98499O7842j6215p95024
43649C366176j652356p15576J112155J003350o99490q73463N54882L59155j638880
43640H15953j735986N89918R19531k207397l800307o44550K694831J077482k737833
43631e028358k615468J336306L685919K250163P6388l44626P7687J9019k94910
43622h37880m88629o88450o67555k32739J6608j74325Q9515J063121J337986K12530
$$ plain form
43612 -369818 -1140322 -1550575 -1436947 -1722262 -2138158 -1501660 -321605 -514279 -2149259
43603 -2149259 -3038841 -2126921 -815665 -261418 237433 1400973 2789782 4121096 5458157
43594 5458157 5576982 2851624 -1371606 -3130390 -933631 2095273 2691125 1554244
43586 1554244 1130381 1588336 1340429 -18103 -1579780 -2986668 -4542006 -6032651 -6753024
43577 -6753024 -6213285 -4179883 -999660 1577366 1316676 -1892926 -5576653 -7495603
43569 -7495603 -7629157 -6937892 -5966178 -5357304 -5745690 -6157596 -4577700 -1297843 471902
43560 471902 -1096666 -3640224 -4021394 -2628842 -1967707 -2578813 -3040090 -2989297 -3330723
43551 -3330723 -3807035 -3026380 -1123988 -106350 -919926 -2037111 -1860273 -1065555 -1310054
$$ packed form
43612c69818p70504m10253J13628k85315m15896O36498J180055j92674j634980
43603b149259q89582R11920J311256N54247M98851J163540J388809J331314J337061
43594E458157J18825k725358m223230j758784K196759L028904N95852j136881
43586A554244m23863M57955k47907j358532j561677j406888j555338j490645p20373
43577f753024N39739K033402L180223K577026k60690l209602l683727j918950
43569g495603j33554O91265R71714O08874l88386m11906J579896L279857J769745
43560D71902j568568k543558l81170J392552O61135o11106m61277N0793l41426
43551c330723m76312P80655J902392J017638q13576j117185J76838P94718k44499
$$ plain form
43542 -1310054 -2478207 -2716311 -1218217 380536 259391 -797019 -424202 1604379 2687246
43533 2687246 1316940 -316093 504602 2852875 3706058 2635676 1995909 2800398 3493667
43524 3493667 3007951 2028550 762865 -1428525 -3392249 -2508889 921151 2845022 1036397
43515 1036397 -1386876 -518315 2721280 4415173 3282268 1429275 530992 103821 -751601
43506 -751601 -2031037 -3083478 -2849451 -598629 2297861 2606810 -961526 -5305415 -6340852
43497 -6340852 -4031660 -1870697 -1886237 -2505310 -1599704 298532 769017 -1286423 -3960029
43488 -3960029 -4136781 -1099076 2332345 3257073 2508091 3020294 4896855 5127993 2679227
43479 2679227 383243 203852 -26117 -2667455 -5945406 -6584802 -4541411 -1987215 418999
$$ packed form
43542a310054j168153k38104J498094J598753j21145j056410L72817K028581J082867
43533B687246j370306j633033Q20695K348273Q53183j070382o39767Q04489O93269
43524C493667m85716r79401j265685k191390j963724Q83360L430040J923871j808625
43515A036397k423273Q68561L239595J693893j132905j852993q98283m27171q55422
43506g51601j279436j052441K34027K250822K896490L08949l568336m343889j035437
43497f340852K309192K160963j5540o19073R05606J898236M70485k055440k673606
43488c960029j76752L037705L431421R24728p48982N12203J876561K31138k448766
43479B679227k295984j79391k29969k641338l277951o39396K043391K554196K406214
$$ plain form
43470 418999 2815095 3430368 607990 -3289488 -3930029 -922794 1734111 1295885 -790789
43461 -790789 -2003260 -1853209 -1081485 -137350 621654 873627 933365 1094801 624283 -1001599
43451 -1001599 -2459302 -2208988 -1152415 -1329648 -2528077 -2865823 -2369464 -2925346 -4587966
43442 -4587966 -5092644 -3660251 -2335931 -2587544 -3250356 -2999064 -2421171 -2295948 -1908219
43433 -1908219 -482486 1338152 2560047 2942973 2344475 657576 -936890 -559369 1656789
43424 1656789 3245771 2670487 1106939 111764 -561939 -1690339 -2856545 -3220849 -2643107
43415 -2643107 -1223694 760552 1939561 912109 -1045005 -770719 2043370 3475546
43407 3475546 601090 -4214867 -6570872 -5664039 -4078565 -3438682 -3136716 -2614223 -2238197
$$ packed form
43470D18999K396096O15273k822378l897478o40541L007235K656905m38226k086674
43461g90789j212471J50051P71724R44135P59004K51973N9738J61436m70518j625882
43451a001599j457703K50314J056573j77233j198429l37746M96359n55882j662620
43442d587966n04678J432393J324320k51613o62812K51292N77893J25223L87729
43433a908219J425733J820638J221895L82926n98498j686899j594466L77521K216158
43424A656789J588982n75284j563548r95175o73703j128400j166206l64304N77742
43415b643107J419413J984246J179009j027452j957114K74286K814089J432176
43407C475546k874456m815957k356005R06833J585474O39883L01966N22493L76026
$$ plain form
43398 -2238197 -2125581 -2158100 -2833444 -4280604 -5059116 -3980444 -2466993 -2730488 -4069865
43389 -4069865 -3710878 -1323522 265488 -441365 -1304207 -134315 1907241 2463140 1571372
43380 1571372 793389 225540 -924824 -1626034 33970 3057446 3751225 872491 -2092853
43371 -2092853 -1727441 363772 54377 -3184639 -5838762 -5679915 -4232388 -3320402 -2411243
43362 -2411243 -965928 -547372 -2161902 -3676109 -2734225 -699916 -575529 -2033045 -1985919
43353 -1985919 197934 1671284 804139 -539632 -610484 -479935 -1299275 -1601417 181695
43344 181695 2475672 2579169 802334 -35977 1178202 2456641 1682958 -735679 -2599964
43335 -2599964 -2275983 -119468 1835069 1727301 -168750 -1809019 -2004787 -1628604 -1562959
$$ packed form
43398b238197J12616l2519o75344j447160p78512J078672J513451k63495j339377
43389d069865L58987K387356J589010p06853q62842J169892K041556N55899q91768
43380A571372p77983n67849j150364p01210J660004L023476O93779k878734k965344
43371b092853L65412K091213l09395l239016k654123J58847J447527R11986R09159
43362b411243J445315M18556j614530j514207R41884K034309J24387j457516M7126
43353a985919K183853J473350q67145j343771p0852J30549q19340l02142J783112
43344A81695K293977J03497j776835q38311J214179J278439p73683k418637j864285
43335b599964L23981K156515J954537j07768j896051j640269j95768L76183O5645
$$ plain form
43326 -1562959 -985767 786129 2073584 736379 -2247511 -3577360 -2243145 -1035897
43318 -1035897 -2537530 -5492539 -6621275 -4862264 -2233797 -993146 -1364864 -2090720
43310 -2090720 -2117020 -1367983 -493318 -264913 -947096 -2024859 -2733113 -2935536 -3142281
43301 -3142281 -3455098 -2989259 -1027597 1427778 2239105 672181 -1498874 -2204234 -1715065
43292 -1715065 -1906513 -3220266 -3856376 -2355309 292277 1895362 1535565 -74999 -2016865
43283 -2016865 -3862209 -5199286 -5486351 -4612461 -3082111 -1502437 -211614 596940 764055
43274 764055 279707 -686553 -1842859 -2671965 -2444725 -844271 1229484 1932841 198721
43265 198721 -2734652 -4156534 -2802090 -535973 -236075 -2088420 -3177364 -1222508
$$ packed form
43326a562959N77192J771896J287455j337205k983890j329849J334215J207248
43318a035897j501633k955009j128736J759011K628467J240651l71718p25856
43310b090720k6300P49037Q74665K28405o82183j077763p08254k02423k06745
43301c142281l12817M65839J961662K455375Q11327j566924k171055p05360M89169
43292a715065j91448j313753o36110J501067K647586J603085l59797j610564j941866
43283b016865j845344j337077k87065Q73890J530350J579674J290823Q08554J67115
43274G64055m84348r66260j156306q29106K27240J600454K073755P03357j734120
43265A98721k933373j421882J354444K266117K99898j852345j088944J954856
$$ plain form
43257 -1222508 2470963 4789443 4593481 3323251 2367953 1545729 391260 -514760 -225749
43248 -225749 1310235 3171710 4241199 3986691 2949928 2313435 2418353 2170747 845457
43239 845457 -166502 977114 3426026 4212170 2384681 515080 1039727 2897810 3345258
43230 3345258 1790166 5350 -733198 -858442 -995864 -850556 -27256 1034913 1469041
43221 1469041 928760 -79038 -635110 -249496 588121 911561 471452 119394 840485
43212 840485 2671404 4570012 4992262 2856275 -1281749 -5143634 -6809482 -6831127 -7079895
43203 -7079895 -7575138 -6283672 -2615544 941146 2075010 1834883 2605338 4112553 3873381
43194 3873381 1241077 -1460986 -2296620 -2126714 -2642542 -3581359 -3433131 -2128474 -1320427
$$ packed form
43257a222508L693471K318480j95962j270230r55298q22224j154469r06020K89011
43248b25749J535984J861475J069489k54508j036763o36493J04918k47606j325290
43239H45457j011959J143616K448912P86144j827489j869601N24647J858083M47448
43230C345258j555092j784816p38548j25244j37422J45308Q23300J062169M34128
43221A469041n40281j007798n56072L85614Q37617L23440m40109l52058P21091
43212H40485J830919J898608M22250k135987m138024l861885j665848k1645k48768
43203g079895m95243J291466L668128L556690J133864k40127P70455J507215k39172
43194C873381k632304k702063q35634J69906n15828r38817J48228J304657Q08047
$$ plain form
43185 -1320427 -1838513 -2238729 -799661 1725526 2640381 731861 -2004464 -2765340 -1142108
43176 -1142108 1085836 2526960 3053140 2583599 898733 -1110891 -1737162 -583155 966119
43167 966119 1835026 2356180 2870899 2986309 2896268 3532903 4458844 3705124 1085796 -522918
43157 -522918 808590 2812100 2338785 263864 7615 2231577 4380159 5098953 5600673
43148 5600673 6308283 5585071 2934097 476487 -370772 -1201016 -3677091 -6288456 -6274897
43139 -6274897 -3541701 -626709 418431 -588583 -2845375 -4995560 -5277054 -3164534
43131 -3164534 -639348 -43464 -831611 -473508 1266660 1448880 -1406659 -4073069 -2529892
43122 -2529892 1944549 3693338 157563 -4422251 -4573483 -794520 1606641 79942
$$ packed form
43185a320427n18086m00216J439068K525187R14855j908520k736325p60876J623232
43176a142108K227944J441124N26180m69541j684866k009624o26271J154007J549274
43167I66119Q68907N21154N14719J15410r0041O36635R25941p53720k619328j608714
43157e22918J331508K003510m73315k074921k56249K223962K148582P18794N01720
43148E600673P07610p23212k650974k457610q47259q30244k476075k611365J3559
43139f274897K733196K914992J045140j007014k256792k150185k81494K112520
43131c164534K525186N95884p88147L58103J740168J82220k855539k666410J543177
43122b529892M474441J748789l535775m579814j51232L778963K401161j526699
$$ plain form
43114 79942 -2000259 -545327 3548450 5871197 4230932 811137 -961109 -43292 1749840
43105 1749840 1813908 -704024 -3743666 -4074827 -942216 2639057 3235231 995941 -996981
43096 -996981 -820422 555973 1499536 1792456 1932347 1883623 1445194 908252 514319 -135897
43086 -135897 -1511132 -3411674 -5135305 -5906593 -5023844 -2374887 800163 2386102 1271165
43077 1271165 -1518020 -3836783 -4256450 -2793994 -425249 1688088 2760091 2566993
43069 2566993 1263009 -680498 -2226740 -2147211 -404400 1263637 1107069 -491160 -1611726
43060 -1611726 -1312307 -302836 817084 2377927 4174195 4730883 3146523 612500
43052 612500 -1133202 -2071169 -3214723 -4225645 -3598545 -1520212 -670084 -2810048 -5720327
$$ packed form
43114G9942k080201J454932M093777K322747j640265l419795j772246R17817J793132
43105A749840O4068k517932l039642l31161L132611L581273N96174k239290j992922
43096i96981J76559J376395R43563K92920J39891m8724m38429n36942l93933o50216
43086a35897j375235j900542j723631p71288Q82749K648957L175050J585939j114937
43077A271165k789185k318763m19667J462456K368745K113337J072003j93098
43069B566993j303984j943507j546242P9529J742811J668037j56568j598229j120566
43060a611726K99419J009471J119920J560843J796268N56688j584360k534023
43052F12500j745702r37967j143554j010922O27100K078333Q50128k139964k910279
$$ plain form
43043 -5720327 -5531521 -1967876 933439 212455 -2052814 -2208308 -755635 -1291445 -4105305
43034 -4105305 -4898567 -1369448 2604664 2307018 -992602 -2338099 -593143 659237
43026 659237 -655654 -2357708 -2407727 -2197805 -3575621 -5472646 -5672141 -3938497 -1508029
43017 -1508029 802057 2241499 1633508 -766103 -2318591 -982672 1778519 2984252
43009 2984252 2094218 996028 780827 691004 85443 -480530 -398253 103782 448622 264120
42999 264120 -425299 -893921 -110506 1780222 3088442 2631678 1310409 530008 84975
42990 84975 -864343 -1681989 -1137020 108057 36604 -1664582 -2994260 -2363082 -335842
42981 -335842 1566767 2257340 1095828 -1746500 -4415492 -4475942 -1742219 1107410 1447774
$$ packed form
43043e720327J88806L563645K901315p20984k265269j55494J452673n35810k813860
43034d105305p93262L529119L974112k97646l299620j345497J744956J252380
43026F59237j314891j702054n0019K09922j377816j897025j99495J733644K430468
43017a508029K310086J439442o07991k399611j552488J335919K761191J205733
43009B984252q90034j098190k15201q9823o05561n65973Q2277N02035L44840j84502
42999B64120o89419m68622P83415J890728J308220m56764j321269p80401m45033
42990H4975r49318q17646N44969J245077p1453j701186j329678O31178K027240
42981c35842J902609O90573j161512k842328k668992o0450K733723K849629L40364
$$ plain form
42972 1447774 -611032 -2806589 -3002834 -643692 2887559 4994286 4127545 1696343
42964 1696343 508995 1030347 785888 -1854822 -5050407 -5916330 -4211466 -2004122 -537588
42955 -537588 817904 2665279 4101521 3614450 965047 -2046763 -2862149 -744657 2016257
42946 2016257 2465720 596382 -800433 -212886 591883 -251146 -1519383 -947599 949423
42937 949423 1678820 792373 452195 1858618 3542724 3838612 2976197 1869074 705158
42928 705158 -169395 318774 2239768 3739862 3440497 2655280 3400164 4965870 4626130
42919 4626130 1698034 -1219240 -1697416 -404474 547263 773446 1423579 2461495 2160481
42910 2160481 -252071 -3038562 -4085813 -3539804 -2959404 -2512704 -818455 2309702 4790497
$$ packed form
42972A447774k058806k195557j96245K359142L531251K106727q66741k431202
42964A696343j187348N21352k44459k640710l195585q65923J704864K207344J466534
42955e37588J355492J847375J436242m87071k649403l011810q15386K117492K760914
42946B016257M49463j869338j396815N87547Q04769q43029j268237N71784J897022
42937I49423P29397q86447l40178J406423J684106K95888q62415j107123j163916
42928G05158q74553M88169J920994J500094k99365p85217P44884J565706l39740
42919D626130k928096k917274m78176J292942R51737K26183O50133J037916l01014
42910B160481k412552k786491j047251N46009N80400M46700J694249L128157K480795
$$ plain form
42901 4790497 4842673 3259724 1940726 1264239 435630 -332591 161856 2048063 3988458
42892 3988458 4984930 5109830 4293536 2060545 -947771 -2720615 -2107881 -283494 786127
42883 786127 442865 -634935 -1427846 -1010450 811179 2599679 2314268 76016 -1461218
42874 -1461218 -481997 1760050 3305715 4370643 6055485 7680985 7683493 6173061 4354597
42865 4354597 2290122 -380074 -2353739 -2102423 -879616 -1301997 -3146101 -3764953 -2713255
42856 -2713255 -2276257 -2764000 -1383127 2478767 4789606 2497091 -1570861 -2786020
42848 -2786020 -1243913 -510831 -1608920 -2276859 -1473890 -752873 -1012321 -1154918 -547320
42839 -547320 -183615 -775282 -1790776 -2747425 -3511641 -3285322 -1476201 414392 222208
$$ packed form
42901D790497N2176j582949j318998o76487q28609p68221M94447J886207J940395
42892C988458R96472J24900q16294k232991l008316j772844O12734J824387J069621
42883G86127l43262j077800p92911M17396J821629J788500k85411k238252j537234
42874a461218R79221K242047J545665J064928J684842J625500K508j510432j818464
42865D354597k064475k670196j973665K51316J222807m22381j844104o18852J051698
42856b713255M36998m87743J380873L861894K310839k292515m067952j215159
42848b786020J542107P33082j098089o67939Q02969P21017k59448j42597O07598
42839e47320L63705n91667j015494r56649p64216K26319J809121J890593j92184
$$ plain form
42830 222208 -1398343 -1606119 92578 905146 -714493 -2669438 -2987418 -3096633 -4976794
42821 -4976794 -7334413 -7420212 -5161506 -2758116 -1237723 -124888 246448 -964228 -2643763
42812 -2643763 -2457313 -533138 180890 -1772641 -3978534 -3586939 -1361784 -331046 -1393708
42803 -1393708 -2416218 -1641775 -134002 -99038 -1944457 -4037987 -4900056 -4650502 -4300243
42794 -4300243 -4431295 -4866747 -5059958 -4445153 -2910551 -1334065 -1047365 -2104679 -2674535
42785 -2674535 -1157226 1474861 2693579 1658254 29053 -663663 -887610 -1648744 -2667483
42776 -2667483 -3234232 -3755375 -4928236 -6047702 -5752020 -4252585 -3305167 -3774048 -4478976
42767 -4478976 -3871933 -1919117 114556 1032741 516321 -747622 -1386946 -471324 1209829
$$ packed form
42830B22208j620551k07776J698697Q12568j619639j954945l17980j09215j880161
42821d976794k357619q5799K258706K403390J520393J112835L71336j210676j679535
42812b643763J86450J924175P14028j953531k205893L91595K225155J030738j062662
42803a393708j022510P74443J507773L4964j845419k093530q62069K49554L50259
42794d300243j31052m35452j93211O14805J534602J576486K86700j057314n69856
42785b674535J517309K632087J218718j035325j629201o92716k23947p61134j018739
42776b667483n66749n21143j172861j119466K95682J499435R47418m68881p04928
42767d478976O07043J952816K033673R18185n16420j263943o39324R15622J681153
$$ plain form
42758 1209829 1604116 -224661 -2590283 -2860933 -600069 1718641 1470646 -1121423 -3284631
42749 -3284631 -2836213 -438539 1398328 945639 -1525589 -4518849 -6397334 -5977274 -3276832
42740 -3276832 -74611 1227734 -36236 -2163325 -3274613 -3366092 -3480940 -3725727 -3354499
42731 -3354499 -2412216 -1941933 -2522742 -3723775 -5043858 -6113573 -5739609 -2397386 3210220
42722 3210220 7290585 6399067 1540651 -2629044 -2935003 -774966 387710 -667711
42714 -667711 -2277236 -2758537 -2239855 -1451990 -191412 2044180 4668348 6344798 6484953
42705 6484953 5579802 4225682 2703444 1481100 1142278 1517104 1672812 1147361 552018
42696 552018 632241 1404497 2516028 3603570 3865525 2393316 -162925 -1338187 269158
$$ packed form
42758A209829L94287j828777k365622k70650K260864K318710k47995k592069k163208
42749c284631M48418K397674J836867m52689k471228k993260j878485M20060K700442
42740c276832L202221J302345j263970k127089j111288r1479j14848k44787L71228
42731c354499R42283M70283n80809j201033j320083j069715L73964L342223N607606
42722C210220M080365q91518m858416m169695l05959K160037J162676j055421
42714f67711j609525m81301N18682P87865J260578K235592K624168J676450J40155
42705F484953r05151j354120j522238j222344l38822L74826J55708n25451n95343
42696E52018Q0223P72256J111531J087542K61955j472209k556241j175262J607345
$$ plain form
42687 269158 2536876 2065656 -1208450 -3586622 -2320632 1038096 3043582 2553649 982505
42678 982505 -453134 -1635466 -2093660 -938426 1180850 1901129 55310 -2480966 -3077948
42669 -3077948 -1601696 -120401 -101007 -1359820 -3277933 -5247022 -5918390 -4005274 -566213
42660 -566213 1227541 -159424 -2404356 -2356646 -320104 590690 -972151 -2758808 -2273803
42651 -2273803 -298949 253913 -1708769 -4027832 -3950021 -1307007 1598530 2943504 3308449
42642 3308449 4231618 5629616 5842588 4145523 1885221 707599 891463 2035544 3918091
42633 3918091 5504412 4553589 162230 -5015939 -7087274 -5263085 -2228542 -479570
42625 -479570 -168239 -460754 -904689 -1046874 -533802 -73438 -667002 -1646268 -1367041 -89408
$$ packed form
42687B69158K267718m71220l274106k378172J265990L358728K005486m89933j571144
42678I82505j435639j182332m58194J155234K119276P20279j845819k536276n96982
42669c077948J476252J481295J9394j258813j918113j969089o71368J913116L439061
42660e66213J793754j386965k244932M7710K036542R10794j562841j786657M85005
42651b273803J974854N52862j962682k319063P7811K643014K905537J344974L64945
42642C308449R23169J397998K12972j697065k260302j177622J83864J144081J882547
42633C918091J586321r50823m391359n178169k071335J824189L034543J748972
42625d79570L11331k92515m43935j42185N13072M60364n93564r79266K79227J277633
$$ plain form
42615 -89408 148802 -922890 -1060444 585893 1639972 417814 -1001547 -200661 1304902
42606 1304902 395619 -2532896 -4179651 -3296038 -1665452 -397859 1297711 3186800
42598 3186800 3156269 572423 -2072307 -2407028 -1150888 -403347 -659537 -1075285 -1318597
42589 -1318597 -1473889 -1061764 165973 992873 -109146 -2673068 -4402400 -3939415 -2557571
42580 -2557571 -2541720 -4264986 -5509456 -3974445 -151622 3002974 3412366 1968893 665978
42571 665978 -213062 -1562883 -2895682 -2527865 -503747 896093 532613 335972 2213878
42562 2213878 4474134 3621367 -601419 -4132425 -3241841 1081502 4381087 3767546 801035
42553 801035 -591898 1572223 5425589 7402040 5835531 2199603 -907008 -2369386
$$ packed form
42615h9408K38210j071692j37554J646337J054079j222158j419361Q00886J505563
42606A304902r09283k928515j646755Q83613J630586J267593J695570J889089
42598C186800l0531k583846k644730l34721J256140P47541k56190m15748k43312
42589a318597j55292M12125J227737Q26900j102019k563922j729332M62985J381844
42580b557571J5851j723266j244470J535011L822823L154596M09392j443473j302915
42571F65978q79040j349821j332799L67817K024118J399840l63480j96641J877906
42562B213878K260256q52767m222786l531006Q90584M323343L299585o13541k966511
42553H01035j392933K164121L853366J976451j566509l635928l106611j462378
$$ plain form
42545 -2369386 -2922164 -3452111 -3734183 -3090507 -1760071 -910258 -1223929 -2046850 -2235079
42536 -2235079 -1367673 251813 2156540 3568608 3368838 1409561 -541265 -625136 497053
42527 497053 536743 -932824 -2020584 -1997271 -2633484 -4686803 -5581576 -2932045 1450540
42518 1450540 3752756 3152879 1977951 1845399 2428577 3353941 4395083 4210974 1917012
42509 1917012 -353504 289677 2753809 3179878 1278372 1191776 4579139 7174345 5063189
42500 5063189 822722 -375154 1563469 1985070 -1516573 -6178312 -8165293 -6697032
42492 -6697032 -3666209 -1286829 -672362 -1396993 -2180163 -2638918 -3673331 -5226218 -5056410
42483 -5056410 -1650886 2622642 3704407 1027890 -1721559 -1403085 919752 1924831
$$ packed form
42545b369386n52778n29947k82072O43676J330436Q49813l13671q22921j88229
42536b235079Q67406J619486J904727J412068j99770j959277j950826q3871J122189
42527D97053L9690j469567j087760K3313o36213k053319q94773K649531M382585
42518A450540K302216n99877j174928j32552N83178R25364J041142j84109k293962
42509A917012k270516O43181K464132M26069j901506q6596L387363K595206k111156
42500E063189m240467j197876J938623M21601l501643m661739j986981J468261
42492f697032L030823K379380O14467p24631p83170m58755j034413j552887J69808
42483e056410L405524M273528J081765k676517k749449L18474K322837J005079
$$ plain form
42475 1924831 310056 -2010352 -2655456 -1860260 -2098871 -4409721 -6222878 -4523648 -580348
42466 -580348 1225172 -326220 -1540839 54289 1413372 -1012357 -4876947 -4960218 -1015632
42457 -1015632 2126866 1904801 842007 1464825 2700244 2770858 2128806 1770262 1521430
42448 1521430 1628446 3333946 6118945 6910911 4065547 88682 -1513267 -294582
42440 -294582 1878162 3640974 4260867 2840967 -245352 -2374604 -1314001 1939145
42432 1939145 4549347 5051185 3739673 1286623 -1163995 -1778890 -47221 1802422
42424 1802422 1309027 -1017966 -2732209 -2817900 -2169216 -1548584 -1087232 -1191112 -1962558
42415 -1962558 -2258302 -1234926 -192674 -782017 -1986508 -1316921 1272582 3234430 3315864
$$ packed form
42475A924831j614775k320408o45104P95196k38611k310850j813157J699230L943300
42466e80348J805520j551392j214619J595128J359083k425729l864590q3271L944586
42457a015632L142498k22065j062794O22818J235419P0614o42052l58544k48832
42448A521430J07016J705500K784999P91966k845364l976865j601949J218685
42440b94582K172744J762812O19893j419900l086319k129252J060603L253146
42432A939145K610202N01838j311512k453050k450618o14895J731669J849643
42424A802422m93395k326993j714243q5691O48684O20632M61352j03880p71446
42415a962558k95744J023376J042252n89343j204491O69587K589503J961848Q1434
$$ plain form
42406 3315864 3022155 3597748 3950160 2745010 805090 125736 1495869 3889137 5445584
42397 5445584 4775461 2250501 131580 373346 2313203 3608214 3134338 1605035 -68352
42388 -68352 -1072069 71102 3887028 7627603 7600004 4351767 2333130 3380448 4101506
42379 4101506 1677407 -1368768 -1359282 588737 900694 -195173 530725 3068895 3738613
42370 3738613 1604427 639249 3614209 7768971 9347458 9384748 11415884 15238223 16890282
42361 16890282 14582294 11207968 10129442 11074210 11617741 10916991 10186633 10303766 10579314
42352 10579314 9885550 8013861 5822160 4617741 5290004 7406253 9155899 8798295
42344 8798295 6334925 3391884 1497628 976579 1428121 2387447 3113708 2553691 445233
$$ packed form
42406C315864k93709N75593L52412j205150j939920o79354J370133K393268J556447
42397E445584o70123k524960k118921K41766J939857J295011m73876j529303j673387
42388f8352j003717J143171L815926L740575k7599l248237k018637J047318P21058
42379D101506k424099l046175R486J948019L11957j095867P25898K538170O69718
42370C738613k134186r65178K974960M154762J578487L7290K031136L822339J652059
42361A6890282k307988l374326j078526R44768N43531p00750p30358J17133K75548
42352A0579314o93764j871689k191701j204419O72263K116249J749646l57604
42344H798295k463370k943041j894256n21049M51542R59326P26261n60017k108458
$$ plain form
42335 445233 -1741928 -1816232 871994 4511459 6459488 5764442 3942447 3186768 3979777
42326 3979777 4887937 4702898 3898319 3374379 2803467 1596074 703923 1383996 2458853
42317 2458853 1449430 -1132288 -1673417 1001135 3215568 2070931 425502 2440670
42309 2440670 6415530 6963797 3458935 1027340 2615969 5214743 5623421 5134088 5692135
42300 5692135 5578022 2686566 -889739 -1605278 163666 1330904 1265627 1878190 3337179
42291 3337179 3547938 1969789 666004 1042734 2161906 2804466 2962524 2754077 1732295
42282 1732295 -221405 -2613205 -4858065 -5920129 -4334799 -427569 2548181 1992404
42274 1992404 -145544 46427 2604203 3919535 2694709 1674183 2567373 3228058 1779944
$$ packed form
42335D45233k187161p4304K688226L639465J948029o95046j821995p55679P93009
42326C979777R08160j85039q04579n23940n70912j207393q92151O80073J074857
42317B458853j009423k581718n41129K674552K214433j144637j645429K015168
42309B440670L974860N48267l504862k431595J588629K598774M08678m89333N58047
42300E692135j14113k891456l576305p15539J768944J167238o5277O12563J458989
42291C337179K10759j578149j303785L76730J119172O42560J58058k08447j021782
42282A732295j953700k391800k244860j062064J585330L907230K975750n55777
42274A992404k137948J91971K557776J315332j224826j020526Q93190O60685j448114
$$ plain form
42265 1779944 85521 478584 1706776 1126445 -844317 -1500231 -154640 1070099 586984
42256 586984 -652089 -800866 529702 1922580 1721050 11875 -1109099 -56542 1765212
42247 1765212 1596248 -585687 -1814146 -578014 931925 331639 -1487202 -2219820 -1535710
42238 -1535710 -519714 611797 1921106 2209589 590281 -1215915 -577640 2449720
42230 2449720 5278899 6144714 5360136 3684178 1620042 309088 1055771 3459488 5371011
42221 5371011 5103746 2948253 682099 221874 2041985 4119204 3581783 519344 -1360974
42212 -1360974 487330 3738973 4602174 3257622 2702578 3382080 2988008 1399938 1474899
42203 1474899 3912953 5392416 3745229 1470838 1489683 2310268 695270 -2794771 -4449482
$$ packed form
42265A779944j694423L93063J228192n80331j970762o55914J345591J224739m83115
42256E86984j239073j48777J330568J392878k01530j709175j120974J052557J821754
42247A765212j68964k181935j228459J236132J509939o00286j818841p32618O84110
42238a535710J015996J131511J309309K88483j619308j806196O38275L027360
42230B449720K829179Q65815p84578j675958k064136j310954P46683K403717J911523
42221E371011k67265k155493k266154m60225J820111K077219n37421l062439j880318
42212a360974J848304L251643Q63201j344552n55044O79502l94072j588070P4961
42203A474899K438054J479463j647187k274391J8845Q20585j614998l490041j654711
$$ plain form
42194 -4449482 -2777696 -63842 1281555 1134196 150094 -1545556 -3212256 -3080227 -549574
42185 -549574 2329768 2962150 1267474 -517427 -895295 -788781 -1711536 -3068948 -2392778
42176 -2392778 1489974 6338656 8418197 6412454 2645766 292119 186367 850282
42168 850282 907413 476908 294451 434065 439342 301865 642568 1820840 3296755 4162617
42158 4162617 4051528 3192414 1810307 -8563 -1919471 -3335045 -3910491 -3594955 -2322380
42149 -2322380 -310829 1440870 1933602 1638434 2175155 4117415 6077208 6466871 5229235
42140 5229235 3328428 1608322 748286 1087914 1685362 950411 -720773 -581014 2520135
42131 2520135 5361721 3964415 -825883 -3998584 -2524343 1601912 4736545 5566206
$$ packed form
42194d449482J671786K713854J345397j47359r84102j695650j666700J32029K530653
42185e49574K879342O32382j694676j784901l77868J06514r22755j357412O76170
42176b392778L882752M848682K079541k005743l766688k353647j05752O63915
42168H50282N7131m30505j82457J39614N277j37477L40703J178272J475915Q65862
42158D162617j11089q59114j382107j818870j910908j415574n75446L15536J272575
42149b322380K011551J751699M92732k95168N36721J942260J959793L89663j237636
42140E229235j900807j720106q60036L39628N97448p34951j671184J39759L101149
42131B520135K841586j397306m790298l172701J474241M126255L134633Q29661
$$ plain form
42123 5566206 4785589 2896355 32632 -2910202 -4441266 -3849211 -1948811 -399259
42115 -399259 -166653 -525326 20746 1677436 3089800 3469654 3560899 3586352 2062275
42106 2062275 -1511767 -4411442 -3706271 -478522 1751404 2058759 2483016 3810463 4544593
42097 4544593 4345352 4821218 5927893 5150136 1895762 -562823 315396 2609580 3218658
42088 3218658 2373068 2060605 2022393 653165 -1227404 -863642 2206321 5054798 5029337
42079 5029337 2801299 1260402 2380515 5393528 7566150 7026859 4989630 4239393
42071 4239393 5205982 5286206 2976110 629135 1208179 3841932 5015421 3371866 938380
42062 938380 -152441 105319 865673 1950704 3292287 4093594 3503325 1806135 474587
$$ packed form
42123E566206p80617j889234k863723k942834j531064N92055J900400J549552
42115c99259K32606l58673N46072J656690J412364L79854R1245K5453j524077
42106B062275l574042k899675P05171L227749K229926L07355M24257J327447P34130
42097D544593j99241M75866J106675p77757l254374k458585Q78219K294184O09078
42088C218658q45590l12463l8212j369228j880569L63762L069963K848477k5461
42079E029337k228038j540897J120113L013013K172622n39291k037229p50237
42071D239393R66589Q0224k310096k346975N79044K633753J173489j643555k433486
42062I38380j090821K57760P60354J085031J341583Q01307n90269j697190j331548
$$ plain form
42053 474587 872987 2767973 4437971 4861746 5262904 7151453 9324350 9057182 6401563
42044 6401563 4498605 4732234 4697853 2750477 1268138 2449404 3805266 1926373 -1248689
42035 -1248689 -752850 3521644 6215104 4382630 1445351 1680987 4625762 7214090
42027 7214090 8390924 8869325 8494666 6774160 4899325 4692349 5929260 6586016 5567728
42018 5567728 3809448 2841847 3374493 5127084 7096139 8020126 7281294 5437322 3660429
42009 3660429 2868310 3395680 4855275 6070063 5818395 4048862 1916888 506507 124735
42000 124735 805332 2462480 4264232 4953761 4377134 3808133 4219932 5184430 6097436
41991 6097436 7334466 9082283 9969872 8452405 5317305 3311647 3940233 5702753
$$ packed form
42053D74587L98400J894986J669998M23775M01158J888549K172897k67168k655619
42044F401563j902958K33629l4381j947376j482339J181266J355862j878893l175062
42035a248689M95839M274494K693460j832474k937279K35636K944775K588328
42027G214090J176834M78401l74659j720506j874835k06976J236911O56756j018288
42018E567728j758280r67601N32646J752591J969055R23987p38832j843972j776893
42009C660429p92119N27370J459595J214788k51668j769533k131974j410381l81772
42000A24735O80597J657148J801752O89529n76627n69001M11799R64498R13006
41991F097436J237030J747817Q87589j517467l135100k005658O28586J762520
$$ plain form
41983 5702753 6046212 4376840 2571909 2873566 5689849 9220481 10964111 9901929
41975 9901929 7525315 6415746 7499781 9191562 9792797 10013264 11786605 14871726
41967 14871726 16575043 15556956 14052696 14780019 17046957 17928498 16385788 14004520
41959 14004520 12260378 11530748 12482496 15516074 18554464 18499147 15833319 14736282 17190921
41950 17190921 20024280 19819619 17798111 17084255 17724001 17778189 17372609 17946575 18803532
41941 18803532 18173290 16811968 16729686 16958287 14710816 10669816 8774919 10116929 11387362
41932 11387362 10700636 10584219 12894127 14736367 12757916 8555403 6112381 5838658
41924 5838658 5040957 3331876 3657850 7562798 12398591 14293325 12150619 7959933
$$ packed form
41983E702753L43459j669372j804931L01657K816283L530632J743630j062182
41975I901929k376614j109569J084035J691781O01235K20467J773341L085121
41967A4871726J703317j018087j504260P27323K266938Q81541j542710k381268
41959A4004520j744142p29630R51748L033578L038390n5317k665828j097037K454639
41950A7190921K833359k04661k021508p13856O39746N4188m05580N73966Q56957
41941A8803532o30242j361322q2282K28601k247471m041000j894897J342010J270433
41932A1387362o86726j16417K309908J842240j978451m202513k443022k73723
41924E838658p97701j709081L25974L904948M835793J894734k142706m190686
$$ plain form
41916 7959933 4442136 3079397 3652631 5100369 6842552 8908463 10593538 10147389
41908 10147389 7004324 3603519 3358719 6767259 10781691 12246010 10908050 8747523
41900 8747523 7355660 6698719 5996274 5071855 4617842 5231571 6406060 6826502 5807301
41891 5807301 4121357 3185113 3726614 5466466 7648774 9439527 10200520 10016538 9767236
41882 9767236 10017787 9973193 8462986 6209597 5965832 9229077 13357477 13672403 8964199
41873 8964199 3450116 2073073 4947370 8093880 8832942 8101502 7500152 6814565 5590010
41864 5590010 4850793 5469074 6470111 6805210 7382926 9268824 11066905 10515092 8052424
41855 8052424 6443878 7124600 9058387 10996300 12647170 13633811 13540263 13246142 14119107
$$ packed form
41916G959933l517797j362739N73234J447738J742183K065911J685075m46149
41908A0147389l143065l400805k44800L408540M014432J464319j337960k160527
41900H747523j391863o56941p02445r24419m54013O13729J174489M20442j019201
41891E807301j685944r36244N41501J739852K182308J790753P60993j83982k49302
41882I767236K50551m4594j510207k253389k43765L263245M128400L14926m708204
41873H964199n514083j377043K874297L146510P39062p31440o01350o85587j224555
41864E590010p39217O18281J001037L35099N77716J885898J798081n51813k462668
41855H052424j608546O80722J933787J937913J650870R86641r3548k94121Q72965
$$ plain form
41846 14119107 15583764 15613085 14047335 13174260 14234632 15523192 15158518 13928933 13940255
41837 13940255 15688877 17784127 18708270 17862231 15628345 13212272 11836215 11595516
41829 11595516 11656284 11632949 11890663 12531617 13233178 14122353 15587575 17187952 17999560
41820 17999560 18017869 17984202 18103876 18336507 19364614 21450433 23098479 23224786 23776335
41811 23776335 26957024 30439927 29594018 24882323 22253062 24480585 26915934 24865895
41803 24865895 20888501 20453643 23471782 25118945 23442722 21245169 20790242 20997252
41795 20997252 20437457 19637655 19394433 19269582 18663419 17684671 16549896 15544668 15533677
41786 15533677 17012809 18839416 19365854 18512887 17370181 16455012 15961941 16765838 19065149
$$ packed form
41846A4119107J464657K9321j565750q73075J060372J288560l64674j229585J1322
41837A3940255J748622K095250R24143q46039k233886k416073j376057k40699
41829A1595516O0768k3335K57714O40954P01561Q89175J465222J600377Q11608
41820A7999560J8309l3667J19674K32631J028107K085819J648046J26307N51549
41811B3776335L180689L482903q45909m711695k629261K227523K435349k050039
41803B4865895l977394m34858L018139J647163j676223k197553m54927K07010
41795B0997252n59795p99802k43222j24851o06163r78748j134775j005228j0991
41786A5533677J479132J826607N26438q52967j142706r15169m93071Q03897K299311
$$ plain form
41777 19065149 20826658 19997461 17742046 16932661 17784482 17840930 16359666 15658861 17288382
41768 17288382 19556490 20138590 19035627 17658366 16757423 16522912 17167772 18135181 18074497
41759 18074497 16816281 16088604 16975535 17883025 16661433 13977093 12772622 14423022
41751 14423022 16933278 17487089 15858621 14426232 14956101 16218236 15495776 12252783
41743 12252783 9275074 9620610 13179351 17057242 18829610 18509993 17735619 18059512 19855697
41734 19855697 21962639 22570624 21329578 20255269 21475632 24382122 26348327 26178715
41726 26178715 25283868 25093061 24903253 23319008 20774911 19272072 19793676 20969596 20592230
41717 20592230 18047937 14972773 13600788 14661557 16918983 18486273 18347059 16925261
$$ packed form
41777A9065149J761509q29197k255415q09385Q51821N6448j481264p00805J629521
41768A7288382K268108N82100j102963j377261r00943k34511O44860R67409o0684
41759A8074497j258216p27677Q86931R07490j221592k684340j204471J650400
41751A4423022K510256N53811j628468j432389N29869J262135p22460l242993
41743A2252783k977709L45536L558741L877891J772368l19617p74374L23893J796185
41734A9855697K106942O07985j241046j074309J220363K906490J966205j69612
41726B6178715q94847j90807j89808j584245k544097j502839N21604J175920l77366
41717B0592230k544293l075164j371985J060769K257426J567290j39214j421798
$$ plain form
41709 16925261 15712997 16097124 17810434 18741319 17255135 14558399 13437409 14573315
41701 14573315 15750964 15200226 13900285 13582302 14218615 14944685 15903718 17325695 17975939
41692 17975939 16626748 14402770 13658203 14837054 16200502 16450145 16002781 15801739 16328494
41683 16328494 17648010 19092731 19163411 17150166 14620661 13887978 15210252 16911486
41675 16911486 18004125 19050800 20397503 21195574 20693580 19430992 18669292 19177738 20655492
41666 20655492 21999217 22389421 22253745 22418886 22314695 20603775 18030905 17454439 19836713
41657 19836713 22529488 23327602 23711754 25505223 26856752 25210782 22412301 22517198
41649 22517198 25426023 27157325 26294882 25727743 27452628 29842981 31122237 31737397
$$ packed form
41709A6925261j212264L84127J713310R30885j486184k696736j120990J135906
41701A4573315J177649n50738j299941l17983O36313P26070R59033J421977O50244
41692A7975939j349191k223978p44567J178851J363448K49643m47364k01042N26755
41683A6328494J319516J444721P0680k013245k529505p32683J322274J701234
41675A6911486J092639J046675J346703P98071n01994j262588p61700N08446J477754
41666B0655492J343725L90204j35676J65141j04191j710920k572870n76466K382274
41657A9836713K692775P98114L84152J793469J351529j645970k798481J04897
41649B2517198K908825J731302q62443n67139J724885K390353J279256O15160
$$ plain form
41641 31737397 32045976 31229787 29853225 30019043 31557400 31605607 29567863 28710312 30719485
41632 30719485 32535169 31473322 29979289 31707139 35678887 38268732 38962035 40149505
41624 40149505 42516694 44525995 45858354 47851152 50619530 52686840 53554115 54258317
41616 54258317 55463313 57096692 59594309 63494515 68203027 73010618 78508365 84889568
41608 84889568 90087221 92599757 95320440 102835412 114776780 125657751 132393267 138456572
41600 138456572 148601993 162424119 176009005 188199839 202036172 220208668 241541517
41593 241541517 262604896 281346202 298243516 314442965 329542025 341440240 348147369
41586 348147369 349226222 345258706 336673845 324040782 309022362 293553775 277827930
$$ packed form
41641C1737397L08579q16189j376562J65818J538357M8207k037744q57551K009173
41632C0719485J815684j061847j494033J727850L971748K589845O93303J187470
41624D0149505K367189K009301J332359J992798K768378K067310Q67275P04202
41616E4258317J204996J633379K497617L900206M708512M807591N497747O381203
41608H4889568N197653K512536K720683P514972J1941368J0880971O735516O063305
41600A38456572J0145421J3822126J3584886J2190834J3836333J8172496K1332849
41593B41541517K1063379J8741306J6897314J6199449J5099060J1898215O707129
41586C48147369J078853l967516q584861j2633063j5018420j5468587j5725845
$$ plain form
41579 277827930 260438368 241178165 222527504 207253746 195197005 183675630 170954272
41572 170954272 158205685 147743975 140182403 134042148 127817696 121586462 116284330 111915387
41564 111915387 107181784 101020890 94046529 88047589 84146952 81816740 79820369 77797798
41556 77797798 76456406 76129182 75731766 73856448 70802273 68628833 68738057 70036329
41548 70036329 70156840 68122957 65140681 63043875 62673601 63653609 65033786 65998895 66288432
41539 66288432 65996814 65057211 63440956 61854812 61211286 61052527 59844866 57665164 57055673
41530 57055673 59731846 63801555 66157114 66445143 66394078 66328746 65357632 64490012 66044087
41521 66044087 69464907 71050721 69017666 65989214 65068826 66082105 67303722 68367358
$$ packed form
41579B77827930j7389562j9260203j8650661j5273758j2056741j1521375j2721358
41572A70954272j2748587j0461710p561572o140255o224452o231234n302132m368943
41564A11915387m733603o160894o974361n998940l900637k330212j996371k022571
41556G7797798j341392l27224l97416j875318l054175k173440J09224J298272
41548G0036329J20511k033883k982276k096806l70274R80008J380177R65109K89537
41539F6288432k91618r39603j616255j586144o43526j58759j207661k179702o09491
41530E7055673K676173M069709K355559K88029n1065o5332r71114q67620J554075
41521F6044087L420820J585814k033055l028452r20388J013279J221617J063636
$$ plain form
41513 68367358 69525954 70266869 70738412 72536275 75979015 78657247 79043929 79443308 82406567
41504 82406567 86010233 86309020 83551650 82161690 84482678 87958255 89206248 87982409
41496 87982409 86081387 84791684 84772905 86516076 89452801 91891226 93015369 93942088
41488 93942088 95935206 98699853 101420210 104352157 107992960 111340865 112628250 111950808
41480 111950808 111816701 114237598 118028311 120282281 120522491 121814107 126661442 133035149
41472 133035149 136538992 136220216 135835808 138737606 143814789 147876568 150047415 151791788
41464 151791788 153983500 156237911 158424283 160703792 162440462 163044951 163700513 166305576
41456 166305576 170605297 174158676 175520391 175992637 177764408 181409369 185537581 188073951
$$ packed form
41513F8367358J158596P40915M71543J797863L442740K678232L86682L99379K963259
41504H2406567L603666K98787k757370j389960K320988L475577J247993j223839
41496H7982409j901022j289703j8779J743171K936725K438425J124143R26719
41488I3942088J993118K764647K720357K931947L640803L347905J287385o77442
41480A11950808j34107K420897L790713K253970K40210J291616M847335O373707
41472A33035149L503843l18776l84408K901798N077183M061779K170847J744373
41464A51791788K191712K254411K186372K279509J736670O04489O55562K605063
41456A66305576M299721L553379J361715M72246J771771L644961M128212K536370
$$ plain form
41448 188073951 187899040 186159082 185785082 188647299 193380271 197140640 199151268 201034566
41440 201034566 203862817 206712147 208496962 209612262 211056676 213109956 215499402 217904576
41432 217904576 219827376 220910572 221786352 223610769 226304085 228267410 228444166 227779678
41424 227779678 227963253 229412010 231106931 231822479 230979184 228913490 226963302 226772722
41416 226772722 228722063 231229749 232234688 231299353 229723868 228663211 227900983 226875837
41408 226875837 226169176 226786821 227926484 226897338 222270793 216095688 211517770 208921360
41400 208921360 206348661 203309674 201522176 201337449 200226262 196399047 191654450 188567678
41392 188567678 186725621 184236812 181547783 180798268 181890473 181962615 178967208 173712895
$$ packed form
41448A88073951j74911j739958l74000K862217M732972L760369K010628J883298
41440B01034566K828251K849330J784815J115300J444414K053280K389446K405174
41432B17904576J922800J083196Q75780J824417K693316J963325J76756o64488
41424B27779678J83575J448757J694921P15548q43295k065694j950188j90580
41416B26772722J949341K507686J004939r35335j575485j060657p62228j025146
41408B26875837p06661O17645J139663j029146m626545o175105m577918k596410
41400B08921360k572699l038987j787498j84727j111187l827215m744597l086772
41392A88567678j842057k488809k689029p49515J092205P2142k995407n254313
$$ plain form
41384 173712895 168248493 164040585 161709140 160693880 159135596 155851886 152353073 150992476
41376 150992476 151215348 149903693 145745386 140929061 137715384 135467202 132328721 128209044
41368 128209044 124636989 122579433 121552569 120396658 118269940 115253627 112192768 109575525
41360 109575525 106897234 103784035 100959225 98864468 96291317 92345249 88992847 88974800
41352 88974800 91276787 91587530 87867350 82722716 79302367 77566734 76052171 74747512
41344 74747512 74216916 73856625 73079471 72643003 72900611 72302624 69678902 66576197 65112555
41335 65112555 64758999 63671721 62207733 62346862 63993913 64620640 62914448 60447946
41327 60447946 59019249 58218649 56578786 53789254 50808682 48602980 47470500 47069653
$$ packed form
41384A73712895n464402m207908k331445j015260j558284l283710l498813j360597
41376A50992476K22872j311655m158307m816325l213677k248182l138481m119677
41368A28209044l572055k057556j026864j155911k126718l016313l060859k617243
41360A09575525k678291l113199k824810k094757k573151l946068l352402j8047
41352H8974800K301987L10743l720180n144634l420349j735633j514563j304659
41344G4747512n30596l60291p77154m36468K57608n97987k623722l102705j463642
41335F5112555l53556j087278j463988J39129J647051O26727j706192k466502
41327F0447946j428697q00600j639863k789532k980572k205702j132480m00847
$$ plain form
41319 47069653 46699914 45971486 45324009 45466303 46449194 47859419 49557116 51249230 51613916
41310 51613916 49293143 45117367 42003171 41711062 42549686 41441547 37910666 34750058
41302 34750058 34427631 35960310 36436895 35145725 34548267 36527961 39184137 39093398 36117638
41293 36117638 33724441 34121167 35265029 34099844 31102942 29509053 30711855 32618770
41285 32618770 32749497 31154282 29523960 28706441 28207863 27594270 27327886 28012774 29260102
41276 29260102 29752191 28691456 27014207 26533540 27645568 28652108 28016806 26568241
41268 26568241 26343136 27651195 28733299 28459759 27887393 28423457 29602143 29787344 28502224
41259 28502224 27044165 27003548 28840227 31556037 33083210 31568759 27421904 23817830
$$ packed form
41319D7069653l69739p28428o47477J42294R82891J410225J697697J692114L64686
41310E1613916k320773m175776l114196k92109Q38624j108139l530881l160608
41302C4750058l22427J532679M76585j291170n97458J979694K656176r0739k975760
41293C6117638k393197L96726J143862j165185k996902j593889J202802J906915
41285C2618770J30727j595215j630322q17519m98578o13593k66384O84888J247328
41276B9260102M92089j060735j677249m80667J112028J006540o35302j448565
41268B6568241k25105J308059J082104k73540n72366N36064J178686J85201j285120
41259B8502224j458059m0617J836679K715810J527173j514451m146855l604074
$$ plain form
41251 23817830 23803077 26755352 29044790 28558274 27074819 27350967 29410588 31279746 32303980
41242 32303980 33642618 35724005 37277780 37382002 36888930 37077893 38006446 38800741 38597102
41233 38597102 36771867 33455628 30442647 30245298 33190582 36533013 37631893 37045519
41225 37045519 37064493 38017831 38007231 36315611 35151071 36986976 41200721 44711881 45981690
41216 45981690 47250924 51772514 59049367 64297139 63561728 58223706 52841592 49382547
41208 49382547 45928098 40942638 35963836 33034129 31875858 31112435 30284792 29067966
41200 29067966 26490138 22872057 20683024 21194565 21944555 20119508 17007144 16059070
41192 16059070 17508438 18276216 16997603 15835465 16764124 18811780 19863720 19119577
$$ packed form
41251B3817830j4753K952275K289438m86516j483455K76148K059621J869158J024234
41242C2303980J338638K081387J553775J04222m93072J88963R28553P94295k03639
41233C8597102j825235l316239l012981j97349K945284L342431J098880n86374
41225C7045519J8974R53338j0600j691620j164540J835905M213745L511160J269809
41216D5981690J269234M521590P276853N247772p35411n338022n382114l459045
41208D9382547l454449m985460m978802k929707j158271p63423q27643j216826
41200B9067966k577828l618081k189033N11541P49990j825047l112364r48074
41192A6059070J449368P67778j278613j162138R28659K047656J051940p44143
$$ plain form
41184 19119577 17114165 15121232 14883158 16986683 19164501 18270797 14450094 11282397
41176 11282397 11080302 12064573 11301389 8816913 7435479 9301098 13413999 16339778
41168 16339778 15400951 11659825 9158736 10409914 13661727 15781690 16236607 16186211 15378736
41159 15378736 13039117 10638107 10149102 10268909 8427367 6256811 8294779 14444765
41151 14444765 18593087 16705777 12033749 9722926 10070868 10230823 9373651 8580156 7922156
41142 7922156 7157026 7696961 10645909 14005977 14713004 12677986 10463338 9777244 10393617
41133 10393617 11640076 12854095 13019648 11701270 9762055 8013484 6275261 4835609
41125 4835609 5153557 7584602 10029325 10497925 9536187 8669271 8202244 8044387 8658495
$$ packed form
41184A9119577k005412j992933k38074K103525K177818q93704l820703l167697
41176A1282397k02095R84271p63184k484476j381434J865619M112901K925779
41168A6339778r38827l741126k501089J251178L251813K119963M54917n0396q07475
41159A5378736k339619k401010m89005J19807j841542k170556K037968O149986
41151A4444765M148322j887310m672028k310823L47942J59955q57172p93495o58000
41142G922156p65130N39935K948948L360068P07027k035018k214648o86094O16373
41133A0393617J246459J214019J65553j318378j939215j748571j738223j439652
41125D835609L17948K431045K444723M68600r61738q66916m67027j57857O14108
$$ plain form
41116 8658495 9519353 8899004 7014096 6712857 8728309 9289356 5712628 1551792 2011166
41107 2011166 6270591 8924471 7784814 5591780 4587757 4163469 4146311 5908653 9071004
41098 9071004 10793398 9782420 8164063 8168656 9388438 10341673 10574219 10271441 9592713
41089 9592713 9048747 9059735 9063941 8611400 8833185 10744589 12742497 12416446 10366076
41080 10366076 9224251 9159174 7790396 4867407 3437004 5323587 8599740 10784511
41072 10784511 11680657 11743866 10492572 8195541 6648923 6529085 6162667 4633221 3966916
41063 3966916 6179508 9750920 11089705 8632344 4168459 1026020 1783691 6380945
41055 6380945 11424307 12704142 9553402 5657569 4748697 6735056 8831710 9116050
$$ packed form
41116H658495Q60858o20349j884908l01239K015452N61047l576728m160836M59374
41107B011166M259425K653880j139657k193034j004023m24288j7158J762342L162351
41098I071004J722394j010978j618357M593J219782R53235K32546l02778o78728
41089I592713n43966J0988M206m52541K21785J911404J997908l26051k050370
41080A0366076j141825o5077j368778k922989j430403J886583L276153K184771
41072A0784511Q96146O3209j251294k297031j546618j19838l66418j529446o66305
41063C966916K212592L571412J338785k457361m463885l142439P57671M597254
41055F380945N043362J279835l150740l895833r08872J986359K096654K84340
$$ plain form
41047 9116050 8020476 7411303 8839893 11665504 12824517 10077735 5513145 3607959
41039 3607959 5471582 7613176 7185036 5528852 5054671 5457653 5203010 4422664 3906061
41030 3906061 3106373 1609939 934715 2308667 4052971 3790421 2084580 1226209 1471083
41021 1471083 1427484 1462000 3471161 7240770 10081384 10669761 10622754 11437832 12273457
41012 12273457 11918522 10924043 10379815 10145453 9696957 9452351 9852179 10211308 9976020
41003 9976020 10179124 11852447 13543346 12508655 8589290 4953766 4211108 5498580
40995 5498580 6665236 7697392 9827642 12208810 12363960 10255369 9088894 10723664
40987 10723664 12685551 11869088 9341239 8639794 10309125 11327345 10004021 8384893
$$ packed form
41047I116050j095574o09173J428590K825611J159013k746782m564590j905186
41039C607959J863623K141594m28140j656184m74181M02982k54643p80346n16603
41030C906061p99688j496434o75224J373952J744304k62550j705841q58371K44874
41021A471083m3599L4516K009161L769609K840614N88377m7007Q15078Q35625
41012A2273457l54935r94479n44228k34362m48496k44606L99828L59129k35288
41003I976020K03104J673323J690899j034691l919365l635524p42658J287472
40995E498580J166656J032156K130250K381168J55150k108591j166475J634770
40987A0723664J961887q16463k527849p01445J669331J018220j323324j619128
$$ plain form
40979 8384893 8827426 10690497 11927510 12137856 12313864 12714075 12664398 11952622 11150721
40970 11150721 10780612 10952059 11501114 11861042 11203923 9371048 7431475 6805925 7879149
40961 7879149 9612040 10398511 9470512 7801297 7297607 8549864 9852375 9302283 7372734
40952 7372734 6208550 6684966 7565674 7540929 6734846 6092255 6506354 8518909 11517695
40943 11517695 13322212 12222135 9559163 8559540 10328218 12793844 13983595 14259638
40935 14259638 14457815 13854274 11462505 7987794 5058350 3384830 2740811 2930500 3797302
40926 3797302 4892678 5836779 6529663 6821236 6731992 6903654 7698937 8100361 7105995
40917 7105995 6017330 7219226 10526948 13105963 13485275 13077124 12931568 11885608 9423334
$$ packed form
40979H384893M42533J863071J237013K10346J76008M00211m9677p11776q01901
40970A1150721l70109J71447N49055L59928o57119j832875j939573o25550J073224
40961G879149J732891P86471r27999j669215n03690J252257J302511n50092j929549
40952G372734j164184M76416Q80708k4745q06083o42591M14099K012555K998786
40943A1517695J804517j100077k662972r99623J768678K465626J189751K76043
40935A4259638J98177o03541k391769l474711k929444j673520o44019J89689Q66802
40926C797302J095376R44101O92884K91573q9244J71662P95283M01424r94366
40917G105995j088665J201896L307722K579015L79312m08151j45556j045960k462274
$$ plain form
40908 9423334 7567064 7771922 8275684 6983420 5076805 5148786 7244833 9374649 10759330
40899 10759330 11933719 12552559 11818997 10638184 10832028 12341105 13367299 13222868 13061204
40890 13061204 13763135 14861114 15612516 15631859 14565578 12627229 11301649 11995730 14032527
40881 14032527 15370916 15255137 14812047 15040206 15507216 15242467 14019240 12645737 12456744
40872 12456744 14127186 16534991 17597457 16843027 16056099 16553263 17227634 16564961 15162348
40863 15162348 14531871 14589836 14210839 13312892 12571358 12072613 12115792 14080325 18156254
40854 18156254 21419883 21038007 18568185 17923581 19582752 20414811 19313457 18977419 20979268
40845 20979268 22998936 23151315 23613523 26681198 29674527 27930687 22129957 18512753
$$ packed form
40908I423334j856270K04858N03762j292264j906615P1981K096047K129816J384681
40899A0759330J174389O18840p33562j180813J93844J509077J026194j44431j61664
40890A3061204P01931J097979P51402J9343j066281j938349j325580O94081K036797
40881A4032527J338389j15779m43090K28159M67010k64749j223227j373503j88993
40872A2456744J670442K407805J062466p54430p86928M97164O74371o62673j402613
40863A5162348o30477N7965l78997q97947p41534m98745M3179J964533M075929
40854A8156254L263629l81876k469822o44604J659171Q32059j101354l36038K001849
40845B0979268K019668J52379M62208L067675K993329j743840n800730l617204
$$ plain form
40837 18512753 20821628 25270732 25679159 21560573 18220206 19412341 23028488 25041246
40829 25041246 24962736 24979999 25489885 24972012 23947262 25309330 29651156 33568206 34471816
40820 34471816 34178506 35274988 36602382 35654387 33500652 33479150 35971116 38259774 39190119
40811 39190119 40210878 41677660 41954482 41039235 41465609 44008036 45556810 43417419
40803 43417419 39525546 38148525 40737899 44895128 47509080 47452714 45850328 44788796
40795 44788796 45324887 46260186 45534752 42942694 40388345 39386134 39704875 40609730 41730120
40786 41730120 42319205 41502774 39936271 39446373 40269508 40471518 39028899 37575766 37836334
40777 37836334 39110865 39839262 40070385 40580146 40766451 39370276 36610084 33940442 32177340
$$ packed form
40837A8512753K308875M449104M08427m118586l340367J192135L616147K012758
40829B5041246p8510J7263N09886n17873j024750J362068M341826L917050R03610
40820C4471816k93310J096482J327394r47995k153735k1502K491966K288658R30345
40811C9190119J020759J466782K76822r15247M26374K542427J548774k139391
40803D3417419l891873j377021K589374M157229K613952n6366j602386j061532
40795D4788796N36091R35299p25434k592058k554349j002211L18741R04855J120390
40786D1730120N89085q16431j566503m89898Q23135K02010j442619j453133K60568
40777C7836334J274531P28397K31123N09761J86305j396175k760192k669642j763102
$$ plain form
40768 32177340 31279879 31480408 33106232 35374904 36553719 35471840 32399677 28793324
40760 28793324 26587102 26972946 29134029 30816783 30793308 29992306 29609103 29262776 28095619
40751 28095619 26618267 25999865 26223636 26435935 26607791 27242980 27710265 26657665 24357403
40742 24357403 22997228 23840769 25297147 24928418 22734428 21196034 22035612 24039970
40734 24039970 24765937 23756437 22943083 23800364 25267804 25213657 23118565 20315115 18200001
40725 18200001 17430257 18397667 20856897 23032309 22780259 20248573 18084676 18325503 20223501
40716 20223501 21856499 22674482 23347490 23940143 23545139 21582691 18701214 16435612 16175793
40707 16175793 17945649 19926213 19978164 18191010 17117886 18628608 21174805 21410434
$$ packed form
40768C2177340q97461K00529J625824K268672J178815j081879l072163l606353
40760B8793324k206222L85844K161083J682754k3475q01002l83203l46327j167157
40751B8095619j477352o18402K23771K12299J71856O35189M67285j052600k300262
40742B4357403j360175Q43541J456378l68729k193990j538394Q39578K004358
40734B4039970P25967j009500q13354Q57281J467440n4147k095092k803450k115114
40725A8200001p69744R67410K459230K175412k52050k531686k163897K40827J897998
40716B0223501J632998Q17983O73008N92653l95004j962448k881477k265602k59819
40707A6175793J769856J980564N1951j787154j073124J510722K546197K35629
$$ plain form
40699 21410434 18513664 15717992 16765302 21275918 24729877 23545673 19291149 16526083
40691 16526083 16864869 17357357 15475457 13195029 13892920 16979791 18767767 17988672 17105925
40682 17105925 17920234 19096249 19017134 18266504 17899355 17636110 17242068 17555850 18681711
40673 18681711 19258097 19001709 19676723 21735390 22480985 20072875 17142992 17306330 19716484
40664 19716484 20579090 19049786 17843732 18223608 18285300 16982977 16247514 17359615 18058690
40655 18058690 15683214 11450979 9062033 9733128 10904660 10010776 7679669 6359863
40647 6359863 6996367 8457327 9898127 12004231 15109309 17471893 17169232 15124551
40639 15124551 14149439 14891290 15026417 13181872 11206202 11025651 11498103 10650290 9289212
$$ packed form
40699B1410434k896770k795672J047310M510616L453959j184204m254524k765066
40691A6526083L38786M92488j881900k280428O97891L086871J787976p79095q82747
40682A7105925Q14309J176015p9115p50630l67149k63245l94042L13782J125861
40673A8681711N76386k56388O75014K058667P45595k408110k929883J63338K410154
40664A9716484Q62606j529304j206054L79876O1692j302323p35463J112101O99075
40655A8058690k375476m232235k388946O71095J171532q93884k331107j319806
40647F359863O36504J460960J440800K106104L105078K362584l02661k044681
40639A5124551r75112P41851J35127j844545j975670j80551M72452q47813j361078
$$ plain form
40630 9289212 9606720 11228182 11582838 9852990 7819751 6820879 6554237 7132565 9478602
40621 9478602 12792452 14249108 12715307 10741317 11168580 13350243 14590793 14143318
40613 14143318 13643483 14040098 14236756 13247993 12117902 12561959 14352723 15313517 14145687
40604 14145687 12276212 12025607 13509148 14670578 14300423 13397198 13103388 13128495 13235695
40595 13235695 14313535 16189630 16250064 12908873 9179810 9481545 13241197 15167418
40587 15167418 12430008 8221524 6858262 8342667 9844479 10264447 10810368 12336190
40579 12336190 14364120 16123990 16952293 16300294 14664618 13726058 14288383 14951540 14158536
40570 14158536 12591247 11950379 12199505 11867947 10625462 9689130 9755428 10205399 10496537
$$ packed form
40630I289212L17508J621462L54656j729848k033239r98872k66642N78328K346037
40621I478602L313850J456656j533801j973990M27263K181663J240550m47475
40613A4143318m99835L96615J96658r88763j130091M44057J790764R60794j167830
40604A4145687j869475k50605J483541J161430l70155r03225k93810K5107J07200
40595A3235695J077840J876095O0434l341191l729063L01735L759652J926221
40587A5167418k737410m208484j363262J484405J501812M19968N45921J525822
40579A2336190K027930J759870Q28303o51999j635676r38560N62325O63157p93004
40570A4158536j567289o40868K49126l31558j242485r36332O6298M49971K91138
$$ plain form
40561 10496537 10858712 11324259 11368248 10957247 10953500 12000854 13654698 14870841 14869263 13563656
40551 13563656 11748321 10713856 10928865 11225613 10131688 7960227 6670343 7527194
40543 7527194 9721541 11524592 12069195 11649010 10837348 9823708 8543899 7254044 6733498
40534 6733498 7506081 8871110 9436728 8898919 8420258 8747292 9066417 8682440 8670129
40525 8670129 10284769 12495678 13017362 11608920 10458023 10978719 11851484 10922898 8040877
40516 8040877 5478636 5989155 10162216 15077259 16543079 13998713 11873765 13795058
40508 13795058 16822425 15198882 9405190 6546261 10228770 14999408 14249089 9638873
40500 9638873 7909073 10884605 14126380 14604952 14200978 14878777 15242093 13818997 12128142
$$ packed form
40561A0496537L62175M65547M3989m11001l747J047354J653844J216143j578j305607
40551A3563656j815335j034465K15009K96748j093925k171461j289884Q56851
40543G527194K194347J803051N44603m20185q11662j013640j279809j289855n20546
40534F733498P72583J365029N65618n37809m78661L27034L19125l83977j2311
40525H670129J614640K210909N21684j408442j150897N20696Q72765r28586k882021
40516H040877k562241N10519M173061M915043J465820k544366k124948J921293
40508A3795058L027367j623543n793692k858929L682509M770638p50319m610216
40500I638873j729800K975532L241775M78572m03974O77799L63316j423096j690855
$$ plain form
40491 12128142 12152838 13285393 13844121 13652368 13314591 12628708 11311864 9810200 8177628
40482 8177628 5921718 4112667 5317588 9608524 12934105 11985096 8836716 7876973
40474 7876973 9619632 10945619 10592027 10521226 11649223 12083751 10960176 10695731 13113739
40465 13113739 15716349 14720735 10623233 7812542 8752422 11168780 11800903 10781353
40457 10781353 10576014 11774772 12202870 10407125 8105414 7948631 9878265 11244834
40449 11244834 10349165 8527978 8392883 10826458 14049287 15234841 13144687 9663916
40441 9663916 8289418 10313699 13187878 13853217 12737846 12429588 13181115 12768785 10946983
40432 10946983 10548720 12838890 14988769 14282467 12117128 11314667 11830425 12020462 12187458
$$ packed form
40491A2128142K4696J132555N58728j91753l37777o85883j316844j501664j632572
40482H177628k255910j809051J204921M290936L325581r49009l148380r59743
40474G876973J742659J325987l53592p0801J127997M34528j123575k64445K418008
40465A3113739K602610r95614m097502k810691R39880K416358O32123j019550
40457A0781353k05339J198758M28098j795745k301711j56783J929634J366569
40449A1244834q95669j821187j35095K433575L222829J185554k090154l480771
40441I663916j374498K024281K874179O65339j115371l08258P51527m12330j821802
40432A0946983l98263K290170K149879p06302k165339q02461N15758J90037J66996
$$ plain form
40423 12187458 13628467 15550470 16136193 15649583 15460281 15030933 13032757 10452426 9203646
40414 9203646 8579381 6807608 5315129 7099924 11069146 12657360 10623672 8628414
40406 8628414 9031655 9847604 9539571 10057499 12454915 13789394 11797103 9186843 9622212
40397 9622212 12180561 13445987 12813573 12052788 11504303 10451309 9891256 11312638 13594645
40388 13594645 14341436 13521442 12830152 12371869 11109544 9837574 10393631 12266830 13145864
40379 13145864 12676706 12584675 13058012 12212767 9700361 7963217 8949039 11799470 14582768
40370 14582768 16369934 16968342 16474336 15786051 16006479 16831277 16862525 15662917 14088839
40361 14088839 12698582 11461249 10848724 11361549 12141551 12062434 11977816 13533141 15815618
$$ packed form
40423A2187458J441009J922003N85723m86610j89302m29348j998176k580331j248780
40414I203646o24265j771773j492479J784795L969222J588214k033688j995258
40406H628414M03241Q15949l08033N17928K397416J334479j992291k610260M35369
40397I622212K558349J265426o32414p60785n48485j052994n60053J421382K282007
40388A3594645P46791q19994o91290m58283j262325j271970N56057J873199Q79034
40379A3145864m69158r2031M73337q45245k512406j737144R85822K850431K783298
40370A4582768J787166N98408m94006o88285K20428Q24798L1248j199608j574078
40361A4088839j390257j237333o12525N12825P80002p9117q4618J555325K282477
$$ plain form
40352 15815618 15962909 13575028 11677716 12283277 13671840 13542474 12439804 12144417 12613346
40343 12613346 12719382 12709518 13686880 15268283 15693759 14220989 12143161 11384203 12750929
40334 12750929 15316312 17059860 16603016 14724652 13552941 13986741 14872561 15151632 15501011
40325 15501011 16783173 17954893 17155029 14605842 12859963 13643378 15489503 15517634 13264668
40316 13264668 11501050 12570971 14972910 15252121 13012900 11721986 13666455 16509133
40308 16509133 16866092 15385417 15388657 17557475 19299480 19249096 19052670 19956212 20607393
40299 20607393 19583866 17715976 16393959 15520062 14657717 14533658 15819001 17716786
40291 17716786 19130590 20065362 20706954 20425373 19013733 17763862 17987676 19410983 21069204
$$ packed form
40352A5815618J47291k387881j897312O05561J388563j29366j102670k95387M68929
40343A2613346J06036r864R77362J581403M25476j472770k077828p58958J366726
40334A2750929K565383J743548m56844j878364j171711M33800Q85820K79071L49379
40325A5501011J282162J171720p99864k549187j745879P83415J846125K8131k252966
40316A3264668j763618J069921K401939K79211k239221j290914J944469K842678
40308A6509133L56959j480675L240K168818J742005n0384j96426R03542O51181
40299B0607393j023527j867890j322017q73897q62345j24059J285343J897785
40291A7716786J413804R34772O41592k81581j411640j249871K23814J423307J658221
$$ plain form
40282 21069204 22638210 23811599 23745809 22532354 21955601 23184293 24804153 24873208 23987718
40273 23987718 24358335 26401343 28215659 28340714 27350436 26581832 26613620 27153452 27393135
40264 27393135 26493728 24713975 23950882 26041109 30382857 34136512 34992468 33169654
40256 33169654 30749560 29722469 30660244 32571450 33797522 33412424 31979671 31002609
40248 31002609 31762197 34450210 37822686 39763198 39076850 36972854 35930926 36833877
40240 36833877 38174307 38415262 37915769 37807009 38127973 38200318 38138811 38858448 40816382
40231 40816382 43411424 45399416 45646450 44053162 42019075 41331205 42371814 44088327
40223 44088327 45580333 46572132 46539565 45164473 43887466 44981695 48385832 51383684
$$ packed form
40282B1069204J569006J173389o5790j213455n76753J228692J619860O9055q85490
40273B3987718L70617K043008J814316J25055r90278p68604L1788N39832K39683
40264B7393135q99407j779753p63093K090227M341748L753655Q55956j822814
40256C3169654k420094j027091R37775J911206J226072l85098j432753r77062
40248C1002609P59588K688013L372476J940512o86348k103996j041928R02951
40240C6833877J340430K40955m99493j08760L20964P2345o1507P19637J957934
40231D0816382K595042J987992K47034j593288k034087o87870J040609J716513
40223D4088327J492006R91799l2567j375092j277007J094229L404137K997852
$$ plain form
40215 51383684 52242759 52167136 52753499 53827847 55044676 57084751 59483323 59798553 57232921
40206 57232921 54761875 55066280 56585811 56574402 55838846 56782826 58567756 58479400 57050022
40197 57050022 57407195 59933307 61928006 62571660 63774974 65631436 65602041 63373231 62114767
40188 62114767 63216325 63995966 62815029 62328685 64700885 67306926 66925152 65317257
40180 65317257 66442200 69988097 71975730 70960457 69568521 69776487 70265159 69443398
40172 69443398 68361988 69012736 71157390 72355806 70956385 68339956 67697638 70261478
40164 70261478 73324961 73217969 69947250 67016973 66537661 66970590 66550582 66211120 67333159
40155 67333159 68902540 69100735 67903943 66027740 63191676 59713858 57854279 58869459
$$ packed form
40215E1383684Q59075p5623N86363J074348J216829K040075K398572L15230k565632
40206E7232921k471046L04405J519531j1409p35556R43980J784930q8356j429378
40197E7050022L57173K526112J994699O43654J203314J856462k9395k228810j258464
40188F2114767J101558P79641j180937m86344K372200K606041l81774j607895
40180F5317257J124943L545897J987633j015273j391936K07966M88672q21761
40172F9443398j081410O50748K144654J198416j399421k616429o42318K563840
40164G0261478L063483j06992l270719k930277m79312M32929m20008l39462J122039
40155F7333159J569381J98195j196792j876203k836064l477818j859579J015180
$$ plain form
40147 58869459 60479893 60096133 58763900 58752721 59163821 57846350 56072313 56711915 58722560
40138 58722560 58462375 56185051 55853741 57983083 58293470 55046412 52224577 52867263 54331423
40129 54331423 53562703 52518807 54139739 56587030 56188027 53554594 52211117 52969163
40121 52969163 53925077 54534993 55513329 55886683 54298683 52375221 52758882 54498450 54469104
40112 54469104 52879641 53119822 56181811 59418501 61143944 62402976 63662529 63810318
40104 63810318 63234208 63903554 65429178 65086057 62857770 62085413 63490842 63201754 59227517
40095 59227517 55437648 55720814 58049556 58217369 56162390 54374481 52926284 50798064
40087 50798064 49853343 52297982 55502093 54593331 49770939 46073616 45823242 46268304 45416799
$$ packed form
40147E8869459J610434l83760j332233j1179M11100j317471j774037O39602K010645
40138E8722560k60185k277324l31310K129342L10387l247058k821835O42686J464160
40129E4331423p68720j043896J620932K447291l99003k633433j343477P58046
40121E2969163R55914O09916R78336L73354j588000j923462L83661J739568k9346
40112E4469104j589463K40181L061989L236690J725443J259032J259553J47789
40104F3810318n76110O69346J525624l43121k228287p72357J405429k89088l974237
40095E9227517l789869K83166K328742J67813k054979j787909j448197k128220
40087E0798064r44721K444639L204111r08762m822392l697323k50374M45062q51505
$$ plain form
40078 45416799 45150302 46753344 47866519 46588880 45095118 46121587 48426378 48788523
40070 48788523 46690449 44142369 42196438 40441753 39162050 39300043 40365634 40497956
40062 40497956 38827592 36312653 34198737 32923141 32480207 32591976 32462200 31564159 30852482
40053 30852482 32022082 35068644 37485658 36658909 32735117 28541194 26750477 27589229
40045 27589229 29399292 30868784 32006860 33035359 33412375 32752235 32025184 32553000 33841828
40036 33841828 33730371 31249177 28290048 27443064 28704079 29493076 28041495 25738167
40028 25738167 25385095 27621484 30137749 30601868 29269173 27888091 26991673 25830484
40020 25830484 24617059 24857108 26972489 29341162 30512457 30757254 30497716 29123739
$$ packed form
40078D5416799k66497J603042J113175j277639j493762J026469K304791L62145
40070D8788523k098074k548080j945931j754685j279703J37993J065591J32322
40062D0497956j670364k514939k113916j275596m42934J11769j29776q98041p11677
40053C0852482J169600L046562K417014q26749l923792m193923j790717Q38752
40045B7589229J810063J469492J138076J028499L77016o60140p27051N27816J288828
40036C3841828j11457k481194k959129q46984J261015P88997j451581k303328
40028B5738167l53072K236389K516265M64119j332695j381082q96418j161189
40020B5830484j213425K40049K115381K368673J171295K44797k59538j373977
$$ plain form
40012 29123739 26912741 26208305 28356753 30856557 30304906 27383498 25967317 27518602
40004 27518602 29440240 29402762 28261298 27493297 26393158 23737779 20561445 19275765
39996 19275765 20714747 23383684 25212254 25232479 23978049 22827800 22685304 23222900 23791674
39987 23791674 24529778 25572293 25876942 24547890 22918208 23190989 25017115 25775035 24667012
39978 24667012 24043794 25666192 27951188 28370222 26727370 24552024 22821294 21805792
39970 21805792 21796189 22438801 22460378 21431455 20771250 21732397 23405306 23965565 22966197
39961 22966197 21266164 19665129 18746116 19134846 20752545 22495833 23447128 23628758 23180203
39952 23180203 22102694 21265554 21919745 23451053 23533802 21539058 19758535 19994804 21143324
$$ packed form
40012B9123739k210998p04436K148448K499804n51651k921408j416181J551285
40004B7518602J921638l7478j141464p68001j100139k655379l176334j285680
39996A9275765J438982K668937J828570K0225j254430j150249j42496N37596N68774
39987B3791674P38104J042515L04649j329052j629682K72781J826126P57920j108023
39978B4667012o23218J622398K284996M19034j642852k175346j730730j015502
39970B1805792r603O42612K1577j028923o60205R61147J672909N60259r99368
39961B2966197j700033j601035r19013L88730J617699J743288R51295J81630m48555
39952B3180203j077509q37140O54191J531308Q2749j994744j780523K36269J148520
$$ plain form
39943 21143324 21753853 22600639 24468799 25581968 24096104 21620147 21314209 23501394
39935 23501394 25874551 27093359 27378107 26393310 23661782 20775484 20174774 21566381
39927 21566381 22164099 20681228 18634101 17512851 17205364 17641900 19428371 21935555
39919 21935555 22930397 21304693 18679961 17349160 17729886 18437021 17916114 15784182 13483743
39910 13483743 13358694 15829375 18010885 16951705 13856263 12810459 15273591 18323895
39902 18323895 18940979 17595364 16509249 16475902 16826902 16941813 16409620 15008514 13744625
39893 13744625 14566335 17670732 20303736 19814795 17005054 14821177 14424742 14404228 13647451
39884 13647451 12988439 13415864 14254019 14325553 14013372 14718651 16470262 17511280 16703347
$$ packed form
39943B1143324O10529Q46786J868160J113169j485864k475957l05938K187185
39935B3501394K373157J218808K84748r84797k731528k886298o00710J391607
39927B1566381N97718j482871k047127j121250l07487M36536J786471K507184
39919B1935555R94842j625704k624732j330801L80726P07135n20907k131932k300439
39910A3483743j25049K470681K181510j059180l095442j045804K463132L050304
39902A8323895O17084j345615j086115l3347L51000J14911n32193j401106j263889
39893A3744625Q21710L104397K633004m88941k809741k183877l96435k0514p56777
39884A3647451o59012M27425Q38155P1534l12181P05279J751611J041018q07933
$$ plain form
39875 16703347 15141674 14507547 14764681 14706439 14116073 13893968 14379445 15112886 16056026
39866 16056026 17297857 17660305 15720037 12467952 10649958 10907782 11066155 10094056 9894155
39857 9894155 11620617 13165309 12644136 11799277 13074154 15436596 16291458 15859480 16280211
39848 16280211 17636203 18356515 18660332 19984342 21447240 20518878 17287544 14735248
39840 14735248 14448603 15097245 15482925 15971931 16249140 14699153 11263581 8613574 9246371
39831 9246371 12891690 17243212 19776251 18976277 15685652 13085289 13380579 14934114
39823 14934114 14864200 13630555 14036850 16267681 17550510 16874520 16350287 17179438 17760334
39814 17760334 16876194 15662346 15297940 15557887 16492404 18571947 20388061 19488388 16523825
$$ packed form
39875A6703347j561673o34127K57134n8242n90366k22105M85477P33441R43140
39866A6056026J241831L62448j940268l252085j817994K57824J58373r72099j99901
39857I894155J726462J544692n21173q44859J274877K362442Q54862m31978M20731
39848A6280211J355992P20312L03817J324010J462898r28362l231334k552296
39840A4735248k86645O48642L85680M89006K77209j549987l435572k650007O32797
39831I246371L645319M351522K533039p99974l290625k600363K95290J553535
39823A4934114o9914j233645M06295K230831J282829o75990n24233Q29151N80896
39814A7760334q84140j213848l64406K59947R34517K079543J816114q99673k964563
$$ plain form
39805 16523825 15188905 16818347 18594348 18677662 19322380 22477449 25622404 25046338 21076830
39796 21076830 17357645 16477302 18295639 21110315 22969645 23280147 23900404 26738984
39788 26738984 30108230 30442530 27945228 26617866 27796111 28277424 26670503 26600988 30561399
39779 30561399 35203237 36628605 36341734 37622284 39546808 39398818 38132033 38492437
39771 38492437 39953581 40307740 40334017 42116784 44438858 44637121 43568852 43993410 45456564
39762 45456564 45725025 45954718 49049157 53791902 56268291 56679282 58775215 62312901
39754 62312901 62414564 57867027 54095479 55376199 59118114 60803306 60316113 60096771
39746 60096771 60455052 60132454 59121358 58023535 56497531 54676753 54263076 55996708
$$ packed form
39805A6523825j334920J629442J776001Q3314O44718L155069L144955n76066l969508
39796B1076830l719185q80343J818337K814676J859330L10502O20257K838580
39788B6738984L369246L34300k497302j327362J178245M81313j606921o9515L960411
39779C0561399M641838J425368k86871J280550J924524j47990j266785L60404
39771C8492437J461144L54159K6277J782767K322074J98263j068269M24558J463154
39762D5456564K68461K29693L094439M742745K476389M10991K095933L537686
39754F2312901J01663m547537l771548J280720L741915J685192m87193k19342
39746F0096771L58281l22598j011096j097823j526004j820778m13677J733632
$$ plain form
39738 55996708 57656325 56590948 52973940 49106469 46889202 46984382 48580790 48928483
39730 48928483 45409527 39492961 36202415 37832188 40612895 39895816 36346174 34067784
39722 34067784 34346259 34718767 33528814 32035603 31747479 32357874 32995625 33470494 33570781
39713 33570781 32856200 31949837 32491278 34686176 36058530 34110670 29819827 27071811
39705 27071811 28293850 31649599 33309870 31936171 29854001 29787875 31610504 33054027
39697 33054027 32890956 32313679 33227272 35997282 39099610 40545306 39483188 36713085
39689 36713085 33931265 32591973 33312142 35672965 38067295 38436871 36284562 33634619
39681 33634619 32813572 33671539 34479378 34963971 36095727 37062417 35600150 32111991 30130959
$$ packed form
39738E5996708J659617j065377l617008l867471k217267R5180J596408L47693
39730D8928483l518956n916566l290546J629773K780707p17079l549642k278390
39722C4067784K78475L72508j189953j493211k88124O10395O37751M74869J00287
39713C3570781p14581r06363N41441K194898J372354j947860m290843k748016
39705B7071811J222039L355749J660271j373699k082170o6126J822629J443523
39697C3054027j63071n77277R13593K770010L102328J445696j062118k770103
39689C6713085k781820j339292P20169K360823K394330L69576k152309k649943
39681C3634619q21047Q57967Q07839M84593J131756R66690j462267l488159j981032
$$ plain form
39672 30130959 31001320 31320098 28185033 24089954 23285249 25461593 26798265 25895735 24836138
39663 24836138 25020084 25598782 25929234 26308033 26088314 24003134 20728307 18615941 18576350
39654 18576350 19405113 20219217 21306996 22492010 22773082 21729562 19701833 17083269
39646 17083269 15035409 15655533 19136970 22084233 21382107 18417254 16487342 15728596
39638 15728596 14425062 13652978 15679708 18619740 18190603 14884496 13813916 16589789
39630 16589789 18953405 18061150 16626406 17444745 18900377 18926125 18961552 20670019 22564468
39621 22564468 23133488 23754455 25280145 25217499 21757435 17428996 15253036 14287705 12553770
39612 12553770 11342372 12624575 14824650 15339232 15027050 16027637 17140986 15756614
$$ packed form
39672C0130959Q70361L18778l135065m095079q04705K176344J336672r02530j059597
39663B4836138J83946N78698L30452L78799k19719k085180l274827k112366l9591
39654A8576350Q28763Q14104J087779J185014K81072j043520k027729k618564
39646A7083269k047860O20124L481437K947263p02126k964853j929912p58746
39638A5728596j303534p72084K026730K940032m29137l306107j070580K775873
39630A6589789K363616q92255j434744Q18339J455632K5748L5427J708467J894449
39621B2564468N69020O20967J525690o2646l460064m328439k175960r65331j733935
39612A2553770j211398J282203K200075N14582l12182J000587J113349j384372
$$ plain form
39604 15756614 12835776 11635554 12581177 13485865 13885798 15112654 16810060 17299738 16819709
39595 16819709 16695026 16094317 13628316 11475254 13385073 18538179 21822252 20789070
39587 20789070 18160108 16605161 15320987 13358929 12381266 13711413 15593513 15850603
39579 15850603 15097842 15052042 15386367 14557502 12714442 11721349 12563962 14099957 14504558
39570 14504558 13409396 12435693 13334562 15495475 16294488 14640951 12766041 12967815 14056917
39561 14056917 13398757 11359584 10705948 12048982 13151802 12918374 12756425 13308230 13193772
39552 13193772 12305647 13070811 16322336 18676745 16764497 12186721 9384784 9740844
39544 9740844 10687599 10208403 9333466 9654827 10684333 10930552 10244767 9697502 9666539
$$ packed form
39604A5756614k920838j200222R45623R04688L99933J226856J697406M89678m80029
39595A6819709j24683o00709k466001k153062J909819N153106L284073j033182
39587B0789070k628962j554947j284174j962058r77663J330147J882100K57090
39579A5850603p52761m5800L34325q28865j843060r93093Q42613J535995M04601
39570A4504558j095162r73703Q98869K160913P99013j653537j874910K01774J089102
39561A4056917o58160k039173o53636J343034J102820k33428j61949N51805j14458
39552A3193772q88125P65164L251525K354409j912248m577776k801937L56060
39544I740844R46755m79196q74937L21361J029506K46219o85785n47265l0963
$$ plain form
39535 9666539 9359790 8415387 7954796 9220864 11553780 12782922 11914605 10544909 10903832
39526 10903832 13012758 14572676 13536672 10272857 7216908 6540630 7949532 8944006
39518 8944006 7857607 6201370 6614928 8749450 9466274 7731697 6643074 8886959
39510 8886959 12616183 14373820 14163058 14469606 15592558 15559941 14153965 13270978 13023440
39501 13023440 11159282 7373014 4793821 5443358 7051678 6611546 4861084 4573674
39493 4573674 5808097 5820341 3529433 1503411 2542175 5796843 7764383 6841600 5439235
39484 5439235 6704116 10065371 11825556 10209206 7639306 6965484 7622426 7511970 6843678
39475 6843678 7318984 8644334 9004666 8565088 9293771 11172831 11736768 10045313 8245000
$$ packed form
39535I666539l06749r44403m60591J266068K332916J229142q68317j369696L58923
39526A0903832K108926J559918j036004l263815l055949o76278J408902R94474
39518H944006j086399j656237M13558K134522P16824j734577j088623K243885
39510H886959L729224J757637k10762L06548J122952l2617j405976q82987k47538
39501A3023440j864158l786268k579193O49537J608320m40132j750462k87410
39493D573674J234423J2244k290908k026022J038764L254668J967540r22783j402365
39484E439235J264881L361255J760185j616350k569900o73822O56942j10456o68292
39475F843678M75306J325350L60332m39578P28683J879060N63937j691455j800313
$$ plain form
39466 8245000 8201908 9100329 9390155 8772262 7322237 5060006 3371696 4300266 7244058
39457 7244058 8990714 8361145 7918825 9287684 9928471 7318572 3659273 2989339 5428879
39448 5428879 7831949 8944133 10257530 12251355 13326379 12694154 11340482 9757025
39440 9757025 7491649 5458032 5856442 8697072 10811716 9759307 6836164 4768714
39432 4768714 4114897 3685057 3201056 3436970 4280935 4691108 4722067 5911639 8994549
39423 8994549 12395935 13870771 12930196 10788727 8532447 6549070 5487168 6126001
39415 6126001 7726115 8025747 6159528 4559878 6314136 11089407 15307576 16183431
39407 16183431 13988369 10483871 7157421 5422773 6457837 9655038 12608732 13648877
$$ packed form
39466H245000m3092Q98421K89826o17893j450025k262231j688310R28570K943792
39457G244058J746656o29569m42320J368859O40787k609899l659299o69934K439540
39448E428879K403070J112184J313397J993825J075024o32225j353672j583457
39440I757025k265376k033617L98410K840630K114644j052409k923143k067450
39432D768714o53817m29840m84001K35914Q43965M10173L0959J189572L082910
39423H994549L401386J474836r40575k141469k256280j983377j061902O38833
39415F126001J600114K99632j866219j599650J754258M775271M218169Q75855
39407A6183431k195062l504498l326450j734648J035064L197201K953694J040145
$$ plain form
39399 13648877 13216411 12076664 9876778 6636331 3970511 3179873 3463157 3746247 4905838
39390 4905838 7941388 10981654 10901792 7783688 5085805 4848282 5191210 3767713 1633222
39381 1633222 1691394 4280747 6456687 5903494 4005753 3985869 6597892 9019334 8470329
39372 8470329 5832209 4350188 5216448 6350731 6011882 5500917 6630117 8078274 6878908
39363 6878908 3259267 1338288 4009461 8976945 11449423 9844419 7151445 6744031
39355 6744031 8378300 9144211 7525876 5172813 4473604 5580918 6801530 7210757 7474155
39346 7474155 8201203 8992713 9507289 10087553 10658130 10311900 8929680 8001239 8599108
39337 8599108 9485632 8619274 5907667 3176678 1942767 2405011 3993557 5567295 5704334
$$ packed form
39399A3648877m32466j139747k199886l240447k665820p90638K83284K83090J159591
39390D905838L035550L040266p9862l118104k697883k37523L42928j423497k134491
39381A633222N8172K589353K175940n53193j897741j9884K612023K421442n49005
39372H470329k638120j482021Q66260J134283l38849n10965J129200J448157j199366
39363F878908l619641j920979K671173M967484K472478j605004k692974m07414
39355F744031J634269P65911j618335k353063o99209J107314J220612M09227K63398
39346G474155P27048P91510N14576N80264N70577l46230j382220r28441N97869
39337H599108Q86524q66358k711607k730989j233911M62244J588546J573738J37039
$$ plain form
39328 5704334 4335207 3545600 5067281 7481481 7953393 6486164 6003781 7817271 9534729
39319 9534729 8677772 6277325 5116921 5801838 6516734 6028251 5139227 5148032 6095515
39310 6095515 6834977 6302263 4670856 3434829 4008234 6078941 7921211 8472482 8186254
39301 8186254 7535720 6002285 3476538 1451596 1370439 2514159 3055539 2732742 2829931
39292 2829931 3726379 4325012 4192911 4413023 5459060 5811840 4062382 1419380 627505
39283 627505 2744055 6190219 8812368 9770192 9412022 8415931 7435040 6859207 6529271
39274 6529271 6069065 5548554 5276113 4949686 3806220 1862958 289683 176146 1509138
39265 1509138 3637268 6014108 8073483 9161839 9220626 8895048 8417244 7210464 5336528
$$ packed form
39328E704334j369127p89607J521681K414200M71912j467229m82383J813490J717458
39319I534729q56957k400447j160404O84917P14896m88483q89024Q805R47483
39310F095515P39462n32714j631407j236027N73405K070707J842270N51271k86228
39301H186254o50534j533435k525747k024942q1157J143720N41380l22797R7189
39292B829931Q96448N98633j32101K20112J046037L52780j749458k643002p91875
39283F27505K116550L446164K622149R57824l58170r96091r80891n75833l29936
39274F529271m60206n20511k72441l26427j143466j943262j573275j13537J332992
39265A509138K128130K376840K059375J088356N8787l25578m77804j206780j873936
$$ plain form
39256 5336528 4304586 5153912 6482176 5990871 3670628 1795571 1787611 2806729 3755376
39247 3755376 4928521 6835250 8724006 9332371 8352610 6496894 4817096 4290717 5059459
39238 5059459 5704221 4516490 1999167 679856 1736041 3432920 3940359 3879304 4470453
39229 4470453 4932769 4042256 2996334 3949097 6264852 7070045 5527363 3775710 3208814
39220 3208814 2673263 1400585 976321 2575685 4448199 4460137 3584699 4282584 6332179
39211 6332179 7108199 5944021 5363369 6987666 8601223 7235077 3810238 2325300
39203 2325300 4577942 7902935 8931831 7773682 6895693 7126839 7119499 6522586 7003522
39194 7003522 9133908 10604287 9415054 7103721 6398177 6886171 5982428 3741722 3340938
$$ packed form
39256E336528j031942Q49326J328264m91305k320243j875057p960J019118R48647
39247C755376J173145J906729J888756O08365r79761j855716j679798n26379P68742
39238E059459O44762j187731k517323j319311J056185J696879N07439o1055N91149
39229D470453M62316q90513j045922R52763K315755Q05193j542682j751653n66896
39220C208814n35551j272678m24264J599364J872514J1938q75438O97885K049595
39211F332179P76020j164178n80652J624297J613557j366146l424839j484938
39203B325300K252642L324993J028896j158149q77989K31146p340n96913M80936
39194G003522K130386J470379j189233k311333p05544M87994r03743k240706m00784
$$ plain form
39185 3340938 6122970 9309060 10125556 9510370 9694445 10400803 10044039 9041767 9001493
39176 9001493 9589527 9242885 8585542 9919714 12892072 13752282 10298040 5209300 2703039
39167 2703039 3540453 5229041 5976499 6266783 6830018 7071338 6193714 4814160 4561653
39158 4561653 6168431 8436765 9462708 8856386 8108544 8295215 8277106 6427068 3562553
39149 3562553 2244194 3088640 3993663 3781575 4227771 6800027 9509638 9557600 7724351
39140 7724351 7126389 8238295 8434537 6715459 5519307 6542796 7728636 6601955
39132 6601955 4424990 4335169 6627192 8692030 9086933 8808010 8361701 6480892 2954360
39123 2954360 342236 851073 2981991 3590544 2490338 2389399 4182122 5171539 3357409
$$ packed form
39185C340938K782032L186090Q16496o15186J84075P06358l56764j002272m0274
39176I001493N88034l46642o57343J334172K972358Q60210l454242n088740k506261
39167B703039Q37414J688588P47458K90284N63235K41320q77624j379554k52507
39158D561653J606778K268334J025943o06322p47842J86671j8109j850038k864515
39149C562553j318359Q44446R05023k12088M46196K572256K709611M7962j833249
39140G724351n97962J111906J96242j719078j196152J023489J185840j126681
39132F601955k176965q9821K292023K064838L94903k78923m46309j880809l526532
39123B954360k612124N08837K130918O08553j100206j00939J792723R89417j814130
$$ plain form
39114 3357409 1102047 2000560 5410657 7157828 5547963 3574321 4234207 6474430
39106 6474430 7556161 7116319 6473297 5617410 3744211 1799561 1539473 2443684 2439346
39097 2439346 1616472 2203629 4467424 5785129 4854256 3857614 4780380 6141958 5504204
39088 5504204 3263248 1721059 1799723 2721297 3818567 4795447 5123568 4769151 4580115
39079 4580115 4687920 3868644 1842209 490608 1046097 1915238 1495336 1297770 3457448
39070 3457448 6617327 7546236 6015877 4801633 5190372 5652738 5039959 4183978 3942464
39061 3942464 4087280 4430997 4984545 5074396 4332762 4043706 5196015 6079502 4721996
39052 4721996 2764118 3259786 5268956 4978129 2200599 949727 2648313 3700698
$$ packed form
39114C357409k255362Q98513L410097J747171j609865j973642O59886K240223
39106F474430J081731m39842o43022q55887j873199j944650k60088R04211m338
39097B439346q22874N87157K263795J317705r30873r96642R22766J361578o37754
39088E504204k240956j542189P8664R21574J097270R76880L28121l54417j89036
39079D580115J07805q19276k026435j351601N55489Q69141m19902j97566K159678
39070C457448L159879R28909j530359j214244L88739M62366o12779q55981k41514
39061C942464J44816L43717N53548Q9851p41634k89056J152309Q83487j357506
39052D721996j957878M95668K009170k90827k777530j250872J698586J052385
$$ [...]
##END NTUPLES=NMR SPECTRUM
##END=
