##TITLE=31Pdec_SR94_rm1
 , 124 sc
 25.10.2021
##JCAMPDX= 6.0         $$ Bruker NMR JCAMP-DX V2.0
##DATA TYPE= NMR SPECTRUM
##DATA CLASS= NTUPLES
##ORIGIN= UXNMR, Bruker Analytische Messtechnik GmbH
##OWNER= root
$$ XWIN-NMR		Version 3.5
$$ Mon Oct 25 10:10:16 2021 Russian Standard Time (UT+4h)  she@DPX200
##.OBSERVE FREQUENCY= 81.013821
##.OBSERVE NUCLEUS= ^31P
##.ACQUISITION MODE= SIMULTANEOUS
##.ACQUISITION SCHEME= undefined
##.AVERAGES= 124
##.DIGITISER RES= 16
##SPECTROMETER/DATA SYSTEM= spect
##.PULSE SEQUENCE= zgpg30
##.SOLVENT NAME= CDCl3
##.SHIFT REFERENCE= (INTERNAL, CDCl3, 0, 248.564)
##AUDIT TRAIL= $$ (NUMBER, WHEN, WHO, WHERE, WHAT)
$$ ##TITLE= Audit trail, XWIN-NMR		Version 3.5
$$ ##JCAMPDX= 5.01
$$ ##ORIGIN= Bruker BioSpin GmbH
$$ ##OWNER= she
$$ F:/spectra/data/she/nmr/P31/1/pdata/1/auditp.txt
$$ ##AUDIT TRAIL=  $$ (NUMBER, WHEN, WHO, WHERE, WHAT)
(   1,<2021-10-25 10:07:22.98 +0400>,<she>,<DPX200>,
      <continue with go, POWCHK disabled, PULCHK disabled
       configuration hash MD5:
       00 E9 B6 7A A2 85 ED C7 34 08 36 98 17 FE 4E 26
       data hash MD5: 32K
       24 A6 6C 67 25 4F 9F 89 F9 25 ED 9F 20 10 A3 80>)
(   2,<2021-10-25 10:07:58.03 +0400>,<she>,<DPX200>,
      <Start of raw data processing
       efp BC_mod = 2 LB = 1 FT_mod = 6 PKNL = 1 PHC0 = -8766.141 PHC1 = -91.93107 SI = 64K 
       data hash MD5: 64K
       8A 03 49 F3 B2 55 16 3E C1 BF 76 B1 D5 B5 96 C6>)
(   3,<2021-10-25 10:08:46.92 +0400>,<she>,<DPX200>,
      <pk PHC0 = -72.06184 PHC1 = 207.6001 
       data hash MD5: 64K
       27 33 D5 0D F2 2D 17 07 32 8B 6D 47 77 6F E8 FC>)
$$ ##END=
$$ 
$$ hash MD5
$$ 5A B6 5B 51 2D C4 9D 19 77 CF 68 A2 D7 B7 7A 81
##$RELAX= 
##$RELAX= 
##$RELAX= 
##$RELAX= 
##$RELAX= 
##$RELAX= 
##$RELAX= 
##$RELAX= 
$$ Bruker specific parameters
$$ --------------------------
##$DU= <F:/spectra>
##$EXPNO= 1
##$NAME= <P31>
##$PROCNO= 1
##$TYPE= <nmr>
##$USER= <she>
##$AMP= (0..31)
100 100 100 100 100 100 100 100 100 100 100 100 100 100 100 100 100 100 
100 100 100 100 100 100 100 100 100 100 100 100 100 100 
##$AQSEQ= 0
##$AQ_mod= 1
##$AUNM= <au_zg>
##$AUTOPOS= <>
##$BF1= 81.014009
##$BF2= 200.13
##$BF3= 200.13
##$BF4= 200.13
##$BF5= 200.13
##$BF6= 200.13
##$BF7= 200.13
##$BF8= 200.13
##$BYTORDA= 1
##$CFDGTYP= 0
##$CFRGTYP= 5
##$CHEMSTR= <none>
##$CNST= (0..31)
1 1 145 1 1 1 1 1 1 1 1 1 1 1 1 1 1 1 1 1 1 1 1 1 1 1 1 1 1 1 1 1 
##$CPDPRG= <waltz16>
##$CPDPRG1= <>
##$CPDPRG2= <waltz16>
##$CPDPRG3= <>
##$CPDPRG4= <mlev>
##$CPDPRG5= <mlev>
##$CPDPRG6= <mlev>
##$CPDPRG7= <mlev>
##$CPDPRG8= <mlev>
##$CPDPRGB= <>
##$CPDPRGT= <>
##$D= (0..31)
0 1 0 0 0 0 0 0 0 0 0 0.03 2e-05 3e-06 0 0 0 0 0 0 0 0 0 0 0 0 0 0 0 0 
0 0 
##$DATE= 1635141844
##$DBL= (0..7)
120 120 120 11 120 120 24 19 
##$DBP= (0..7)
150 150 150 150 150 150 150 150 
##$DBP07= 0
##$DBPNAM0= <>
##$DBPNAM1= <>
##$DBPNAM2= <>
##$DBPNAM3= <>
##$DBPNAM4= <>
##$DBPNAM5= <>
##$DBPNAM6= <>
##$DBPNAM7= <>
##$DBPOAL= (0..7)
0.5 0.5 0.5 0.5 0.5 0.5 0.5 0.5 
##$DBPOFFS= (0..7)
$$ [...]
##$SUBNAM2= <"">
##$SUBNAM3= <"">
##$SUBNAM4= <"">
##$SUBNAM5= <"">
##$SUBNAM6= <"">
##$SUBNAM7= <"">
##$SUBNAM8= <"">
##$SUBNAM9= <"">
##$SW= 501.771253377433
##$SWIBOX= (0..15)
0 1 3 0 0 0 0 0 0 0 0 0 0 0 0 0 
##$SW_h= 40650.406504065
##$TD= 32768
##$TD0= 1
##$TE= 0
##$TE2= 300
##$TE3= 300
##$TEG= 300
##$TL= (0..7)
0 120 53 12 22 120 120 120 
##$TP= (0..7)
150 150 150 150 150 150 150 150 
##$TP07= 0
##$TPNAME0= <>
##$TPNAME1= <>
##$TPNAME2= <>
##$TPNAME3= <>
##$TPNAME4= <>
##$TPNAME5= <>
##$TPNAME6= <>
##$TPNAME7= <>
##$TPOAL= (0..7)
0.5 0.5 0.5 0.5 0.5 0.5 0.5 0.5 
##$TPOFFS= (0..7)
0 0 0 0 0 0 0 0 
##$TUNHIN= 0
##$TUNHOUT= 0
##$TUNXOUT= 0
##$USERA1= <user>
##$USERA2= <user>
##$USERA3= <user>
##$USERA4= <user>
##$USERA5= <user>
##$V9= 5
##$VALIST= <valist>
##$VCLIST= <CCCCCCCCCCCCCCC>
##$VD= 0
##$VDLIST= <DDDDDDDDDDDDDDD>
##$VPLIST= <PPPPPPPPPPPPPPP>
##$VTLIST= <TTTTTTTTTTTTTTT>
##$WBST= 1024
##$WBSW= 4
##$XGAIN= (0..3)
0 0 0 0 
##$XL= 0
##$YL= 0
##$YMAX_a= 24818
##$YMIN_a= -50163
##$ZGOPTNS= <>
##$ZL1= 120
##$ZL2= 120
##$ZL3= 120
##$ZL4= 120
##$ABSF1= 0
##$ABSF2= 0
##$ABSG= 0
##$ABSL= 0
##$ALPHA= 0
##$AQORDER= 0
##$ASSFAC= 0
##$ASSFACI= 0
##$ASSFACX= 0
##$ASSWID= 0
##$AUNMP= <proc_1d>
##$AZFE= 0.1
##$AZFW= 0.5
##$BCFW= 0
##$BC_mod= 2
##$BYTORDP= 0
##$COROFFS= 0
##$CY= -3
##$DATMOD= 1
##$DC= 0
##$DFILT= <>
##$DTYPP= 0
##$F1P= 0
##$F2P= 0
##$FCOR= 1
##$FTSIZE= 65536
##$FT_mod= 6
##$GAMMA= 0
##$GB= 0
##$INTBC= 1
##$INTSCL= 5.30512e-09
##$ISEN= 30
##$LB= 1
##$LEV0= 0
##$LPBIN= 0
##$MAXI= 10000
##$MC2= 0
##$MEAN= 0
##$ME_mod= 0
##$MI= 50
##$NCOEF= 0
##$NC_proc= -6
##$NLEV= 6
##$NOISF1= 182.463
##$NOISF2= 159.3651
##$NSP= 0
##$NTH_PI= 0
##$NZP= 0
##$OFFSET= 248.5645
##$PC= 4
##$PHC0= -8838.202
##$PHC1= 115.669
##$PH_mod= 1
##$PKNL= yes
##$PPARMOD= 0
##$PSCAL= 0
##$PSIGN= 0
##$REVERSE= no
##$SF= 81.014009
##$SI= 65536
##$SIGF1= 159.3651
##$SIGF2= -187.1042
##$SINO= 113.3802
##$SIOLD= 16384
##$SREGLST= <1H.CDCl3>
##$SSB= 0
##$STSI= 65536
##$STSR= 0
##$SW_p= 40650.406504065
##$SYMM= 0
##$S_DEV= 0
##$TDeff= 32768
##$TDoff= 0
##$TI= <>
##$TILT= no
##$TM1= 0
##$TM2= 0
##$TOPLEV= 0
##$USERP1= <user>
##$USERP2= <user>
##$USERP3= <user>
##$USERP4= <user>
##$USERP5= <user>
##$WDW= 1
##$XDIM= 65536
##$YMAX_p= 280508784
##$YMIN_p= -36236807
$$ End of Bruker specific parameters
$$ ---------------------------------
##NTUPLES= NMR SPECTRUM
##VAR_NAME=  FREQUENCY,     SPECTRUM/REAL,   SPECTRUM/IMAG
##SYMBOL=    X,             R,               I
##VAR_TYPE=  INDEPENDENT,   DEPENDENT,       DEPENDENT
##VAR_FORM=  AFFN,          ASDF,            ASDF
##VAR_DIM=   65536,         65536,           65536
##UNITS=     HZ,            ARBITRARY UNITS, ARBITRARY UNITS
##FACTOR=    0.620285442955139, 1,           1
##FIRST=     20137.2065510759, 0,            0
##LAST=      -20513.1999529892, 0,           0
##MIN=       -20513.1999529892, -36236807,   0
##MAX=       20137.2065510759, 280508784,    0
$$ Real data points
##PAGE= N=1
##DATA TABLE= (X++(R..R)), XYDATA
$$ [...]
44163G86715r40291l9197n00953j765470j376860P64755J888487J064957P99590
44154F81733K222926K534661j14671k821522k428835o46474p43037j922767j445011
44145d682997J3818N0427k85421J564312L752982J992247k753746m526939j183258
44136f058575K641763K844138Q99684l29862q67377j217618k19020J830233J881737
44127A405103j036542l295351j968932P23784J344735L08032k21743l36169q04700
44118c881783m43032J306045J960917o2090j874941n18390J841558J616668R6
44109e4952K99180J429793L4006k505629j726660J773295K609491m40363k444471
44100a026310q09008P46683o65965k027204k08754K255489J678699m47294l87204
$$ y = [786715, -153576, -192773, -693726, -2459196, -3836056, -3071301, -1182814, -117857, 681733, 2904659, 5439320, 5324649, 2503127, 74292, -572182, -1315219, -3237986, -4682997, -4669179, -4618752, -4904173, -3339861, 413121, 2405368, -348378, -4875317, -6058575, -3416812, -572674, 327010, -2852, -870229, -2087847, -2306867, -476634, 1405103, 368561, -2926790, -4895722, -4171938, -2827203, -2519171, -2740914, -3077083, -3881783, -4324815, -3018770, -1057853, -1119943, -2994884, -3513274, -1671716, -55048, -54952, 244228, 1674021, 1708027, -797602, -2524262, -750967, 1858524, 1418161, -1026310, -1835318, -1088635, -1754600, -3781804, -3990558, -1735069, -56370, -503664, -890868]
44091h90868J454553J850495N04282j32910K69604m34270k542349l529059j900571
44082e351093O95305J838025R83197n53495r50824O41951K908093L203811O67165
44073D082135k368823l195816j843926j32795R66647J386641Q15073n03340j003749
44064a797953J12232J154443M21558q24604l31991J257179J337507m17908j622692
44055g12229q94113N74884J254568Q42866m12187j884000k256936j067743m3579
44046d598469o85306j394328J50736K615806K581291J15691j200753k5326J127379
44037a313279O88101J47418K28899n76472k008365j265858J479887J748350j864146
44028b735465m004579p27396L395629K193642j929556j919007K158454L299246
$$ y = [-890868, 563685, 2414180, 2918462, 2785552, 3055156, 2620886, 78537, -3450522, -5351093, -4655788, -2817763, -1834566, -2388061, -3338885, -2696934, 211159, 3414970, 4082135, 1713312, -1482504, -3326430, -3459225, -2492578, -1105937, -290864, -794204, -1797953, -1685721, -531278, -109720, -934324, -1266315, -9136, 1328371, 910463, -712229, -1606342, -1031458, 223110, 1065976, 653789, -1230211, -3487147, -4554890, -4598469, -5283775, -6678103, -6527367, -3911561, -1330270, -1214579, -2415332, -2440658, -1313279, -625178, -477760, -248861, -825333, -2833698, -4099556, -2619669, -871319, -2735465, -6740044, -7467440, -4071811, -1878169, -3807725, -5726732, -3568278, -269032]
44020b69032p32266l852374j582028K464654L129208J050911l36204o59828j339471
44011b126430j750493o52075Q49384J154739J001191J500856J492450j10154j433839
44002g4371m24528J313814R09150j100806k023647j572420j404305j230295M94160
43993e113248K611307K295587p569r62943K8124P4588j498576j533424J006789
43984c099365K260240k53476k769268r07262K952208K925433j400034m442433
43976d733957k915990K06978J159394O20457J145874K321541J615662j147091
43968a727132l041230j941513P89390K293898J739416P33193O47462Q93201M00880
43959G87565l23597k7145Q76306N42101j338664k601453j548573O81883J838320
$$ y = [-269032, -1001298, -4853672, -6435700, -3971046, -841838, 209073, -127131, -786959, -2126430, -3876923, -4528998, -3679614, -2524875, -1523684, -22828, 1469622, 1359468, -74371, -498899, 814915, 1724065, 623259, -1400388, -2972808, -4377113, -5607408, -5113248, -2501941, -206354, -213923, -1176866, -1148742, -1074154, -2572730, -4106154, -3099365, -839125, -1092601, -3861869, -4769131, -1816923, 1108510, -291524, -4733957, -7649947, -7442969, -6283575, -5663118, -4517244, -2195703, -580041, -1727132, -4768362, -6709875, -5920485, -3626587, -1887171, -1153978, -506516, 386685, 787565, 463968, 436823, 1313129, 1855230, 516566, -2084887, -3633460, -2951577, -1113257]
43950a113257J296508j85565j998859l293127k446423Q29463L744657L243939
43942G7336J69006j762243r41659O21736Q49491P4452n49945p35463l98839N33326
43932b062802R77709l87435k347071j905017J093384K975457J600152k65117N05949
43923A85209K200704J170714j954616l129601j257169N07516J49941m35327O59461
43914a903168K039908J601625k1238q76562r02214j407675k316198k146731n11802
43905f444055J177619J720163J515219J514477J702584J267483q0606j550429
43897H22455k139061j733699j012217m22922J17426M50955L2236r12046j048186
43888e845059K31489J439969Q30792q97965j327992L63504K399264K888462J844249
$$ y = [-1113257, 183251, -2314, -2001173, -5294300, -7740723, -6911260, -3166603, 77336, 246342, -1515901, -2457560, -1835824, -986333, -911881, -1461826, -2197289, -2596128, -2062802, -1085093, -1472528, -3819599, -5724616, -4631232, -1655775, -55623, -320740, 185209, 2385913, 3556627, 1602011, -1527590, -2784759, -2277243, -2127302, -2562629, -1903168, 136740, 1738365, 1717127, 840565, -61649, -1469324, -3785522, -5932253, -6444055, -5266436, -3546273, -2031054, -516577, 1186007, 2453490, 2372884, 822455, -1316606, -3050305, -4062522, -4485444, -4368018, -3917063, -3884827, -4796873, -5845059, -5613570, -4173601, -3342809, -4240774, -5568766, -5205262, -2805998, 82464, 1926713]
43879A926713L91837o54152r66005o69332n45711j169764j671966p00568J230614
43870b828334K006104Q91569n29370r30645p83309n70046K92239J520588J299935
43861C68731o63197j671139K5513J844276M29066k877486l605540n88197K674971
43852d063002L179889J663012R5060r94604j575015j121807N1053N55708K12363
43843a997343N30962J781361J863435l12593k487785k151778k16816O72164R6250
43834b222143l22042p6466j75267q08127j000396n44866k18516q3932M49047Q53494
43824d149214j06470j895078k255901m21791J650837K146144J683473J590297
43816a757703J548447N75951p88372j079885k14221L53118k58843j227920j193255
$$ y = [1926713, 2318550, 1664398, 698393, 29061, -516650, -1686414, -3358380, -4058948, -2828334, -822230, 69339, -460031, -1390676, -2173985, -2744031, -2451792, -931204, 368731, -294466, -1965605, -1940092, -95816, 333250, -2544236, -6149776, -6737973, -4063002, -883113, 779899, 874959, -119645, -1694660, -2816467, -2765414, -2209706, -1997343, -1466381, 314980, 2178415, 1865822, -621963, -2773741, -2990557, -2318393, -2222143, -2544185, -2620651, -2795918, -3604045, -4604441, -5149307, -5367823, -5451755, -5002708, -4149214, -4255684, -6150762, -8406663, -8828454, -7177617, -5031473, -3348000, -1757703, -209256, 366695, -421677, -1501562, -1715783, -1362665, -1621508, -2849428, -4042683]
43807d042683J16148J538844J552268m9835j487352p57534J647513K874340J278454
43798B670163j299493k033043q86054k06632j076984k004541j415850K48942J540088
43789d463404J822812J356881M45121p37498j894459k618254k467300j202741
43781i758842N55444J374416O96941N0918J161040L105847L201745R11095j214300
43772H4304j255388n21432j064589k375953k423718q39906Q35449J482185J353903
43763d725145J089332J052595J282170J174571p4955j902614k424097j077740
43755e605883L31788N79320R83556K368224K416405o38737l622146k146517K177113
43746c156877L300256k17545k999232j234954J833151J654630p97464j726150
$$ y = [-4042683, -3926535, -2387691, -835423, -885258, -2372610, -3130144, -1482631, 1391709, 2670163, 1370670, -662373, -1548427, -1755059, -2832043, -4836584, -6252434, -6003492, -4463404, -2640592, -1283711, -838590, -1576088, -3470547, -6088801, -8556101, -9758842, -9203398, -7828982, -7132041, -7081123, -5920083, -2814236, 387509, 1298604, 84304, -1171084, -1692516, -2757105, -5133058, -7556776, -8396682, -7561233, -6079048, -4725145, -3635813, -2583218, -1301048, -126477, -201432, -2104046, -4528143, -5605883, -5274095, -4694775, -3711219, -1342995, 1073410, 434673, -3187473, -5333990, -3156877, 143379, -74166, -3073398, -4308352, -2475201, -820571, -1618035, -3344185]
43738c344185o72934K23641P02824J778978K285825L60006k455359k683812k53332
43729d058348J366977M79702q46052n44407P86390J690925J702964P72544q20919
43720E29776j615972l74302J457995J233372p74214j594494k89773P53050J26767
43711e47795l87180N29585J110596k20972j712523j120547M51529M89509o75000
43702b082798o03347J023163J829226M25062j652857k154699p64849R05599J140828
43693a934672j77461j328221o57070J089761J480899r1912j311883m33223R95606
43684b368176P53256l87867k12535P93023K5752k498045l197243o382L983865
43675c114352M065793J7226l449618k458993J408156L306081J227966j714032
$$ y = [-3344185, -4017119, -3793478, -3090654, -1311676, 974149, 1334155, -1121204, -3805016, -4058348, -2691371, -2211669, -3057721, -3602128, -2815738, -1124813, 578151, 1350695, 529776, -1086196, -1460498, -2503, 1230869, 456655, -1137839, -1427612, -674562, -547795, -934975, -405390, 705206, 484234, -1228289, -2348836, -1897307, -1407798, -2082798, -2686145, -1662982, 166244, 591306, -1061551, -3216250, -3981099, -3075500, -1934672, -2112133, -3440354, -4097424, -3007663, -1526764, -1618676, -2930559, -3363782, -2368176, -1614920, -2002787, -2215322, -1422299, -1396547, -3894592, -7091835, -7098217, -3114352, 951441, 968667, -2480951, -4939944, -3531788, -225707, 1002259, -711773]
43667g11773j672145Q39119K063947M65483j517571j545676n42016m01499q26320
43658c848451n21680J21655r5160p00874k97079R08865J522298J399357J518863
43649G794J820260J326319J65976o20703j035544j723133j942760m30074J787357
43640f44508K147114M17887r39060p86122p21824j542019j476547L21436J508053
43631a715590J94578j632976j229260L81743L40803r77851o48936J496992K234611
43622a555886L00858j309988j32712J765719J145720j224719j926562l71677M94845
43613b814402q09032j794477N7362L192985L985295J550006j609268l096649k618854
43604c957034p99961J623973L068833J859926j267304l272151k552085q58624
$$ y = [-711773, -2383918, -1544799, 519148, 984631, -532940, -2078616, -2620632, -3022131, -3848451, -4370131, -4248476, -4343636, -5044510, -5341589, -4432724, -2910426, -1511069, 7794, 1828054, 3154373, 3320349, 2699646, 1664102, -59031, -2001791, -2431865, -644508, 1502606, 1920493, 981433, 195311, -526513, -2068532, -3545079, -3223643, -1715590, -1521012, -3153988, -4383248, -4001505, -3660702, -4638553, -5287489, -3790497, -1555886, -1255028, -2565016, -2697728, -932009, 213711, -1011008, -2937570, -3309247, -2814402, -3623434, -5417911, -5360549, -2167564, 1817731, 3367737, 1758469, -1338180, -3957034, -4756995, -3133022, -64189, 1795737, 528433, -2743718, -5295803, -6154427]
43596f154427k20610R0721J572605L172211K628054K65458j282945r28898j65246
43587a023077j37277j37765M17530O90784k529r55570j205196o50462L56497J248465
43577a398600J017731o33659j973501j097485Q80804J017267p85868j360779M87126
43568c846964J724504O6276k030269j324472Q91313J148418l25640l00530J642982
43559b354382K340264M73212j245635o39919O03847J62797j096144r81965K43946
43550b493979O42044L2734l9427O03400L45954j145710j738578J11451K764976
43541i17135L402377J643309m57759j476145j853041k067364j508332N8464J449550
43532a726076J606986J019906N02420k26854j388784j854839q44138K06964l01059
$$ y = [-6154427, -6375037, -6284316, -4711711, -1539500, 1088554, 1354012, 71067, -857831, -1023077, -1160354, -1298119, -880589, -189805, -192334, -1147904, -2353100, -3003562, -2647065, -1398600, -380869, -1014528, -2988029, -4085514, -3204710, -2187443, -2973311, -4334090, -3846964, -2122460, -2056184, -4086453, -5410925, -4519612, -3371194, -3696834, -3997364, -2354382, -14118, 459094, -786541, -1426460, -822613, -659816, -1755960, -2737925, -2493979, -1851935, -1819201, -1858628, -1255228, -909274, -2054984, -3793562, -3682111, -917135, 2485242, 4128551, 3670792, 2194647, 341606, -1725758, -3234090, -3175626, -1726076, -119090, 900816, 1403236, 1176382, -212402, -2067241, -2911379, -2704415, -3005474]
43523c005474j146937q3948J976106J852157p23615k312687j014717R07975J040794
43514b510346J52362k92769p03053j190146r5710K491433K984586l57546l353724
43505b874913j614261K178203K071252j655692k934634K87002L030613J561422
43497D8992j131377r60306R12416J016026n88464j272472m21076M24869N41703
43488a429689K66407m75484j407395r84314J332760L177679K160453n03100j781938
43479C55379j161709m42472j28983Q16351J882806R22281k212607m576089l722336
43470h267379n48409K272819L140700K144686L18642r47146q32749M5823N13313
43461b159700M94675O05496M48563p88962k100799j430422P63037J331031q40268
$$ y = [-3005474, -4152411, -4236359, -2260253, -408096, -1131711, -3444398, -4459115, -3551140, -2510346, -2357984, -2650753, -3353806, -4543952, -4639662, -2148229, 836357, 478811, -2874913, -4489174, -2310971, -239719, -1895411, -4830045, -4543043, -1512430, 48992, -1082385, -2042691, -1130275, -114249, -702713, -1975185, -2396261, -1971392, -1429689, -1163282, -1638766, -3046161, -4030475, -2697715, 479964, 2640417, 2137317, 355379, -806330, -1248802, -1377785, -561434, 1321372, 2243653, 31046, -4545043, -8267379, -8815788, -6542969, -3402269, -1257583, -938941, -1886087, -2718836, -2673013, -2159700, -1665025, -1059529, -610966, -1399928, -3500727, -4931149, -4168112, -2837081, -3677349]
43452c677349k483662n27136L039948L779043J065975j461705j358559j8180N80128
43443a061497O28837P34163J87335j069365j062834J124972K681118N55063l384465
43434f66673m188967q29593K208956J376233j228861j671680j8275O11782p24776
43425e131854j763917r14082O44088J178904O23654r3564m17047k64402J43690
43416e994530K39414j91849l44169M93600J455520J146850j05876p44581n24783
43407d570404n77932r27139k61405J365978K021444R49818j41573M0202M98852
43398a602159L13209N27563J843611K582979J206900q72351j342300l82066K92688
43389B568074L00708Q5110r01124k688761l001761l35682K436407J498469j619660
$$ y = [-3677349, -6161011, -6688147, -3648199, 130844, 1196819, -264886, -1623445, -1641625, -1061497, -432660, 301503, 488838, -580527, -1643361, -518389, 2162729, 2717792, -666673, -4855640, -5685233, -3476277, -2100044, -3328905, -5000585, -5018860, -4407078, -5131854, -6895771, -7809853, -7165765, -5986861, -5363207, -5456771, -5873818, -6138220, -5994530, -5755116, -5946965, -6291134, -5797534, -4342014, -3195164, -3301040, -4045621, -4570404, -5148336, -6075475, -6336880, -4970902, -2949458, -1999640, -2141213, -2101011, -1602159, -1288950, -761387, 1082224, 3665203, 4872103, 3999752, 2657452, 2275386, 2568074, 2868782, 2953892, 2052768, -635993, -3637754, -3973436, -1537029, -38560, -1658220]
43380a658220j758753J740223L617851Q20842k798216k636463r9427N34517r52334
43371c189980j239146O12427J972549J144136m02938p54629N1261R42129J219169
43362C54978N59509q95570k079657j785797j31119J556899K139571J316223m02804
43353F32233j549609o86690J262357J213104j710139l760099j356913L115137
43345b840619M072266P31513j998592j110558O62379L51523m22277P04295J860697
43336B010627K4670l311641m064649j877465j17939j14816J76484J513105J759781
43327d001843J24075r62466n9811O53693o42584j847294l80268K130163K120615
43318b865720k95927j608434l78315J025835O06238m15443j45518R36397J149614
$$ y = [-1658220, -3416973, -1676750, 1941101, 2761943, -36273, -2672736, -2772163, -2237646, -3189980, -4429126, -3816699, -1844150, -700014, -1102952, -1857581, -1806320, -864191, 354978, 914487, 18917, -2060740, -3846537, -3977656, -2420757, -281186, 1035037, 632233, -917376, -1604066, -341709, 871395, -838744, -4598843, -5955756, -2840619, 1231647, 1963160, -35432, -1145990, -483611, -132088, -554365, 149930, 2010627, 2035297, -1276344, -5340993, -7218458, -7336397, -7451213, -7274729, -5761624, -4001843, -3877768, -4840234, -4900045, -4246352, -4888936, -6736230, -7116498, -4986335, -2865720, -3161647, -4770081, -5148396, -4122561, -3516323, -3931766, -4077284, -3140887, -1991273]
43309a991273L22427l99149o44674j086720j778698j615012M9465K009468K252372
43300b881794L66574j766375k095331o74805R21504J921051K719434L098574K029713
43291C638545j01003j080713j327J051686K24707j003543l79672J048611O07870
43282D005161j192078j237097Q75768J949340L64445j542204j616760q94913o76594
43273C5068l4289J395336J414871r64229k738628j397841N38553l75010k271459
43264d397628r55398K407165K549690j022489k636241N20280L754994K227412
43256B447785j869219l363029j663885L3515M45527O17683L87153j101015k263081
43247f328566p47641K079502K418025n6622j595055l39587J115616M66659p86025
$$ y = [-1991273, -1668846, -2067995, -2712669, -3799389, -5578087, -7193099, -7143634, -5134166, -2881794, -2515220, -4281595, -6376926, -7051731, -6130227, -4209176, -1489742, 1608832, 3638545, 3537542, 2456829, 2455502, 3507188, 3731895, 2728352, 2348680, 3397291, 4005161, 2813083, 1575986, 2451754, 4401094, 4765539, 3223335, 1606575, 711662, 35068, 779, 1396115, 2810986, 1846757, -891871, -2289712, -1751159, -2126169, -4397628, -5353026, -2945861, -396171, -1418660, -4054901, -3534621, 220373, 2447785, 578566, -2784463, -4448348, -4414833, -3969306, -3351623, -2964470, -4065485, -6328566, -7076207, -4996705, -2578680, -2635302, -4230357, -4569944, -3454328, -2987669, -3773694]
43238c773694o01050J67335J42792L60457J852270K712895R78025j433057j387029
43229i81056K08510l5136j917156j826632P21703J724987n10759k030894L25099
43220d321334L331611K426832q06098j318598J103923J884199l93376j870893
43212C6266m19665O92248j264239l482857k257332Q17168J537849k79634j297271
43203e917467m69837J18925j52772N61130K393436K628215K14316j942900j173191
43194c740145J101734J861818P79294k79486n32172o78344q66594m51823M88769
43185b316949J094166J085617R24821P70234L70460j83215n51574p82792j048274
43176f37506j085850o87557k90125k56774j21947N08869R20445L07415o77606
$$ y = [-3773694, -4374744, -4207409, -4064617, -3704160, -1851890, 861005, 1839030, 405973, -981056, -772546, -807682, -2724838, -4551470, -3829767, -2104780, -2615539, -4646433, -4321334, -989723, 1437109, 631011, -687587, 416336, 2300535, 1907159, 36266, -383399, 308849, -955390, -4438247, -6695579, -5878411, -4340562, -4620196, -5917467, -6387304, -6268379, -6421151, -5860021, -3466585, -838370, -624054, -2566954, -3740145, -2638411, -776593, 2701, -276785, -808957, -1487301, -2353895, -2805718, -2316949, -1222783, -137166, 787655, 1557889, 1928349, 1745134, 1193560, 410768, -637506, -1723356, -2410913, -2701038, -2957812, -3079759, -2570890, -1650445, -1343030, -2020636]
43167b020636p03850K40367R58856R09182N71314J62639m64384p19281J61234
43158i04559J274842P83131r40964j113425J238955L041996J350718j880538k200035
43149F50121P77611K578427L35404l079023l302775n50105J304529N05090p81561
43140a562282m35850O98037R00409L84766L87782Q23463N84824m96245j476253
43131a91349j716251j274011k67326R69514J429286L86699j304458j940357q92341
43122d800594J022156K616738K797464P95671k462786l963110j720962K016870
43114c698553L053188P25890j469741j074721M16455P78993K63594p354k01520
43105a213769m35323K75155J656641J297483j424631l130163j224768J567175
$$ y = [-2020636, -2724486, -2484119, -1525263, -616081, -44767, 117872, -346512, -1065793, -904559, 370283, 1153414, 212450, -900975, 337980, 3379976, 4730694, 2850156, 650121, 1427732, 4006159, 4341563, 1262540, -2040235, -2590340, -1285811, -780721, -1562282, -1998132, -1300095, -399686, -14920, 372862, 1196325, 1781149, 1284904, -191349, -1907600, -3181611, -3448937, -2479423, -1050137, -663438, -1967896, -3908253, -4800594, -3778438, -1161700, 1635764, 2431435, -31351, -3994461, -5715423, -3698553, -645365, 80525, -1389216, -2463937, -2047482, -1268489, -1004895, -1012249, -1213769, -1649092, -1373937, 282704, 1580187, 155556, -2974607, -4199375, -2632200]
43097b632200J233583j086956j251024P42822R62317j446599k811977j244690
43089g534724O33785P16978M85530J116500R53259o90936j313472L50950J519289
43080c762841J64630j063045N32045K549410J418302j307126j503467O35789J393405
43071i42898J3601p61306j69797l83321j728770j707655L69773J963039J522681
43062a824653L78694m26776j411080j945693l38805K276560K397411k7400p57307
43053a679049J656515K742338o80537m588853l486723J253339L704363J947224
43045H68617n32628r04034L1026O01893L03921q33649j994006j285597J480257
43036b264200K899420K63248l463847l047427J377532M560160L782996J439622
$$ y = [-2632200, -1398617, -2485573, -3736597, -2993775, -2031458, -3478057, -6290034, -7534724, -6900939, -6183961, -5698431, -4581931, -3628672, -4319608, -5633080, -5282130, -3762841, -3598211, -4661256, -4129211, -1579801, -161499, -1468625, -2972092, -2336303, -942898, -929297, -1690603, -1860400, -2243721, -3972491, -5680146, -5310373, -3347334, -1824653, -1445959, -1872735, -3283815, -5229508, -5568313, -3291753, -894342, -921742, -1679049, -22534, 2719804, 2039267, -2549586, -6036309, -4782970, -1078607, 868617, 335989, -568045, -537019, 64874, 368795, -464854, -2458860, -3744457, -2264200, 635220, 898468, -2565379, -5612806, -4235274, 324886, 4107882, 5547504]
43028E547504l07809k139277l628779k226406J358346K003260k067259n129770
43020f590190k122780L158338L726182K09682q24890J956844K670862j511842
43012F72206n140346k894728K237128L850850J474224k56388L45370M39826j161054
43003d32912j693310K49466J700793K44894j633253n89581J751331J166267k280555
42994a516860m156697k402363J59101R60345J188983K261701K598369P62220j242137
42985a387338j137181l50786j182665k181877o29156J990958J910932k96766l32485
42976c596364K392762L470087R57469j333094m64832P85468p47708k799834j627816
42967b963862J403154J984392l51694k150053j580581k7891J075019J415491N64715
$$ y = [5547504, 5239695, 3100418, -528361, -2754767, -1396421, 606839, -1460420, -6590190, -8712970, -5554632, -1828450, -1618768, -2443658, -486814, 2184048, 672206, -4468140, -7362868, -5125740, -1274890, 199334, -57054, 288316, 728142, -432912, -2126222, -1876756, -175963, 68931, -1564322, -2153903, -402572, 763695, -1516860, -5673557, -8075920, -7916819, -6956474, -5767491, -3505790, -907421, -145201, -1387338, -2524519, -2875305, -4057970, -6239847, -6869003, -4878045, -2967113, -3263879, -3596364, -1203602, 2266485, 3223954, 1890860, 1426028, 2211496, 1463788, -1336046, -2963862, -1560708, 423684, 71990, -2078063, -3658644, -3686535, -2611516, -1196025, -631310]
42958f31310j113587j306910J089859K908662P30961l184691l608898l21547J761101
42949c676360N58267n46452Q39943K430248K073518J300529J421149O73282j625630
42940C448494k421889q5840J788192j8650k598703j659468J133079J192089r59740
42931a82436r85617J203124J366716j060681j616051J189687K877764N39831k334138
42922I98199j961339j84798j92225o85084Q33083K476076J166245j115873j82135
42913A152149K720291K330277j799688m152878k000678N99866j97531k324604
42905c672796k301073r62283p54801q61556O05051K198300J501101N829R20391
42896c321837L277889L075781j10492k470133k199988j636185k142117j592821
$$ y = [-631310, -1744897, -3051807, -1961948, 946714, 1677675, -1507016, -5115914, -5437461, -3676360, -3118093, -3664545, -2824602, -394354, 1679164, 2979693, 4400842, 5074124, 3448494, 1026605, 940765, 2728957, 2710307, 111604, -1547864, -414785, 777304, -182436, -1168053, 35071, 1401787, 341106, -1274945, -85258, 2792506, 3332337, 998199, -963140, -1147938, -1340163, -2025247, -1192164, 1283912, 2450157, 1334284, 1152149, 3872440, 6202717, 4403029, 250151, -1750527, -1150661, -1348192, -3672796, -5973869, -6936152, -7690953, -8552509, -7947458, -5749158, -4248057, -4242228, -3321837, -43948, 3031833, 2921341, 451208, -1748780, -3384965, -5527082, -7119903]
42888g119903J062035K982876J951675J81163M53488J396407K21637k067604k224314
42879c162540k65397N92558p47058j695532l50189J621281J721784J03152j150490
42870c332431r47205n6157M36048N08288Q38538J447166J382916K57671o12028
42861g7194Q3603J228706N71245j537116k217720n35192R74286N84426J01444
42852h23512J127561J666779m01341l023739k915380q54367M3730j64460J000631
42843d344098L017016K545194p92880l338688k827748q50518Q49533K429318L324367
42834A1496J874688q57540j070464J894458L637990J266561j924537j682997N08437
42825C658092J15385l067311m572528j857631K322488L720512J501491j457908
$$ y = [-7119903, -6057868, -3074992, -1123317, -942154, -488666, 907741, 1129378, -938226, -3162540, -3427937, -2835379, -3582437, -5277969, -5628158, -4006877, -2285093, -2181941, -3332431, -4279636, -4335793, -3899745, -3391457, -2552919, -1105753, 277163, 534834, -77194, 6409, 1235115, 1806360, 269244, -1948476, -2483668, -1509382, -924956, -823512, 304049, 1970828, 1569487, -1454252, -4369632, -5223999, -5180269, -5344729, -4344098, -1327082, 1218112, 425232, -2913456, -5741204, -6591722, -5742189, -3312871, 11496, 1886184, 1028644, -41820, 1852638, 5490628, 6757189, 4832652, 3149655, 3658092, 3773477, 706166, -3866362, -5723993, -3401505, 319007, 1820498, 362590]
42817C62590k062015j96267J469376Q55353j061173k054008j812570j369307m85732
42808f353753J454925K736201J259343j073610l64576K620451K955019k07317
42800C026683j759948O56007K277335n50787l668375k034503J622596J578110
42792A147118j267580j652018P14558J424333l59839j105736J4723J26110j030439
42783a988770m27569J778087J608414j425996k638226O0100K560892J455864q95898
42774H6898j409952j361654k586542k988077l36779K741349K243389q76998k173563
42765f661929k33640K050392K114524N03706q26372p45813M39176J313313P84185
42756a262458k32741O2756J141523M90662j847349k249252Q50942L440251J339204
$$ y = [362590, -1699425, -1895692, -426316, 429037, -632136, -2686144, -4498714, -5868021, -6353753, -4898828, -2162627, -903284, -1976894, -2341470, 278981, 3234000, 3026683, 1266735, 1922742, 4200077, 3649290, -19085, -2053588, -430992, 1147118, -120462, -1772480, -1057922, 366411, 6572, -1099164, -1084441, -958331, -1988770, -2416339, -638252, 970162, -455834, -3094060, -3033960, -473068, 982796, 86898, -1323054, -2684708, -5271250, -8259327, -8596106, -5854757, -3611368, -4488366, -6661929, -6895569, -4845177, -2730653, -2226947, -3053319, -3799132, -3359956, -2046643, -1262458, -1495199, -1432443, -290920, 199742, -1647607, -3896859, -3045917, 394334, 1733538]
42747A733538l236667m508017j219652K237281K520866J161911Q54544J304349
42739H48153O35404j135197k123590j348115R3340O65388K83683O5904N39105
42730a475925R24851N57852Q8368K44850K20449j051354k521350k085645j5690
42721e113594J073545J64443p42314o6264R92329R20025L93527N48310P46795
42712a083198L5455p96983n30560M60246J108872J185581N86627j048254k540358
42703b622572j366490K282371M187691J668714j932745j877120Q78683J512558
42695B731090r81970k794863j860391n15159n84113l81013J330523K263480L82375
42686d10041k084752j672325J025528K318770Q76237q20235n56030P10850R44952
$$ y = [1733538, -1503129, -6011146, -7230798, -4993517, -2472651, -1310740, -456196, 848153, 1483557, 348360, -1775230, -3123345, -3030005, -2364617, -2080934, -2015030, -1475925, -551074, 6778, 95146, 339996, 560445, -490909, -3012259, -5097904, -5113594, -4040049, -3875606, -4617920, -4684184, -3691855, -2771830, -2378303, -1829993, -1083198, -1047743, -1844726, -2375286, -1915040, -806168, 379413, 966040, -82214, -2622572, -3989062, -1706691, 2481000, 4149714, 2216969, 339849, 1218532, 2731090, 1749120, -1045743, -2906134, -3421293, -4005406, -4386419, -3055896, -792416, -410041, -2494793, -4167118, -3141590, -822820, 53417, -766818, -1322848, -611998, 332954]
42677C32954J39411j87787L14167L47282p32426j619297r79823L49542N57848
42668a478129k56086l20260N76009L71457j737203l290727j971252P50685J776318
42659e579188R40643O33118J519142J707765L41627r25465q56073m67553p57199
42650c443183q64397n3039M19426o41272j864911j054567J364341K815625K255073
42641a066904J261702J126079Q72765p16473k627325k871821j527434o05232q21599
42632f976242n01128J378826K894425J808539o77205j297429M65422J698223P38744
42623d67825k63526R58924K876454K334407p28635l247203l172005j464647p2023
42614c246079K67520O7526K86353J484797K806260K286232o03069l414957l388410
$$ y = [332954, 472365, 284578, 598745, 946027, 213601, -1405696, -2385519, -2035977, -1478129, -1734215, -2054475, -1478466, -1107009, -2844212, -6134939, -8106191, -7355506, -5579188, -4638545, -4005427, -2486285, -778520, -436893, -1362358, -2218431, -2685984, -3443183, -4307580, -4360619, -3941193, -4582465, -6447376, -7501943, -6137602, -3321977, -1066904, 194798, 1320877, 2193642, 1477169, -1150156, -4021977, -5549411, -6154643, -6976242, -7477370, -6098544, -3204119, -1395580, -2072785, -3370214, -2904792, -1206569, -467825, -731351, 227573, 3104027, 5438434, 4709799, 1462596, -1709409, -3174056, -3246079, -2978559, -2911033, -2624680, -1139883, 1666377, 3952609, 3349540, -65417, -3453827]
42605c453827j132603K72375l61925j014916J70479K228666K986447J880575J26996
42596A702267j031680j354842j305865j278500j074701k73917P26842P37991n04974
42587c657379j470006p50468Q59222J507755Q66287Q0526k76825m81678k95398
42578c617964P42973J773921J340735j96461r06977k82950j4184j094826k012192
42569d267925r66563J397022K697530J620796p92742k313942j636555L80237J624303
42560b257839J154919J48438p6266J03285j67327l87168K36732R57562P24609
42551D36945K77355O98294Q56102q51934k920312k286866O59821K191613P67908
42542a71074j107008j307194p25078l41715O09172J875931J259476j357537k527171
$$ y = [-3453827, -4586430, -4314055, -4675980, -5690896, -5520417, -3291751, -305304, 1575271, 1702267, 670587, -684255, -1990120, -3268620, -4343321, -4617238, -3890396, -3152405, -3657379, -5127385, -5877853, -5018631, -3510876, -2644589, -2564063, -2840888, -3322566, -3617964, -2874991, -1101070, 239665, 43204, -863773, -1146723, -1160907, -2255733, -4267925, -5234488, -3837466, -1139936, 480860, -311882, -2625824, -4262379, -3882142, -2257839, -1102920, -954482, -1030748, -927463, -1094790, -1481958, -1245226, -287664, 436945, 714300, 1412594, 2268696, 1416762, -1503550, -3790416, -3130595, -938982, -171074, -1278082, -2585276, -3310354, -3652069, -3042897, -1166966, 92510, -1265027, -3792198]
42533c792198m10615J830809R05199j347405j200555Q98832J570971J74957q15827
42524b185832k53367N37682O33381L80084k31650j267600j489256j0657J442517
42515b444698P71951q85980r13392L59980N71026n8077Q38173K812820K534194
42506C585997n75334k866517k003603j12913L15216M1379N06682R50181M80044
42497C21132J36403M75002j25795k158055k794281j18648K965397K673806J64594
42488A539555n87277P31694Q81558r14315j697523q0376J420631P55187n84659
42479A464475p43384o35180j535623k059895l47062K375740L215236J693123j31081
42470C296349j072482j836156k640159k256139j85315J947245K221815P17081
$$ y = [-3792198, -4202813, -2372004, -1466805, -2814210, -4014765, -3115933, -1544962, -1370005, -2185832, -2439199, -1901517, -1268136, -888052, -1119702, -2387302, -3876558, -3887215, -2444698, -1672747, -2558727, -3472119, -3112139, -2541113, -2599190, -1761017, 1051803, 3585997, 3010663, 144146, -1859457, -1972370, -1657154, -1615775, -1109093, -158912, 321132, 457535, 932537, 806742, -1351313, -4145594, -4264242, -1298845, 1374961, 1539555, 952278, 1683972, 2565530, 1651215, -46308, -126684, 1293947, 2049134, 1464475, 721091, 85911, -1449712, -3509607, -3856669, -1480929, 1734307, 3427430, 3296349, 2223867, 387711, -2252448, -4508587, -4693902, -2746657, -524842, 192239]
42462A92239p71974p64422N28070J452428N91157j336776j791559L63080K667510
42453A129753J910354j165218k454198k39702K383761K212185L80697k54298M6688
42444C950022j008478l069495l314485j214644M47087N1907n94432K36986J352905
42435c162627J103563K43940J86484L55541l95005j234666o24636R19878J607172
42426a000356J137687N95861K54443m46423j252648j365624q87743l24506N15458
42417b773851J340566M75552k329834l662627n65278M035498M376860L19713k150096
42408i33497o1842K085706j58139l879956l441637P13385L053120J335215j012540
42399b300185q71902N80927R13756J29556k31357M10611J355766J610263O83699
$$ y = [192239, -579735, -1344157, -816087, 636341, 1227498, -109278, -1900837, -1537757, 1129753, 3040107, 1874889, -579309, -819011, 1564750, 3776935, 4157632, 3903334, 3950022, 2941544, -127951, -3442436, -4657080, -4209993, -4158086, -4752518, -4515532, -3162627, -2059064, -1815124, -1628640, -1273099, -1668104, -2902770, -3527406, -2607528, -1000356, 137331, 733192, 987635, 541212, -711436, -2077060, -2964803, -3289309, -2773851, -1433285, -957733, -3287567, -6950194, -7515472, -3479974, 896886, 1216599, -933497, -995339, 1090367, 932228, -2947728, -6389365, -5675980, -2622860, -1287645, -2300185, -3172087, -2591160, -1677404, -1547848, -1779205, -1368594, -12828, 1597435, 2281134]
42390B281134o66280q21259L30068M07834k014172m123920k162209K516199M460224
42381B07619J656259j848843k152001n01082O6682l60100J892R09314J035457
42372i84803P27414P64438J18531j859722k743460k71396K968784K364367j648215
42363e64062l773545j544599J584184K116932J263856J502278J993684O61229
42355C239957j568538k075436q55811l55324j428892k190921j070963J103945
42347e201983K563989K612941J635279J58039j416761k559534k587425j141782
42339e937237J105749K534395K059430M15816q30066j247909j365289r80436M62064
42330c783483J913296J554401M8827K28832K451259L262642O92255k017188r77718
$$ y = [2281134, 1614854, 793595, 1123663, 1531497, -482675, -4606595, -6768804, -4252605, 207619, 1863878, 15035, -2136966, -2638048, -2571366, -2931466, -2929574, -2020260, -984803, -257389, 507049, 625580, -1234142, -3977602, -4248998, -1280214, 1084153, -564062, -4337607, -5882206, -4298022, -2181090, -917234, 585044, 2578728, 3239957, 1671419, -404017, -1259828, -1615152, -3044044, -5234965, -6305928, -5201983, -2637994, -25053, 1610226, 1768265, 351504, -2208030, -4795455, -5937237, -4831488, -2297093, -237663, 178153, -651913, -1899822, -3265111, -4245547, -3783483, -1870187, -315786, -266959, -38127, 2413132, 5675774, 6368029, 4350841, 3373123]
42321C373123K276083K988628K02031k351061k133334q29866p64384j385958p31786
42312F43476J538510L755023L859593J168968k445258l592854j101144J969118
42304E795432J988704m07000j694517q80120k07514o42014m74578Q59495J369914
42295E707802L27327j00462J073491J425510n16780j970089k64735K201935J407622
42286I291621j697625k504688l5644J596153k65471k793461k125735R74372K443426
42277D882948N06688k460206l398559k029822l37044K38667M6980j9534J36992
42268b432890K89637Q38447K128077L116625K120779p96267l316944l296697r64204
42259b313437J563621K193986L02809k581798l486069q41315L068700M107073
$$ y = [3373123, 5649206, 8637834, 8839865, 6488804, 4355470, 3525604, 2761220, 1375262, 643476, 2181986, 5937009, 9796602, 10965570, 8520312, 4927458, 3826314, 5795432, 7784136, 7377136, 5682619, 4802499, 4594985, 3952971, 3478393, 4337888, 5707802, 6035129, 5934667, 7008158, 8433668, 7916888, 5946799, 5682064, 7883999, 9291621, 7593996, 5089308, 5053664, 6649817, 6384346, 3590885, 1465150, 2439522, 4882948, 5389636, 2929430, -469129, -2498951, -2835995, -2597328, -2550348, -2569882, -2432890, -2143253, -1304806, 823271, 3939896, 6060675, 5264408, 1947464, -1349233, -2313437, -749816, 1444170, 1746979, -834819, -4320888, -5162203, -2093503, 2013570]
42251B013570J262524k046024k383415k22488J640825J817622R00691k95478j273681
42242A414146j450814p38405K4959K96595P33053J898837K993072K895566J581493
42233I648502l97460k710686m551275m457143k120893O64623J996920J798038
42225a29374R92858K11751J23872J188933K046379M17211k982450m057529r12580
42216c100929K861920L116492P29371r32011j509778k513376k840914m16951K826844
42207a779332K847207J54507o51598J468043K158440r08695l835565k538657J023652
42198b061998K140547J72580j424193n02017J311430J262333j110654l259461
42190c471433k161255J747368L968210J274800l236980l701187K40469K958429
$$ y = [2013570, 3276094, 1230070, -1153345, -1375833, 264992, 2082614, 2983305, 2687827, 1414146, -36668, -775073, -750114, -453519, 279534, 2178371, 5171443, 8067009, 9648502, 9251042, 6540356, 1989081, -2468062, -4588955, -3924332, -1927412, -129374, 863484, 1075235, 1199107, 2388040, 4434419, 4851630, 1869180, -2188349, -3100929, -239009, 2877483, 3606854, 2674843, 1165065, -1348311, -4189225, -4606176, -1779332, 1067875, 1222382, 570784, 2038827, 4197267, 3288572, -546993, -3085650, -2061998, 78549, 251129, -1173064, -1675081, -363651, 898682, -211972, -3471433, -5632688, -3885320, 82890, 1357690, -1879290, -5580477, -5340008, -2381579]
42182b381579J315467j184294p49948R38041O70981o32313m41717L23851n84836
42173b726347j823021n56302J937068J809264p56467j481105J088701L262965
42165G54756K063127o29298j605623p56689J23315M23389M51475m3321j062657
42156b81526j413926l11548J095736J228243K08319p10223r25302n48334L88829
42147a269732J547769J893446R59966j34780j91076J64524m97751j891634k185930
42138a605198p80233P05006P67282l4269l68987k12680l57993o24541j57761P14177
42128a955197O31585m74861q84730K69602J397903Q07337n93547o84827O02354
42119h84381J384846P91376j98260p74615j076884q46399M38505J686399R42184
$$ y = [-2381579, -1066112, -2250406, -3000354, -2062313, -1391332, -2023645, -2465362, -2141511, -2726347, -4549368, -5105670, -3168602, -1359338, -2115805, -3596910, -2508209, 754756, 2817883, 2188585, 582962, -173727, -50412, 372977, 824452, 781131, -281526, -1695452, -2007000, -911264, 316979, 525298, -184925, -1110227, -1658561, -1269732, 278037, 2171483, 3131449, 2996669, 2805593, 2970117, 2472366, 580732, -1605198, -2385431, -1680425, -913143, -947412, -1316399, -1529079, -1887072, -2511613, -2669374, -1955197, -1323612, -1798473, -2683203, -2413601, -1015698, -208361, -801908, -1486735, -884381, 500465, 1291841, 1093581, 318966, -757918, -1604317, -1165812, 520587, 1462771]
42110A462771j139472j262202J538723L578327J575174k238533l210389r71413
42102f67014N92697m50157j704902r05536P05610J076513P76018J484252K653288
42093C560769K076795o52135l146208k975976l75521K171773K578627J075572
42085D313696m79142r62191j043131j555369j753095m52949J587880K207137R39108
42076B801944k29188P6161N47761n02262k240834k563599j361958m09044k15687
42067d096706P15394K867266M002126K038810j536385l039977j186963J354701
42059A118266J468638o71250k344191j948995n60922J50878K41462R20710K333106
42050G07702L029221J825254n60863k231884k128823q46387L42311O51808q020
$$ y = [1462771, 323299, -938903, 599820, 4178147, 5753321, 3514788, 304399, -667014, -74317, -524474, -2229376, -3134912, -2429302, -1352789, -576771, 907481, 3560769, 5637564, 4985429, 1839221, -1136755, -1512276, 659497, 3238124, 4313696, 3834554, 2872363, 1829232, 273863, -1479232, -1932181, -344301, 1862836, 2801944, 2572756, 2648917, 3196678, 2694416, 453582, -2110017, -3471975, -3881019, -4096706, -3381312, -514046, 3488080, 5526890, 3990505, 950528, -236435, 1118266, 2586904, 1915654, -428537, -2377532, -2938454, -2787576, -2546114, -1625404, 707702, 3736923, 5562177, 5001314, 2769430, 640607, -205780, 136531, 788339, 780319]
42041G80319j195446j899710j049390J154306K847775K411475N35616p30642q54092
42032B000211j188913k147511j936691N68643L282053L258987P30366j376597
42024C190548j531805r07050n82577R864J106951J437400L78491o24896l94777
42015B082149j13007j173873k321669j267916J572493L357918K662713Q25546
42007E624354o53509j787378k549177j842078O10244K870485K895676J186643
41999F355260j14239k00061j93161r38120j665144j285586m5384P82546M61023
41990C157134m61907r10611n42012r0162l06600p09468k3748J844899L081760
41981E039285K088221k07386j393812p21483K66289L85975L38283Q02501P78370
$$ y = [780319, -415127, -2314837, -3364227, -2209921, 637854, 3049329, 3584945, 2854303, 2000211, 811298, -1336213, -3272904, -2704261, 577792, 3836779, 4567145, 3190548, 1658743, 751693, 169116, 178980, 1285931, 2723331, 3101822, 2476926, 2082149, 1969142, 795269, -1526400, -2794316, -1221823, 2136095, 4798808, 5624354, 4970845, 3183467, 634290, -1207788, -597544, 2272941, 5168617, 6355260, 6241021, 6040960, 5847799, 4909679, 3244535, 1958949, 1913565, 2696111, 3157134, 2695227, 1784616, 1242604, 1152442, 845842, 136374, 112626, 1957525, 5039285, 7127506, 6920120, 5526308, 4804825, 5071114, 5457089, 5795372, 6597873, 7376243]
41972G376243o39108k166944j984065o60315k96349j137691j336740j54680R22812
41963g6837Q07170L83425N97980R01197O48016L49713M51730M22868L5379n7640
41953D463001J26652l21997r96042j21748K014134K374700j57561k325430j344786
41944C710923O50388L81257j017133m10693J474571J464876j32294k11524J129510
41935G039881O96016j538638j756108J161126L630430L343768K220921J723678
41927A6521074M00135j705002j525483J190860J809047j653431m046198r57645
41919A0033357L566382L108982r03288j865485J203386K629849m24206l989241
41911A3359736m003992j682917k34001k17041k99131J03363P29915J307544J493523
$$ y = [7376243, 6737135, 4570191, 2586126, 1925811, 1629462, 491771, -844969, -999649, -76837, 730333, 1113758, 1711738, 2612935, 3260951, 3610664, 4062394, 4485262, 4520641, 4463001, 4589653, 4267656, 3271614, 3149866, 5164000, 7538700, 7381139, 5055709, 3710923, 4361311, 4742568, 3725435, 3314742, 4789313, 6254189, 6121895, 5910371, 7039881, 7735897, 6197259, 4441151, 5602277, 9232707, 12576475, 14797396, 16521074, 16921209, 15216207, 13690724, 14881584, 16690631, 15037200, 10991002, 10033357, 13599739, 16708721, 15805433, 13939948, 15143334, 17773183, 17348977, 13359736, 9355744, 7672827, 7438826, 7221785, 6922654, 7026017, 7755932, 9063476, 10556999]
41902A0556999J188845R67212J023531M54506r55878j636586q30713l50533j187385
41893I229998q79686K043173L657480p1987n550205n594933n44696J976328p87887
41884C477585k673010M74024L531937R33655l608182l075704J463075L078271
41876C601651L89235j036089J386486L209129P85925k776402k796052L0827J607766
41867D402476P23315l94477m30138l73800q21174q30530q377M67617k25368j179277
41857A330267j160194j40193J285642K642847K911779Q46970k558468l701613
41849A457037p87847K791867K522370p34555k036377O1702J638451N0376k152813
41840B810211k037317o56566K43232J662030L847149L541213n42646l340089m34103
$$ y = [10556999, 11745844, 12713056, 13736587, 14191093, 13235215, 11598629, 10767916, 10417383, 9229998, 8350312, 10393485, 14050965, 13978978, 8428773, 2833840, 2289144, 4265472, 3477585, 804575, 1278599, 4810536, 5744191, 2136009, -939695, 523380, 3601651, 3990886, 2954797, 4341283, 7550412, 8336337, 5559935, 2763883, 2794710, 4402476, 5125791, 4731314, 4301176, 3927376, 3106202, 2275672, 2267295, 2734912, 2509544, 1330267, 170073, 29880, 1315522, 3958369, 6870148, 7717118, 5158650, 1457037, 669190, 3461057, 5983427, 5248872, 3212495, 3274197, 4912648, 4963024, 2810211, 772894, 116328, 359560, 2021590, 5868739, 9409952, 8867306, 5527217, 5093114]
41831E093114L746070J856152m254677n583651P5653M809752L034506q83754j066653
41822F826512R30260O24840j420894j715185j58451R11073J228271J654752J206835
41813A0088013p76343j887110k26594J597011L80375j956934j340660J478780
41805G356538K112703j25718j349994J97815J483573l6478k480751k714910o09204
41796C833574J648210K563179K225935J438563R13381O71546J11690o93961m35567
41787A2276550J513538L393752K894662K30161k119676k361571q44549Q77426
41779A5860293J317035R6831j379493j311239j27995O3374p20474K1149K392192
41770A6211673K537704j159201l996079j392570L563342M369748R10818j076909
$$ y = [5093114, 8839184, 10695336, 6440659, 857008, 932661, 5742413, 8776919, 7893165, 6826512, 7756772, 8381612, 6960718, 5245533, 5087082, 5998155, 7226426, 8881178, 10088013, 9311670, 7424560, 7197966, 8794977, 9175352, 7218418, 5877758, 7356538, 9469241, 9343523, 7993529, 8191344, 9674917, 9638439, 7157688, 4442778, 3833574, 5481784, 8044963, 10270898, 11709461, 12622842, 13294388, 13406078, 12712117, 12276550, 13790088, 17183840, 20078502, 20308663, 18188987, 15827416, 14982867, 15860293, 17177328, 17274159, 15894666, 14583427, 14455432, 14518806, 13798332, 13819481, 16211673, 18749377, 17590176, 13594097, 12201527, 15764869, 20134617, 21045435, 19968526]
41762A9968526M84796J566643k20562j758724m45233J345627Q21148n91600n15074
41753B0655547k2166j196466k870440k362387J00014J746556J127765p24271k228878
41744A4225274k494886j314543N91168J820453J635523M63696j023848k054516
41736A1848321j259811J719302M134741K585088j842485m164319k354266l3k91163
41727A0375375j248136O1766K103009J762316N2020K25009J712804Q97773k407518
41718A3534418m049145j875632J172639J804155P16285K22252L85196k0171o21307
41709A1268690j25262J102249J453267P18684L34937R35733J419832R82311N75688
41700A8666129J286738K263912J722276l42920k022048k230736j916816j872070
$$ y = [19968526, 20453322, 22019965, 21799403, 20040679, 19595446, 20941073, 21762221, 21170621, 20655547, 20633381, 19436915, 16566475, 14204088, 14304102, 16050658, 17178423, 16454152, 14225274, 11730388, 10415845, 11007013, 12827466, 14462989, 14926685, 13902837, 11848321, 10588510, 12307812, 16442553, 19027641, 17185156, 13020837, 10666571, 10666538, 10375375, 9127239, 9189005, 11292014, 13054330, 13106350, 13331359, 15044163, 15941936, 13534418, 9485273, 7609641, 8782280, 10586435, 11302720, 11524972, 11910168, 11889997, 11268690, 11143428, 12245677, 13698944, 14417628, 14752565, 15688298, 17108130, 18090441, 18666129, 19952867, 22216779, 23939055, 23596135, 21574087, 19343351, 17426535, 15554465]
41692A5554465j194722N99931J658923K93962j804000j735700j08164j33466j973855
41683A1157374k022906Q87660K663619L8241l893222l939286l15076K299532J961797
41674H837733J297284K144939K629577R10791j439065j855217n20643L36292k60694
41665A2080997j179392j167156l93423R7595j39520l54159L38216J389779J119619
41656A1792556q91849k606922j807077J003812L123544K704335K73949k290678
41648A1301670l233583j951937K67819J196705N05429N74730K803106M479944
41640A5943883K123394k737219m567510j173769L186642L524874L27561k024815
41632A4603041j217308R80510J845933P87869p49261j226690n16979K16603Q8797
$$ y = [15554465, 14359743, 14959674, 16618597, 16912559, 15108559, 13372859, 13264695, 13131229, 11157374, 9134468, 10022128, 12685747, 12723988, 8830766, 4891480, 4576404, 6875936, 8837733, 10135017, 12279956, 14909533, 15820324, 14381259, 12526042, 12005399, 12341691, 12080997, 10901605, 9734449, 9341026, 9438621, 9299101, 8944942, 9283158, 10672937, 11792556, 10900707, 8293785, 6486708, 7490520, 10614064, 13318399, 13592348, 11301670, 8068087, 6116150, 6383969, 7580674, 8086103, 8660833, 11463939, 15943883, 18067277, 15330058, 10762548, 9588779, 12775421, 16300295, 16627856, 14603041, 13385733, 14366243, 16212176, 17000045, 16250784, 15024094, 14507115, 14723718, 14812515]
41623A4812515m06118m17710k59400o71359j057662k32793J219079J389030N6729
41614A4432311r02005n52014j8541J02540Q75700K418935K795562J169372l78148
41605A9943712j17238O35592L27444K04777J678251K909447J587709n68347j52021
41596B6449326K002225J625180k087339m578858k173851L066653O312516N447483
41588C6063335K292882J68459J056253L659972M271635J500024o15326K510522
41580E0907756Q492483J0060400N575873K106154N229356J0861154J1814512Q510637
41572A13558325P217978R935621J2652560J3275563J4654532J8164975K0135620
41565B09595174J7771360J4099764J3071910J3034657R642710L293209j328881
$$ y = [14812515, 14406397, 13988687, 13729287, 13057928, 12000266, 11767473, 12986552, 14375582, 14432311, 13530306, 12978292, 12959751, 13062291, 13937991, 16356926, 19152488, 20321860, 19943712, 19826474, 20462066, 20789510, 20994287, 22672538, 25581985, 27169694, 26601347, 26449326, 28451551, 30076731, 27989392, 23410534, 21236683, 24303336, 30615852, 36063335, 38356217, 38524676, 39580929, 43240901, 47512536, 49012560, 48397234, 50907756, 59400239, 69460639, 75036512, 77142666, 82372022, 93233176, 105047688, 113558325, 120776303, 130711924, 143364484, 156640047, 171294579, 189459554, 209595174, 227366534, 241466298, 254538208, 267572865, 277215575, 280508784, 279179903]
41558B79179903k737755m776822j0003894j5180067j6105941j4019085j3533782
41551B02822557j5617078j6544323j3957514j0294882q759069q796297p892666
41544A20960728n892406m806328n311766o053308o097312n825972n483561m811547
41536G6678528m023254l355501k109560j55782M66127j743602m221895l238603
41528E8296458l8820M30238k525842l922750j416786O31301j140905k818258J21814
41519D7616450M311677L313987j831276m066113j203948J706236J064194r48714
41511D9962493j882552k584360l221001j449778K662305M787657K503566q26642
41503D9951688j330372R7371Q64438J207208K115111K160511L13087r19065Q15191
$$ y = [279179903, 276442148, 271665326, 261661432, 246481365, 230375424, 216356339, 202822557, 187205479, 170661156, 156703642, 146408760, 137649691, 128853394, 120960728, 115068322, 110261994, 104950228, 98896920, 92799608, 86973636, 81490075, 76678528, 72655274, 69299773, 67190213, 67034431, 67500558, 65756956, 61535061, 58296458, 58257638, 58687876, 56162034, 52239284, 50822498, 51453799, 50312894, 47494636, 47616450, 51928127, 55242114, 53410838, 49344725, 48140777, 49847013, 50911207, 49962493, 48079941, 45495581, 42274580, 40824802, 43487107, 48274764, 50778330, 49951688, 48621316, 48718687, 49583125, 50790333, 52905444, 55065955, 55379042, 54459977, 55275168]
41494E5275168L213848K562022m37412k076172j328588j53044O35422J740778
41486E9432022K422783J146649j041762j394236K61631J340829O59240k44788
41478F2582368q3495P09705J666212K819333L412786K544003J129713Q20420J141653
41469G6742698L54558j072297r01509Q86094J842051J346709J740311L924830
41461H4863445N105969L030563l7754k10770K540327M370724K804011P234M0338
41452A02514087L569159O523156M930501M79219r80714K732381O554054M900411
41444A31222254l23214k341412Q86019M254839L332043K90249n7258K924663N541484
41435A45729667M883172J824537n61960k64791J843324L094992K196327P33351
$$ y = [55275168, 58489016, 61051038, 60613626, 58537454, 57208866, 57055822, 57691244, 59432022, 61854805, 63001454, 61959692, 60565456, 60827087, 62167916, 62827156, 62582368, 62498873, 63208578, 64874790, 67694123, 71106909, 73650912, 74780625, 75601045, 76742698, 77097256, 76024959, 75123450, 76009544, 77851595, 79198304, 80938615, 84863445, 89969414, 92999977, 92962223, 92751453, 95291780, 99662504, 102466515, 102473749, 102514087, 106083246, 112606402, 117536903, 118016122, 117035408, 119767789, 126321843, 131222254, 130899040, 128557628, 129443647, 133698486, 137030529, 137320778, 137263520, 140188183, 145729667, 150612839, 152437376, 151875416, 151610625, 153453949, 156548941, 158745268, 159478619]
41427A59478619O66010J486688J640211J531700K468483L495851K573633N93255
41419A73934450O26310K905573M229483L098075J762320K004246K492177J900154
41411A92952788J263113J437955J388216P84890J139600K531929K578543O83794
41403B04760828k83800J064195J863195J29988j316557R6905J504921p33259m222704
41394B02863712l890057j79208J768042J27245j880310j988952j422264j146106
41386A94252102m66048r5892k077526n527359o628791m233447j690106j653451
41378A71879482k695436k739073k380978k716599k876862k049096j544979k609732
41370A52266727m077116m201926l243482k535351k402250k398014k285244j749900
$$ y = [159478619, 160144629, 161631317, 163271528, 164803228, 167271711, 170767562, 173341195, 173934450, 174560760, 177466333, 181695816, 184793891, 186556211, 188560457, 191052634, 192952788, 194215901, 195653856, 197042072, 197826962, 198966562, 201498491, 204077034, 204760828, 204477028, 205541223, 207404418, 207534406, 206217849, 206314754, 207819675, 207086416, 202863712, 198973655, 198794447, 200562489, 200689734, 198809424, 196820472, 195398208, 194252102, 193786054, 193690162, 191612636, 186085277, 179456486, 175223039, 173532933, 171879482, 169184046, 166444973, 164063995, 161347396, 158470534, 156421438, 154876459, 152266727, 148189611, 143987685, 140744203, 138208852, 135806602, 133408588, 131123344, 129373444]
41362A29373444n88163J43558r81177l110386l667698k332797j705332k806907
41354A14324542l112984j089815N14411j092960l876132m012009j958316j421323
41346I8275414l174794m102240k598590j076265j866680l603039l481639j280054
41338G7092113O13238K95904j709478l241979k707538p53122L46621n80251k026240
41329F7329268j881070m48696Q3955j074526k253997j789856j41978R29584L06161
41320F1058845j670251l489526l561794j879581l54308m52388j060301l07506
41312D8283190J090469P43281j202284j804281k42153K21928k589119n398395
41304C9102636l684687J296193L650747Q87479k950968l269945q16024N24412
$$ y = [129373444, 128785281, 128928839, 127947662, 124837276, 121169578, 118836781, 117131449, 114324542, 111211558, 110121743, 110636154, 109543194, 105667062, 101655053, 99696737, 98275414, 95100620, 90998380, 88399790, 87323525, 85456845, 81853806, 78372167, 77092113, 77705351, 78001255, 76291777, 73049798, 70342260, 69589138, 69935759, 69355508, 67329268, 65448198, 64999502, 65083457, 64008931, 61754934, 59965078, 59823100, 60752684, 61058845, 59388594, 55899068, 52337274, 50457693, 50103385, 49650997, 48590696, 48283190, 49373659, 50116940, 48914656, 47110375, 46868222, 47090150, 44501031, 39102636, 35417949, 36714142, 40364889, 41252368, 38301400, 35031455, 34215431, 34739843]
41296C4739843m02503j136626J46021K057540K192620L37018j487074j639049
41288C4807790o93842m42772j432998k217026j423061J58679O13953l22775r94893
41279B8053055n02900l9538p48491j698279j319083J19432R83275P05461K49720
41270B5802652K88182K84550l67416j289721j603623r67438Q3815O76116N67965
41261B3475082M80124Q81998P35824j117347l236385k511683J088454L235016
41253B3031083R57168k614913k503367P70376K257150L23931j450567p47815M3597
41244B0066643j078743j665224P65222L647775K898412n66115k168968n89038
41236B1309964Q65242j00652j562331r46383J099501K103692J253096j81683r95796
$$ y = [34739843, 34337340, 33200714, 33346735, 35404275, 37596895, 37933913, 36446839, 34807790, 34113948, 33671176, 32238178, 30021152, 28598091, 28756770, 29370723, 29047948, 28053055, 27550155, 27510617, 26762126, 25063847, 23744764, 23864196, 24847471, 25552932, 25802652, 26090834, 26375384, 26007968, 24718247, 23114624, 22147186, 22231001, 22907117, 23475082, 23955206, 24837204, 25573028, 24455681, 21219296, 18707613, 19796067, 23031083, 23988251, 21373338, 18869971, 19640347, 21897497, 22221428, 20770861, 20023046, 20066643, 18987900, 17322676, 18087898, 21735673, 24634085, 24067970, 21899002, 21309964, 22175206, 22074554, 20512223, 19565840, 20665341, 22769033, 24022129, 23840446, 22844650]
41227B2844650j235197j406400j406630o66921P40132J707494J454984Q70345
41219B2902457J288289K130888J532818m53140j472900n00675N57982K88018K36183
41210B6509920J807966L112282J873172l43470k53760J898956K747681R84814
41202C8337561j187668j720789q11109O73303J977858J691462q88391l598647
41194C4473580l586392j618222j009480k261255k496568p03041N25383l32333
41186B2991672j264772o79813q7870o99842q33927P64033K137010J342082l52226
41177B3316347j129437j617331k406555j668249J268599K867407J34034l854167
41169A6910648l787190J00107K876465K492684J443545J145600p3261k514294
$$ y = [22844650, 21609453, 20203053, 18796423, 18129502, 18869634, 20577128, 22032112, 22902457, 24190746, 26321634, 27854452, 27401312, 25928412, 25427737, 25985719, 26273737, 26509920, 28317886, 31430168, 33303340, 32959870, 32706110, 34605066, 37352747, 38337561, 37149893, 35429104, 34617995, 35291298, 37269156, 38960618, 38072227, 34473580, 30887188, 29268966, 28259486, 25998231, 23501663, 22798622, 23324005, 22991672, 21726900, 21047087, 20959217, 20259375, 19425448, 20189481, 22326491, 23668573, 23316347, 22186910, 20569579, 18163024, 16494775, 17763374, 20630781, 20764815, 16910648, 13123458, 13223565, 16100030, 18592714, 20036259, 21181859, 21108598, 18594304]
41161A8594304l462537j721275J59869R3497n44080j08080L10538n85220j476805
41152A1260211p03101P54967J055229N27060M79629M35876q76098k695312k856077
41143G382384r11203J325013K204139J712969P33502R9823J61407L13992n97601
41134A2424425k559683l755440k577373M27519L366970M715918L541200j92509
41126A5391027m143731m491388o73812K555960R30691k855114k469780K717088
41118F960941O282675L761871j468206l602251j887697M29395J541289J673547
41110A3691564M49913k184002l680212j687827J491136J382787j863390l448144
41102D151825j163359J767585K337350J814178J989792J511660r28729l125785
$$ y = [18594304, 15131767, 13410492, 13570361, 13663858, 13119778, 13011698, 13322236, 12737016, 11260211, 10557110, 11312077, 12367306, 12894366, 13373995, 13809871, 12933773, 10238461, 7382384, 6471181, 7796194, 10000333, 11713302, 12446804, 12546627, 12708034, 13022026, 12424425, 9864742, 6109302, 3531929, 3959448, 7326418, 12042336, 15583536, 15391027, 11247296, 6755908, 6082096, 8638056, 9568747, 6713633, 4243853, 6960941, 13243616, 17005487, 15537281, 11935030, 10047333, 10476728, 12018017, 13691564, 14141477, 11957475, 8277263, 6589436, 8080572, 9463359, 7599969, 4151825, 2988466, 4756051, 7093401, 8907579, 10897371, 12409031, 11480302, 8354517]
41094H354517k623361p83953m9470L51826K033056L121740R64261k462773k862479
41085F043364m25254Q19685l2578l2265J221569N57106k090906k218880J483219
41076E325060L847085J300067k258413k150017m39078j214610k697394p39862
41068I72838K866914K929019R872n24334J819606J733388k114430m066922r36698
41059B689253K487420J427546j307303p99338J613556J324161j325453j955658
41051D154184K31892J542009K76484r78591k70692P88624L19052r21631j361827
41042C779504q26687K57931J708118K669486J939588R8712p35855j40447j19300
41033H631050j529664k273801p78829J110390J100985K51200P33664J351801p65974
$$ y = [8354517, 5731156, 4947203, 4897733, 5249559, 7282615, 10404355, 11368616, 8905843, 6043364, 5618110, 6437795, 6405217, 6372952, 7594521, 8151627, 6060721, 3841841, 5325060, 9172145, 10472212, 8213799, 6063782, 5624704, 4410094, 1712700, 972838, 3839752, 6768771, 6778643, 6254309, 8073915, 9807303, 7692873, 3625951, 2689253, 5176673, 6604219, 5296916, 4497578, 6111134, 7435295, 6109842, 4154184, 4386076, 5928085, 6204569, 5225978, 4955286, 5743910, 6062962, 5141331, 3779504, 2952817, 3210748, 4918866, 7588352, 9527940, 9626652, 8890797, 8750350, 8631050, 7101386, 4827585, 4048756, 5159146, 6260131, 6511331, 7244995, 8596796, 7830822]
41024G830822m372044m436378M04553M710025L245282j839353m330690k445061
41016a232844J53311R30572J368991K587564K661111N52148j028255J45615J621504
41007G759717J13234k615231k230403Q96577J920022p11160k774751j214332J105260
40998B248933N24294j347683o73955K052183K973713J230755o7044P27256J409083
40989I077535K3577j918615k052272o57322L35793K81317m1026k21129m93798
40980D334060p14016m14861K80811P73178Q77135Q55125P39996L63859j4558J69745
40970G250474R05267J381184Q99659l05774j383138j747658j406260o38868J86724
40961E141610N34607O2986o67551n08224O71615J341558K70624j329159j048701
$$ y = [7830822, 3458778, -977600, -573047, 4136978, 7382260, 5542907, 1212217, -1232844, -1079533, -148961, 1220030, 3807594, 6468705, 7020853, 5992598, 6138213, 7759717, 7872951, 5257720, 3027317, 3923894, 5843916, 5132756, 2358005, 1143673, 2248933, 2773227, 1425544, 751589, 2803772, 5777485, 7008240, 6941196, 7668452, 9077535, 9101112, 7182497, 5130225, 4472903, 4808696, 5090013, 5048987, 4827858, 4334060, 3620044, 3205183, 3485994, 4259172, 5136307, 5991432, 6731428, 7095287, 7080729, 7250474, 8155741, 9536925, 10436584, 10130810, 8747672, 7000014, 5593754, 4954886, 5141610, 5676217, 5739203, 5071652, 4563428, 5235043, 6576601, 6847225, 5518066, 4469365]
40952D469365J286365K989414J929876p43604k230626j471932Q5266N21439n61129
40943F274434j749807j257439Q26128J994892L35836k252610k091096Q33527K421402
40934E335267N59188j694945j223912K47120k17249j207751L51942K999631K590557
40925G739848m47264j364989J071645K635926Q99737r94503k13885J057100O5436
40916A0449051j501677p70579J271987J848434R84465L81912o8789j082396j387508
40907A0124900K9852J095054j67824j615802l44862J788097Q72267k074636k239682
40898G467364J133222L527383K485751Q34616J015862J232712k13786j104481
40890A6378643Q12951L348749K927433N8523j644049o98727R57973J322095M92321
$$ y = [4469365, 5755730, 8745144, 10675020, 9931416, 7700790, 6228858, 6314124, 6835563, 6274434, 4524627, 3267188, 4093316, 6088208, 6424044, 4171434, 2080338, 2913865, 5335267, 5894455, 4199510, 2975598, 3222718, 3005469, 1797718, 2149660, 5149291, 7739848, 7292584, 5927595, 6999240, 9635166, 10534903, 9540400, 9326515, 10383615, 10449051, 8947374, 8176795, 9448782, 11297216, 12281681, 12663593, 12594804, 11512408, 10124900, 10154752, 11249806, 11081982, 9466180, 9121318, 10909415, 11781682, 9707046, 7467364, 8600586, 12127969, 14613720, 15448336, 16464198, 17696910, 17483124, 16378643, 17191594, 20540343, 23467776, 23526299, 21882250, 21183523, 22141496, 23463591, 23955912]
40881B3955912l83747n36981J00624R07821J052816N75590M32002R33698J045696
40872B8083431m221j288475j288458J07667J503671J610707N16165n05210m08262
40863B8327015K97664K07958o66606n03798J340757K484076O88164k321558k859000
40854B6994672m55613J792030J791789M77373p39702j585474j735182q74917k41359
40845B5423617j271436k635933j778203N88914J221566k44706q60871J33386J64310
40836B0740644j219333j007075J264068J695522r98707k338926L60195K855440
40828B1351828J210946j120845N47461L482049K117138k095573l171578q41143
40820B1480283k73240k320946k168849J491674L552569R17382k645317k925685
$$ y = [23955912, 23572165, 23035184, 23135808, 24043629, 25096445, 25672035, 26104037, 27037735, 28083431, 28079210, 26790735, 25502277, 25609944, 27113615, 28724322, 29240487, 28735277, 28327015, 28624679, 28832637, 28166031, 27662233, 29002990, 31487066, 32175230, 29853672, 26994672, 26539059, 28331089, 30122878, 30600251, 29860549, 28275075, 26539893, 25664976, 25423617, 24152181, 21516248, 19738045, 20326959, 21548525, 21303819, 20442948, 20576334, 20740644, 19521311, 18514236, 19778304, 21473826, 20475119, 18136193, 18496388, 21351828, 22562774, 21441929, 21989390, 25471439, 27588577, 25493004, 22321426, 21480283, 21207043, 18886097, 16717248, 18208922, 21761491, 22678873, 20033556, 17107871]
40812A7107871j149157k96016q8341R06685J635944M33833j747026k694463j915334
40803A2193996m33434Q54659J373548R52863M66741Q11283J118005P579j602427
40794A5742813j590158l41337k25658j325769j226000M89198J261858L3675r47266
40785A1871356j35279Q64641M10618o23108r18329o01302J84697J799714L088577
40776A5941585J849414j404976l135868j603198Q28526J452446M30790q76300
40768A3482419j790013j432861Q66508L186444K357165j165604l244502j992054
40760A0267502R140N86320Q40171J529473J033030r47258j886327q59786k55557
40751A0316708r65568n17591J675869K357903N28639o2379K011897K307488j448615
$$ y = [17107871, 15958714, 15662698, 15574357, 16481042, 18116986, 18550819, 16803793, 14109330, 12193996, 11760562, 12615221, 13988769, 14941632, 15408373, 16219656, 17337661, 17345240, 15742813, 14152655, 13811318, 13585660, 12259891, 11033891, 11523089, 12784947, 12818622, 11871356, 11736077, 12600718, 13011336, 12388228, 11469899, 10868597, 11053294, 12853008, 15941585, 17790999, 16386023, 13250155, 11646957, 12475483, 13927929, 14358719, 13482419, 11692406, 10259545, 11126053, 14312497, 16669662, 15504058, 12259556, 10267502, 10276642, 10862962, 11703133, 13232606, 14265636, 13318378, 11432051, 10572265, 10316708, 9351140, 8833549, 10509418, 12867321, 13395960, 13333581, 15345478, 17652966, 16204351]
40742A6204351l944749q17585L131851J446998l066959l132826Q40535K231525
40734A2893141k08714j246641Q19114J636725p23230k391902p33599J556347J553913
40725A3155154J55767q75263j529126j731714p97545L34322n9243j075666l64040
40716G212646J462335J750522P21368P67737J291300m10090l162999k652072J247068
40707H227815L652385K207206k42274j570449k965369m122787k202144K114446
40699E098829L711719J054966q94497R20822K432096j34556l315360k158664J673716
40690H389071L156442J734900M62598J03994o53778j296852p07489m22403k032180
40681H734303l120201n67351L523747M134118Q06035j915152j386587J55829m806
$$ y = [16204351, 12259602, 11442017, 14573868, 16020866, 12953907, 9821081, 10661616, 12893141, 12684427, 11437786, 12256900, 13893625, 13170395, 10778493, 10044894, 11601241, 13155154, 13310921, 12435658, 10906532, 9174818, 8377273, 8711595, 8652352, 7576686, 7212646, 8674981, 10425503, 11146871, 11914608, 13205908, 12795818, 9632819, 6980747, 8227815, 11880200, 14087406, 13845132, 12274683, 9309314, 5186527, 2984383, 5098829, 8810548, 9865514, 8971017, 9891839, 12323935, 12189379, 8874019, 6715355, 8389071, 11545513, 13280413, 13743011, 13847005, 13193227, 11896375, 11188886, 10766483, 8734303, 5614102, 5046751, 8570498, 12704616, 13510651, 11595499, 10208912, 10364741, 10359935]
40672A0359935j445110k275388j609595L80489K716971L612452K138638j07263
40664A3771129q15419j11662P6189o39267p22597L19903Q56638l90106k368608
40655I976200k915297j167911J507798K649969J057695j691201k751284j304000
40647E361969O49198J037002p5612j375455j811236p87769J379364K793057J796514
40638H967032k18593l93082Q46178L9178l260260m726772j756831K202229K953022
40629D652101J655324J771343K901318K229408Q3219o88784K02243M25561n46213
40620A2685520r95702n77555n61459o84680N03713K166415J712777q85831k713909
40611A0649289k269206j015898j82267P27699J547672Q02547j412594k689995
$$ y = [10359935, 8914825, 6639437, 5029842, 5410331, 8127302, 11739754, 13878392, 13771129, 12955710, 12844048, 12920237, 12280970, 11558373, 11878276, 12734914, 12344808, 9976200, 7060903, 5892992, 7400790, 10050759, 11108454, 9417253, 6665969, 5361969, 6011167, 7048169, 6972557, 5597102, 3785866, 2998097, 4377461, 7170518, 8967032, 8748439, 8355357, 9201535, 9240713, 5980453, 1253681, -503150, 1699079, 4652101, 6307425, 8078768, 10980086, 13209494, 13292713, 12603929, 12806172, 13231733, 12685520, 11689818, 11112263, 10550804, 9866124, 10369837, 12536252, 14249029, 13363198, 10649289, 8380083, 7364185, 7181918, 7909617, 9457289, 10259836, 8847242, 6157247]
40603F157247j730680j61075K69089J14600N15733R39128K32556j205994j696881
40594C433723l37070J838846K673233J083960j343844j861474j19924J308788
40586F676238Q80668L41862J253313J774849j30418k457892j954078L64863P84955
40577G534360r00365j391162J34652Q92774j11479l85053J117851J975724R79286
40568I846588M28958J506002J561303j117860l634372k931702o93349j65526q05150
40559C994892P530K042460L014165K748910K600267J901590q45747l874502l580566
40550H008999l06373J407763o14203l053699k228800P71621K388020J678227M35845
40541H487400k95742j000084j524846q40902O77999R69460p35506k318524j548975
$$ y = [6157247, 4426567, 4265492, 4534581, 4649181, 5164914, 6104042, 6336598, 5130604, 3433723, 3096653, 4935499, 7608732, 8692692, 7348848, 5487374, 5367450, 6676238, 7556906, 7898768, 9152081, 10926930, 10796512, 8338620, 6384542, 6749405, 7534360, 6633995, 5242833, 5377485, 6270259, 6158780, 5773727, 6891578, 8867302, 9846588, 10275546, 11781548, 13342851, 12224991, 8590619, 5658917, 4965568, 4800042, 3994892, 4002422, 6044882, 9059047, 11807957, 14408224, 16309814, 15464067, 11589565, 8008999, 7702626, 9110389, 8496186, 5442487, 3213687, 3985308, 6373328, 8051555, 8487400, 8191658, 7191574, 5666728, 4825826, 5503825, 6473285, 5737779, 3419255, 1870280]
40532A870280O91012J642189N21219p80601q45344n20141q32785j017826m0399
40523F87604J323753J664980J226109J192243J434812R60562J21222J64651P32392
40514I508328J85723j312076j551713O9266J109925k44067k191896j985279m3031
40505C545180Q98196q7205j153516p22025N65170J328106J287533R46578N91476
40496G199493L76650N97427J106009J042928m3455j241093j360354p06151o01562
40487F369892j129434q77343M25798P57984j120787k912458j622843J589214K558589
40478D038612K91998j495034k66411J438976M48703j742991j576641P38042J894496
40469C769750R03917q2346j1478j84058r90364r31558L35578J113884P64736Q04665
$$ y = [1870280, 2561292, 4203481, 4724700, 3944099, 3098755, 2578614, 1745829, 728003, 687604, 2011357, 3676337, 4902446, 6094689, 7529501, 8490063, 8611285, 8775936, 9508328, 9694051, 8381975, 6830262, 6899528, 8009453, 7765386, 5573490, 3588211, 3545180, 4443376, 4356171, 3202655, 2480630, 3045800, 4373906, 5661439, 6608017, 7199493, 7576143, 8173570, 9279579, 10322507, 10279052, 9037959, 7677605, 6971454, 6369892, 5240458, 4363115, 4788913, 5546897, 4426110, 1513652, -109191, 1480023, 4038612, 4330610, 2835576, 2569165, 4008141, 4456844, 2713853, 1137212, 1875254, 3769750, 4673667, 4591321, 4579843, 4395785, 3405421, 2473863, 2809441, 3923325, 4688061, 5492726]
40459E492726J873137K387553J411143J86807m61582j504577k963444k701102
40451C720661j07686J717855L10179j805572n30209L310383M667049J477573k329197
40442A0431036k302474O62114K073292J61983k103607j620443M43390O56055j373281
40433G028065k443124q69020Q46942K39843r56369N2630J844807P79134k548279
40424C974629l417104l7494L796859M381751K523039O14421r14976k022019j464876
40415G434230M96605R62699j125999k393417k08296K501505J631346j419414k159918
40406E719341l60575K17891j294302j732422q4337N25909j276566k083473O06103
40397B37569L579890K583532q20653j429028J593296L327128N38165l235022k522760
$$ y = [5492726, 7365863, 9753416, 11164559, 11351366, 10889784, 9385207, 6421763, 3720661, 3612975, 5330830, 5641009, 3835437, 3305228, 6615611, 11282660, 12760233, 10431036, 8128562, 8790676, 10863968, 11025951, 8922344, 7301901, 7745291, 8401346, 7028065, 4584941, 3715921, 4562863, 4802706, 3846337, 3898967, 5743774, 6522908, 3974629, 557525, 520031, 4316890, 8698641, 11221680, 11836101, 10921125, 8899106, 7434230, 7930835, 8893534, 7767535, 5374118, 5165822, 7667327, 9298673, 7879259, 5719341, 5358766, 5576657, 4282355, 2549933, 2465596, 2991505, 1714939, -368534, 237569, 3817459, 6400991, 5580338, 4151310, 5744606, 9071734, 9609899, 6374877, 3852117]
40388C852117K283911N322731L172452r68802k405555j353253j261249k550104
40380F092248k229469L08119J629213q944j395349L05410K476242J260412j744484
40371F693398j834460J075680K292158o458k039232p36552J684448J834085K59832
40362I222899n20680m46533j086245k049192j536271K08593R43985o3743j006617
40353C666196m19039Q41582J179824M10174m38749n33199J60185J009445J068908
40344F945327l4512j246600r28634R17914K120415R61265j285838j786493j0008
40335E652836J407204L12003j861783k028233L10694K487264K243552K23414j542663
40326G204288k174575k082380j628325p83815K83017J091127J234051O61969r2462
$$ y = [3852117, 6136028, 11458759, 14631211, 13662409, 11256854, 9903601, 8642352, 6092248, 3862779, 4170898, 5800111, 5791167, 4395818, 4701228, 7177470, 8437882, 6693398, 4858938, 5934618, 8226776, 8220318, 6181086, 5444534, 7128982, 8963067, 9222899, 8702219, 8255686, 7169441, 5120249, 3583978, 3792571, 4736556, 4672813, 3666196, 3247157, 4088739, 5268563, 5678737, 5239988, 4706789, 4866974, 5876419, 6945327, 6910815, 5664215, 4735581, 5653495, 7773910, 8735175, 7449337, 5662844, 5652836, 7060040, 7372043, 5510260, 3482027, 3792721, 6279985, 8523537, 8746951, 7204288, 5029713, 2947333, 1319008, 535193, 818210, 1909337, 3143388, 3805357, 3712895]
40317C712895o7186R68433J636441N08667j381757j365511R00614K361267Q75516
40308H149379j368219j024630J270224J914977j5423j442058k57145J436318Q41665
40299I505088j072104j205149P47540J874570N94938j055117q06575L22977p1392
40290H834776j664744j828391M5728J435936O86655n19833k78762L47743l59129
40281F699979j258712k55674J615319J600802N4989q3842J368488J325634q95340
40272A0171643j853708J74898J914824N07588j565985o52339K008574K566462
40264A3271957P45873n92655o09413p99305r97264M62862K699154K668491J56409
40255A7006109j497204o09114M90273l22485j623382j211085L15992Q61237L0557
$$ y = [3712895, 3645709, 4614142, 6250583, 6759250, 5377493, 4011982, 4912596, 7273863, 8149379, 6781160, 5756530, 7026754, 8941731, 8926308, 7484250, 7227105, 8663423, 9505088, 8432984, 7227835, 7975375, 9849945, 10444883, 9389766, 8583191, 8906168, 8834776, 7170032, 5341641, 5387369, 6823305, 7509960, 6990127, 6711365, 7059108, 6699979, 5441267, 5185593, 6800912, 8401714, 8456703, 8372861, 9741349, 11066983, 10171643, 8317935, 8492833, 10407657, 10915245, 9349260, 8696921, 10705495, 13271957, 14017830, 13425175, 12815762, 12016457, 11019193, 11482055, 14181209, 16849700, 17006109, 15508905, 14899791, 15390064, 15067579, 13444197, 12233112, 12549104, 13410341, 13440898]
40246A3440898q17091o60470L79104J535776J892963J170404L85661P12779J576521
40237A9616545J288967k63037j293012r07178l66908p37749j056859j55342J025916
40228A7151343N74283j458379k669341j108988K175452L918523K159588j334140
40220A9408341k964686j593227M00817P65180K40309N50239J408057J544306J243744
40211B1003080J469348J574452M31676j045020j141776l15249j66545k91000P01982
40202B2220948J765955P03154j437744j327278J005742J810928j42347j349030
40194B3250328N76704K896081K189684n11267j897794j087850N62629K113035
40186B8091550K883984J664488j309065l264070k189059L34032J739607K099891
$$ y = [13440898, 12623807, 11963337, 12342441, 13878217, 15771180, 16941584, 17327245, 18040024, 19616545, 20905512, 20642475, 19349463, 18442285, 18075377, 17337628, 16280769, 16125427, 17151343, 17725626, 16267247, 13597906, 12488918, 14664370, 18582893, 20742481, 19408341, 16443655, 14850428, 15251245, 16016425, 16256734, 16806973, 18215030, 19759336, 21003080, 22472428, 24046880, 24478556, 23433536, 22291760, 21976511, 21809966, 21518966, 22220948, 23986903, 24690057, 23252313, 21925035, 22930777, 24741705, 24599358, 23250328, 23827032, 26723113, 28912797, 28401530, 26503736, 25415886, 25978515, 28091550, 30975534, 32640022, 31330957, 28066887, 25877828, 26211860, 27951467, 30051358]
40178C0051358K729528K981192J348591j352889k655234j684044L72667K227650
40170C4018819L001127J850965p61291k380485j256501J107167K056987J409638
40162C9046426Q58619Q33598L78112n53033j039393r56452p06725J47965J810290
40153C9819407K556931O39653k551723l784868k302841l83894L80897P56363J402454
40144C6532379J297764k64417j885307j513531J139040M188919N025512K387777
40136D6908136k018095m382338k601896J078899K618960R57526j397723k164047
40128C8999422j595911r05431m69652k61539l89231m32233L89189J618576J401526
40119C8354716j064915l759988l655704k07396L650384M315475J295527k180533
$$ y = [30051358, 32780886, 35762078, 37110669, 35757780, 33102546, 31418502, 31791169, 34018819, 37019946, 38870911, 38109620, 35729135, 34472634, 35579801, 37636788, 39046426, 39905045, 40738643, 41116755, 40563722, 39524329, 38567877, 37861152, 38009117, 39819407, 42376338, 43015991, 40464268, 36679400, 34376559, 33992665, 34373562, 35129925, 36532379, 37830143, 37565726, 35680419, 34166888, 35305928, 39494847, 44520359, 46908136, 44890041, 40507703, 37905807, 38984706, 41603666, 42561192, 41163469, 38999422, 37403511, 36498080, 36028428, 35766889, 35377658, 34945425, 35334614, 36953190, 38354716, 37289801, 33529813, 29874109, 29666713, 33317097, 37632572, 38928099, 36747566]
40111C6747566k770760p93970P33039N03810K65738J194595J521763l32868k425902
40102C4643011j875960N35918J444234N291j211986n39155N85240M48758m77737
40093C3557614j019811j152286j144711n29519Q06446J780006J554513Q62089
40085C4714341Q23400J193280Q26621m51489j309460m43643J579660K446426O91832
40076D0070968j980722k313505J42751K074499J017795j078745j082786L13124
40068C7163379O876k038172k515799k06039J984646J600037O3184l05139o8878
40059C5684095j047125k618462k352900J31755K125811J099235k108102m069244
40051B6845063k632879N00959J794783L80178r76888j62266J104086L78587j133877
$$ y = [36747566, 33976806, 33182836, 33915875, 34419685, 34685423, 35880018, 37401781, 37068913, 34643011, 32767051, 33302969, 34747203, 34752494, 33540508, 33001353, 33586593, 34035351, 33557614, 32537803, 31385517, 30240806, 29711287, 30517733, 32297739, 33852252, 34714341, 35537741, 36731021, 37557642, 37106153, 35796693, 35353050, 36932710, 39379136, 40070968, 38090246, 35776741, 35919492, 37993991, 39011786, 37933041, 36850255, 37163379, 37170255, 35132083, 32616284, 32410245, 34394891, 35994928, 36058112, 35752973, 35684095, 34636970, 32018508, 29665608, 29797363, 31923174, 33022409, 30914307, 26845063, 24212184, 24713143, 26507926, 26888104, 25911216, 25748950, 26853036, 27231623, 26097746]
40042B6097746n20961J654362J985150j44874j630993r72910m26383j468688k118541
40033B2453908q86157K80368l44996r62881L02969J605118N72209j193109p99798
40024B1027631O92763J16418j904268j563493J733693M043624K779504J09648
40016B7035520r26869n31099o10572j551475k374484k476029j715659p3874J565763
40007A8341222J508870o86569l149037l651887j905970O94708K682764L236471
39999A7070572K251579N22076p29680j036895r20860q19757o16957l83194n36707
39990A4800177r27031p98204o3815M30903L54397M77932J266484J994464J897399
39981A9432706J079521l45730k585556m644850m127420l86785L316616L199089
$$ y = [26097746, 25576785, 27231147, 29216297, 29071423, 27440430, 26467520, 26041137, 24572449, 22453908, 21567751, 21848119, 21503123, 20540242, 20843211, 22448329, 23020538, 21827429, 21027631, 21720394, 21836812, 19932544, 18369051, 20102744, 24146368, 26925872, 27035520, 26108651, 25577552, 24966980, 23415505, 21041021, 18564992, 16849333, 16775459, 18341222, 19850092, 19163523, 16014486, 12362599, 10456629, 11151337, 13834101, 17070572, 19322151, 19844227, 19114547, 18077652, 17156792, 16337035, 15720078, 15336884, 14800177, 13873146, 13074942, 13011127, 13442030, 13796427, 14274359, 15540843, 17535307, 19432706, 20512227, 20166497, 17580941, 12936091, 8808671, 8421886, 11738502, 14937591]
39973A4937591O7208j535997L62560K397145Q34719k894314m116288j346129K005377
39964A0711872K579682J149421M65239J012910J095852K25378q6676Q25842J367564
39955A9347084K29846j277256j084784L76285O61133j111198k938892k672964
39947A1529254o94618R67330J241894P47343M53556O23215R64760J045225N13707
39938A7391666m61709r54281j74767J200904J380557k94800k077115j753650L48309
39929A4605114J499528J11163j987033j865187N49260K286828J240415j097702
39921A5342386j625349M32896K657870K397516k35158k618157k499646k87395
39913A3564963J554600J220287o45903k031053j969205j195548n77938Q3660J295068
$$ y = [14937591, 15004799, 13468802, 13831362, 16228507, 17063226, 14168912, 10052624, 8706495, 10711872, 13291554, 14440975, 14906214, 15919124, 17014976, 17240354, 17153678, 17979520, 19347084, 19576930, 18299674, 17214890, 17591175, 18252308, 17141110, 14202218, 11529254, 10834636, 11801966, 13043860, 13791203, 14244759, 14867974, 15832734, 16877959, 17391666, 16929957, 15975676, 15800909, 17001813, 18382370, 18087570, 16010455, 14256805, 14605114, 16104642, 16215805, 14228772, 12363585, 12912845, 15199673, 16440088, 15342386, 13717037, 14149933, 16807803, 19205319, 18970161, 16352004, 13852358, 13564963, 15119563, 16339850, 15693947, 13662894, 11693689, 10498141, 9920203, 10003863, 11298931]
39904A1298931K687520L229060K249689k0252k390258l083792j241641J468176
39896A4197433K056966j2755j695870n47341J451793P54498k040505k764247j59044
39887A1240928J992141P70377j403851j026132O83718K14834j800870j411451
39879I259694J659433K888137K09418k251139n75918K560584J989930j816317
39871A3923822l472901q99455J872140J077062j507764j808318O89065K935473
39863A2809124K814722J219329J571k87123l50304q92351j763285k047956j066437
39854A0437290O43534J736359J477962J68309j716255l695239m484185k596139
39846A971636J337531M098823L091794n85107l385969l167052q18565J419817
$$ y = [11298931, 13986451, 17215511, 19465200, 19444948, 17054690, 13970898, 12729257, 14197433, 16254399, 16241644, 14545774, 13998433, 15450226, 16204724, 14164219, 11399972, 11240928, 13233069, 14003446, 12599595, 11573463, 12257181, 12472015, 10671145, 9259694, 10919127, 13807264, 14016682, 11765543, 11189625, 13750209, 15740139, 13923822, 10450921, 9551466, 11423606, 12500668, 10992904, 9184586, 9873651, 12809124, 15623846, 16843175, 16844746, 16557623, 16207319, 15314968, 13551683, 11503727, 10437290, 11080824, 12817183, 14295145, 14463454, 12747199, 9051960, 4567775, 1971636, 3309167, 7407990, 10499784, 9914677, 6528708, 3361656, 2543091, 3962908]
39838C962908K102414J245166o5681n89765m7975O91950Q29890N82094M67453
39829I178454L08792k55572p65527l99148P43831J584823J233146k27090j826917
39820I574792k229359p29098J696001K904254J829246k83406j435364j044985
39812A0282081J8674P36376M61767r94615k747073l032101j214608R69454J394462
39803E874417K97763k45863O91961J791073J444293k43879j693912j517909J30189
39794F528133J625321J536696K85387n00820k71504k6144l16701l88436O4743
39785H536675R5159m88033j50855J819884L467441K633358o5910k367026l105128
39776A0375565k338765m38734J261729Q79094j004011j012088J961271M017815
$$ y = [3962908, 6065322, 7310488, 7244807, 6655042, 6607067, 7299017, 8128907, 8711001, 9178454, 9487246, 9231674, 8466147, 8066999, 8810830, 10395653, 11628799, 11401709, 9574792, 7345433, 6616335, 8312336, 11216590, 13045836, 12762430, 11327066, 10282081, 10300755, 11037131, 11498898, 10504283, 7757210, 4725109, 3510501, 4479955, 5874417, 6172180, 5926317, 6618278, 8409351, 9853644, 9609765, 7915853, 6397944, 6528133, 8153454, 9690150, 9975537, 9474717, 9203213, 9177069, 8860368, 8471932, 8536675, 8631834, 8143801, 7992946, 9812830, 13280271, 15913629, 15847719, 13480693, 10375565, 8036800, 7598066, 8859795, 9738889, 8734878, 7722790, 9684061, 13701876]
39768A3701876J800048j872810k097066N76573J672761L99313J38687J736651
39760A6056033K038039j26214j749455q83675N14792N89885L23055O41963O13199
39751A8017622J11733O85631K274020K568687R88679j97674J70543P27073R81936
39742B6328250K043537L100334J840667n67518j34380K911815L572925O06749
39734C9702379p99802K047067M361175K073142j307630j267517J02269r11846
39726D3999237k317603p77467J251952q0676k331365r89276J837282Q92076k545089
39717C8939071k733996K61968P96080k248249l683645j056143J850861J804659
39709C3930606O8089j627135l296177l955254k094141M73753M76087j038530l69708
$$ y = [13701876, 15501924, 13629114, 11532048, 12108621, 13781382, 14180695, 14319382, 16056033, 18094072, 17967858, 16218403, 15334728, 15849520, 16439405, 16762460, 17404423, 18017622, 18129355, 18814986, 21089006, 23657693, 24646372, 24448698, 24619241, 25346314, 26328250, 28371787, 31472121, 33312788, 32745270, 32610890, 35522705, 39095630, 39702379, 38902577, 40949644, 45310819, 47383961, 46076331, 44808814, 44911083, 43999237, 41681634, 40904167, 42156119, 42075443, 39744078, 38754802, 40592084, 41484160, 38939071, 36205075, 36467043, 37263123, 35014874, 31331229, 30275086, 32125947, 33930606, 33998695, 32371560, 29075383, 25120129, 23025988, 23499741, 23975828, 22937298, 22567590]
39700B2567590J731543J058327k062500k902979q93316m51357k222015j591466
39692A5233827K084809L138203m04193k615591L64877L789414K678637k44005
39684B4025978n32888L81002m54877j200500M39658J499520j166037m342423l461253
39675A5188180l92121K37192q54162J69673K672522K890337R13747M4681O85781
39666B1555830O43527O6296N73074R73438p09340k511897j307646J287621J398917
39657B1969820l50290m70340N98191k69010k097181j147937J670301J872839l19988
39648B1456405k79003J999069J158871l537942n558330j570731K782986J828249
39640A8279574j798135k665857j015294k22561p2871J575355L265640J776276
$$ y = [22567590, 24299133, 25357460, 23294960, 20391981, 19498665, 19047308, 16825293, 15233827, 17318636, 20456839, 20052646, 17437055, 17801932, 21591346, 24269983, 24025978, 23493090, 23874092, 23419215, 22218715, 22658373, 24157893, 22991856, 18649433, 15188180, 14796059, 15033251, 14179089, 14348762, 17021284, 19911621, 20825368, 20870049, 21555830, 22199357, 22265653, 22838727, 23812165, 23102825, 20590928, 19283282, 20570903, 21969820, 21619530, 21149190, 21747381, 21478371, 19381190, 18233253, 19903554, 21776393, 21456405, 21177402, 23176471, 24335342, 20797400, 15239070, 13668339, 16451325, 18279574, 16481439, 13815582, 12800288, 12577727, 12504856, 14080211, 17345851, 19122127]
39632A9122127k000413l861164k269249L24751J550836J232984k6452j467867
39624A2605553j759289l85408R61623M08441j287905j822971n23104J338853K623800
39615A2159593K968848K110123K98190j187796j387201r10648p48803q14410p70041
39606A1717855r82379j321223n34624J484644K375863M38300k185747k005234
39598H987455Q55527K782243J600823j005399k275600j520648P7580J206876J219227
39589A1928084K19107j001915j570944j200882k7158J652830K899500K305588
39581A5204210j78748k326945k017449p2645Q73551L5192q70715p18256o05520
39572I322675j491824k041260n46557J943234K435929O6092k339594j712565J284062
$$ y = [19122127, 17121714, 13260550, 10991301, 11316052, 12866888, 14099872, 14073420, 12605553, 10846264, 10460856, 11422479, 11830920, 10543015, 8720044, 8196940, 9535793, 12159593, 15128441, 17238564, 17536754, 16348958, 14961757, 14051109, 13302306, 12487896, 11717855, 10735476, 9414253, 8879629, 10364273, 12740136, 13178436, 10992689, 8987455, 9842982, 12625225, 14226048, 13220649, 10945049, 9424401, 9501981, 10708857, 11928084, 12147191, 11145276, 9574332, 8373450, 8346292, 9999122, 12898622, 15204210, 15025462, 12698517, 10681068, 10608423, 11481974, 11517166, 10646451, 9928195, 9322675, 7830851, 5789591, 5243034, 7186268, 9622197, 9688289, 7348695, 5636130, 6920192]
39563F920192L139775K029120j98943j060524q07821j286530k505752k504580
39555C724937n87183J379339J574527N16266j56128J30457R01807J689487J971868
39546A1145377J041269r24364k467979k599180k063872j732613q06187J645378
39538C237829M076935L591213j38720l880806m427105j915964J022842K334756
39530C900980J958020R56251K14142o3267n3538J94940O97779R28956M4192j644753
39520G133702k255134o64314J355283J166192p17028r85649J404710L107192J170793
39511A0715747k203749k592136J89436K068349J082706n1233R78654K042565L43907
39502A2574246k431388k437621J81043J422113m18251k537693k390134j106822
$$ y = [6920192, 10059967, 12089087, 11890144, 10829620, 10021799, 8735269, 6229517, 3724937, 3137754, 4517093, 6091620, 6607886, 6451758, 6582215, 7484022, 9173509, 11145377, 12186646, 11262282, 8794303, 6195123, 4131251, 2398638, 1592451, 3237829, 7314764, 10905977, 10767257, 6886451, 2459346, 543382, 1566224, 3900980, 5859000, 6815251, 7029393, 6966126, 6912588, 7107528, 7805307, 8734263, 8778455, 7133702, 4878568, 4214254, 5569537, 6735729, 6018701, 5033052, 6437762, 9544954, 10715747, 8511998, 5919862, 6109298, 8177647, 9260353, 9209120, 10187774, 12230339, 12574246, 10142858, 7705237, 7886280, 9308393, 8890142, 6352449, 3962315, 2855493]
39494B855493n28227N375J474977K358635J024725p95636k63750J802000J890749
39485I824341o43066k467327j427471L97610L70869n87653J16032K327890L170599
39476A1081824J115611k027845l509255k646858r10878J01123N6008l97292n96342
39467B266096l36551K54181Q40556R16385K31644o49500p30261J91289J169594
39458D153433J293946O67548r8761o21316n36944M89959J812892J811252j11582
39449H860427k292483k633217r98591J131763K468679K270733J28661k942636
39441E993336m243915k255929R08198J935356N83476o27435l87755K46350M05523
39432B557205N07128P26839P81552J219493K437417K677189R7169l218742l069886
$$ y = [2855493, 2327266, 2332641, 3807618, 6166253, 7190978, 6395342, 6131592, 7933592, 9824341, 9181275, 6713948, 5286477, 5684087, 6054956, 5467303, 5583335, 7911225, 11081824, 12197435, 10169590, 6660335, 4013477, 3102599, 3203722, 3259730, 2862438, 2266096, 1929545, 2183726, 3024282, 3940667, 4172311, 3522811, 2792550, 2983839, 4153433, 5447379, 6114927, 6016166, 5394850, 4857906, 5347865, 7160757, 8972009, 8860427, 6567944, 3934727, 2936136, 4067899, 6536578, 8807311, 8935972, 5993336, 1749421, -506508, 401690, 2337046, 2920522, 2293087, 1905332, 2151682, 2557205, 3064333, 3791172, 4572724, 5792217, 8229634, 10906823, 11003992, 7785250, 4715364]
39423D715364M50888K444663M65816j944334j240218P45962O71937o30009l81214
39414E298855R12516Q25355k68669k67721J59277j281697l486484k761256J034580
39405A64756L511981J997824r74882j884955p42677L56614N95281M33615J16532
39396C574089j47764J34318P35724O72769q2674l90037m9777k46813j093167q57898
39386B248770J114268K772366K243355N20204n02109r18760j610011j713558K2064
39377D176589K275422K406253M62558p96783j70796L42421r53884k725748k863712
39368B152320j578954m36721K76883J152827J622161P07978n78519j51716J593394
39359D759653J799020l25240j716036j42179J784496L71096k985716l375249J10784
$$ y = [4715364, 5166252, 7610915, 8076731, 6132397, 4892179, 5638141, 6310078, 5680069, 5298855, 6211371, 7036726, 6768057, 6500336, 6659613, 5377916, 1891432, -869824, 164756, 3676737, 5674561, 4699679, 2814724, 2072047, 2428661, 3023942, 3457557, 3574089, 3426325, 3560643, 4296367, 4969136, 4886462, 4496425, 4446648, 4199835, 3106668, 2248770, 3363038, 6135404, 8378759, 8898963, 8396854, 7478094, 5868083, 4154525, 4176589, 6452011, 8858264, 9320822, 8524039, 8353243, 8695664, 7741780, 5016032, 2152320, 573366, 136645, 413528, 1566355, 3188516, 3896494, 3317975, 3166259, 4759653, 6558673, 6233433, 4517397, 4375218, 6159714, 6530810, 3545094, 169845, 280629]
39350B80629K705136J072424j827024j534846J336712K800430J757708O10496
39342G201665M21409m60776k451226l032785o03739K538915L022690P08068j501915
39333E842306j256825J076342L159661K754930j98202k960937k456749R65491
39325F926017L432069K164969j036641k287185n61398J559718J538742n22048
39317A1214243k865768l965415l089868m89436K255806L137059J774250j04087
39309G866784q08178n34901l89038m68490j35957L17642j77672j507552k002711
39300B159927p49365Q14741O72646j025373k126898j173769J085319K861742L069057
39291E588027J786251p9717j224904q08000N74487J217112P4971k020229l157689
$$ y = [280629, 2985765, 4058189, 2231165, 696319, 2033031, 4833461, 6591169, 7201665, 7623074, 7162298, 4711072, 1678287, 1074548, 3613463, 6636153, 7344221, 5842306, 4585481, 5661823, 8821484, 11576414, 11378212, 8417275, 5960526, 6926017, 10358086, 12523055, 11486414, 9199229, 8637831, 10197549, 11736291, 11214243, 8348475, 4383060, 1293192, 803756, 3059562, 6196621, 7970871, 7866784, 7058606, 6523705, 6134667, 5666177, 5530220, 5847862, 5670190, 4162638, 2159927, 1410562, 2225303, 2897949, 1872576, -254322, -1428091, -342772, 2518970, 5588027, 7374278, 7294561, 6069657, 5261657, 5836144, 7053256, 7128227, 5107998, 1950309]
39282A950309k170820L72365K688985L279140K196396P30692l36566j523445l073272
39273D113784l537226j482939J766774L024211J177327j476799k362289j396302
39265a73459P3026J284443J858338J194853m25827j354706o27682N56492P45803
39256C131281L93056N24553N23095o74106k011094j301376J370544L316490K596952
39247G869395J46814j733335j785842n07054N63718J74546j352902k397462k041331
39238a063453j000546j6027J244135K582998K362771P9359j794065j001683Q30059
39229B223548O35892j096915j281120L79258R48510m07771p40064J572158L655401
39220E888897K433474o25021j769903l05331R64395n9835k173670k554868j10709
$$ y = [1950309, -220511, 151854, 2840839, 6119979, 8316375, 9047067, 8710501, 7187056, 4113784, 576558, -906381, 860393, 3884604, 5061931, 3585132, 1222843, -173459, -100433, 1184010, 3042348, 4237201, 3811374, 2456668, 1828986, 2385478, 3131281, 3524337, 4048890, 4571985, 3897879, 1886785, 585409, 1955953, 5272443, 7869395, 8016209, 6282874, 4497032, 3989978, 4553696, 4728242, 3375340, 977878, -1063453, -2063999, -2080026, -835891, 1747107, 4109878, 4189237, 2395172, 1393489, 2223548, 2859440, 1762525, 481405, 860663, 1809173, 1401402, 661338, 2233496, 5888897, 8322371, 7697350, 5927447, 5622116, 6586511, 6526676, 4353006, 1798138, 1687429]
39211A687429K967783L187186r1248l212775k513281P02804J909516k52019k433397
39202A951998j843657K60175J540600J909696K106350J601140l9797j739372k528415
39193C218718k656344j957327L32906K882471K574687o11826k421632m95969J761002
39184B626686O79135j745627j510417P03816J279441K6063k47977P59207P96286
39175C366613j39707J71132J537576J407852l42874j132643m02825k26071r08015
39166C331038n36383O24332Q2463j784492j648961N65349P94466j949433l048402
39157c570023J39083L509076K836362L18501o4991N58777r10657k919294j784439
39148a887605J271176J696630p57886j818959K311J431585N55368j72221J245194
$$ y = [1687429, 4655212, 7842398, 7751150, 4538375, 2025094, 2727898, 4637414, 4385395, 1951998, 108341, 368516, 1909116, 3818812, 5925162, 7526302, 7486505, 5747133, 3218718, 562374, -1394953, -1062047, 1820424, 4395111, 3783285, 1361653, 865684, 2626686, 3305821, 1560194, 49777, 753593, 2033034, 2059097, 1811120, 2570327, 3366613, 3226906, 3398038, 4935614, 6343466, 6000592, 4867949, 4465124, 4239053, 3331038, 2794655, 3418987, 3501450, 1716958, 67997, 633346, 1427812, -521621, -3570023, -3430940, 78136, 2914498, 3232999, 3168008, 3726785, 2816128, -103166, -1887605, -616429, 1080201, 322315, -1496644, -1494333, -62748, 492620, 320399, 1565593]
39139A565593K762254J855389m63014j592641j146201o42154p98944r24512l12890
39130C02880Q18641J444078O26809j117012j815975m63962J290801J391595M32822
39121B910677M26823J305041J233917K0986o37265l04519k83154o86141q9546
39112C896819J293008J262908n17739j516863n93239k8713j271147j807835P58104
39103A475303L963161L418404p62554l976768l320741p35870M85038j18436o16028
39094a88491J19536J036524O09877q43874j322345J24863J803065J710226N64766
39085C614147M63451J115481L15970j679274j729507J025338L034092J507281
39077G666979j364627k087528j024564o25873p91972K08091J722726J558607O9560
$$ y = [1565593, 4327847, 6183236, 5720222, 4127581, 2981380, 2339226, 1540282, 615770, 302880, 1121521, 2565599, 3192408, 2075396, 259421, -204541, 1086260, 2477855, 2910677, 3337500, 4642541, 5876458, 5897444, 5260179, 4955660, 4672506, 3986365, 3896819, 5189827, 6452735, 5934996, 4418133, 3824894, 3796181, 2525034, 717199, 1475303, 5438464, 8856868, 8094314, 4117546, 796805, 60935, 545973, 427537, -188491, -68955, 967569, 1577446, 733572, -588773, -463910, 1339155, 3049381, 3614147, 4077598, 5193079, 5509049, 3829775, 2100268, 3125606, 6159698, 7666979, 6302352, 4214824, 3190260, 2564387, 1772415, 1980506, 3703232, 5261839, 5331399]
39068E331399k52274J074516K077222J761191Q80104l56050k145633l035038j408549
39059C926888J162228J602426K12636m4541Q56159k52181l493109m410409q69732
39050a309635K915789K364034j003199k567844j365251p2442n3932j14497N96352
39041f10625J457063J839334J533395K17243j709014k539210j271573O38418J232667
39032G87698P90331P92706J117593L87301j384048k488032j828597j01647J292529
39023f34166J557569R68361O43606J315333K048580J282133o20643j554265q87636
39014D118872l44345p89402o71708Q10660J613838J36749j695376j271406O57518
39005B565400J531639R91647M92707K84536k73255m61559P59485K182241J573469
$$ y = [5331399, 5079125, 6153641, 8230863, 9992054, 10872158, 10516108, 8370475, 5335437, 3926888, 5089116, 6691542, 6904178, 6859637, 7715796, 7463615, 3970506, -439903, -1309635, 1606154, 3970188, 2966989, 399145, -966106, -1038548, -1092480, -1206977, -610625, 846438, 2685772, 4219167, 4436410, 2727396, 188186, -1083387, -444969, 787698, 1578029, 2370735, 3488328, 3875629, 2491581, 3549, -1825048, -1926695, -634166, 923403, 1891764, 2535370, 3850703, 5899283, 7181416, 6560773, 5006508, 4118872, 3774527, 2985125, 2313417, 3124077, 4737915, 4874664, 3179288, 1907882, 2565400, 4097039, 5088686, 5581393, 5865929, 5592674, 5131115, 5890600, 8072841, 9646310]
38996I646310r94834l262888l551451j633132J724257M113719K525531k303455
$$ y = [9646310, 8651476, 5388588, 1837137, 204005, 1928262, 6041981, 8567512, 6264057]
$$ [...]
##END NTUPLES=NMR SPECTRUM
##END=
