##TITLE=31Pdec_SR94_oil
 d2O, 24 sc
 26.10.2021
##JCAMPDX= 6.0         $$ Bruker NMR JCAMP-DX V2.0
##DATA TYPE= NMR SPECTRUM
##DATA CLASS= NTUPLES
##ORIGIN= UXNMR, Bruker Analytische Messtechnik GmbH
##OWNER= root
$$ XWIN-NMR		Version 3.5
$$ Tue Oct 26 12:13:38 2021 Russian Standard Time (UT+4h)  she@DPX200
##.OBSERVE FREQUENCY= 81.013821
##.OBSERVE NUCLEUS= ^31P
##.ACQUISITION MODE= SIMULTANEOUS
##.ACQUISITION SCHEME= undefined
##.AVERAGES= 24
##.DIGITISER RES= 16
##SPECTROMETER/DATA SYSTEM= spect
##.PULSE SEQUENCE= zgpg30
##.SOLVENT NAME= CDCl3
##.SHIFT REFERENCE= (INTERNAL, CDCl3, 0, 248.564)
##AUDIT TRAIL= $$ (NUMBER, WHEN, WHO, WHERE, WHAT)
$$ ##TITLE= Audit trail, XWIN-NMR		Version 3.5
$$ ##JCAMPDX= 5.01
$$ ##ORIGIN= Bruker BioSpin GmbH
$$ ##OWNER= she
$$ F:/spectra/data/she/nmr/P31/1/pdata/1/auditp.txt
$$ ##AUDIT TRAIL=  $$ (NUMBER, WHEN, WHO, WHERE, WHAT)
(   1,<2021-10-26 12:12:33.40 +0400>,<she>,<DPX200>,
      <created by zg, POWCHK disabled, PULCHK disabled
       configuration hash MD5:
       00 E9 B6 7A A2 85 ED C7 34 08 36 98 17 FE 4E 26
       data hash MD5: 32K
       5F AE B6 45 B9 C1 95 70 BE 76 A4 F5 36 DE 9B 28>)
(   2,<2021-10-26 12:12:36.10 +0400>,<she>,<DPX200>,
      <Start of raw data processing
       efp BC_mod = 2 LB = 1 FT_mod = 6 PKNL = 1 PHC0 = -8910.786 PHC1 = 277.8693 SI = 64K 
       data hash MD5: 64K
       C9 99 A9 DC 00 01 F5 08 4E 94 95 BE AE 16 27 50>)
(   3,<2021-10-26 12:12:55.87 +0400>,<she>,<DPX200>,
      <pk PHC0 = 48.28094 PHC1 = -138.2 
       data hash MD5: 64K
       43 DA FC A9 7C 62 AA EF 8E CF 54 CC 50 30 2E FD>)
$$ ##END=
$$ 
$$ hash MD5
$$ 9B 6A 1E 9F FE 20 45 96 B0 3E 45 62 F5 8C 9D A5
##$RELAX= 
##$RELAX= 
##$RELAX= 
##$RELAX= 
##$RELAX= 
##$RELAX= 
##$RELAX= 
##$RELAX= 
$$ Bruker specific parameters
$$ --------------------------
##$DU= <F:/spectra>
##$EXPNO= 1
##$NAME= <P31>
##$PROCNO= 1
##$TYPE= <nmr>
##$USER= <she>
##$AMP= (0..31)
100 100 100 100 100 100 100 100 100 100 100 100 100 100 100 100 100 100 
100 100 100 100 100 100 100 100 100 100 100 100 100 100 
##$AQSEQ= 0
##$AQ_mod= 1
##$AUNM= <au_zg>
##$AUTOPOS= <>
##$BF1= 81.014009
##$BF2= 200.13
##$BF3= 200.13
##$BF4= 200.13
##$BF5= 200.13
##$BF6= 200.13
##$BF7= 200.13
##$BF8= 200.13
##$BYTORDA= 1
##$CFDGTYP= 0
##$CFRGTYP= 5
##$CHEMSTR= <none>
##$CNST= (0..31)
1 1 145 1 1 1 1 1 1 1 1 1 1 1 1 1 1 1 1 1 1 1 1 1 1 1 1 1 1 1 1 1 
##$CPDPRG= <waltz16>
##$CPDPRG1= <>
##$CPDPRG2= <waltz16>
##$CPDPRG3= <>
##$CPDPRG4= <mlev>
##$CPDPRG5= <mlev>
##$CPDPRG6= <mlev>
##$CPDPRG7= <mlev>
##$CPDPRG8= <mlev>
##$CPDPRGB= <>
##$CPDPRGT= <>
##$D= (0..31)
0 1 0 0 0 0 0 0 0 0 0 0.03 2e-05 3e-06 0 0 0 0 0 0 0 0 0 0 0 0 0 0 0 0 
0 0 
##$DATE= 1635235952
##$DBL= (0..7)
120 120 120 11 120 120 24 19 
##$DBP= (0..7)
150 150 150 150 150 150 150 150 
##$DBP07= 0
##$DBPNAM0= <>
##$DBPNAM1= <>
##$DBPNAM2= <>
##$DBPNAM3= <>
##$DBPNAM4= <>
##$DBPNAM5= <>
##$DBPNAM6= <>
##$DBPNAM7= <>
##$DBPOAL= (0..7)
0.5 0.5 0.5 0.5 0.5 0.5 0.5 0.5 
##$DBPOFFS= (0..7)
$$ [...]
##$SUBNAM2= <"">
##$SUBNAM3= <"">
##$SUBNAM4= <"">
##$SUBNAM5= <"">
##$SUBNAM6= <"">
##$SUBNAM7= <"">
##$SUBNAM8= <"">
##$SUBNAM9= <"">
##$SW= 501.771253377433
##$SWIBOX= (0..15)
0 1 3 0 0 0 0 0 0 0 0 0 0 0 0 0 
##$SW_h= 40650.406504065
##$TD= 32768
##$TD0= 1
##$TE= 0
##$TE2= 300
##$TE3= 300
##$TEG= 300
##$TL= (0..7)
0 120 53 12 22 120 120 120 
##$TP= (0..7)
150 150 150 150 150 150 150 150 
##$TP07= 0
##$TPNAME0= <>
##$TPNAME1= <>
##$TPNAME2= <>
##$TPNAME3= <>
##$TPNAME4= <>
##$TPNAME5= <>
##$TPNAME6= <>
##$TPNAME7= <>
##$TPOAL= (0..7)
0.5 0.5 0.5 0.5 0.5 0.5 0.5 0.5 
##$TPOFFS= (0..7)
0 0 0 0 0 0 0 0 
##$TUNHIN= 0
##$TUNHOUT= 0
##$TUNXOUT= 0
##$USERA1= <user>
##$USERA2= <user>
##$USERA3= <user>
##$USERA4= <user>
##$USERA5= <user>
##$V9= 5
##$VALIST= <valist>
##$VCLIST= <CCCCCCCCCCCCCCC>
##$VD= 0
##$VDLIST= <DDDDDDDDDDDDDDD>
##$VPLIST= <PPPPPPPPPPPPPPP>
##$VTLIST= <TTTTTTTTTTTTTTT>
##$WBST= 1024
##$WBSW= 4
##$XGAIN= (0..3)
0 0 0 0 
##$XL= 0
##$YL= 0
##$YMAX_a= 6496
##$YMIN_a= -8277
##$ZGOPTNS= <>
##$ZL1= 120
##$ZL2= 120
##$ZL3= 120
##$ZL4= 120
##$ABSF1= 0
##$ABSF2= 0
##$ABSG= 0
##$ABSL= 0
##$ALPHA= 0
##$AQORDER= 0
##$ASSFAC= 0
##$ASSFACI= 0
##$ASSFACX= 0
##$ASSWID= 0
##$AUNMP= <proc_1d>
##$AZFE= 0.1
##$AZFW= 0.5
##$BCFW= 0
##$BC_mod= 2
##$BYTORDP= 0
##$COROFFS= 0
##$CY= -3
##$DATMOD= 1
##$DC= 0
##$DFILT= <>
##$DTYPP= 0
##$F1P= 0
##$F2P= 0
##$FCOR= 1
##$FTSIZE= 65536
##$FT_mod= 6
##$GAMMA= 0
##$GB= 0
##$INTBC= 1
##$INTSCL= 5.30512e-09
##$ISEN= 30
##$LB= 1
##$LEV0= 0
##$LPBIN= 0
##$MAXI= 10000
##$MC2= 0
##$MEAN= 0
##$ME_mod= 0
##$MI= 50
##$NCOEF= 0
##$NC_proc= -6
##$NLEV= 6
##$NOISF1= 182.463
##$NOISF2= 159.3651
##$NSP= 0
##$NTH_PI= 0
##$NZP= 0
##$OFFSET= 248.5645
##$PC= 4
##$PHC0= -8862.505
##$PHC1= 139.6693
##$PH_mod= 1
##$PKNL= yes
##$PPARMOD= 0
##$PSCAL= 0
##$PSIGN= 0
##$REVERSE= no
##$SF= 81.014009
##$SI= 65536
##$SIGF1= 159.3651
##$SIGF2= -187.1042
##$SINO= 113.3802
##$SIOLD= 16384
##$SREGLST= <1H.CDCl3>
##$SSB= 0
##$STSI= 65536
##$STSR= 0
##$SW_p= 40650.406504065
##$SYMM= 0
##$S_DEV= 0
##$TDeff= 32768
##$TDoff= 0
##$TI= <>
##$TILT= no
##$TM1= 0
##$TM2= 0
##$TOPLEV= 0
##$USERP1= <user>
##$USERP2= <user>
##$USERP3= <user>
##$USERP4= <user>
##$USERP5= <user>
##$WDW= 1
##$XDIM= 65536
##$YMAX_p= 373795787
##$YMIN_p= -83458661
$$ End of Bruker specific parameters
$$ ---------------------------------
##NTUPLES= NMR SPECTRUM
##VAR_NAME=  FREQUENCY,     SPECTRUM/REAL,   SPECTRUM/IMAG
##SYMBOL=    X,             R,               I
##VAR_TYPE=  INDEPENDENT,   DEPENDENT,       DEPENDENT
##VAR_FORM=  AFFN,          ASDF,            ASDF
##VAR_DIM=   65536,         65536,           65536
##UNITS=     HZ,            ARBITRARY UNITS, ARBITRARY UNITS
##FACTOR=    0.620285442955139, 1,           1
##FIRST=     20137.2065510759, 0,            0
##LAST=      -20513.1999529892, 0,           0
##MIN=       -20513.1999529892, -83458661,   0
##MAX=       20137.2065510759, 373795787,    0
$$ Real data points
##PAGE= N=1
##DATA TABLE= (X++(R..R)), XYDATA
$$ [...]
43316A77385o47039j183486n69574R40095J569592M14140j026922p50859R09356
43307a67312J731414P70570m76472n11477P0345p5491p93443r16591l06759R6609
43297e78607J893P5399M51889L26789n31465j046577l32391R13459J321469O20874
43287A222732k72394n86579l46676J27737N92090O76567M2870r33690j203315
43278f80658k83631Q88730R89839M5105o21619k74173K63932j426o75322o64576
43268a013799R5651O61439N95032L52745J85946j78908n73587l02627N35609P86860
43258A144361m9204q88101o52358J33749L02334j80937m73362l18415j56592j44879
43248a283404p1909K1780K2285K11871O79574O87369l07153j342756r44734O38315
$$ y = [177385, -469654, -1653140, -2222714, -1282619, 286973, 701113, -325809, -1076668, -167312, 1564102, 2334672, 1858200, 1346723, 1417068, 1341577, 548134, -368457, -675216, -578607, -576714, -501315, -49426, 277363, -254102, -1300679, -1633070, -719611, 601858, 1222732, 950338, 363759, 17083, 144820, 736910, 1413477, 1456347, 522657, -680658, -964289, -75559, 914280, 959385, 337766, 63593, 327525, 326099, -349223, -1013799, -918148, -256709, 338323, 691068, 877014, 698106, 124519, -178108, 357501, 1144361, 1095157, 207056, -445302, -311553, -9219, -190156, -663518, -981933, -1138525, -1283404, -1355313, -1333533, -1311248, -1099377, -419803, 267566, -39587, -1382343, -2327077, -1688762]
43238a688762J487254N64632r16770j169094j4999J198747J338709N65875j37798
43229A227794j74378L7488k61847r41819r82523J2667J007898Q99381Q8319j94551
43219G18429L12608P89565P23656L33073k54879j123140j810121j513395k97215
43210b121419P75348R66214N81555K08425j2911j49127j80006j49154q5119K38240
43200G2046Q78879J184388M52904q86521j577123j092874j40922M34334M74362
43191b00527J85677k05702l61832q5763K87195L56824L32430N04214M07818m26889
43181G93445j218816p89686M29134P77176q1039n95712J91458J184718J067012
43172A757690K35082j45312J8943k9348n10522r31601q97355m15679K44336N87240
$$ y = [-1688762, -201508, 363124, -553646, -1722740, -1737739, -538992, 799717, 1365592, 1227794, 1053416, 1090904, 829057, -112762, -1095285, -1082618, -74720, 824661, 912980, 718429, 1031037, 1820602, 2544258, 2877331, 2622452, 1499312, -310809, -1824204, -2121419, -1346071, -379857, 201698, 410123, 397212, 248085, 68079, -81075, -166194, 72046, 950925, 2135313, 2588217, 1701696, 124573, -968301, -1109223, -674889, -200527, -14850, -220552, -582384, -668147, -380952, -24128, 308302, 812516, 1220334, 793445, -425371, -1215057, -785923, -8747, -89786, -685498, -494040, 690678, 1757690, 1992772, 1847460, 1866403, 1837055, 1326533, 394932, -502423, -918102, -673766, -86526]
43162h6526K82073j97542N346P96680J045684K08188q39595j070011n70101k0645
43152d46449K96425M29311L96140L49184M56262L79567l23689j162578j149166
43143g74993m34116j84603n41533k78734R20529J564646P01064m58244n03193
43134A0823L6929n4393n68347n65036j39678L9873P2076K64592J43214n57003
43124a316950q68022n2215R04331Q49376M43324P91428J206879M53779p46337
43115A665593q30797k41736n44753j278516o18113R99343J097660o10250j438839
43106a800408j32606J047019J64498j264110j010939L36790R19078Q16020J190553
43097B65895J571279O29756j095408j747366j070471n03964n04047k7125J100671
$$ y = [-86526, 195547, -1995, 3351, 800031, 1845715, 2053903, 1214308, 144297, -425804, -446449, -150024, 279287, 675427, 1024611, 1480873, 1860440, 1536751, 374173, -774993, -1209109, -1393712, -1935245, -2213979, -1293450, 271196, 972260, 514016, 10823, 47752, -6641, -574988, -1140024, -1279702, -1239829, -1167753, -903161, -759947, -1316950, -2184972, -2237187, -1332856, -483480, -40156, 751272, 1958151, 2411930, 1665593, 834796, 593060, 48307, -1230209, -1848322, -848979, 248681, -361569, -1800408, -1933014, -885995, -721497, -1985607, -2996546, -2659756, -1740678, -924658, 265895, 1837174, 2466930, 1371522, -375844, -1446315, -1950279, -2454326, -2481451, -1380780]
43088a380780J459829L60474q95480r72814k89500J33561L68964R33342J357613
43079A075209P95373l51332p40125k8567O34170L58071k08771K8538Q93029J151882
43069C607477K49047r73882j415772r45848k08139K97371N06309M88136L23029
43060A927728J38496o4447m31568q02190n94004L26664R84565L13233j214976
43051E83501j862776p92717Q40310J440527R14981L27709J10271l30963j208147
43042B2696j630038q92030K32056M32125j90551k39430P43512J379617N43030
43033D00987p15441o27198N92070J146691N25738O1081L51985J98574r69402j584223
43023f19138m37521R45526M91213j014759j096079M29674J215598K01612q68369
$$ y = [-1380780, 79049, 439523, -455957, -1428771, -1718271, -1584710, -1215746, -282404, 1075209, 1870582, 1519250, 779125, 750558, 1384728, 1742799, 1534028, 1562566, 2455595, 3607477, 3856524, 2882642, 1466870, 521022, 312883, 610254, 1116563, 1604699, 1927728, 2066224, 2001777, 1570209, 768019, 174015, 500679, 1485244, 1798477, 583501, -1279275, -2071992, -1231682, 208845, 1123826, 1451535, 1561806, 1230843, 22696, -1607342, -2499372, -2267316, -1835191, -2025742, -2265172, -1521660, -142043, 400987, -314454, -941652, -349582, 797109, 1322847, 1383928, 1735913, 1934487, 965085, -619138, -1056659, -111133, 380080, -634679, -1730758, -1301084, -85486, 116126, -752243]
43014g52243m75246L51890J6729r97149r99440L59671J796131K119771J206454
43005B626568l52072j683773j990284j179586l5542N96786N39987N2511n67857
42996a993262q62590l36215Q23794J633046J373729M23916k92968l39153j3854
42987D16443Q7271l52254r09590o64679N74596J563544R98257n81007j359943
42978b27362p05164J97678L20398L1752o0235j22649k72372J2628Q26666J252977
42968A254317O74723k98243r35225j339335j533951q43977P54878J824887J262500
42959H20574l3515n38599k61854k16142n50927o45754m37291k57711J18702R26132
42949a076385J423348Q15886l03776p68903o07037o26923p52473k95589M81083
$$ y = [-752243, -1227489, -875599, -858870, -1856019, -2855459, -2495788, -699657, 1420114, 2626568, 2274496, 590723, -1399561, -2579147, -2614689, -2017903, -1477916, -1425405, -1993262, -2855852, -3192067, -2368273, -735227, 638502, 1062418, 769450, 430297, 416443, 503714, 151460, -758130, -1422809, -848213, 715331, 1713588, 1132581, -227362, -932526, -734848, -414450, -382698, -442933, -565582, -837954, -825326, 1340, 1254317, 1929040, 1630797, 695572, -643763, -2177714, -3021691, -2266813, -441926, 820574, 787059, 248460, -13394, -229536, -780463, -1426217, -1863508, -2121219, -2002517, -1076385, 346963, 1162849, 859073, 90170, -516867, -1143790, -1896263, -2191852, -1710769]
42940a710769O36772J63619j30865r8734j73534j68868K93841N59070j14345p71037
42930a514850M1569J522253J387078m84044j622129p17333O29184P71146K89795
42921C02669J90299J7855o83237r39874j11872N55426l5375p15406M0985J331490
42911d7040J149556l66691j247519p63484k9754K35021M59766O75571K11092p05418
42901d28900p95703K61979J152797Q52710m1468n00704m01912n1145N14481J018095
42891A580230P36572l59062j077687n05211O18639R00658J53013o48689q80394
42882E18069p89941o69585m30612p9860J29605J94985L95104O34517L61383n21916
42872b58251j176550p63430M03091J148532Q24550j8084l93130J2144O20938O70923
$$ y = [-1710769, -1073997, -910378, -1041243, -1139977, -1313511, -1482379, -1188538, -629468, -743813, -1514850, -1473281, 48972, 1436050, 952006, -670123, -1387456, -758272, 12874, 302669, 492968, 510823, -172414, -1112288, -1224160, -668734, -704109, -1419515, -1378530, -47040, 1102516, 735825, -511694, -1275178, -1304932, -1069911, -610145, 65426, 276518, -428900, -1224603, -962624, 190173, 1042883, 1001415, 500711, 98799, 47654, 562135, 1580230, 2316802, 1957740, 880053, 374842, 993481, 1894139, 2047152, 1398463, 518069, -271872, -941457, -1372069, -1451929, -1322324, -1127339, -732235, -97718, 263665, -258251, -1434801, -2198231, -1795140, -646608, 177942, 159858, -233272, -221128, 399810, 1070733]
42862A070733K2969o76995o86204p6531K68591j94446q33542o72115J61683N70904
42852a044953Q2064n63776o46294l76480j20029L36626J017130J148201L12796
42843A45285n31324l41065L31322K81587k40881J0469R36978J023232j59622j130055
42833C25926p68271J36963L97345J06984j00951k74319o07711o93000k93099J1217
42823a758916j63731k51341J43729L98757J08950L0695O18898Q31750r7060q41987
42813i80256J31775J719657J479196n61451j773304q13582O29433O80110j57874
42804C53704m17909n5475L2435j22615L44350J506355K249004J575362k49580
42795E215631j899840k161293j062645J31256L03039k89940n87130k19605K84062
$$ y = [1070733, 1093702, 416707, -269497, -346028, -77437, -271883, -1105425, -1777540, -1615857, -1044953, -962889, -1526665, -2172959, -2549439, -2669468, -2332842, -1315712, -167511, 145285, -386039, -727104, -395782, -114195, -355076, -344607, 592371, 1615603, 1455981, 325926, -442345, -305382, 91963, 198947, 97996, -176323, -784034, -1477034, -1770133, -1758916, -1922647, -2173988, -2030259, -1631502, -1522552, -1491857, -872959, -41209, -138269, -980256, -848481, 871176, 2350372, 1788921, 15617, -797965, -168532, 511578, 353704, -64205, -119680, -87245, -209860, 134490, 1640845, 3889849, 5465211, 5215631, 3315791, 1154498, 91853, 223109, 526148, 236208, -350922, -570527, -286465]
42786b86465N29195N44644J72988p18619j390804q30392N61742J151629L74591
42777A08509m33137j57085M29429J03718p77983r22079q7637P64846R37262N82827
42767E48670P9786l08168l21305K4319K28491n1266m16800l22742J04796L90419
42757d3800M26633K91860j39111p24518p53419M8608P30532L17819o26339p65292
42747a237027k6579L81477n4017m62060j50716L16934J64534l44417l38972M60041
42737a290802J417270J566519M23828j339024k105734r30064J029673J586474
42729C58140K41225j165180r48019K99396Q50902K64513m01546l29635J82296
42720f47908N00152M20848N5330l99678o21962l65689J74634N31205N21717L60952
$$ y = [-286465, 242730, 787374, 960362, 241743, -1149061, -1979453, -1417711, -266082, 108509, -324628, -481713, -52284, 51434, -726549, -1648628, -1736265, -971419, -34157, 548670, 628456, 320288, -1017, 23302, 251793, 200527, -216273, -539015, -434219, -43800, 382833, 674693, 535582, -188936, -942355, -893747, -163215, 154604, -471735, -1237027, -1263606, -882129, -936146, -1398206, -1548922, -1231988, -1067454, -1411871, -1750843, -1290802, 126468, 1692987, 2116815, 777791, -1327943, -2258007, -1228334, 358140, 599365, -565815, -1513834, -1214438, -363536, -99023, -500569, -830204, -647908, -147756, 273092, 328422, -71256, -693218, -1058907, -884273, -353068, 168649, 529601]
42710E29601K72118K84498L38839L13143O8199k69742l03033L3428J89480k04658
42700A251873o17737l60375K43135K78425k94753n64785j16232M32713N45798
42691G98062M09551J46555m94190j150151p84078N35428J032662l09754j758903
42682a574818j042152J139544J898545L59351j141423o26691Q02085J021109M6109
42673H81659n07284j49721P8443l65227o84569j79808O17689P44957R8868n55932
42663b0925o15047l03550k31362m20935j86597P06918J271026N24784p97261j009225
42653a082174J1513N78349q5914n75000K50440J184700O38974o24385o94030L92736
42643d791Q73387J73240n08271m48404k23818j31997K82443P99947M67093n89021
$$ y = [529601, 801719, 1086217, 1425056, 1738199, 1806398, 1536656, 1233623, 1267051, 1456531, 1251873, 634136, 273761, 516896, 795321, 500568, -64217, -180449, 252264, 798062, 1207613, 1354168, 859978, -290173, -1074251, -538823, 493839, 184085, -1574818, -2616970, -1477426, 421119, 780470, -360953, -987644, -185559, 835550, 881659, 374375, 224654, 303097, -62130, -746699, -926507, -308818, 436139, 535007, -20925, -635972, -939522, -1170884, -1591819, -1778416, -1071498, 199528, 724312, -72949, -1082174, -1070661, -492312, -578226, -1153226, -902786, 281914, 920888, 296503, -397527, -4791, 868596, 1041836, 533565, 85161, -138657, -270654, 11789, 811736, 1278829, 689808]
42633F89808j054561o20177m57557r27374p84683M50213J317436Q16021Q5623
42624d85251K28492K88391p39994j528016l70215J602195J735746j03799j323317
42615f95768n08410P78471O89711l46256p40793j04206N87220N05710j65465o37470
42605f37256l98016K26268M46990R8554q5811L29772O60726J98268n34610o27513
42595c22628l05685l85063o55892k52867N70512O07608k58754p16642q7172P04437
42585a102146P64692N14089N93715O48641J36429n07493m90039Q2360L97656O3906
42575A101810n75868r88174q66417k77745L00921M04719K09807L06650P29553
42566C45256Q16279K46640m29140n91784k63091K44319O86417O22310l46397j606769
$$ y = [689808, -364753, -984930, -1442487, -2369861, -3154544, -2704331, -1386895, -570874, -485251, -256759, 31632, -708362, -2236378, -2606593, -1004398, 731348, 627549, -695768, -1204178, -425707, 264004, -82252, -823045, -927251, -340031, 165679, 214, -637256, -1035272, -809004, -362014, -263460, -349271, -19499, 641227, 839495, 304885, -322628, -628313, -1013376, -1669268, -1922135, -1351623, -744015, -1002769, -1719411, -1806583, -1102146, -337454, 176635, 770350, 1418991, 1555420, 1047927, 557888, 640248, 1037904, 1101810, 525942, -462232, -1328649, -1606394, -1305473, -900754, -690947, -384297, 345256, 1161535, 1408175, 979035, 387251, 124160, 368479, 1054896, 1677206, 1330809, -275960]
42556b75960j727092l37148J022731Q56087k08260m45945L57623P55277N8429
42547E5742n62636K5308J059214R31021m49350j454272r37195L12024P96446L52014
42537A28316J05392N55132P21796k94841j672299j713220j16504J525456J655168
42528H94396M31599q24190j218500q12802j5487Q45983J366024J076534l873j039091
42518G00593j055410j08705O22423L12248l19717n2761Q31792Q08584l98233j060859
42508B79955p2664J106232O50944o15816m90781R20927J220008m25641j852943
42499G20221j189052N15966J213835P24635J64161j76230o97808j124742r06453
42490g55467m50908m92955o47560j662J138466J485668O73137l35815p39168o45289
$$ y = [-275960, -2003052, -2340200, -1317469, -461382, -669642, -1115587, -757964, -2687, 55742, -506894, -481586, 577628, 1508649, 1059299, -394973, -1332168, -1020144, -223698, 128316, 233708, 788840, 1510636, 1215795, -456504, -2169724, -2286228, -760772, 894396, 1325995, 501805, -716695, -1529497, -1544984, -699001, 667023, 1743557, 1739684, 700593, -354817, -463522, 158901, 471149, 151432, 98671, 930463, 1739047, 1340814, 279955, 207291, 1313523, 1964467, 1348651, 857870, 1778797, 2998805, 2573164, 720221, -468831, 47135, 1260970, 1985605, 2149766, 1973536, 1275728, 150986, -755467, -1206375, -1699330, -2346890, -2348552, -1210086, 275582, 948719, 612904, -126264, -771553]
42480g71553k96852L03274Q06588O08761j63682o10673k95959K16622L19636J48021
42470B64183J12140K38300K67835l320n93996j148675r88923N7410J033783Q61280
42460A00017j02639m69668J47214O23959J82521m13116k11713L84340L95090j45295
42450D90710m35296k79894j50160j43981M9056K61224j827m86640l71307K65470
42440h02645L15546n23882r50231L1509J387354J476213N04665N2929M44954L29403
42430B265815q34943j611486q15624M83391N20009n30646r77700k11089O36118
42421a076155N67718p6948n08704m65285k8179N91934Q33310K28021p16986r76172
42411a627446n06720k66317n19824l72373N28673J138687O71756q3069j25061
$$ y = [-771553, -1068405, -765131, 41457, 650218, 486536, -124137, -420096, -203474, 116162, 264183, 376323, 614623, 882458, 879138, 285142, -863533, -1852456, -1795046, -761263, 100017, -2622, -472290, -325076, 298883, 481404, 68288, -143425, 240915, 636005, 490710, 55414, -224480, -374640, -518621, -469565, -208341, -210168, -696808, -1068115, -802645, -487099, -1010981, -1961212, -1929703, -542349, 933864, 1438529, 1491458, 1936412, 2265815, 1430872, -180614, -996238, -512847, 7162, -523484, -1501184, -1712273, -1076155, -508437, -585385, -1094089, -1559374, -1587553, -995619, -162309, 65712, -651274, -1627446, -2134166, -2400483, -2920307, -3292680, -2764007, -1625320, -953564, -1036633, -1161694]
42402a161694J60542j151j51779M93646J194517N09052j228875k006347r34630
42393c126719N95812J055399O78525M51542L68368j81602r46151r26830J26588
42384a905068J243389J450919Q64765K42162j38357o09086j186160j185052k42067
42375a464555P46480N85202m12883o66587L24363J083134L96739p22483o47909
42366g78499J89621O4764r79420r65201P43144K059796J175865p01263j166702
42357c57895p6718O19444l359p65265n42990J34878K81164J1950L1517L27968
42347c39306L03682j79502o68920q43916p34804l63275K32348O90854O33489K58811
42337a010539P4841P4624j54210m76833k30077N25742P09030j92997j049481n38640
$$ y = [-1161694, -1001152, -1002303, -1154082, -660436, 534081, 1043133, -185742, -2192089, -3126719, -2530907, -1475508, -796983, -345441, 22927, -158675, -1104826, -2031656, -1905068, -661679, 789240, 1654005, 1896167, 1757810, 1148724, -37436, -1222488, -1464555, -718075, -132873, -545756, -1212343, -887980, 195154, 591893, -130590, -778499, -588878, -524114, -1503534, -2468735, -1725591, 334205, 1510070, 808807, -357895, -434613, 184831, 181472, -583793, -1126783, -991905, -710741, -698791, -667274, -339306, -35624, -215126, -884046, -1727962, -2462766, -2826041, -2593693, -1902839, -1269350, -1010539, -935698, -861074, -1015284, -1492117, -1722194, -1196452, -487422, -680419, -1729900, -2268540]
42327b268540Q67682J455670N57603p83338j370678j019800j03397R60839J487394
42318b16565Q57245m21423r03172n7753Q74599N65706n83950j132534n65776L14480
42308a269143O85765N43220K69803J7220l21699p86033j063485o24129N39125
42299b009356J421261R58799m16030j052795k81269O17520K88102p65330j074235
42290b313333l45816M03018M55154N2985l67929o23986n11780O2856O65244P19978
42280a803609K93850o3721r4945J19077N90468J198738J322327N33023n15528
42271A579680p54466j68606K57624L2728l04074k56836j17240l16020o91223p95844
42261a534277n34217j78152M5790K02890N13500R36657R92330L64975l79066l48498
$$ y = [-2268540, -1400858, 54812, 612415, -170923, -1541601, -2561401, -2664798, -1703959, -216565, 640680, 219257, -683915, -741668, 132931, 698637, 114687, -1017847, -1583623, -1269143, -583378, -40158, 229645, 246865, -74834, -860867, -1924352, -2548481, -2009356, -588095, 370704, -45326, -1098121, -1379390, -761870, -473768, -1239098, -2313333, -2659149, -2256131, -1800977, -1747992, -2115921, -2739907, -3251687, -3188831, -2523587, -1803609, -1509759, -1573480, -1668425, -1549348, -958880, 239858, 1562185, 2095208, 1579680, 825214, 656608, 914232, 946960, 642886, 386050, 268810, -47210, -738433, -1534277, -2068494, -2246646, -2200856, -1997966, -1484466, -547809, 444521, 809496, 430430, 81932]
42251H1932L19387N81902K16303K06890Q35616Q52730l49374j234527m61204O02441
42241A652096p6763j577247j166684J203023K483298J144422n85782l39798Q99742
42232C636307P07504j070863k450915k165832p01084Q90777J785297J468399K48482
42223B348072o68098n73326k48548o47894j244487q66255L10443R41330N15947
42214a32816j03679k16753j60818l27470l32336K25382Q58071P64174K2621m26411
42204A69965j5827P14013Q52168K82865k98184m32649m04784n21041m98914p6871
42194b29259K69090l7249o13966n47180K24428Q15760P29459M14448L01452J30696
42184A457679l76383q67615q57870m12522N3552L04635L27050J63683n2288j24628
$$ y = [81932, 401319, 983221, 1199524, 1406414, 2242030, 3094760, 2745386, 1510859, 1049655, 1652096, 1575333, -1914, -1168598, 34425, 2517723, 3662145, 3076363, 2736565, 3636307, 4343811, 3272948, 822033, -1343799, -2044883, -1154106, 631191, 2099590, 2348072, 1679974, 1106648, 858100, 210206, -1034281, -1900536, -1590093, -648763, -132816, -236495, -453248, -614066, -941536, -1273872, -1048490, -190419, 573755, 596376, 169965, 154138, 868151, 1720319, 2003184, 1705000, 1272351, 867567, 346526, -152388, -229259, 39831, 2582, -611384, -1158564, -934136, -118376, 611083, 1025531, 1326983, 1457679, 1081296, 213681, -644189, -1056711, -1003159, -698524, -371474, -207791, -260079, -384707]
42174c84707J1878K60605M53383L29819k60834q67966o66476L24903Q80905K03652
42164B85162p25934n06675N30786Q99551L42395M5304M58092N60379k71482j111948
42154E05630q78340J92791J074522J139206M22459n44929r60864n64681j90810
42145A94984o08181j087823m27604Q49905J017596j23995r12077n06861N5788
42136a548268L9134J96787R18795J151057L34540l35031R6485O52561J32477q78400
42126G60137j134875o65039k08096J70878N93829N58027j21445n64451j83613
42117g94648K63647O7650j87411Q3757K33832k71284n88446J2614O69366M13390
42107i7533j09522O4302M40150J85072j90772P5285M19265J31767j13185L67138
$$ y = [-384707, -372829, -112224, 341159, 670978, 410144, -457822, -1124298, -799395, 81510, 285162, -440772, -947447, -416661, 482890, 825285, 870589, 1328681, 1889060, 1617578, 505630, -372710, -179919, 894603, 2033809, 2456268, 1911339, 950475, 385794, 194984, -413197, -1501020, -1928624, -1078719, -61123, -185118, -1097195, -1604056, -1548268, -1509134, -1312347, -393552, 757505, 1092045, 757014, 853499, 1506060, 1638537, 760137, -374738, -1039777, -1247873, -1076995, -483166, 74861, -46584, -611035, -794648, -531001, -463351, -650762, -567005, -333173, -604457, -1192903, -1180289, -510923, -97533, -207055, -142753, 297397, 482469, 291697, 366982, 786247, 918014, 804829, 1171967]
42097A171967O65080r6211q90801n34975P1221l72300j016362m08160P05664P24621
42087A9744J52045M35973R68834K49301r24959o57301M18043J31925j136011j016809
42077a359215M36273P32786m79683p52620O06796J200356j29641j310101q21665
42068a876714l8565j30522R3410J326688J833198N63351n71203J23761J172961
42059B496365O03404o98213q74456l43796m68625o84029K25490J283621O14838
42050B154599j206170j750460l30607J255386J441329N01303m93865q41975m00545
42041C28995L00431L82830j97558m24270J67151O65920L69093n6784K7621N1428
42031A614857l96486m83679K10922M72394m96834j272932l55832J184544J295199
$$ y = [1171967, 1837047, 1740836, 850035, 315060, 386281, 13981, -1002381, -1410541, -704877, 19744, 171789, 607762, 1576596, 1825897, 900938, 243637, 661680, 793605, -342406, -1359215, -922942, -190156, -669839, -1422459, -815663, 384693, 255052, -1055049, -1876714, -1915279, -2045801, -1952391, -625703, 1207495, 1770846, 1199643, 1323404, 2496365, 3099769, 2401556, 1527100, 1183304, 714679, 30650, 256140, 1539761, 2154599, 948429, -802031, -1132638, 122748, 1564077, 2065380, 1571515, 729540, 328995, 629426, 1012256, 814698, 390428, 557579, 1223499, 1592592, 1535808, 1563429, 1614857, 1218371, 734692, 945614, 1418008, 921174, -351758, -707590, 476954, 1772153]
42022A772153J09128o33224m68511l10466l25761O5861M86348K6132q66628q96825
42012a041793j21664K44043J1867R8664N51858M35155k68877m96199j2254K32169
42002c67031j21550l15502J3790L02975L04718M43002O67186L31922m65157p18567
41992G5786o0397O49269O15531L8922m74061n96616k95094J15833P9345l47950
41982a99432k31089P67340J393486N50015p40059p52940J98227L81066m11378
41973I55236o98698l8569L11098k34263o46539k64596J89353J92809K37109M19302
41963D22242r013r67096j183620l39679J79399l57682o78169K67889J373831J156366
41953a35532J10064l31329j23807k36900o96562o42092N6157O53739P96705P55768
$$ y = [1772153, 1881281, 1248057, 779546, 469080, 143319, 209180, 695528, 721660, -144968, -1041793, -1163457, -919414, -907547, -808883, -257025, 178130, -90747, -586946, -599200, -367031, -488581, -804083, -790293, -487318, -182600, 260402, 927588, 1259510, 794353, 75786, 15389, 664658, 1280189, 1319111, 845050, 248434, -46660, 69173, 148518, -199432, -430521, 336819, 1730305, 2280320, 1540261, 787321, 985548, 1366614, 955236, 256538, 217969, 529067, 294804, -351735, -616331, -426978, -234169, 2940, 422242, 413229, -553867, -1737487, -2077166, -1897767, -2255449, -2933618, -2665729, -1291898, -135532, -25468, -356797, -480604, -717504, -1414066, -2056158, -2000001, -1346262, -549557, 206211]
41943B06211N81542R0690m23261m35850j21528j92935p59547j064918n22968M89016
41933b153548J071199P75543K962m98817m40670j32269J93437P15518J327966
41924H61321J228372J5285j264912j243805j58123N20231K46125j11194M7616
41915A40916K95256L03507L02859J37022o43744j394079p71930Q90771J452000
41906G12578J27761j061907l47601J035102R01722n02086j238736q11379l80707
41897a565253l70835o29Q45367J168411N47131k12722m26667l22849k53630j79699
41887g71375j25683k20258k09861J80579M70214Q709p29579n81551M86668J161799
41877c30338O60329k43216m78189n6236L05758K32721j17114m05021l16338J85876
$$ y = [206211, 787753, 878443, 455182, 19332, -102196, -295131, -1054678, -2119596, -2642564, -2153548, -1082349, -306806, -303844, -802661, -1243331, -1375600, -1182163, -466645, 861321, 2089693, 2104978, 840066, -403739, -561862, -41631, 204494, 93300, 140916, 436172, 739679, 1042538, 1179560, 535816, -858263, -1630193, -739422, 712578, 840339, -221568, -569169, 465933, 1367655, 865569, -373167, -1184546, -1565253, -1936088, -1936717, -1091350, 77061, 624192, 411470, -15197, -338046, -591676, -771375, -897058, -1117316, -1327177, -1146598, -676384, -667675, -1397254, -1978805, -1492137, -330338, 329991, 86775, -391414, -447650, -141892, 90829, -26285, -431306, -747644, -561768]
41867e61768O44569N56512O6991k67747l45272n03951o91491m44640J77747M54243
41857i14807Q2267l19450j67962K41651K98279k857j84421l9056J70597J45272
41847f90487r4079k66137j66782M5985K1774k40140k84606J30877N84327N74678
41837c84590K44567O7207J17879J67963J90795K03766n4616o36018r30119m61526
41827a474692K23618L44509J73970M51174Q27193K75038r64484j332361k07333
41818a683368J115724J244726L41392o00312j020261p38393K50652J219536J017477
41809A147173k74486j049117l83347N83081N22972m911K19517P79498L45760q40650
41799A045490j119755k1590J002245P55510k45216r14510r52765n71135N0789
$$ y = [-561768, 82801, 639313, 706304, 438557, 93285, -410666, -1102157, -1546797, -1369050, -914807, -832540, -1151990, -1319952, -1078301, -780022, -782879, -967300, -1006356, -835759, -690487, -784566, -1050703, -1217485, -1171500, -1149726, -1389866, -1674472, -1543595, -959268, -384590, -140023, -72816, 45063, 213026, 403821, 607587, 552971, -83047, -1013166, -1474692, -1251074, -906565, -732595, -281421, 545772, 820810, -143674, -1476035, -1683368, -567644, 677082, 1018474, 418162, -602099, -1340492, -1089840, 129696, 1147173, 872687, -176430, -559777, 23304, 546276, 541365, 760882, 1540380, 1886140, 1045490, -74265, -95855, 906390, 1661900, 1416684, 502174, -450591, -1021726, -970937]
41790i70937N17119L66821o7539J26240R22763J068499o2141j285268j141662
41781e26105J02850R02491M22416p08380j312827p18487P47406J800595J232899
41772A942858n37594j564995p28317P16596R02918j6253l51027M07863R73448
41763A745497M68745l33221n10166l68907n12002o18268j33165N98138Q51877
41754A188528O19731L24639k7548n45477q05802m49779k070j18714m19104j48121
41744c83717L66126J97549m50913m76966J21118P9373r04328j409047n46449N29851
41734b877403N08430J7923L89267J284819J235668M2857r92781j082573p16659
41725b190452m05383k8038L89512M82301L72523N75046Q84351N22442l63932o29270
$$ y = [-970937, -453818, -86997, -154536, -28296, 894467, 1962966, 1900825, 615557, -526105, -423255, 479236, 901652, 193272, -1119555, -1838042, -1090636, 709959, 1942858, 1405264, -159731, -888048, -171452, 731466, 715213, 364186, 772049, 1745497, 2214242, 1881021, 1370855, 1001948, 489946, -128322, -261487, 336651, 1188528, 1808259, 2132898, 2105350, 1559873, 754071, 304292, 302222, 183508, -235596, -383717, -17591, 179958, -270955, -747921, -626803, -547430, -1451758, -2860805, -3407254, -2877403, -2368973, -2351050, -1961783, -676964, 558704, 601561, -391220, -1473793, -2190452, -2595835, -2623873, -2234361, -1752060, -1379537, -804491, 79860, 602302, 238370, -390900]
41715c90900K8952M52807j20211q31200o69280l1956K05564K01295N40191Q69391
41705B54653M26832n12772r29106n58149n5888J67061L13851N04082N54886M08403
41695E73853J27535l53072r03670j006037n09522n0174O028L10197J249207J777538
41685A221883R21086k99648k08492P58973O65391p06744j479581p98889m8816
41676B5163k60705n25376o0913K14681m12649q39444j01685O80064J76709p25035
41666a829190m18616O51918R11985M43903N00001Q41859J00010j374863j578189
41657a751182r4740J073188N76553m79896o69172k76445j29894m4531L28826M36203
41647a031090j17020m96342J24337J102559J278871O88170K11893J24686P6515
$$ y = [-390900, -361948, 90859, -29352, -860552, -1529832, -1561788, -1356224, -1154929, -614738, 254653, 681485, 168713, -760393, -1318542, -1374430, -1207369, -893518, -389436, 165450, 573853, 701388, 348316, -555354, -1561391, -2070913, -2121087, -2115059, -1804862, -555655, 1221883, 2142969, 1843321, 1634829, 2393802, 3059193, 2352449, 872868, 73979, 25163, -235542, -760918, -821831, -607150, -1019799, -1859243, -1960928, -1280864, -1104155, -1829190, -2247806, -1595888, -683903, -240000, 260001, 1101860, 1201870, -172993, -1751182, -1845922, -772734, -196181, -676077, -1345249, -1621694, -1751588, -1796119, -1467293, -1031090, -1148110, -1644452, -1520115, -417556, 861315, 1549485, 1761378, 1886064, 1962579]
41638A962579K9806J32546K0341o80509j349217r22923M82352J391972P28824
41629A795771q00069j481012o07068O28285N26637q83170j634284l37925J731239
41620a061596K118443M36861j221657j198221j34870N21364M64595J66781k40485
41611a48785p01139p15070n9424O03059O06029J57841k26866l97248j83519O32707
41601d32415J408888R54480n16334j180587l06383M82577n5682o01517K71420
41592B4447J197596J53319j764783j709728L54802J579576P12857m00975k95664
41583a48553Q4635j95076k89049M00871P20416j09754p87267o6393R99369P46066
41573A355265m45743r84039n84611k17175k31418j71348m129p5394j45991K50756
$$ y = [1962579, 1992385, 2124931, 2145272, 1464763, 115546, -807377, -325025, 1066947, 1795771, 995702, -485310, -1092378, -464093, 62544, -820626, -2454910, -2792835, -1061596, 1056847, 1493708, 272051, -926170, -1061040, -539676, -75081, 91700, -148785, -849924, -1564994, -1624418, -1021359, -415330, -257489, -484355, -881603, -1065122, -432415, 976473, 1930953, 1414619, 234032, -72351, 410226, 354544, -246973, 24447, 1222043, 1375362, -389421, -2099149, -1744347, -164771, 548086, 147111, -148553, -63918, -258994, -548043, -147172, 573244, 463490, -323777, -390170, 609199, 1355265, 909522, -74517, -659128, -876303, -1107721, -1279069, -1283198, -1358592, -1504583, -1253827]
41563a253827P43917N88301O278m0831O13378J003143L74007q04124j376844p77646
41553i24248L11117O20059j87646r62190o06801K93493M69581J57319O04555J492593
41543A267832J026223q85607j871617o49002Q94754P39072k61607l98035j74584
41534c12571q62882j562451n78470J270954J652842M54550l15488q039J47904
41525a13651j36800J69079Q25207L40761r71781r96066M05222P50303p45040j415111
41515a887877M56770K449220J688463o88915j612389p99570l15036n87746r9036
41506a396116J295748J715589L19411j300584j463919m50966M08129M20066j76889
41497f29531o48645k54699R11134J636751R98406k14398n12970J60566N50235
$$ y = [-1253827, -509910, 78391, 84669, 43838, 657216, 1660359, 2034366, 1230242, -146602, -924248, -613131, 6928, -180718, -1142908, -1749709, -1456216, -986635, -829316, -224761, 1267832, 2294055, 1408448, -463169, -1112171, -217417, 521655, 260048, -137987, -312571, -1175453, -2737904, -3316374, -2045420, -392578, 61972, -253516, -261555, -113651, -250451, -81372, 743835, 1084596, 112815, -883251, -478029, 272274, -472766, -1887877, -1431107, 1018113, 2706576, 2017661, 405272, -394298, -709334, -1297080, -1396116, -100368, 1615221, 1934632, 634048, -829871, -1280837, -872708, -452642, -629531, -1278176, -1532875, -621741, 1015010, 2013416, 1799018, 1286048, 1446614, 1996849]
41488A996849J21936l93118m84285n12688o85441o31917k80450o1129k1488K08434
41478g43297M70120K59249p9792K94278J002951O65134p24049j338685k86959
41469d81050Q29576L72630p81651p94969J28372K54498o96056j128176k36652
41460b533478P50050O03026q1374m2432O31310P91391J23093l63909R5432P82060
41450G55169M34648q75480j611889q05063M79866N31031n07333p47842N96901
41441a749992J834716J177583n66745j128829n8804Q16486K80786o12810m48952
41432d56561L79418N49759m6593l76129o0660K36526K09876M28768J081059J287181
41422C232644L85703q64370j254574q31671o44335r73165r13189L5472R63907
$$ y = [1996849, 2118785, 1725667, 1241382, 728694, 43253, -588664, -869114, -930243, -951731, -743297, -273177, -13928, -93720, 200558, 1203509, 1868643, 1144594, -194091, -481050, 348526, 721156, -60495, -855464, -727092, -472594, -1168650, -2296826, -2533478, -1783428, -1180402, -1261776, -1304208, -672898, 118493, 241586, -122323, -26891, 755169, 1189817, 314337, -1297552, -2102615, -1622749, -1091718, -1599051, -2346893, -1749992, 84724, 1262307, 695562, -433267, -492071, 324415, 605201, -7609, -456561, -77143, 472616, 426023, 49894, -10766, 225760, 435636, 864404, 1945463, 3232644, 3618347, 2753977, 1499403, 667732, 23397, -949768, -1862957, -1827485, -863578]
41413h63578P90048j70898o85762l07673K37110K80719J8199r4053o4439j23672
41403i83999k07766q7510K38131N91290Q52482Q75125L94353n82097j379563j130417
41393a419971J39444J220519R70036j85156n96613L95625J253203K14018j846542
41384A44563k083052L25895K550593J845597m92524j066671M91054J116868o99487
41375B132836k456293j585848N94932J148850P4982j39975J200705K003724Q83350
41366C857263q00277j264068p55094m96045n80983l13214J97097J71084l91724
41357c75961n75403L7597O61981L84075n27662q82036r7731R67496J067067J98378
41347H57801m38085j38886M37012M50918R5238l6467k3349j66024j24320L98471
$$ y = [-863578, -73530, -244428, -930190, -1237863, -1000753, -720034, -701835, -795888, -860327, -983999, -1191765, -1279275, -1041144, -449854, 402628, 1277753, 1672106, 1090009, -289554, -1419971, -1280527, -60008, 910028, 724872, 128259, 523884, 1777087, 1991105, 144563, -1938489, -1612594, 937999, 2783596, 2291072, 1224401, 1715455, 2832323, 2132836, -323457, -1909305, -1314373, -165523, -90541, -230516, 970189, 2973913, 3857263, 3056986, 1792918, 1037824, 541779, -39204, -352418, -155321, 15763, -375961, -951364, -913767, -251786, 132289, -395373, -1277409, -1375140, -407644, 659423, 857801, 419716, 280830, 717842, 1168760, 1263998, 1227531, 1204182, 1038158, 913838, 1312309]
41337A312309O41873k50523j568852j724100n26986N81468O54835K51786J08859
41328e19331J25535O8971J32843L52809M22002L57217M11442K90556l76765q41380
41318D23899j5429J448266J610137J30278j160106j126357p59990r05999p05719
41309a061020L97370J124559M96253k67946J83054R45514N24454n25025p30015
41300A087198k40787o2627R4968Q61932J171069k03152j881015j494942L86657
41291b80699R35239l91528j063522K53550J610376J079237l52655p01980N9305
41282A147323N49684K46765j75228r3460M18508Q36456P14490K64592J95262N40588
41272D644980M10074l42393m44464N71575J127481M28200M76170K514264L852396
$$ y = [1312309, 1954182, 1703659, 134807, -1589293, -2116279, -1534811, -879976, -628190, -519331, -393796, -324825, -191982, 160827, 582829, 940046, 1351488, 1642044, 1265279, 423899, 408470, 1856736, 3466873, 3597151, 2437045, 1310688, 550698, -355301, -1061020, -663650, 460909, 957162, 689216, 872270, 1817784, 2342238, 1817213, 1087198, 846411, 783784, 878752, 1740684, 2911753, 2708601, 827586, -667356, -280699, 654540, 263012, -800510, -546960, 1063416, 2142653, 1789998, 1088018, 1147323, 1697007, 1943772, 1768544, 1675084, 2093592, 2930048, 3644538, 3909130, 4104392, 4644980, 5055054, 4712661, 4268197, 4839772, 5967253, 6395453, 6871623, 9385887, 13238283]
41263A3238283K428187K258370Q061094J5147219J2536405j586130j4908285j5949760
41255B1225383p951286k183235k456910l529106j863596R8940J46561j97210K90013
41246C579554K69615p77111j114521j75637K08915o69558j005914Q1508Q82486
41237A279337K42008n54451m32615k97480p47631o94997K67292O94679l853k45306
41227d93017P33911J163073j02863j251275n84707M03877l54936j756257j301612
41218c543806P08515J710328Q65561k06928l66616j76817j87676q2492K27561
41209a052370K97514J61595L56313Q28328R06407L65702l64444q82916r62834
41200c46705m38255L10328L87588l00215n99568R0122O32258m174q71976o25853
$$ y = [13238283, 15666470, 17924840, 25985934, 41133153, 53669558, 52083428, 37175143, 21225383, 13274097, 11090862, 8633952, 5104846, 3241250, 3340190, 3486751, 3289541, 3579554, 3849169, 3072058, 1957537, 1781900, 1990815, 1321257, 315343, 396851, 1279337, 1521345, 966894, 534279, 236799, -510832, -1205829, -938537, -243858, -247711, -493017, 240894, 1403967, 1301104, 49829, -534878, -131001, -485937, -2242194, -3543806, -2835291, -1124963, -259402, -466330, -832946, -1009763, -1197439, -1279931, -1052370, -754856, -593261, -236948, 591380, 1497787, 1863489, 1499045, 616129, -346705, -784960, -474632, -87044, -387259, -986827, -896705, -264447, -268621, -1140597, -1766450]
41190a766450R5772j40008q04549j50716J637090K398744J215696m65666j205655
41181H14258j062224l74902Q80735J943266J468830k91566j325311p39787p934
41172A305365l24885o22849L20958J487109J184304j82867q57159m55969p9759
41163A774248j98208k50301j11831k42396m34639n6681M29407r6499j222250j091507
41153a500657O38616J729346M89939j505588j562618K09504J184115K17224q11322
41144i11441j21087J184755R33807o73872j346889j64183J126868P83027n23698
41135B87287j014945m10505J68589K83199N72316J111830R38934k72802j328072
41126C35831j132674k77534k1800l59233k46629N44292J013849N20098k33100
$$ y = [-1766450, -1670678, -1810686, -2615235, -2765951, -1128861, 1269883, 2485579, 2019913, 814258, -247966, -622868, 257867, 2201133, 3669963, 3378397, 2053086, 1313299, 1305365, 980480, 357631, 678589, 2165698, 3350002, 3167135, 2309976, 1854007, 1774248, 1576040, 1325739, 1213908, 971512, 536873, 480192, 909599, 813100, -409150, -1500657, -862041, 867305, 1357244, -148344, -1710962, -1501458, -317343, -100119, -911441, -1032528, 152227, 1086034, 412162, -934727, -1098910, 27958, 810985, 287287, -727658, -1138163, -969574, -686375, -114059, 997771, 1936705, 1663903, 335831, -796843, -1074377, -1096177, -1455410, -1702039, -1157747, -143898, 376200, 143100]
41117A43100k61151L21838N85774J31943m05120k32788N43029R45296K46933j042811
41107I76043j574748o68146Q46204J549865R50110k73278j228651j460926q62340
41098a745867K75414J068953P24900l05720o29304K02154Q95158K07882j140342
41089d46772j347819L0546J585994J942841J137300j3853r26880j266644q28088
41080a33375K0490M01979N596m04968p8921O36384Q87021N17832J5916l46435
41070A521519n70834m68419L9053L79886k9082p30195p35319n1483L16351o223
41060c34746k36839J26916M66075K30154p4916R4999K51035j50007m50537K05663
41050A27797J151653R38941l78841j198349p45647m7125r5304m48166m10277l51445
$$ y = [143100, -118051, 203787, 789561, 921504, 516384, 283596, 826625, 1771921, 2018854, 976043, -598705, -1266851, -420647, 1129218, 2079328, 1806050, 577399, -883527, -1745867, -1470453, -401500, 323400, 17680, -611624, -409470, 485688, 693570, -446772, -1794591, -1764045, -178051, 1764790, 2902090, 2888237, 1961357, 694713, -133375, -112885, 289094, 294690, -110278, -189199, 447185, 1334206, 1852038, 1867954, 1521519, 950685, 482266, 521319, 901205, 872123, 141928, -593391, -644874, -328523, -334746, -571585, -444669, 21406, 251560, 176644, 271643, 522678, 372671, -77866, 127797, 1279450, 2218391, 1839550, 641201, -104446, -151571, -246875, -695041, -1105318, -1456763]
41040a456763p72137j029778k84322R02242J229859N85015L0511N6863J48327
41031e90183Q7991L26661P85348O26873k54425p45708k30878L42160O319o52505
41021b98347n76974J737J98631J67212O48295J268378R45033j27640o03833k64328
41011A358164m12651j463884j880296n20218J404079K005635J250331M12952j01076
41002B053036p96881j474902j253056j78612O00995M72154J4072j61514j51879
40993h76587r7404J93536N92949N47331L1981k27202Q6979L30043J6611l13232
40983B85005k6167M85006M22584j50543n09565m38755l52438l57918n6974N72211
40973a27554Q44149L03273n06943o86011j16066N15951P00334N60898K66676l66089
$$ y = [-1456763, -2228900, -3258678, -3543000, -2640758, -1410899, -825884, -795373, -738510, -590183, -502192, -175531, 609817, 1236690, 982265, 236557, 5679, 347839, 354158, -298347, -875321, -873584, -674953, -507741, 140554, 1408932, 2353965, 2226325, 1622492, 1358164, 945513, -518371, -2398667, -2918885, -1514806, 490829, 1741160, 2154112, 2053036, 1256155, -218747, -1471803, -1650415, -1049420, -577266, -563194, -724708, -876587, -973991, -780455, -187506, 359825, 391806, 164604, 251583, 581626, 598237, 285005, 258838, 743844, 1166428, 1015885, 506320, 67565, -284873, -642791, -699765, -127554, 716595, 1019868, 512925, -173086, -289152, 226799, 927133, 1488031, 1754707, 1388618]
40963A388618j238813j474321m00028J134477J434928J99042r31548o24899L22660
40954a89884L92647k56373k19848O72334R36686k25498j594775j620228l84681
40945b489620Q99744J530635J575284J111402J95722o60977q32123l71096R5102
40936A054073J96811N7247j84978n31423p91522o20731n6123L75127L27183J59121
40926a5215M55789J085612J132921M2711j407891j803403q07947L89388O26628
40917c01407J50719q3040J09554K06609J12991J82367K55005k16074r84154j038269
40907a605699j00061Q83786J088876P14689J84740n09464j123668q82369K98076
40898a051094J166793O47006o40257j237315p13322J60935O26963N07579l3372
$$ y = [1388618, 149805, -1324516, -1724544, -590067, 844861, 1043903, 112355, -512544, -189884, 202763, -53610, -273458, 398876, 1335562, 1110064, -484711, -2104939, -2489620, -1589876, -59241, 1516043, 2627445, 2823167, 2162190, 1330067, 958971, 1054073, 1250884, 1308131, 1123153, 591730, -199792, -820523, -876646, -501519, -174336, -15215, 440574, 1526186, 2659107, 2701818, 1293927, -509476, -1317423, -928035, -301407, -150688, -233728, -124174, 82435, 195426, 377793, 632798, 416724, -567430, -1605699, -1705760, -821974, 266902, 981591, 1166331, 656867, -466801, -1349170, -1051094, 115699, 762705, 122448, -1114867, -1828189, -1667254, -1040291, -532712, -566084]
40889e66084n29709l80335L40409O86546J29667n28835l42255L06477M23436N0633
40879d10050M914L39123L42932p7540k76950j01917k5221j5278M47573J062088
40869A289674P84307l62733r11792j08477P76583L20735q30241r21954K48121
40860B84223J045255M05316p26144q77947q4317M22328J50492m6256M78867R32331
40850A984148K22408j141055j447058j88034J085029Q61043l71679j102998q92269
40841i90465l75177J71681Q97684J315097O64313n75171r61637k13643L11239
40832B43921j68371n24565L96273J645841J324500o25972k171179j795781k65855
40823a941188O24708L18014j44190K31596J030702J035393n5198j076232q55935
$$ y = [-566084, -1095793, -1476128, -1135719, -449173, -319506, -848341, -1190596, -884119, -460683, -410050, -405136, -66013, 276919, 199379, -77571, -179488, -204709, -219987, 227586, 1289674, 2073981, 1711248, 799456, 690979, 1467562, 1788297, 958056, 36102, 284223, 1329478, 1734794, 1008650, 130703, 46386, 468714, 619206, 572950, 1051817, 1984148, 2206556, 1065501, -381557, -569591, 515438, 1376481, 1004802, -98196, -990465, -1365642, -1193961, -296277, 1018820, 1683133, 1107962, 146325, -67318, 243921, 75550, -449015, -52742, 1593099, 2917599, 2291627, 120448, -1675333, -1941188, -1316480, -998466, -1142656, -911060, 119642, 1155035, 1099837, 23605, -832330]
40814h32330J98256O01639k15208j129560p80269P50776K096837K120827R23626
40805C734594m61154j085468q61887m46479l41690k94347J45455P19335P22601
40796A830960J43837j91023J38235M48086k1500q99219j132322m11670M30536
40787C35920M50288l46374j037313p44301M07192J289176R56635j61434o68384
40778D81405N0159J003336R30261p153n52048j77490K42073j96447j073458j238731
40768e38093m22355M25569M41963j03330l67949q1446L57016O23644O83792L80457
40758A399268m47794j309272j263251j42379J045595J367387J034096P22879M49852
40749B856381j47203q42882r71121l64519M85949J021994Q88265L1308q80838
$$ y = [-832330, -634074, -32435, -247643, -1377203, -2157472, -1406696, 690141, 2810968, 3734594, 3273440, 2187972, 1326085, 879606, 537916, 243569, 389024, 1108359, 1830960, 1974797, 1783774, 1922009, 2370095, 2348595, 1449376, 317054, -94616, 335920, 786208, 439834, -597479, -1341780, -934588, 354588, 1311223, 1149789, 481405, 531564, 1534900, 2465161, 2458008, 1905960, 1728470, 1970543, 1774096, 700638, -538093, -960448, -534879, -92916, -196246, -564195, -645641, -288625, 335019, 1018811, 1399268, 951474, -357798, -1621049, -1763428, -717833, 649554, 1683650, 2406529, 2856381, 2709178, 1866296, 895175, 530656, 1016605, 2038599, 2926864, 2958172, 2077334]
40740B077334p20914N72189J341162K26800j657892j991578m42887R88310R02990
40731A295514J10638j36777O8507O4663j19884k11763l87641o63233m85492K66530
40721a98938P61335M92042J61397M34325P51890L91179j99046k80311k23253o98026
40711A392594j118868l90114J120830J804486R50143n57077j632196j915081j343309
40702a688592m9147J156957J334650O94806L35318N20600L36921n99391j250359
40693G91763o48395O03818J135661N75316k09389l37340J85743O58535M43010
40684C198722l66760r54163o95061o261J68466l25492o86221l83700J77599M67524
40674E94653N48081N72731K83666m03729q84800o08333N5939L31601J14558o5449
$$ y = [2077334, 1356420, 1928609, 3269771, 3496571, 1838679, -152899, -595786, 392524, 1295514, 1406152, 1269375, 1337882, 1402545, 1282661, 1070898, 683257, 20024, -465468, -198938, 562397, 1054439, 1215836, 1650161, 2402051, 2793230, 2594184, 2313873, 2090620, 1392594, 273726, -116388, 1004442, 2808928, 3759071, 3201994, 1569798, -345283, -1688592, -1737739, -580782, 753868, 1448674, 1783992, 2304592, 2641513, 2042122, 791763, 143368, 747186, 1882847, 2458163, 2248774, 1911434, 2097177, 2755712, 3198722, 2831962, 1877799, 1182738, 1176477, 1344943, 1019451, 333230, -50470, 127129, 594653, 1142734, 1715465, 1999131, 1595402, 710602, 102269, 158208, 489809, 604367, 538918]
40664E38918R7692M54686P93600Q93564M47891m34819r28223m49118K95825J32335
40654A842351q06502j188631m83307L25142M35571M14484Q82670J140790L18166
40645B880734q92191j067858j97417M68166M80420N35770P33822K40050q72052
40636B309444j192180k38836M83547j12001p71701o952J172258P19024j034133
40627A328470j732032n78695P03262P54835K78947K22757K36065p9438q1727N71825
40617A624269R21081K92546l65662p3616M18076k3111p99163n70802L33297M02558
40607B159473m59791p58913O1132P45410L95499j13756K51723R30233P33713k41665
40597C703058q27507n36174q0701j73033n97713o75995j37415P18765J407593
$$ y = [538918, 636610, 1091296, 1884896, 2778460, 3226351, 2791532, 1863309, 1414191, 1710016, 1842351, 1035849, -152782, -636089, -310947, 124624, 539108, 1421778, 2562568, 2880734, 1988543, 920685, 723268, 1191434, 1671854, 2207624, 2941446, 3181496, 2309444, 1117264, 878428, 1361975, 1249974, 478273, 471321, 1643579, 2362603, 1328470, -403562, -982257, -278995, 475840, 754787, 977544, 1213609, 1134171, 1052444, 1624269, 2545350, 2837896, 2472234, 2398618, 2816694, 2793583, 1994420, 1423618, 1756915, 2159473, 1699682, 940769, 1001901, 1747311, 2142810, 2029054, 2280777, 3211010, 3944723, 3703058, 2875551, 2339377, 2258676, 2085643, 1487930, 811935, 674520, 1393285, 2800878]
40588B800878J554645J040870J71292m01052k80374J29267R1577l63198l76277
40579D367628L73982R17252L15422q05335j054049k86340L57175L04083J16108
40570D605926Q5473k85711r68166r95063p2622O95520N02713O829o4564j28090
40560C382245m92306l15013P80201J390983L75012r51944o53646P12486J056732
40551E284750K05351q7396O02376O75116n25548j428424p81099M69994Q82494
40542E297614N28680K47086J72976O4255R9014M16622O17821M22721J67880J85602
40532H220271L72231O47000J051864J230964P24478p8643k40711L99289J175489
40523A3502232J747094K162488K096478J498623J611213L470382N734119O275236
$$ y = [2800878, 4355523, 5396393, 5567685, 5166633, 4886259, 5015526, 5107103, 4743905, 4367628, 4741610, 5658862, 5974284, 5168949, 4114900, 3828560, 4185735, 4489818, 4605926, 4691399, 4405688, 3437522, 2442459, 2369837, 3065357, 3568070, 3574899, 3510335, 3382245, 2889939, 2574926, 3355127, 4746110, 5121122, 4169178, 3515532, 4228018, 5284750, 5490101, 5402705, 6005081, 6680197, 6154649, 4726225, 3945126, 4415120, 5297614, 5826294, 6073380, 6246356, 6310611, 6409625, 6826247, 7444068, 7866789, 8034669, 8220271, 8592502, 9239502, 10291366, 11522330, 12246808, 12168165, 11927454, 12326743, 13502232, 15249326, 17411814, 19508292, 21006915, 22618128, 26088510, 31822629, 38097865]
40515C8097865N699234O537700Q999080J0878654J2090210J5361086K1431348
40508A19095177K8104051L5679357M7200003N8852662N6209346K8655191j4012310
40501C59783477m7552608n7063618m8790402l7550841k9978513k3949239j7941730
40494I6956526j3754829j1882398j0131892p349803m971687m300341m668551m751264
40486C5145761l992912k540371j061035n51329j227764j917428j546972o53848
40478B1654102l23493m09561j92171l8533p11001j539498j146807J96052Q08068
40469A8297158K58683o7447N98030J253511J096241R34539J562863K140957J568187
40460B7642722M98798M93492J679387K672605K631420K050425J444432N37709
$$ y = [38097865, 43797099, 50334799, 59333879, 70212533, 82302743, 97663829, 119095177, 147199228, 182878585, 230078588, 288931250, 345140596, 373795787, 359783477, 312230869, 255167251, 206376849, 168826008, 138847495, 114898256, 96956526, 83201697, 71319299, 61187407, 53837604, 48865917, 44565576, 39897025, 35145761, 31152849, 28612478, 27551443, 27000114, 25772350, 23854922, 22307950, 21654102, 21330609, 20921048, 20728877, 20690344, 19979343, 18439845, 17293038, 17489090, 18297158, 18555841, 18488394, 19086424, 20339935, 21436176, 22370715, 23933578, 26074535, 27642722, 28141520, 28635012, 30314399, 32987004, 35618424, 37668849, 39113281, 39650990]
40452C9650990p93895j842856k042303j866720j981295k090623j594313j005357
40444B6433628j503419k987138l769405k756242r74357j41045m56978q23738p58833
40435A2262473q70102j469375j867645j397059l29301N98274R76780P67540J16865
40426H788450n81860r02094q47875o84904l47390L22443P91628K52118r86244
40417E804272j555525q84802M0863K97538K59892M52990L60782m60023j099057
40408C216930n87871K76431O9381p75163n09612R44546J572405L64041j017914
40399C553174p52469M18775M69176p91960j519069n60034J050265J651085R86108
40390D505051R4851k08048m8129J22988K03910K97906K95915O184m33540o64919
$$ y = [39650990, 38857095, 37014239, 34971936, 33105216, 31123921, 29033298, 27438985, 26433628, 24930209, 21943071, 18173666, 15417424, 14443067, 14302022, 13845044, 13021306, 12262473, 11392371, 9922996, 8055351, 6658292, 6328991, 6927265, 7904045, 8671585, 8788450, 8206590, 7304496, 6456621, 5771717, 5424327, 5746770, 6538398, 6790516, 5804272, 4248747, 3363945, 3404808, 3702346, 3962238, 4415228, 4776010, 4315987, 3216930, 2629059, 2905490, 2974871, 2199708, 1690096, 2634642, 4207047, 4571088, 3553174, 2800705, 3219480, 3688656, 2896696, 1377627, 817593, 1867858, 3518943, 4505051, 4599902, 4391854, 4343725, 4466713, 4670623, 4968529, 5264444, 5270628, 4837088, 4172169]
40380D172169n88429l22371K48436J241951K029447J635917L48900p1536J266256
40371I960740K657571J774556j050144l053937k576889q43123J44464J8920l83132
40362F649026o30203q17453q52939o23920m23649m57150l56033J63781O33172
40353C284632M69821j57692p02951r82759r54809l70464O01601J008650K82658
40344B478687p02192p07890J17690N80349K26862k69223l31163m5836L89854P88239
40334B525377O53901k10108r20121n17590L50122J69081r39248j119875K89626
40325B81165J428891N79645j213358j612639k09110J200779J131159j12209j302946
40316A71377j533667o05346Q95766J836473J535174N31574j32314j61369K8058
$$ y = [4172169, 3583740, 3261369, 3509805, 4751756, 6781203, 8417120, 8766020, 8694484, 9960740, 12618311, 14392867, 13342723, 10288786, 7711897, 6868774, 7013238, 7032158, 6649026, 6018823, 5201370, 4348431, 3724511, 3300862, 2843712, 2487679, 2651460, 3284632, 3754453, 3596761, 2893810, 1911051, 956242, 585778, 1187379, 2196029, 2478687, 1776495, 1068605, 1186295, 1766644, 1993506, 1724283, 1393120, 1347284, 1737138, 2525377, 3179278, 2969170, 2049049, 1531459, 1881581, 2050662, 1111414, -8461, 281165, 1710056, 2289701, 1076343, -536296, -745406, 455373, 1586532, 1474323, 171377, -1362290, -1967636, -1071870, 764603, 2299777, 2831351, 2699037, 2537668, 2565726]
40307B565726J92659L11722R8301n71591r58963k67013R17409J139924J56963
40298C585137o93651n25276q6761k95432p11257m21621L69788P26454M62408J74871
40288B584660N6683k66547p29358o58078J25135Q27135P42870K14657J2542J36649
40278C046348j11265r04108j382661p47552N04763J047107M19984m02194m52332
40269A018090q8524j85922n90933m63753R9538J19315m66294m93578M05849R32194
40259B85982K10750n96564j15005R49143J007250K08616p9085J60444k48403j103497
40249F79631q12227P11158J572103J128349J226186K788034L505324J128733k648805
40240I278486m180959k766934r70688n07295m63003J79311P08130K73345n03841
$$ y = [2565726, 2758385, 3070107, 3168408, 2596817, 1637854, 1370841, 2288250, 3428174, 3585137, 2891486, 2366210, 2279449, 1984017, 1272760, 851139, 1220927, 1947381, 2409789, 2584660, 2641343, 2374796, 1645438, 987360, 1112495, 1939630, 2682500, 2897157, 2909699, 3046348, 2935083, 2030975, 648314, -99238, 405525, 1452632, 1872616, 1470422, 1018090, 929566, 743644, 152711, -311042, -211504, -92189, -558483, -1052061, -646212, 285982, 496732, -99832, -214837, 734306, 1741556, 1950172, 1871087, 2031531, 1783128, 679631, -132596, 578562, 2150665, 3279014, 4505200, 7293234, 10798558, 11927291, 9278486, 5097527, 2330593, 1359905, 852610, 389607, 568918, 1277048, 1550393, 1046552]
40231A046552o18612k03287n17j24688j39558J35007M30723L71645j25243n49462
40221B22560k11879O00585N86620o01131j285756j06708J470442J062883p66403
40212I71213j145861N61581J695762N36580j143808j115584J35855R27973R63999
40203B387710O19007l85989j662840j418464P69846K238404P91905j642777j742440
40194d5638J84446J077839J20324o02337j33568J33478m26771n73616O5862J13049
40184h6932p58742q78752L75909J121480J488j518317j465064j37409R54968J334961
40174a056410J294314Q15169J17679N646M90259L88527o37193j139303j85694
40165I2994R38472P13923l49410q71149o87465l39113K02018Q14851N72052o49245
$$ y = [1046552, 427940, 224653, 224136, 99448, -40110, 94897, 525620, 897265, 772022, 222560, 10681, 611266, 1197886, 596755, -689001, -795709, 674733, 1737616, 971213, -174648, 386933, 2082695, 2619275, 1475467, 359883, 495738, 1423711, 2387710, 3006717, 2620728, 957888, -460576, 309270, 2547674, 3339579, 1696802, -45638, 138808, 1216647, 1336971, 734634, 601066, 734544, 307773, -265843, -199981, -86932, -845674, -1724426, -1348517, -227037, -225549, -1743866, -3208930, -3346339, -2391371, -1056410, 237904, 1053073, 1170752, 1176398, 1666657, 2055184, 1417991, 278688, 92994, 1031466, 1745389, 1395979, 524830, -162635, -501748, -299730, 515121, 1087173, 437928]
40155D37928j250633k50135Q63051M34100o21010m91361M35983N58121M6549K41282
40145D03875Q49039M96757m14287k62685N85493J11599j585041j890446J45245
40136a560451K044239J602650n5976p15583l53494l42744q20612p90904p0755
40127a063630N08363M85703J61359j35879k83419j31933K68738M74655K08941
40118D92898j72083j84070J34402M03606M06072J57389k05085m40446m01747k30315
40108c9379n5832K92402Q20292R56677K90489o06020r04340p27981o84206n85903
40098a243801J24032R38150P48305k37007n60930K34118R20014O07475J9154N4265
40088A603775L62640K10983k42787m18451l01054k11792j90637j67132j91789
$$ y = [437928, -812705, -1062840, -199789, 234311, -386699, -878060, -442077, 116044, 162593, 403875, 1252914, 1749671, 1335384, 1072699, 1658192, 1769791, 184750, -1705696, -1560451, 483788, 2086438, 2030462, 1314879, 961385, 618641, -201971, -992875, -1063630, -555267, -69564, 91795, -44084, -327503, -459436, -190698, 283957, 492898, 320815, 136745, 271147, 674753, 1080825, 1238214, 1033129, 592683, 190936, -39379, -95211, 197191, 1017483, 1974160, 2264649, 1658629, 754289, 26308, -657898, -1243801, -1119769, -181619, 566686, 329679, -231251, 2867, 922881, 1530356, 1549510, 1603775, 1966415, 2177398, 1934611, 1516160, 1215106, 1003314, 812677, 645545, 453756]
40079D53756j27258K70121P18351O02191k565l37204j63891j0312n3678J21864
40069A471375M10473Q9390p37848r02297Q509Q19549N07999l42979o42049l39252
40059C42870m1633N6192P8521M6564J41434O09582R92129M39980p83297j283754
40049E98588n26860M32230P57763Q91252J077016N22244q57129j516910n82408
40040G95786M20448j47978j314035j029519N33499J379435Q41961J90311J92668
40031A862576R0120o51404j212564p10673M25712R91236L99919p44314j232428
40022g81820m69275P64476J152113N10463j25935k04887k87295o00907m00434
40013d43501M47535P25044j73287r37001l28354Q42250J185780Q73135O89395
$$ y = [453756, 326498, 596619, 1314970, 1917161, 1914596, 1577392, 1413501, 1403189, 1349511, 1471375, 1881848, 1971238, 1233390, 331093, 339602, 1159151, 1667150, 1324171, 682122, 342870, 301237, 357429, 435950, 482514, 623948, 1233530, 2225659, 2665639, 1882342, 598588, 71728, 503958, 1261721, 2152973, 3229989, 3752233, 2895104, 1378194, 795786, 1216234, 1068256, -245779, -1275298, -741799, 637636, 1479597, 1669908, 1862576, 1952696, 1301292, 88728, -621945, -196233, 795003, 1194922, 450608, -781820, -1251095, -486619, 665494, 1175957, 1050022, 845135, 557840, -43067, -443501, 4034, 729078, 555791, -381210, -709564, 132686, 1318466, 2191601, 2880996]
40004B880996K87146p26694j222045k37082Q48611K26335j156338r58220O35412
39995E78121J221235J92123n21829L684L03039n46695j223713n65430M54060M58503
39985C53098k45602n11115k8101P60495J362496J256054K59090p90754q82919
39976A532742m40715o38898j139145m03556J464679K315013J095981n73860r23821
39967B288420l11957O6742P9076R1898k1673j56035M36226J744777K437314J729947
39957H384735O32961L54267O29080N75742P5455n68071j229477j512617r18343
39948F423732l1277j00834r27013r31489N3901K15661j075115j892114r53637
39939G81815J96883K6522l09666O31256J675914J166127R8418K13376N89477o13583
$$ y = [2880996, 3168142, 2441448, 1219403, 982321, 1830932, 2057267, 900929, -57291, 578121, 1799356, 1991479, 1469650, 1473334, 1776373, 1229678, 5965, -559465, -105405, 353098, 107496, -403619, -431720, 328775, 1691271, 2947325, 3206415, 2415661, 1532742, 1092027, 453129, -686016, -1089572, 375107, 2690120, 3786101, 3212241, 2288420, 1976463, 2043205, 2122281, 2214179, 2192506, 2036471, 2472697, 4217474, 6654788, 8384735, 9017696, 9371963, 10001043, 10576785, 10652240, 10084169, 8854692, 7342075, 6423732, 6392455, 6291621, 5364608, 4433119, 4487020, 4702681, 3627566, 1735452, 781815, 978698, 1005220, 695554, 1326810, 3002724, 4168851, 4267269, 4480645, 5070122, 4456539]
39929D456539k301154j887565J60946Q68901m13668j317285p40250k42565n52344
39920a968445j88270J298641J931097O84332n70542k30225M68834m8474r00211
39911D76737n94294K35347J96908k95389r8685K83729k76187j121649p86464L01285
39901a678662M64737k57769j95741R23988J406350M75571m52809j99039L92409
39892H79035J97616k82118j52476L0547o65732j451434o78280J375985K421647
39883A674790J287955m14546o46375K67038M89909m14874j026343m53670L68163
39874A132047L15022k37148k75579J68599L06262L5630o3892N2225j30751m75033
39864H27382j56861Q19425J191989J98371j093018j082115K46909J400999J314024
$$ y = [4456539, 2155385, 267820, 428766, 1297667, 883999, -433286, -1173536, -1416101, -1968445, -2156715, -858074, 1073023, 1757355, 1186813, 956588, 1425422, 1376948, 476737, -117557, 117790, 314698, 19309, -79376, 204353, -71834, -1193483, -1979947, -1678662, -1213925, -1471694, -1667435, -743447, 662903, 1138474, 685665, 486626, 879035, 1076651, 794533, 642057, 672604, 6872, -1444562, -2122842, -746857, 1674790, 2962745, 2548199, 1901824, 2168862, 2658771, 2243897, 1217554, 763884, 1132047, 1447069, 1209921, 934342, 1102941, 1409203, 1444833, 1380941, 1433166, 1302415, 827382, 670521, 1489946, 2681935, 2880306, 1787288, 705173, 952082, 2353081, 3667105]
39855C667105L43694o22120j190682j323336q76502J35070J123776J366746Q64482
39846C488233L31534K33054K36746j33742o71613p68544l42768M7760K6939j78337
39836B269262k52184k21995j74803l5729Q6094j76884p86986j019716l56749O77477
39826G787J109058P04651O4656k53926j88605P9525K99410J75144l11414o92574
39816I93712n48597j30916m1122m09311p73180o46151Q4168J065996J522180Q41439
39806A958218m62322r69568j33682Q05298N00729n71293r59697m49848m9236r5590
39796d26991M6020M12823K15503n16426o56207R5205N24377p3780o25492o5898
39786a070866Q53796P87517j59735q99779j077738r94050m97177N73809J296602
$$ y = [3667105, 4010799, 3388679, 2197997, 874661, -1841, 133229, 1257005, 2623751, 3488233, 3819767, 4052821, 4289567, 4155825, 3484212, 2715668, 2372900, 2420660, 2447599, 2269262, 2017078, 1795083, 1620280, 1584551, 1670645, 1493761, 706775, -312941, -669690, 7787, 1116845, 1821496, 1886152, 1632226, 1443621, 1523146, 1822556, 1997700, 1686286, 993712, 445115, 314199, 273077, -136234, -909414, -1555565, -1471397, -405401, 1116779, 1958218, 1495896, 526328, 392646, 1197944, 1698673, 1127380, 167683, -282165, -331401, -426991, -380971, 31852, 247355, -269071, -925278, -830073, -305696, -379476, -1004968, -1070866, -217070, 570447, 410712, -489067, -1566805, -2560855, -3058032, -2484223, -1187621]
39777a187621O02870p96413r63515N58071J960606J587898o752j099247j011025
39768c55128m36329o5060J99597O42787J025674Q53988J80428k77605m6629L60022
39758B081745J09684o37411q07232J3735Q87119Q62232K29958k19905m37003p13653
39748A369269p16988n0552O64209M99711k47377n02937k15260l01076q03709o89781
39738i94491J93398N78010j19369o65338N378R77937Q14470j69786n23180P9301
39728A76330O20999M88215J36135R2782L66687Q03475J125873P61061m35033j447970
39718B688554j138402O7737O09688m9271q12960o85009k15M24002L49760j04833
39708A349051q12333j259853p17570O20127J449652R52932j14988n56695k63020
$$ y = [-1187621, -584751, -1381164, -2344679, -1786608, 173998, 1761896, 1755144, 655897, -355128, -791457, -856517, -656920, -14133, 1011541, 1865529, 2045957, 1768352, 1721723, 2081745, 2191429, 1554018, 746786, 760521, 1647640, 2509872, 2739830, 2519925, 2082922, 1369269, 652281, 601729, 1265938, 1765649, 1518272, 1015335, 800075, 498999, -304710, -994491, -801093, -223083, -342452, -1007790, -1002412, -24475, 789995, 620209, 97029, 176330, 797329, 1285544, 1421679, 1514461, 1881148, 2684623, 3810496, 4571557, 4136524, 2688554, 1550152, 1617889, 2227577, 2178306, 1365346, 680337, 680122, 1104124, 1453884, 1349051, 536718, -723135, -1440705, -820578, 629074, 1582006, 1467018, 910323, 647303]
39699F47303P4943J30409K7835k03970m65478l19206L30263P19231K10235o01447
39689E50118o53319M6209N94177O33775N54629L87053l13190j308868j543736
39680a053152o13067N26947Q65797O19461N70419P06667L23034p09276j502431
39671b65601j187946l7178P76592N44532j25677j42427N28710P96656J18223n50925
39661D54959j45537Q13506R29896K1223o57694l17807L47559L81598j25924m57826
39651A243953l39052o1714N5059n6273k29587k12383k0686l0779l45674l88860
39641c85996K22691P86865M67178j81217Q0548J059790J270794L78879k07615
39632C491917K35547M92636m08920j397109j132393k17352K434k54965Q1969P29585
$$ y = [647303, 722246, 852655, 880490, 676520, 211042, -108164, 222099, 941330, 1151565, 550118, -103201, -56992, 537185, 1170960, 1725589, 2112642, 1799452, 490584, -1053152, -1666219, -1139272, -273475, 345986, 916405, 1623072, 1946106, 1236830, -265601, -1453547, -1490725, -714133, -169601, -295278, -437705, 91005, 887661, 1005884, 454959, 309422, 1122928, 2052824, 2074047, 1416353, 1098546, 1446105, 1827703, 1701779, 1243953, 904901, 843187, 898246, 841973, 612386, 400003, 379317, 348538, 2864, -385996, -163305, 623560, 1090738, 909521, 990069, 2049859, 3320653, 3699532, 3491917, 3727464, 4220100, 3811180, 2414071, 1281678, 1064326, 1066760, 811795, 893764, 1623349]
39622A623349N19857l40739m42425M59157J045329N55529l21971r11146j332475
39613H54465j486450q01743M53730J013671M34599j61466J47443P58095P50073
39604A962417K95833j9303k65134n76599m27369L92399Q60152M8527j176547j131779
39594c7403K54892J307282R31438j20944o12742m19406k34866l83159n37048l07174
39584a59130K99907Q57148P97488j9428r13058r20304O3932J022571R62257L7176
39574B028559p66700p87759j51543O57809J144269Q38899l18410j477925j431741
39565b64542p5620J224190J255041M37301m3168q8783n46829j360763j283945
39556g47118Q2539J249596P97079n50811r84781j44446P22730Q57144Q13436J027652
$$ y = [1623349, 2143206, 1802467, 1360042, 1819199, 2864528, 3420057, 3098086, 2186940, 854465, -631985, -1433728, -979998, 33673, 468272, 306806, 454249, 1212344, 1962417, 2258250, 2238947, 1973813, 1397214, 969845, 1362244, 2222396, 2270923, 1094376, -37403, 217489, 1524771, 2456209, 2335265, 1722523, 1303117, 1068251, 685092, 148044, -159130, 140777, 997925, 1795413, 1775985, 862927, -57377, 6555, 1029126, 1991383, 2028559, 1261859, 474100, 322557, 980366, 2124635, 2963534, 2645124, 1167199, -264542, -340162, 884028, 2139069, 2576370, 2533202, 2444419, 1897590, 536827, -747118, -664579, 585017, 1382096, 831285, -153496, -297942, 424788, 1281932, 2095368, 3123020]
39546C123020R11879K1458q51159o33373M54216J078163M27284q79122j549827
39537B102539r83924J84063P87475L34261n64087j015462q37851m56447j24711
39528e74144K05530M18818L54826L86589J061211J956173J789443K08438j315877
39519D491007j210170J18844R19000N42071R1181M62773R37057M56246n38911
39510F269098o67999K87920J022429O57077K6587L89379J587446K356667K110574
39501A4039178J523523J407478J817773K402577K976106L525598M125570M976626
39493C6794429O139641P304544Q328284R733542J1766843J3067491J1477731O503270
39485A11115775m0533o071506j0696449j3313057j3020143j0140591p017371n740853
$$ y = [3123020, 4034899, 4056357, 3205198, 2571825, 3026041, 4104204, 4531488, 3652366, 2102539, 1118615, 1302678, 2090153, 2424414, 1860327, 844865, 7014, -449433, -574144, -368614, 50204, 405030, 791619, 1852830, 3809003, 5598446, 5806884, 4491007, 3280837, 3399681, 4318681, 4860752, 4951933, 5414706, 6351763, 6808009, 6269098, 5601099, 5889019, 6911448, 7568525, 7595112, 7984491, 9571937, 11928604, 14039178, 15562701, 16970179, 18787952, 21190529, 24166635, 27692233, 31817803, 36794429, 42934070, 50238614, 58566898, 68300440, 80067283, 93134774, 104612505, 111115775, 111075242, 105003736, 94307287, 80994230, 67974087, 57833496, 50816125, 45075272]
39477D5075272n839447n528552m396322l333616k573135j648985r38450j344804
39469A9471961k421315k558793j309916K374L23882Q9475J2849K5574m4060N9587
39459A3651618K87147N5341p03339j174864q21590q0871M31957N66597K51451
39450A2463447n53375j247865r81748J8976N61837K42601m3452K75180N48050
39441A1283651K01796k40936j58952J67197K60490K44093L09432K87230K87559
39432A2641560P78668J490780J347810J37634q80627p75071k27119k24854n99022
39423A3689759p52077p69705q73013p76480m65637n43810r77215p64740K00613
39414G967695M24966p89718j792564j040396L43443M14977m33948m18339M50273
$$ y = [45075272, 39235825, 33707273, 29310951, 25977335, 23404200, 21755215, 20816765, 19471961, 17050646, 14491853, 13181937, 13184311, 13508193, 13597668, 13610517, 13636091, 13592031, 13651618, 13938765, 13994106, 13290767, 12115903, 11294313, 11213442, 11645399, 12211996, 12463447, 11910072, 10662207, 9680459, 9699435, 10261272, 10503873, 10460421, 10735601, 11283651, 11485447, 11244511, 11085559, 11252756, 11513246, 11757339, 12066771, 12354001, 12641560, 13420228, 14911008, 16258818, 16396452, 15515825, 14740754, 14513635, 14288781, 13689759, 12937682, 12167977, 11294964, 10518484, 10052847, 9509037, 8531822, 7767082, 7967695, 8392661, 7602943, 5810379, 4769983, 5113426, 5528403, 5094455, 4676116, 5126389]
39405E126389N62256l63219r46910o30378k70902k18504R8512N39134K55347m62447
39395C689278l92825K98605J01686j034857j223572K33112J465038R57803j75097
39386C919171k82392K63789K63704p8496M5316K31625k41879o74479p8822O89374
39376D056911P8728j312238j335970K25936J133930K35478o96845R7488J454797
39367C938215J124251o56507j505464m40438Q94150Q12320k49698q40994n14954
39358B560881J49704O48318P34295J79845o94309q13684K91268J389542R91552
39349E437412m42651j093958m67572N9845l84999q80382m96666J06131l0908m23875
39339A382377j1711R74128J309198N47171o04571j377308j461544p72155L46477
$$ y = [5126389, 5688645, 5325426, 4378516, 3748138, 3477236, 3258732, 3357244, 3896378, 4151725, 3689278, 3296453, 3595058, 3696744, 2661887, 1438315, 1671427, 3136465, 4094268, 3919171, 3636779, 3900568, 4164272, 4085776, 4131092, 4362717, 4120838, 3446359, 3367537, 4056911, 4135639, 2823401, 1487431, 1713367, 2847297, 3082775, 2385930, 2483418, 3938215, 5062466, 4405959, 2900495, 2460057, 3354207, 4166527, 3916829, 3075835, 2560881, 2710585, 3358903, 4093198, 4273043, 3578734, 2765050, 3056318, 4445860, 5437412, 4994761, 3900803, 3433231, 3493076, 3108077, 2227695, 1731029, 1837160, 1806252, 1382377, 1370666, 2344794, 3653992, 4201163, 3596592, 2219284, 757740, -14415, 332062]
39330C32062R55576M96001k97811l38069K25354L16111l48504q84292o23829N1674
39320a15727M59305M79211M18672M61709M53985R8577n59220q79797l37324N03230
39310I82621N30714k16309m98318Q5965L94013j74553m74283K71209P89922l4038
39300A656943q10964J53211J523294P00579j696857k353061l98555J224108M41444
39291D40142r39740n13902R52987J167284l5445r32326p80385l67657j88080J62413
39281a034709Q26667J234153R64141K92765j92958j42187K70321M45280O0860
39272B724333l89000l42321k31912p94210j466507q99379P27229J489011M26521
39263A243765j018857j129245j42868O06650N95827J26685n11803q86951m03564
$$ y = [332062, 1287638, 1783639, 1485828, 1147759, 1373113, 1689224, 1340720, 456428, -167401, -115727, 343578, 822789, 1241461, 1703170, 2157155, 2255732, 1696512, 816715, 479391, 982621, 1513335, 1297026, 798708, 884673, 1278686, 1104133, 629850, 901059, 1690981, 1656943, 845979, 999190, 2522484, 3223063, 1526206, -826855, -1225410, -1302, 440142, -499598, -1013500, -60513, 1106771, 1071326, 139000, -641385, -1009042, -1197122, -1034709, -208042, 1026111, 1990252, 2283017, 2090059, 1947872, 2218193, 2663473, 2724333, 2335333, 1993012, 1761100, 966890, -499617, -1398996, -671767, 817244, 1243765, 224908, -904337, -1047205, -440555, 155272, 281957, -229846, -1116797, -1520361]
39254a520361O17953Q74610K6090m74057L93488J415054J014665j99378m92982
39245A655082J93314L80848m10025j080771q80112l19786J1484K24393M45028
39236B19455M22190J15465j21517j29972q7784l7537J33528K86195J47471k34826
39226G12668n63109o19432k51282N10305J030832N20724o22549q63417L24481
39217A79221J367283P28390p79378j193308k35564O06228M93408J59565L82513
39208A708358Q85856J067885R09357R14062J648783L152111M322128L510236N44587
39199A8663363k504754l594738l050083k478305k197342j385431k05800J71007
39191C417917m16908q80482p42905n66342m18507K99949J212073R88841m21852
$$ y = [-1520361, -902408, -27798, -1708, -475765, -82277, 1332777, 2347442, 2148064, 1655082, 1848396, 2229244, 1819219, 738448, -141664, -461450, -449966, -225573, 219455, 641645, 757110, 635593, 505621, 417837, 380300, 513828, 800023, 947494, 712668, 149559, -469873, -721155, -210850, 819982, 1340706, 718157, -145260, 179221, 1546504, 2274894, 1495516, 302208, 66644, 672872, 1166280, 1325845, 1708358, 2594214, 3662099, 4571456, 5485518, 7134301, 10286412, 14608540, 18118776, 18663363, 16158609, 12563871, 9513788, 7035483, 4838141, 3452710, 3246910, 3417917, 3001009, 2120527, 1377622, 811280, 392773, 692722, 1904795, 2893636, 2471784]
39182B471784j324083p75481O6488m392m03505j17632M34251K69734l89697n86647
39172c59180k30913J074m8394O9920M49795O81254N49463K36154k9095o1411K62228
39161A520895O73998N61994k43635j103333j358529j069216o12121o5667N34952
39152a160662Q13803M90319j12376m56169m25958k47845q8433k8781q8686l2882
39142a337670M31350J038578J060360L10585m71144n82088j91960J16948R5719
39133D70678k48629q81735j441372j276840k96460P31148J184882J313700J433009
39124I88381J117904K2361j057129r77656R4368P86837L09480o58472r97258m10877
39114g82061N18618J020626O88211k42867r76374q33350m052O31518N41266J25700
$$ y = [2471784, 1147701, 372220, 438708, 434316, 30811, -86821, 347430, 617164, 227467, -359180, -590093, -589019, -637413, -567493, -117698, 563556, 1113019, 1349173, 1320078, 1258667, 1520895, 2194893, 2756887, 2513252, 1409919, 51390, -1017826, -1629947, -1695614, -1160662, -346859, 143460, 31084, -425085, -851043, -1098888, -1187321, -1216102, -1304788, -1337670, -906320, 132258, 1192618, 1503203, 1032059, 449971, 258011, 374959, 470678, 222049, -659686, -2101058, -3377898, -3674358, -2943210, -1758328, -444628, 988381, 2106285, 2128646, 1071517, 93861, 188229, 975066, 1284546, 626074, -371184, -782061, -263443, 757183, 1445394, 1202527, 226153, -607197, -611249, 20269, 561535, 687235]
39104F87235R9619N24779P46262K63859n90400j011242o53968K9738M14939L73626
39094H84447J60149n9382k25881j77560J15877K27784k96710j157951j435814
39085a965041o60285O03774J385697J265569O21130J34415R7612J20229l13988
39076A289112r22353p41172M58518J465311J078757j83040p84410l13571J80232
39067A527384m5623m87578m71598j29191J11889J79674J12610j29296l24070j56168
39057A88033R3541j91514q67429j083739n96617n1546K13232N25011Q13356M86594
39047d71078k36038k70862M79604P08039q9865n63393K48534J158329P29484m19285
39037A273469q27259n32367m25190k97003M75729J082093K69919j255460j579731
$$ y = [687235, 786854, 1311633, 2057895, 2321754, 1731354, 720112, 66144, 95882, 510821, 884447, 1044596, 985214, 759333, 581773, 697650, 925434, 628724, -529227, -1965041, -2625326, -2021552, -635855, 629714, 1250844, 1385259, 1482871, 1603100, 1289112, 366759, -374413, 84105, 1549416, 2628173, 2445133, 1660723, 1347152, 1527384, 1481761, 994183, 522585, 393394, 505283, 684957, 797567, 668271, 344201, 188033, 281574, 90060, -777369, -1861108, -2457725, -2509271, -2296039, -1771028, -957672, -471078, -707116, -977978, -498374, 209665, 119800, -443593, -195059, 963270, 1692754, 1273469, 446210, -86157, -511347, -808350, -332621, 749472, 1019391, -236069, -1815800]
39028a815800n22635L11262L79410Q07994J817775J862313K29831j447640j477251
39019A45259m16348R8303l18515p92971o74901n3463N86646N85761l08194j158487
39009b306910o28995R68808J650260N16406p87288m73392P48048R06327k37888
39000C55376j115874q32505q7606L12845L90384K72292j54425n21703o3421J067035
38990c77602J528366N11234r88166j362267m04444O30204P51602K55061n9752
38981D84236k0771m1620l19551n91427o27307n06959l05921P5440N60461P73514
38971e19905N76381L36772K76909K0290o22300q97220n1451J233306J450755L41651
38961B145188p64611r00083n80439n19010m08492K11510Q59029Q72206N24886
$$ y = [-1815800, -2338435, -2027173, -1647763, -839769, 978006, 2840319, 3070150, 1622510, 145259, -271089, -172786, -491301, -1284272, -1959173, -2012636, -1425990, -840229, -1148423, -2306910, -2935905, -1967097, -316837, 199569, -587719, -1061111, -313063, 593264, 355376, -760498, -1593003, -1680609, -1367764, -977380, -705088, -859513, -1381216, -1444637, -377602, 1150764, 1661998, 673832, -688435, -1092879, -462675, 288927, 543988, 484236, 463465, 421845, 102294, -489133, -1116440, -1623399, -1929320, -1853880, -1293419, -519905, 56476, 393248, 670157, 690447, 68147, -829073, -880524, 352782, 1803537, 2145188, 1380577, 480494, -99945, -618955, -1027447, -815937, 43092, 915298, 1440184]
38952A440184L79986J89075m62980r85050n27416M41184O59881O8801j23711M91689
38942A571643Q23016J37752o88413o23954j33264k84893r12532r18521j35969
38933a165135L81129R8091j02749O35016J612995J410306q5034j447009j583250
38924b45640r17036l23517J94617R36927J321686N45781p90525j121292j92611
38915e91610M86358L563n69420j00461O49042M21016k68737p1627O64683M00943
38905A023750p51294r35801L12840J040035m6830j396998r78389O48269J348240
38896B63822N53496l94519n43079k76858q9228J06269K89425J47527k09566k80031
38886d32742l2061J01419Q1302K16419L01771j72864r09424r98950l93636l1504
$$ y = [1440184, 1820170, 2009245, 1546265, 561215, 33799, 474983, 1134864, 1203665, 1079954, 1571643, 2394659, 2532411, 1843998, 1220044, 1086780, 801887, -110645, -1029166, -1165135, -784006, -685915, -788664, -153648, 1459347, 2869653, 2784619, 1337610, -245640, -1162676, -1486193, -1291576, -354649, 967037, 1512818, 722293, -398999, -591610, -105252, -101689, -671109, -771570, -122528, 298488, 29751, -41876, 622807, 1023750, 272456, -663345, -350505, 689530, 642700, -754298, -1732687, -1084418, 263822, 817318, 422799, -120280, -397138, -486366, -380097, -90672, 56855, -152711, -432742, -464803, -363384, -282082, -65663, 236108, 63244, -846180, -1845130, -2238766, -2270270]
38876b270270k13346r3672P15746J297820R47269L59869L19079K71863n29115
38867H05243j351433r86213J20139M21189k10923k80956P45710J381229M35183
38858A079168j020196j179725m7943Q55910P98938M95194N69871O01610J9411
38849B172238r14301j466659j263662m54801M95955R47725N21216k82893m15695
38840f60877L41880Q47239Q4048j217844j342967R5540J543142J481427K03479
38831A375067q70406r46336k49967P44177J549725J461906K01749j201391j234128
38822H30396Q8565J030675M77584n08705l47287O57587Q25865l30964j422169
38813A301547j222150k04878M61249M99289L90447L07115q096n78828j055143
$$ y = [-2270270, -2483616, -2577288, -1861542, -563722, 383547, 743416, 1062495, 1334358, 805243, -546190, -1532403, -1412264, -991075, -1201998, -1482954, -737244, 643985, 1079168, 58972, -1120753, -1168696, -312786, 486152, 981346, 1551217, 2152827, 2172238, 1257937, -208722, -1472384, -1927185, -1431230, -483505, 37711, -245182, -660877, -318997, 528242, 612290, -605554, -1948521, -1852981, -309839, 1171588, 1375067, 504661, -441675, -691642, 52535, 1602260, 3064166, 3265915, 2064524, 830396, 918961, 1949636, 2427220, 1918515, 1571228, 2228815, 3054680, 2723716, 1301547, 79397, -125481, 335768, 835057, 1225504, 1532619, 1524523, 945695, -109448]
38804a09448j128945p04029J29011R50165J171268P29782K34932L016m70184j383809
38794e78241j660573l08853J603280J877464K45627j091258n96861N01879L87755
38785C80219m66818l32570P04007Q04243n40480j514083o92224Q61705J224728
38776D28727K11450p72902p66743p6414N45085O44431J79969m53997o68124l65756
38766a094274p7136p7055N0308M81555N47335j39693o68653n9222J000754R72590
38756I36509j86523r10875l90388L35081J20940o35404q39934l32497J72549K80887
38746a449655K92674N48113Q81947P43513j93028j397388j695292n94238Q45758
38737b017596J198628N49150K31408P36987J050335L38379q34830j470886j340032
$$ y = [-109448, -1238393, -1942422, -1813411, -863246, 308022, 1037804, 1272736, 1275752, 805568, -578241, -2238814, -2547667, -944387, 933077, 1178704, 87446, -509415, -7536, 380219, -86599, -419169, 284838, 1089081, 548601, -965482, -1657706, -796001, 428727, 640177, -132725, -899468, -975882, -430797, 213634, 393603, -60394, -728518, -1094274, -1171410, -1248465, -1198157, -716602, -169267, -308960, -977613, -1036835, -36081, 936509, 749986, -160889, -551277, -216196, -95256, -730660, -1570594, -1903091, -1730542, -1449655, -1156981, -608868, 273079, 1016592, 823564, -573824, -2269116, -2863354, -2017596, -818968, -269818, -38410, 698577, 1748912, 2087291, 1252461, -218425, -1558457]
38728a558457p36058K7810M18202n545n94204p9122J368859J884557N80472r19454
38718C87060q24647K56612O17788J69744J4127J35294m05565j320467j181941
38709b151995K45880J501887J499184O48417k51841q45433p98611L4214Q31546
38700G13248N60722l38288m64080K32465L28912n36391q63233K16244J366600
38691A216199J080123j27245p79412n80403k51633j10739l727M347j15322j4047
38681C18141K88705P4062p88186j106489m1234J289744J231288O5639m14583L95924
38671A313011J123625N44811p26512j238622o21281J34398M8473o49885q30709
38662i02691P3931J190064J202450J09110p36106m67801K39405L64061m5948k95093
$$ y = [-1558457, -2294515, -2266705, -1848503, -1854048, -2448252, -2527374, -1158515, 726042, 1306514, 387060, -437587, -180975, 436813, 606557, 620684, 755978, 350413, -970054, -2151995, -1906115, -404228, 1094956, 1743373, 1491532, 646099, -152512, -118298, 713248, 1273970, 935682, 471602, 704067, 1032979, 496588, -366645, -150401, 1216199, 2296322, 2169077, 1389665, 809262, 557629, 446890, 443163, 447510, 332188, 318141, 606846, 680908, -107278, -1213767, -1255001, 34743, 1266031, 1331670, 917087, 1313011, 2436636, 2981447, 2254935, 1016313, 395032, 529430, 577903, -71982, -902691, -828760, 361304, 1563754, 1672864, 936758, 468957, 708362, 1072423, 1026475, 731382]
38652G31382j91886j1463J84400M22467M04604n0051m69527l30309O8320q102
38642G49835o51906j193271j021325j14707J024911J626420J163883j2604q75464
38633F95772q29706k47186K61132M98903M07889o5352m73705j16625P42380Q52249
38623A725751k11025j194155r28380J9424M16345K00052J39090L70957M21121
38614I59180J65774k03972o61103r66199n28569N02867R03569J22090o40489k59140
38604f05992N18622N05405J35701L76534O85386R8485n85992l6936R21934M35251
38594B448398j007450j133360K19114P39693l71785j044185N0754J288180R33219
38585B122578j89119n37062l45678n03205o46620k01374J16277l56522o37239
$$ y = [731382, 539496, 528033, 712433, 1134900, 1539504, 1489453, 1019926, 689617, 757937, 749835, 97929, -1095342, -2116667, -2231374, -1206463, 419957, 1583840, 1571236, 695772, -133934, -381120, -119988, 378915, 786804, 721452, 247747, 131122, 873502, 1725751, 1514726, 320571, -607809, -588385, -172040, 28012, 167102, 538059, 959180, 1124954, 920982, 259879, -706320, -1234889, -732022, 171547, 293637, -346852, -605992, -87370, 418035, 553736, 930270, 1615656, 1714141, 1128149, 1091213, 2013147, 2448398, 1440948, 307588, 526702, 1266395, 894610, -149575, -98821, 1189359, 2122578, 1933459, 1396397, 1050719, 547514, -99106, -300480, -184203, -540725, -1177964]
38576a177964L19849J513704J245624k13660j109125p74597m4745M37385P09031
38567I05502O10581n1338o46066l92986K57127J91981n47337p83846r451R94362
38557E28529J386275J077934K80537p61583j477027j306605n06916Q7442J55927
38548e35487Q3855J12340N6913p8236N4006M99906P76948M99371j32774n83446
38538G53396n06300p0671J05583l97204j080607r28119J92590J126150R10016
38529A04834N4194l13890m1015J26752j64428n12839n12157j40062M70501J033147
38519A05037J062265M20371k86760m32076k38284l26654o65282o59068j28423
38510a148874M60445O65525M36858n7457m89092m36280J30286O31381N81841K30470
$$ y = [-1177964, -858115, 655589, 1901213, 1687553, 578428, -196169, -240914, 196471, 905502, 1516083, 1464745, 818679, 425693, 682820, 874801, 327464, -456382, -465833, 528529, 1914804, 2992738, 3273275, 2511692, 1034665, -271940, -778856, -691414, -535487, -451632, -339292, -282379, -360615, -306609, 193297, 970245, 1469616, 1336842, 753396, 247096, 176425, 282008, -115196, -1195803, -2123922, -1931332, -805182, 104834, 159028, -154862, -195877, -69125, -233553, -746392, -1258549, -1398611, -928110, 105037, 1167302, 1587673, 1300913, 868837, 630553, 303899, -361383, -1020451, -1148874, -688429, -22904, 413954, 356497, -132595, -568875, -438589, 192792, 774633, 1005103]
38500A005103O4363M7793j20750l62849m08944l12244k37920q2934J88257K38199
38490A8074j00242m37187m72612m40904l94134J58779J174784J542281O25558
38481A674397n08424o07434j66805m00656r91281o35132N31628R71010K63078
38472A30381k43679L11211J024932Q20670m1257p07574q79331o17659K0286O25792
38462D43772O02573R2729j35116J8263j57412p43769q37678j13106N03300L72270
38452D5826J44166M03622M93937k31789r76551n99542M91689Q48261Q2150o98111
38442C658n22450K92268P64246M08796l66810p26624k66117M82964O29459M1426
38432G40816n52968o36486m23265j48238L36507Q84637Q58327J91935j98519J84377
$$ y = [1005103, 1069466, 1117259, 996509, 633660, 224716, -87528, -325448, -408382, -220125, 18074, -82168, -519355, -991967, -1432871, -1827005, -1668226, -493442, 1048839, 1674397, 1165973, 558539, 391734, -8922, -1000203, -1635335, -1103707, -132697, 130381, -113298, 197913, 1222845, 2043515, 2002258, 1294684, 415353, -202306, -182020, 443772, 1046345, 1139074, 1003958, 1022221, 864809, 121040, -716638, -829744, -326444, 45826, 189992, 593614, 1087551, 855762, -120789, -720331, -228642, 619619, 701769, 3658, -518792, -226524, 537722, 946518, 579708, -146916, -413033, 69931, 699390, 740816, 187848, -448638, -871903, -1020141, -683634, 201003, 1059330, 1251265, 1052746, 1237123]
38422A237123M49064k69316j157418p77635O13163J214926K19432j085466j153495
38413g09622j07085P81622Q15639L58464j1792j10263L2135L65067O42314M22794
38403B479273l98648j182839j075170p1315P97543O53089j16795l75897K64061
38394I73302J001220R49704J87082n00782n55236j00005L10822K36319k44689
38385B257737o52417o94057n27144k93889J69359P62490P85491j25257j136249
38376E46064j157959l52175K27216K06670L9243j32166m65421m65455M46443J445423
38366C37883J103113j76213m69075N13412Q15839l63340j083768K7231J214701
38357A919783M95166q87360n78006Q28953Q88906m54120r43889j5036M84825k03042
$$ y = [1237123, 1686187, 1416871, 259453, -518182, 94981, 1309907, 1529339, 443873, -709622, -816707, -35085, 780554, 1139018, 1127226, 1016963, 1049098, 1414165, 2056479, 2479273, 2080625, 897786, -177384, -248699, 548844, 1201933, 1085138, 709241, 973302, 1974522, 2924226, 3111308, 2610526, 2055290, 1955285, 2266107, 2502426, 2257737, 1605320, 911263, 384119, 90230, 259589, 1022079, 1807570, 1682313, 546064, -611895, -964070, -736854, -530184, -490941, -623107, -1088528, -1553983, -1107540, 337883, 1440996, 1264783, 795708, 1309120, 2124959, 1761619, 677851, 705082, 1919783, 2414949, 1527589, 949583, 1778536, 2667442, 2213322, 1269433, 1254397, 1739222, 1536180]
38347A536180o03844k3371K03627n00659o58470M20269J042167O6873q76366j29237
38337D77169J051944O22070p83424j029312J496O23331L41305J23376J20615m08022
38327A140548j052252n70207O44117P97473k80840p55974R97L20199o23312j063859
38317a443110L12397J760009J097903o99584j055961J08526N55434l71841q07271
38308e43498K72895J260599N89089p54964q79928J61129P64883K80260m04053
38299G46412m96023k06029K3373J22616J2167n11556j144732j024494J63348J444290
38289h70628J519639L66259o50364m02830O50784J097305L57057o69124q65222
38280E32876l03381O4106j94327n24166l04221L52664Q89434R46331N07990k08990
$$ y = [1536180, 932336, 908965, 1112592, 611933, -46537, 373732, 1415899, 1482772, 606406, 477169, 1529113, 2151183, 1367759, 338447, 339943, 963274, 1304579, 1427955, 1548570, 1140548, 88296, -481911, 162206, 959679, 678839, -77135, -76138, 244061, -379251, -1443110, -1130713, 629296, 1727199, 1027615, -28346, 80180, 635614, 263773, -543498, -270603, 989996, 1579085, 824121, -55807, 105322, 870205, 1150465, 746412, 250389, 44360, 67733, 190349, 202516, -309040, -1453772, -2478266, -2314918, -870628, 649011, 1015270, 364906, -37924, 612860, 1710165, 2067222, 1398098, 532876, 229495, 293601, 99274, -424892, -729113, -376449, 512985, 1459316, 1967306, 1758316]
38270A758316p89970q58017m82571r8508Q4456K53638M81677M81324P6997m58468
38260D48874p36835o00494q8210M81356M26626n51708j463344q78994R29598J836561
38250a96570O20310j195742j386879l4877R33358O58378J74295M19998R90344
38241I82615J169830R14415L60081n49150j426453j397696l22459O73035N29160
38232I33378l81583p95135j63795P30719P16155l64851j257805o42161J010742
38223b14336J693578N56594o35400M6797J653988J610630l66344j799417j169234
38214A376856J07886K48016l75115n35249k92315l05414l19613R4846L41289j32746
38204B08441m99232J44276R79639O59434m18215q20384n03337n63011q83513k04534
$$ y = [1758316, 968346, 110329, -372242, -470750, -386294, -132656, 349021, 830345, 907342, 448874, -287961, -888455, -976665, -495309, -68683, -620391, -2083735, -2962729, -2033131, -196570, 423740, -772002, -2158881, -2193758, -1260400, -602022, -427727, -7729, 982615, 2152445, 3066860, 3426941, 2877791, 1451338, 53642, -268817, 404218, 933378, 551795, -243340, -407135, 323584, 1039739, 674888, -582917, -1225078, -214336, 1479242, 2035836, 1400436, 1447233, 3101221, 4711851, 4345507, 2546090, 1376856, 1484742, 1732758, 1357643, 822394, 530079, 224665, -94948, -102, 341187, 208441, -290791, -146515, 833124, 1492558, 1074343, 253959, -249378, -812389, -1695902, -1900436]
38194a900436J310723J736535K95123j262202j199103j70816K12168l3101K92151
38185g18958J196509J292478N6683j133442q80996K44808N75037k32255q09773
38176d09909k87947L53988r371o23362k2324J303192J340479j93496j113370j25297
38166B12583J047725L86305j212421j425600j20048P31817K51938l83714j76913
38157f88328L93611N88528M04142N1859l27666l08644L08826P10265M2593j011452
38147A63734j071279k63469O9285k69362j60400N63629P57365K21648J79736Q70728
38137A061615Q46196l98865j230018n36364M26928L17774r1616K81902O18377
38128A295929j55442j006752m09654Q01493O60024n56806p17580O14830J469981
$$ y = [-1900436, -589713, 1146822, 1441945, 179743, -1019360, -1190176, -978008, -1011109, -718958, 477551, 1770029, 1826712, 693270, -187726, 57082, 632119, 399864, -409909, -697856, -343868, -353239, -976601, -998925, 304267, 1644746, 1451250, 337880, 212583, 1260308, 1646613, 434192, -991408, -1111456, -379639, -127701, -511415, -688328, -294717, 293811, 697953, 749812, 422146, 113502, 422328, 1132593, 1175186, 163734, -907545, -1171014, -1101729, -1371091, -1531491, -967862, -210497, 11151, 190887, 1061615, 1907811, 1508946, 278928, -257436, 169492, 487266, 395650, 677552, 1295929, 1140487, 133735, -275919, 525574, 1185598, 628792, -88788, 526042, 1996023]
38119A996023N92453q27503j163338m56581J90250J42238m30301r28468p60983
38110a646210l4128L33611r5302l81504L31943J144503P15758l26644k67888O97160
38100D71299O73426n59667r31310L75474J287329J88234j322638r82076N75926
38091b24003J085998K40576m21500m44420p20607j094265l07198J334050J709428
38082A158059J74909j097711l84273Q90485N03078r64618j096984N06556J716260
38073A405761J234075K63398J62251L36009l21886j293025j273393l54882J63009
38064C21317j97602o26311m87774n719N40288J096334J183571K17209j194745
38055H46568j510427l52696Q10934P63358J55008J26648M33080J70010m84699
$$ y = [1996023, 2588476, 1760973, 597635, 141054, 331304, 473542, 43241, -885227, -1646210, -1680338, -1346727, -1442029, -1823533, -1491590, -347087, 368671, 42027, -225861, 471299, 1144725, 585058, -346252, 29222, 1316551, 1504785, 182147, -799929, -224003, 861995, 1102571, 681071, 236651, -483956, -1578221, -1885419, -551369, 1158059, 1332968, 235257, -149016, 741469, 1244547, 279929, -817055, -310499, 1405761, 2639836, 2903234, 3065485, 3401494, 3079608, 1786583, 513190, 158308, 321317, 123715, -502596, -990370, -996089, -455801, 640533, 1824104, 2041313, 846568, -663859, -1016555, -205621, 557737, 712745, 839393, 1272473, 1442483, 957784]
38046I57784o63097l84663l22802l64632J37304Q64187P89571k8482l99329M9384
38036F35225L48511q867k45042Q7138J37406o34128j171063l88426R39391J233351
38026I33496M11753k60041k53061k88090p83299j087559n97047L00938Q02640
38017h20270N88292j02881p59588p98439k5493R30997J164489O10536P7807J7461
38007H82911n0917n24048q23746k31494P81217R37329q9594j082465q30045K76743
37997g54109Q20668K82377l92912k97129J58097L6886o01820q43976l53682K77263
37987a668337O28955R05250J066375N99590l30225o02089J66713P02004o007q45652
37977F16577k45371J013042P14812j157663k014631n48239J127885O16619j184559
$$ y = [957784, 294687, -89976, -412778, -777410, -640106, 224081, 1013652, 985170, 585841, 635225, 983736, 974869, 729827, 816965, 954371, 320243, -850820, -1239246, -299855, 933496, 1345249, 1085208, 832147, 544057, -239242, -1326801, -1923848, -1622910, -820270, -231978, -334859, -1094447, -1892886, -1918379, -987382, 177107, 787643, 865450, 882911, 831994, 307946, -515800, -747294, 33923, 971252, 881658, -200807, -1030852, -754109, 66559, 348936, -43976, -341105, -183008, -146122, -747942, -1591918, -1945600, -1668337, -1039382, -134132, 932243, 1531833, 1201608, 599519, 766232, 1468236, 1462229, 616577, 371206, 1384248, 2099060, 941397, -1073234, -1621473, -493588, 123031, -1061528]
37968a061528j541424J00745J632202J495128M59515o1705R2764K18447l7812
37959A296332m68305o84641l60732L90726Q09457L08440n09631n06894K75533
37950E50285N98387n0894o81979m74433n8161k57451n67507o7165Q19846Q17798
37940F28726j88756q99279m60398M48496O86657M3813p71147r99455m37821M29864
37930a519300P88121L40217k33128j41193L06696R3672q46605j283547m42405
37921b937472P25128Q22762L4755j65688P44484J479333Q08360n46866q27232
37912A37564K53889J061482M11846o92549o32123K73174K21018j161864j982656
37903b110219p94966J200762J787677O51626o21295r01671m98215j8455L89241
$$ y = [-1061528, -2602952, -2502207, -870005, 625123, 1084638, 1022933, 1115697, 1334144, 1296332, 828027, 143386, -217346, 173380, 982837, 1291277, 781646, 274752, 550285, 1148672, 1097778, 415799, -58634, -116795, -374246, -941753, -1008918, -189072, 628726, 439970, -459309, -919707, -471211, 215446, 259259, -511888, -1511343, -1949164, -1519300, -731179, -390962, -624090, -765283, -458587, -364915, -1211520, -2495067, -2937472, -2212344, -1389582, -1354827, -1520515, -776031, 703302, 1511662, 964796, 137564, 391453, 1452935, 1864781, 1172232, 540109, 813283, 1034301, -127563, -2110219, -2905185, -1704423, 83254, 734880, 113585, -788086, -1286301, -1304756, -915515]
37894i15515N64482K75555j47962r2671K86031K70590n9819J71916J021628J341172
37884B715407N28344n09233q12753o76788o62037m04259M51740J012073K25339
37875A867833j247760j649177n22101P18166P51426j24279p38778n36818R0484
37866a391004M89457L93404N8700j02775l3517j3291r8040Q800L28282L95559
37856C5575M9637j72668L0843O6405n03122q76745p7526J291477J627321O25733
37846B096930k73797l8312N13330N6054j238426j838625p42488J281496K375722
37837B191884J466914n06709j532442r14897j17338n51638j311241n16611J463276
37828c28802K097221M36827j215959o34100R77735Q55463j080605k155698r89913
$$ y = [-915515, -351033, -75478, -223440, -316111, -30080, 240510, 180691, 352607, 1374235, 2715407, 3243751, 2734518, 1921765, 1244977, 582940, 178681, 630421, 1642494, 1867833, 620073, -1029104, -1551205, -833039, -81613, -205892, -944670, -1481488, -1391004, -901547, -508143, -449443, -552218, -585735, -599026, -697066, -688266, -359984, 35575, 85212, -87456, -56613, 9792, -493330, -1370075, -1447601, -156124, 1471197, 2096930, 1823133, 1784821, 2298151, 2354205, 1115779, -722846, -1465334, -183838, 2191884, 3658798, 3152089, 1619647, 704750, 587412, 35774, -1275467, -1792078, -328802, 1768419, 2205246, 989287, 355187, 1332922, 2188385, 1107780, -1047918, -2037831]
37819b037831O84485R54493M64050P84826J490604Q72980r58054j817916o51509
37810b13872Q21872O34034o56410j101414l52557J85329j44109l68118K25976
37801i69269Q82042P13049J6853n03169p75977q32695k85174P31779J113274L90265
37791D80978j95416M46444J253422N64220j024607j391371k40759M56681l26235
37782B3357j130616n02276P46667R36989p5466j053942j067991j16472J157119
37773a082631J660451O41234j047095j473699j61010J069009P19398j96475K3088
37764A52270Q90378N39993j130969k095323j070360Q35934J750143J132123j55425
37755H48764r68934p07685L06756J018311O87825k40330q05199q04181o83496
$$ y = [-2037831, -1353346, -398853, 65197, 850023, 2340627, 3213607, 2255553, 437637, -213872, 608000, 1242034, 585624, -515790, -868347, -683018, -827127, -1195245, -969269, -87227, 625822, 642675, 139506, -636471, -1469166, -1754340, -1022561, 90713, 480978, 285562, 732006, 1985428, 2549648, 1525041, 133670, -107089, 349592, 23357, -1107259, -1609535, -862868, 74121, -1345, -1055287, -2123278, -2239750, -1082631, 577820, 1219054, 171959, -1301740, -1462750, -393741, 325657, 129182, 152270, 1042648, 1582641, 451672, -1643651, -2714011, -1878077, -127934, 1004189, 848764, -120170, -827855, -521099, 497212, 1185037, 944707, 139508, -664673, -1348169]
37746a348169m63096K20591J089408J327810Q50391M59737N01595L43857m14759
37737B567365j112451r65544j99671L19572J75392l04993n57945l17823J60566
37728b35532L74150K56675L09835O39297M08152q52281j891741j104208Q87931
37719a207722J686723M86497p81416m85314K92675j85877j287224j026686O17796
37710a890548J536335O28503p30483q25529K25120J092345R99084J89745o38109
$$ y = [-1348169, -1811265, -1590674, -501266, 826544, 1676935, 2136672, 2638267, 2982124, 2567365, 1454914, 489370, 289699, 609271, 784663, 479670, -78275, -396098, -235532, 138618, 395293, 705128, 1344425, 1752577, 900296, -991445, -2095653, -1207722, 479001, 965498, 184082, -301232, -8557, -194434, -1481658, -2508344, -1890548, -354213, 274290, -456193, -1281722, -1056602, 35743, 1034827, 1224572, 586463]
$$ [...]
##END NTUPLES=NMR SPECTRUM
##END=
