##TITLE=31Pdec_SR92_oil2
 CD3OD, 24 sc
 28.10.2021
##JCAMPDX= 6.0         $$ Bruker NMR JCAMP-DX V2.0
##DATA TYPE= NMR SPECTRUM
##DATA CLASS= NTUPLES
##ORIGIN= UXNMR, Bruker Analytische Messtechnik GmbH
##OWNER= root
$$ XWIN-NMR		Version 3.5
$$ Thu Oct 28 11:32:21 2021 Russian Standard Time (UT+4h)  she@DPX200
##.OBSERVE FREQUENCY= 81.013821
##.OBSERVE NUCLEUS= ^31P
##.ACQUISITION MODE= SIMULTANEOUS
##.ACQUISITION SCHEME= undefined
##.AVERAGES= 100
##.DIGITISER RES= 16
##SPECTROMETER/DATA SYSTEM= spect
##.PULSE SEQUENCE= zgpg30
##.SOLVENT NAME= MeOD
##.SHIFT REFERENCE= (INTERNAL, MeOD, 0, 248.564)
##AUDIT TRAIL= $$ (NUMBER, WHEN, WHO, WHERE, WHAT)
$$ ##TITLE= Audit trail, XWIN-NMR		Version 3.5
$$ ##JCAMPDX= 5.01
$$ ##ORIGIN= Bruker BioSpin GmbH
$$ ##OWNER= she
$$ F:/spectra/data/she/nmr/P31/1/pdata/1/auditp.txt
$$ ##AUDIT TRAIL=  $$ (NUMBER, WHEN, WHO, WHERE, WHAT)
(   1,<2021-10-28 11:30:24.78 +0400>,<she>,<DPX200>,
      <created by zg, POWCHK disabled, PULCHK disabled
       configuration hash MD5:
       00 E9 B6 7A A2 85 ED C7 34 08 36 98 17 FE 4E 26
       data hash MD5: 32K
       13 96 F8 6B 9A 2A 7F 36 BA 87 93 15 8B BC 76 73>)
(   2,<2021-10-28 11:30:28.68 +0400>,<she>,<DPX200>,
      <Start of raw data processing
       efp BC_mod = 2 LB = 1 FT_mod = 6 PKNL = 1 PHC0 = -8987.784 PHC1 = 409.2694 SI = 64K 
       data hash MD5: 64K
       AE 09 DF AF 6B 9A 50 62 8A C4 DF 9E 12 06 41 9A>)
(   3,<2021-10-28 11:30:55.76 +0400>,<she>,<DPX200>,
      <pk PHC0 = -5.135406 PHC1 = 0 
       data hash MD5: 64K
       19 8C 09 FA 67 15 B5 21 7F 87 E2 67 7D 4E B5 ED>)
$$ ##END=
$$ 
$$ hash MD5
$$ 4A 44 66 9C 0C 12 1A B8 CD 0E D9 CC 19 C4 F1 EA
##$RELAX= 
##$RELAX= 
##$RELAX= 
##$RELAX= 
##$RELAX= 
##$RELAX= 
##$RELAX= 
##$RELAX= 
$$ Bruker specific parameters
$$ --------------------------
##$DU= <F:/spectra>
##$EXPNO= 1
##$NAME= <P31>
##$PROCNO= 1
##$TYPE= <nmr>
##$USER= <she>
##$AMP= (0..31)
100 100 100 100 100 100 100 100 100 100 100 100 100 100 100 100 100 100 
100 100 100 100 100 100 100 100 100 100 100 100 100 100 
##$AQSEQ= 0
##$AQ_mod= 1
##$AUNM= <au_zg>
##$AUTOPOS= <>
##$BF1= 81.014009
##$BF2= 200.13
##$BF3= 200.13
##$BF4= 200.13
##$BF5= 200.13
##$BF6= 200.13
##$BF7= 200.13
##$BF8= 200.13
##$BYTORDA= 1
##$CFDGTYP= 0
##$CFRGTYP= 5
##$CHEMSTR= <none>
##$CNST= (0..31)
1 1 145 1 1 1 1 1 1 1 1 1 1 1 1 1 1 1 1 1 1 1 1 1 1 1 1 1 1 1 1 1 
##$CPDPRG= <waltz16>
##$CPDPRG1= <>
##$CPDPRG2= <waltz16>
##$CPDPRG3= <>
##$CPDPRG4= <mlev>
##$CPDPRG5= <mlev>
##$CPDPRG6= <mlev>
##$CPDPRG7= <mlev>
##$CPDPRG8= <mlev>
##$CPDPRGB= <>
##$CPDPRGT= <>
##$D= (0..31)
0 1 0 0 0 0 0 0 0 0 0 0.03 2e-05 3e-06 0 0 0 0 0 0 0 0 0 0 0 0 0 0 0 0 
0 0 
##$DATE= 1635406130
##$DBL= (0..7)
120 120 120 11 120 120 24 19 
##$DBP= (0..7)
150 150 150 150 150 150 150 150 
##$DBP07= 0
##$DBPNAM0= <>
##$DBPNAM1= <>
##$DBPNAM2= <>
##$DBPNAM3= <>
##$DBPNAM4= <>
##$DBPNAM5= <>
##$DBPNAM6= <>
##$DBPNAM7= <>
##$DBPOAL= (0..7)
0.5 0.5 0.5 0.5 0.5 0.5 0.5 0.5 
##$DBPOFFS= (0..7)
0 0 0 0 0 0 0 0 
$$ [...]
##$SUBNAM2= <"">
##$SUBNAM3= <"">
##$SUBNAM4= <"">
##$SUBNAM5= <"">
##$SUBNAM6= <"">
##$SUBNAM7= <"">
##$SUBNAM8= <"">
##$SUBNAM9= <"">
##$SW= 501.771253377433
##$SWIBOX= (0..15)
0 1 3 0 0 0 0 0 0 0 0 0 0 0 0 0 
##$SW_h= 40650.406504065
##$TD= 32768
##$TD0= 1
##$TE= 0
##$TE2= 300
##$TE3= 300
##$TEG= 300
##$TL= (0..7)
0 120 53 12 22 120 120 120 
##$TP= (0..7)
150 150 150 150 150 150 150 150 
##$TP07= 0
##$TPNAME0= <>
##$TPNAME1= <>
##$TPNAME2= <>
##$TPNAME3= <>
##$TPNAME4= <>
##$TPNAME5= <>
##$TPNAME6= <>
##$TPNAME7= <>
##$TPOAL= (0..7)
0.5 0.5 0.5 0.5 0.5 0.5 0.5 0.5 
##$TPOFFS= (0..7)
0 0 0 0 0 0 0 0 
##$TUNHIN= 0
##$TUNHOUT= 0
##$TUNXOUT= 0
##$USERA1= <user>
##$USERA2= <user>
##$USERA3= <user>
##$USERA4= <user>
##$USERA5= <user>
##$V9= 5
##$VALIST= <valist>
##$VCLIST= <CCCCCCCCCCCCCCC>
##$VD= 0
##$VDLIST= <DDDDDDDDDDDDDDD>
##$VPLIST= <PPPPPPPPPPPPPPP>
##$VTLIST= <TTTTTTTTTTTTTTT>
##$WBST= 1024
##$WBSW= 4
##$XGAIN= (0..3)
0 0 0 0 
##$XL= 0
##$YL= 0
##$YMAX_a= 2468
##$YMIN_a= -2472
##$ZGOPTNS= <>
##$ZL1= 120
##$ZL2= 120
##$ZL3= 120
##$ZL4= 120
##$ABSF1= 0
##$ABSF2= 0
##$ABSG= 0
##$ABSL= 0
##$ALPHA= 0
##$AQORDER= 0
##$ASSFAC= 0
##$ASSFACI= 0
##$ASSFACX= 0
##$ASSWID= 0
##$AUNMP= <proc_1d>
##$AZFE= 0.1
##$AZFW= 0.5
##$BCFW= 0
##$BC_mod= 2
##$BYTORDP= 0
##$COROFFS= 0
##$CY= -3
##$DATMOD= 1
##$DC= 0
##$DFILT= <>
##$DTYPP= 0
##$F1P= 0
##$F2P= 0
##$FCOR= 1
##$FTSIZE= 65536
##$FT_mod= 6
##$GAMMA= 0
##$GB= 0
##$INTBC= 1
##$INTSCL= 5.30512e-09
##$ISEN= 30
##$LB= 1
##$LEV0= 0
##$LPBIN= 0
##$MAXI= 10000
##$MC2= 0
##$MEAN= 0
##$ME_mod= 0
##$MI= 50
##$NCOEF= 0
##$NC_proc= -7
##$NLEV= 6
##$NOISF1= 182.463
##$NOISF2= 159.3651
##$NSP= 0
##$NTH_PI= 0
##$NZP= 0
##$OFFSET= 248.5645
##$PC= 4
##$PHC0= -8992.92
##$PHC1= 409.2694
##$PH_mod= 1
##$PKNL= yes
##$PPARMOD= 0
##$PSCAL= 0
##$PSIGN= 0
##$REVERSE= no
##$SF= 81.014009
##$SI= 65536
##$SIGF1= 159.3651
##$SIGF2= -187.1042
##$SINO= 113.3802
##$SIOLD= 16384
##$SREGLST= <1H.CDCl3>
##$SSB= 0
##$STSI= 65536
##$STSR= 0
##$SW_p= 40650.406504065
##$SYMM= 0
##$S_DEV= 0
##$TDeff= 32768
##$TDoff= 0
##$TI= <>
##$TILT= no
##$TM1= 0
##$TM2= 0
##$TOPLEV= 0
##$USERP1= <user>
##$USERP2= <user>
##$USERP3= <user>
##$USERP4= <user>
##$USERP5= <user>
##$WDW= 1
##$XDIM= 65536
##$YMAX_p= 309314982
##$YMIN_p= -142375974
$$ End of Bruker specific parameters
$$ ---------------------------------
##NTUPLES= NMR SPECTRUM
##VAR_NAME=  FREQUENCY,     SPECTRUM/REAL,   SPECTRUM/IMAG
##SYMBOL=    X,             R,               I
##VAR_TYPE=  INDEPENDENT,   DEPENDENT,       DEPENDENT
##VAR_FORM=  AFFN,          ASDF,            ASDF
##VAR_DIM=   65536,         65536,           65536
##UNITS=     HZ,            ARBITRARY UNITS, ARBITRARY UNITS
##FACTOR=    0.620285442955139, 1,           1
##FIRST=     20137.2065510759, 0,            0
##LAST=      -20513.1999529892, 0,           0
##MIN=       -20513.1999529892, -142375974,  0
##MAX=       20137.2065510759, 309314982,    0
$$ Real data points
##PAGE= N=1
##DATA TABLE= (X++(R..R)), XYDATA
$$ [...]
13030F38031N120421L601323j183213j105252K872766K389365l440007o229288
13022B664146k329338J799901Q13390k051859k312310j123035o79267L41756K251054
13013f25562J517436k581365m166299O98436O473776N514825o52470m143782k388285
13004c53290j5856p8949l55492Q23344J186018q44483k692290j479449J691817
12995b118630L595835K850271L16339k490401l855647k518908O36154K936356
12987f48631K983245J814426L21473k133752n096480n570610j793727L190112
12979f933944M684255K332308J86384J006513L174924L666516J713364j340027
12971H490293l952670n104441m450356k740801j223365j56552J100576K382172
$$ plain form
13030 638031 5758452 9359775 8176562 7071310 9944076 12333441 8893434 2664146
13022 2664146 334808 2134709 2948099 896240 -1416070 -2539105 -3218372 -2876616 -625562
13013 -625562 891874 -1689491 -5855790 -5157354 1316422 6831247 6178777 2034995 -353290
13004 -353290 -369146 -448095 -803587 19757 1205775 361292 -2330998 -3810447 -2118630
12995 -2118630 1477205 4327476 4643815 2153414 -1702233 -4221141 -3584987 -648631
12987 -648631 2334614 4149040 4470513 2336761 -2759719 -8330329 -10124056 -6933944
12979 -6933944 -2249689 82619 269003 1275516 4450440 8116956 9830320 8490293
12971 8490293 4537623 -566818 -5017174 -7757975 -8981340 -9137892 -8037316 -5655144
12963e655144K609258J795123J415569J985195K004466M00616j688632k829946
12955C6505l151443k711267j94810M203289O504812L211764k926000n372139k313368
12946b712657J231747R75417r55839m14653K019380K481151K26084j536994r87418
12937C26218j19881q77181j889779r51683J193667J824208K61474j161426l92448
12928a786831J570838K035632N3083k393132k623624j42447K885030L712892J436872
12919D748313k307139m746075m238982j457351J586702L448234L834604K741022
12911C609328K82886k304954k996915j374774N01713R19719Q93470J866211K422267
12902C818951K41438l260328l861947p14716J982835J054205j195636r84349J273301
$$ plain form
12963 -5655144 -3045886 -1250763 164806 2150001 4154467 4555083 2866451 36505
12955 36505 -3114938 -5826205 -6021015 -1817726 4687086 7898850 4972850 -399289 -2712657
12946 -2712657 -1480910 -505493 -1461332 -1875985 143395 2624546 2850630 1313636 326218
12937 326218 206337 -670844 -2560623 -3512306 -2318639 -494431 -232957 -1394383 -1786831
12928 -1786831 -215993 1819639 1872722 -520410 -3144034 -3286481 -401451 3311441 4748313
12919 4748313 2441174 -2304901 -6543883 -8001234 -6414532 -2966298 868306 3609328
12911 3609328 3892214 1587260 -1409655 -2784429 -2282716 -1362997 -469527 1396684 3818951
12902 3818951 4060389 800061 -3061886 -3776602 -1793767 -739562 -1935198 -2919547 -1646246
12893a646246K388448J476557J89713q41735k229181l055698j463489J737868
12885c443763L213114J609652o81883j160692l34860j42386j077666k014790j747601
12876e780875j20539J516269J272417n60157o95009K868282O605150N025503j412995
12867H718046n905461m043881P73257K645449M82703k543024l899163l029904
12859f801978j46301L144313L776784Q41182k165822j454011K119702M745386
12851D059255M480074J661307l158178q058930q721855l115309M084880O379477
12843b389279L764539J423317J259435O12913q96542j00338K744173K436250k794081
12834F060387p258259n826860r28963K336778L246062L215369J293857k633595
$$ plain form
12893 -1646246 742202 2218759 2408472 1566737 -662444 -3718142 -5181631 -3443763
12885 -3443763 -230649 1379003 697120 -463572 -798432 -940818 -2018484 -4033274 -5780875
12876 -5780875 -5901414 -4385145 -3112728 -3672885 -4367894 -1499612 5105538 10131041 8718046
12867 8718046 2812585 -1231296 -458039 2187410 2670113 127089 -3772074 -6801978
12859 -6801978 -6948279 -3803966 -27182 814000 -1351822 -2805833 -686131 4059255
12851 4059255 8539329 10200636 7042458 -1016472 -9738327 -12853636 -8768756 -2389279
12843 -2389279 1375260 2798577 4058012 4670925 3774383 3674045 6418218 8854468 6060387
12834 6060387 -1197872 -7024732 -7953695 -5616917 -2370855 844514 2138371 -495224
12826d95224m160271k41169M130192J978202m627559o728057j336113M823030
12818f656969N466635K265825j8748m65519q20436j289515r41690o7472M85675
12809b042214Q86118J532039J930189J396206j77924k412665l974180k707930
12801e570361J531852N007407M028193Q5944k388463k616088l369489m641386
12793g932391l012537J588015M233792K463093J53588R30909K618933J920672
12785B964074J29541o3667M37379k43636q80373j61980j90609k107590k056727
12776b173588K594691O599762L593889l123907m763950o36411J411200j612413
12768A889273l578053q44686J172652k064905n629384l139640K475573L691932
$$ plain form
12826 -495224 -4655495 -4896664 -766472 1211730 -3415829 -10143886 -11479999 -6656969
12818 -6656969 -1190334 1075491 1056743 591224 -229212 -1518727 -2460417 -2527889 -2042214
12809 -2042214 -1156096 375943 2306132 3702338 3524414 1111749 -2862431 -5570361
12801 -5570361 -4038509 968898 4997091 5083035 2694572 78484 -3291005 -7932391
12793 -7932391 -10944928 -9356913 -5123121 -2660028 -2506440 -1575531 1043402 2964074
12785 2964074 3093615 3029948 3467327 3223691 2343318 2181338 1990729 -116861 -2173588
12776 -2173588 421103 7020865 10614754 7490847 2726897 2090486 3501686 1889273
12768 1889273 -1688780 -2533466 -1360814 -3425719 -9055103 -12194743 -9719170 -6027238
12760f027238P2232k279889q19376J190741J845106L016193M750011L494009j711640
12751C530149o008541m746605L02607L551497K433223o98225k125013k65567L464231
12742e62244N774162M184966k84716l810286l985438k407187k032155l014894
12734f137792k814899j00052L158573M054531K219747N9966k50926P99732J129707
12725B118587J69546k06171J493158L515142K445377k136494o129204n234454
12717c964513j02578M215610L937110L86607k375177k598012k046148k410552
12709d957653k497473l22518L207870M951766L845101K154702J492721J14486
12701G989002l541809o647249m954623N28001L824144J892940j463261j591873
$$ plain form
12760 -6027238 -5955006 -8234895 -9054271 -7863530 -6018424 -3002231 1747780 5241789 3530149
12751 3530149 -2478392 -7224997 -6922390 -3370893 -937670 -1635895 -3760908 -4026475 -562244
12742 -562244 5211918 9396884 9112168 5301882 1316444 -1090743 -3122898 -6137792
12734 -6137792 -8952691 -9052743 -5894170 -1839639 380108 440074 189148 988880 2118587
12725 2118587 2288133 2081962 3575120 7090262 9535639 7399145 1269941 -3964513
12717 -3964513 -4067091 148519 4085629 4472236 2097059 -500953 -2547101 -4957653
12709 -4957653 -7455126 -7777644 -4569774 381992 4227093 6381795 7874516 7989002
12701 7989002 4447193 -2200056 -7154679 -6626678 -2802534 -909594 -2372855 -3964728
12693c964728M96059P77931j149482k131970r09160O28800J377451K272488L209436
12684F06825K441246k2515j815886k048324k299762k706858j103327K125785K826740
12675a996076k93616k276737N98513M020263J972850l290939m440579n34496K218076
12666d022741J064069K23358K058156K372871j708940n617974m148553M44779
12658i334975K588258J941405K123706L501417L136431P05221r10319o28967k15788
12649B906389m18777j23324O52063O47174J43543K65023q0567k476267m538444
12640c023187k074271L726598O450060L473569k72712k92005O32710k155764o733447
12631b68449p081031k281945K304033L019396K021710K113862J916513q52739
$$ plain form
12693 -3964728 -3468669 -2690738 -3840220 -5972190 -6881350 -6252550 -4875099 -2602611 606825
12684 606825 3048071 3025556 1209670 -838654 -3138416 -5845274 -6948601 -4822816 -1996076
12675 -1996076 -2289692 -4566429 -3967916 52347 2025197 -1265742 -5706321 -6240817 -4022741
12666 -4022741 -2958672 -2735314 -677158 1695713 -13227 -5631201 -9779754 -9334975
12658 -9334975 -6746717 -4805312 -2681606 819811 3956242 4661463 3751144 3122177 2906389
12649 2906389 2487612 2364288 3016351 3663525 3807068 4072091 3991524 1515257 -3023187
12640 -3023187 -5097458 -1370860 5079200 8552769 8280057 7988052 8620762 6464998 -268449
12631 -268449 -7349480 -9631425 -7327392 -4307996 -2286286 -172424 1744089 891350
12623H91350m158844l604597J064831M869489L869710L84k059656j090007N9734
12614a57606o49442j873560j814915j022842o03955J67620J983999K797337K15762
12605i57602l768819l876908J609115P739760Q333890K851225l720977o488771
12597A720913m501699j20807L336553L585816R65807j543032j299035N86820L63896
12588C095232k980305n297388k408117L454373N632756J895228k338625j655119
12580f01965J898622K671066N3062j842182j785285k529904l958264j878023L954830
12571d018043P066587L584092j355747j667668L90536n62524l004602j731377
12563a298746J866140J820818j280881p95655L673313M354015j458746n724760
$$ plain form
12623 891350 -3267494 -6872091 -5807260 -937771 2931939 2932323 872667 -217340 -157606
12614 -157606 -807048 -2680608 -4495523 -5518365 -6122320 -5954700 -3970701 -1173364 -957602
12605 -957602 -4726421 -8603329 -6994214 745546 9079436 11930661 8209684 1720913
12597 1720913 -2780786 -2901593 434960 4020776 4986583 3443551 2144516 2731336 3095232
12588 3095232 114927 -5182461 -7590578 -4136205 1496551 3391779 1053154 -601965
12580 -601965 1296657 3967723 4020785 2178603 393318 -2136586 -6094850 -7972873 -4018043
12571 -4018043 3048544 6632636 5276889 3609221 3999757 3437233 432631 -1298746
12563 -1298746 567394 2388212 1107331 311676 3984989 8339004 6880258 1155498
12555A155498k250205L331756K927289j345438j910077J460720K348253r78466
12547D739330l298338j459833J369914J589209k26926j937311k600778j472277
12539c297010J819412M983281M534362O47775k645938k929605j781295r14825
12531D16157L75755K443261L392592J985876k91863j897118l244006m194036k628236
12522c641618J697678M620575K550078j858552l070552o93539M18914j717491
12514a694507k897787L19493M445941L749753j146586l905764j414282K230210
12506c13529J992815j375199l433687k540405j083304j212499k351478k925328
12498a3242614k094228M35022M020509O179040M538276M80532j624676p2530J737758
$$ plain form
12555 1155498 -1094707 2237049 5164338 3818900 1908823 3369543 5717796 4739330
12547 4739330 1440992 -18841 1351073 2940282 2713356 776045 -1824733 -3297010
12539 -3297010 -1477598 3505683 8040045 8687820 6041882 3112277 1330982 416157
12531 416157 791912 3235173 6627765 8613641 8321778 6424660 3180654 -1013382 -3641618
12522 -3641618 -1943940 2676635 5226713 3368161 297609 -395930 22984 -1694507
12514 -1694507 -4592294 -4272801 173140 3922893 2776307 -1129457 -2543739 -313529
12506 -313529 1679286 304087 -3129600 -5670005 -6753309 -7965808 -10317286 -13242614
12498 -13242614 -15336842 -14901820 -10881311 -4702271 -163995 316537 -1308139 -1380669 357089
12489C57089L50078k605163l051660o00430J336528R69314J14608K67351R4589
12480b767696j483918k454849n84479K424462K626063o28779l534221k727201
12472i130618Q77145M036521M911226L516676M84827k503980k678216O04859L533911
12463C652351J956823k553910m405244j987177L15124n87809j923664o64326P90855
12454e406977r48315l566416k362256J753566L541040J924881J138657K973910
12446i51910L812151J102364k283082k595896j89246K263429L182771K005921
12438F346502q81892k669577l65329L959392M473626M8462l437666k026071K69629
12429E717076j521261n018230m704104r89237J043166n472o93750P71941K203682
$$ plain form
12489 357089 707167 -1897996 -4949656 -5550086 -4213558 -3244244 -3129636 -2862285 -2767696
12480 -2767696 -4251614 -6706463 -7290942 -4866480 -2240417 -2869196 -6403417 -9130618
12472 -9130618 -8253473 -4216952 694274 4210950 4695777 2191797 -486419 118440 3652351
12463 3652351 5609174 3055264 -1349980 -3337157 -3022033 -3609842 -5533506 -6197832 -5406977
12454 -5406977 -6355292 -9921708 -12283964 -10530398 -6989358 -5064477 -3925820 -951910
12446 -951910 2860241 3962605 1679523 -916373 -1105619 1157810 4340581 6346502
12438 6346502 5464610 2795033 2429704 6389096 10862722 10911184 7473518 5447447 5717076
12429 5717076 4195815 -822415 -5526519 -6515756 -5472590 -5478062 -6171812 -5399871 -3196189
12420c196189J761948L63648o13112p72449R9375J544669J825805M24932k33091
12411A205536J461369K752127N25368l052757l452493p21839J543008K703241
12403B963560M617612N595587J835440m556813o326702j904808J615427l89174
12395C450129k913071k81563L891248K606883k772478m536057p57344K220559
12387I08306j1011l890339m242973j466745P63872J273337J363020J331791M63079
12378c507663o61246q01472m22222p54311q93894J194186M457245M706708L05922
12369C623253m665090n170970j359539K440428L372433J998048j62943j766187
12361a690567j006591K480842N126468K745835l039436n776177k847429J045446
$$ plain form
12420 -3196189 -1434241 -1070593 -1683705 -2456154 -2356779 -812110 1013695 1438627 1205536
12411 1205536 2666905 5419032 5944400 2891643 -560850 -1282689 260319 2963560
12403 2963560 7581172 13176759 15012199 10455386 4128684 2223876 3839303 3450129
12395 3450129 537058 255495 4146743 6753626 3981148 -554909 -1312253 908306
12387 908306 897295 -2993044 -7236017 -8702762 -7938890 -6665553 -5302533 -3970742 -3507663
12378 -3507663 -4168909 -4970381 -5392603 -6146914 -7040808 -5846622 -1389377 3317331 3623253
12369 3623253 -1041837 -6212807 -7572346 -5131918 -1759485 238563 75620 -1690567
12361 -1690567 -2697158 -216316 4910152 7655987 4616551 -1159626 -4007055 -2961609
12353b961609J145148q51326p30309J433310K471298J646694R18489J261899K212784
12344F546378L618651M671384K933023k221906o816688o568564k613346N71964
12336A20896J373533J284385O05732j393147k900397j092062K688577L780799
12328D468316Q05314k500372k725669o25303J129330J061604o50046k299992j473618
12319b810436J831705L966070K407093N3185Q77018L195793K361260j173055k469491
12310H239142n20267K40708k263180m382993k990732m2081J182050L46719r96689
12301a187323j289966P78367M322001N069356O21349m245522l373100R37892J309148
12292B942202k311955k851058Q29057J854342j148109l28713O253258P802055
$$ plain form
12353 -2961609 -1816461 -2667787 -3398096 -1964786 506512 2153206 3071695 4333594 6546378
12344 6546378 10165029 14836413 17769436 15547530 8730842 2162278 -451068 120896
12336 120896 1494429 2778814 3384546 1991399 -908998 -2001060 687517 4468316
12328 4468316 5273630 2773258 47589 -577714 551616 1613220 963174 -1336818 -2810436
12319 -2810436 -978731 2987339 5394432 5447617 6324635 9520428 11881688 10708633 8239142
12310 8239142 7718875 7959583 5696403 1313410 -1677322 -1719403 -537353 -190634 -1187323
12301 -1187323 -2477289 -1698922 2623079 7692435 8313784 4068262 695162 1633054 2942202
12292 2942202 630247 -2220811 -1391754 462588 -685521 -1014234 5239024 13041079
12284A3041079k147241j2331380r019364L018395P804307J653792m129258k205226
12276d314896K401695L891599L707363L655439J080292m259307o375073j658287
12268a871175M399868M562126j75183l240283k318148j065399j896542k221765
12260c826501N30538L607058K072243l492988o280807k115297M196514N233465
12252g5775J384581p36182O89694O34754k535198l046172J938931N646405J796832
12243E697870m777763n345210n40185J968908N1152j330379K23511J577442P72171
12234a702483l67541p75614j315973j349413L50643J746614K10186j901499m52606
12225e557686K821994K784300J20673K46338K993292J970116m167440q097527
$$ plain form
12284 13041079 10893838 -1437542 -10456906 -7438511 365796 2019588 -2109670 -4314896
12276 -4314896 -1913201 1978398 5685761 9341200 10421492 6162185 -212888 -1871175
12268 -1871175 2528693 7090819 6915636 3675353 1357205 291806 -1604736 -3826501
12260 -3826501 -3295963 311095 2383338 -1109650 -7390457 -9505754 -5309240 -75775
12252 -75775 1308806 572624 1262318 1897072 -638126 -3684298 -1745367 3901038 5697870
12243 5697870 920107 -4425103 -4965288 -2996380 -2945228 -4275607 -4052096 -2474654 -1702483
12234 -1702483 -2070024 -2845638 -4161611 -5511024 -5160381 -3413767 -3203581 -5105080 -5557686
12225 -5557686 -2735692 48608 169281 415619 3408911 5379027 1211587 -6885940
12217f885940m605373J987446M721594K618413q51149k916593k241752J091353
12209g082001M110486L511581P77589J67396J421954M27298k610972k930811j38908
12200b346388P54665r12145L93130N358672O472377O57731m074221j336512K825738
12191G793047J45092o066774o837143j966547J232929J92328j134041n11646Q59761
12182f292994L036067O039728N871408l13534o855558n779931Q30722L385459
12174g8633o09469l659602j115973K228634J372724j086166p61337J171898J325753
12165a212171K73973O13226J838744J305242j400707m003532m295557j758651
12157h639433K005992L596513Q67140l398400l618059J432227O354293N765869
$$ plain form
12217 -6885940 -11491313 -9503867 -4782273 -2163860 -3015009 -5931602 -8173354 -7082001
12209 -7082001 -2971515 540066 1317655 1485051 2907005 3334303 723331 -2207480 -2346388
12200 -2346388 -1591723 -2503868 -2110738 3247934 9720311 10378042 6303821 4967309 7793047
12191 7793047 7938139 1871365 -4965778 -6932325 -5699396 -5507068 -6641109 -7152755 -6292994
12182 -6292994 -3256927 2782801 8654209 8340675 1485117 -4294814 -3464092 -78633
12174 -78633 -688102 -4347704 -5463677 -3235043 -1862319 -2948485 -3709822 -2537924 -1212171
12165 -1212171 -938198 -324972 1513772 2819014 1418307 -2585225 -6880782 -8639433
12157 -8639433 -6633441 -3036928 -2169788 -5568188 -9186247 -7754020 -1399727 4366142
12149D366142O59992l897349n072135l716917j317701J361611L021645K106638
12141b488074p57168k390845n85437K772897L782290J763274L29511K010106M075797
12132H512351K572826j170248k373642o34789n94087l753427n512336l157211
12124f110563r65619k780289m679451j201741M963788O541767K624114j035612
12116b643606j443116r90293r87953L32516K532921K208950r21043k836288j692388
12107f440300j88953m0991M51590J605347P59281k173311k961554K63414L563471
12098e162006L535726K347298K974448L909074K601925L57246l32097j53752q10730
12089I267132j450999r83569r81042k421977k588969M18392K898573L84749m684152
$$ plain form
12149 4366142 5026134 1128785 -3943350 -7660267 -8977968 -7616357 -4594712 -2488074
12141 -2488074 -3245242 -5636087 -6221524 -3448627 333663 2096937 2426448 4436554 8512351
12132 8512351 11085177 9914929 7541287 6906498 6312411 2558984 -2953352 -6110563
12124 -6110563 -7076182 -9856471 -14535922 -15737663 -10773875 -4232108 -1607994 -2643606
12116 -2643606 -4086722 -5077015 -6064968 -5732452 -3199531 -990581 -1911624 -4747912 -6440300
12107 -6440300 -6629253 -6670244 -6218654 -4613307 -3854026 -6027337 -8988891 -8725477 -5162006
12098 -5162006 -1626280 721018 3695466 7604540 10206465 10563711 10231614 10077862 9267132
12089 9267132 7816133 6832564 5851522 3429545 840576 1258968 4157541 4542290 -141862
12080a41862n632704j202928K717818J542773k303889l580101r75874K112639
12072g464128J965649j485331m569755l721235M22196L768179L891513K441948
12064d750964J641651J098471m9429n48913O66115J797279Q55984q31141r85027
12055a105974m91863j489005k702142r45266L101222M862300K301552j226196
12047B304628j848807m5327J001282j37320k151105l342404l205520j781198J099183
12038h106588M764681O370631K929160l820048o921653k073683N454579O613067
12030E210146Q98806l210836j256614J060746j673331n305547l517553J397726
12022f396457K988868J578046K048048L651109J608302k366929j275973M631927
$$ plain form
12080 -141862 -5774566 -6977494 -4259676 -2716903 -5020792 -8600893 -9576767 -7464128
12072 -7464128 -5498479 -6983810 -11553565 -15274800 -14852604 -11084425 -7192912 -4750964
12064 -4750964 -3109313 -2010842 -2060271 -2609184 -1943069 -145790 710194 -120947 -1105974
12055 -1105974 -1597837 -3086842 -5788984 -6734250 -3633028 1229272 3530824 2304628
12047 2304628 455821 410494 1411776 1274456 -876649 -4219053 -7424573 -9205771 -8106588
12038 -8106588 -3341907 3028724 5957884 2137836 -4783817 -6857500 -1402921 5210146
12030 5210146 6108952 2898116 1641502 2702248 1028917 -4276630 -7794183 -6396457
12022 -6396457 -3407589 -1829543 218505 3869614 5477916 3110987 1835014 6466941
12014F466941O422299K77684o211664n547855k83255L203419L858135L475942
12006A1661646J246221l054997n257439k470135J122331R0508l700459m220807
11998d583131m73778L077636L400946J089514k478804n256731l856704J989597
11990g091455O250161L524763k525532l821831L50872L093446J093912j377098
11982e02762r05631j07302j532818k641104o76534K315944L275916K881697K678615
11973D786021J264519k253462m194414q70978M574645N113663o87462o569738
11965A162794o557261j494471L406277M712034K942900M10639j366851k357463
11957H58598k874207k275851K74427L563010M532424K062379r23825j064119Q92172
$$ plain form
12014 6466941 12889240 13166924 6955260 1407405 1124150 4327569 8185704 11661646
12006 11661646 12907867 9852870 4595431 2125296 3247627 3338135 -362324 -4583131
11998 -4583131 -5056909 -1979273 1421673 2511187 32383 -5224348 -9081052 -7091455
11990 -7091455 -841294 2683469 157937 -3663894 -3313022 -219576 874336 -502762
11982 -502762 -1408393 -1515695 -3048513 -5689617 -6366151 -4050207 -774291 2107406 4786021
11973 4786021 6050540 3797078 -397336 -1268314 3306331 8419994 7732532 1162794
11965 1162794 -5394467 -6888938 -3482661 1229373 4172273 4582912 3216061 858598
11957 858598 -2015609 -4291460 -4017033 -454023 4078401 6140780 5216955 4152836 5045008
11948E045008J535443K1521j057290n1447J442961J448466J70406j423821l100167
11939D031080l943387k013908K271093M618477J862515k893562l734409l1638
11931A66261K768744R32606k871312m187805k532479j50247J925258L473437L165719
11922B690182O25511j334831k80231J517165M71879j926304j285270J698707J635596
11913C812404k271632m107881j143168R38999k475516o245036l132364M095699
11905a0528495O340335J908528j809754l98714J949025P59092j862490j993057
11897e635530P896J784180L024398L793945K584181o62008k895061k360667j357757
11888a716423j729942j382875J232558L080545J356130j151043m97728J646361
$$ plain form
11948 5045008 6580451 6601972 5544682 5493235 6936196 8384662 8555068 7131247 4031080
11939 4031080 87693 -1926215 344878 4963355 6825870 3932308 197899 166261
11931 166261 2935005 3867611 996299 -3191506 -5723985 -5874232 -3948974 -475537 2690182
11922 2690182 3315693 1980862 1700631 3217796 3689675 1763371 478101 2176808 3812404
11913 3812404 1540772 -2567109 -3710277 -2771278 -5246794 -11491830 -14624194 -10528495
11905 -10528495 -4188160 -2279632 -4089386 -4488100 -2539075 -1779983 -3642473 -5635530
11897 -5635530 -5627634 -3843454 -819056 2974889 5559070 4897062 2002001 -358666 -1716423
11888 -1716423 -3446365 -4829240 -3596682 -516137 839993 -311050 -808778 837583
11880H37583J262238n25151M13264L170684K811242r39567k962881j419576k99964
11871B347872j586251j637868J566735L753499J155483k991618l510846r47704
11863a850698O74200N69979O08661M68779j351055l166269j808894J992569M361733
11854D99005L795991J828240q01081l844245m307942N26143O463267N328909l249179
11845F239108r207941n084997L626025O468064K332379r16387P69011K606332
11837F831594j09470m375317m306308Q3958L021935O76326m455230o956615m291748
11828a3880875J329985N699511O368387L929863M75256k223207k983237j239643
11820b523960J813509L064724M88060l792372n356057k707976J124809K629926
$$ plain form
11880 837583 2099821 1574670 1987934 5158618 7969860 7030293 4067412 2647836 2347872
11871 2347872 761621 -876247 690488 4443987 5599470 2607852 -902994 -1850698
11863 -1850698 -1176498 -606519 2142 470921 -880134 -4046403 -5855297 -3862728 499005
11854 499005 4294996 6123236 5322155 1477910 -2830032 -2303889 4159378 9488287 6239108
11845 6239108 -2968833 -8053830 -4427805 2040259 4372638 3456251 4225262 6831594
11837 6831594 6722124 2346807 -1959501 -1875543 1146392 1822718 -2632512 -9589127 -13880875
11828 -13880875 -12550890 -6851379 -482992 3446871 3922127 1698920 -1284317 -2523960
11820 -2523960 -710451 2354273 2842333 -950039 -6306096 -9014072 -7889263 -5259337
11812e259337J501547m59215k035251k742705k005622J1473J883033K791604L706230
11803b608243N102050N099600K267030j045903j329087O69470O66124k625384
11795F195657n259134l796798j53170J526919M13765j231464k038815k286036
11787f629076j693634L62639K549414K436249K43610q52357P60249K612611J859357
11778A649062l55323o77293J212177J986551k99061l231922l669568k270335j778253
11769g433965j952051J48506M345551N801211J797365l123332k797909J623371
11761a591253L272462k67208l755322k631215O27945J493059L44918K23237Q71744
11752a411633L1431j302549k09980K387218K533696p8198j380313J93529J201825
$$ plain form
11812 -5259337 -3757790 -4217005 -6252256 -8994961 -11000583 -10989110 -9106077 -6314473 -2608243
11803 -2608243 2493807 7593407 9860437 8814534 7485447 8154917 8821041 6195657
11795 6195657 936523 -2860275 -3013445 -1486526 -1072761 -2304225 -4343040 -6629076
11787 -6629076 -8322710 -7960071 -5410657 -2974408 -2730798 -3583155 -2822906 -210295 1649062
11778 1649062 1293739 616446 1828623 3815174 3516113 284191 -3385377 -5655712 -7433965
11769 -7433965 -9386016 -9237510 -4891959 909252 2706617 -416715 -3214624 -1591253
11761 -1591253 1681209 1414001 -2341321 -4972536 -4344591 -2851532 -2506614 -2283377 -1411633
11752 -1411633 -1380202 -2682751 -2892731 -505513 2028183 1949985 569672 763201 1965026
11743A965026n02371j830829K5349K241407P65288k682034k820302J095875M025822
11734B283231K382880j274859k248783K26997K873353K930118Q11799j542738
11726F441998l150412l846558k791265P76533M904729N410802R87965l849197
11718D884595l820885M0206J876530n89115l258237k357745J59877L05507k039889
11709d799156l717149k568856J157130N475482O848268K620182m398553p124014
11701f506666k969110K176349K454083M26079J661910M793791M214024L83853
11693F634313q61423J179423R26608k849593l930341N77363M278871J239047m686221
11684B508047n954980j909032K439700M273186M049464J990563j053323j976117
$$ plain form
11743 1965026 1462655 -368174 -342825 1898582 2663870 -18164 -2838466 -1742591 2283231
11734 2283231 4666111 3391252 1142469 1369466 4242819 7172937 7984736 6441998
11726 6441998 3291586 -554972 -3346237 -2569704 2335025 7745827 8733792 4884595
11718 4884595 1063710 1103916 2980446 2391331 -866906 -3224651 -3064774 -2759267 -4799156
11709 -4799156 -8516305 -11085161 -9928031 -4452549 2395719 5015901 617348 -6506666
11701 -6506666 -9475776 -7299427 -4845344 -4419265 -2757355 2036436 6250460 6634313
11693 6634313 5772890 6952313 7878921 5029328 1098987 1676350 5955221 7194268 2508047
11684 2508047 -3446933 -5355965 -2916265 1356921 5406385 7396948 6343625 4367508
11676D367508K04127J127680k511158o419465m627969Q02045K968914J012731
11668c075587M8441J180238P3743l739225m587039k48592L656298K472289o60368
11659d879802q67393J036433J590230O00997l38102j393932k568060j863863R22283
11650g761209K356790Q79337j55301J226142J489128j220095j578179M066343
11642f97044Q631042L537214o427811q433821p83745M820252J729319k616381
11634b40975o16098L179629J094004m395362n246032o81396L130316L208200J808863
11625A241149L12225j675617k244535R15428M925171M432508m9232k658457j371803
11616C826837l84391k257324l995158l022791j228241k74423J696580N202129
$$ plain form
11676 4367508 4571635 5699315 3188157 -3231308 -7859277 -7057232 -4088318 -3075587
11668 -3075587 -3027146 -1846908 -1773165 -5512390 -10099429 -10348021 -6691723 -4219434 -4879802
11659 -4879802 -5747195 -4710762 -3120532 -2519535 -2857637 -4251569 -6819629 -8683492 -7761209
11650 -7761209 -5404419 -4525082 -4680383 -3454241 -1965113 -3185208 -4763387 -697044
11642 -697044 7933998 11471212 5043401 -3390420 -4174165 646087 2375406 -240975
11634 -240975 -857073 2322556 3416560 -978802 -6224834 -6906230 -3775914 -567714 1241149
11625 1241149 1553374 -122243 -2366778 -1451350 3473821 7906329 7857097 5198640 3826837
11616 3826837 3442446 1185122 -2810036 -5832827 -7061068 -7335491 -5638911 -436782
11608d36782O224360K234788k561700k783967L31258J581773l9675j014897Q9750
11599C624908P90219n25046k225166k424558j115548R41870K609428J882067j784123
11590A774051m879649l291635J376634K948037q19522m870933l958092M54980
11582a1266129L139892K243087L16628j42085Q20224J876465J935042Q24881j54754
11573d06749O70770K560553K399783p36368l129593j258722K567898K972416q09361
11564D830627l864912k638193N76717J566373k25379j948649j294586J518037
11556a479965M391473M761482J711892k311127l506791j517271k23452k187790
11548c61549m594456l358935N48457K476735J072021r3426J515707L560009K840769
$$ plain form
11608 -436782 5787578 8022366 5460666 2676699 3007957 4589730 4550055 3535158 3624908
11599 3624908 4415127 3890081 1664915 -759643 -1875191 -933321 1676107 3558174 1774051
11590 1774051 -3105598 -6397233 -5020599 -2072562 -2892084 -7763017 -11721109 -11266129
11582 -11266129 -8126237 -5883150 -5566522 -5708607 -4888383 -3011918 -1076876 -251995 -406749
11573 -406749 264021 2824574 5224357 4487989 1358396 99674 2667572 5639988 4830627
11564 4830627 965715 -1672478 -1095761 470612 245233 -1703416 -2998002 -1479965
11556 -1479965 2911508 7672990 9384882 7073755 3566964 2049693 1826241 -361549
11548 -361549 -4956005 -8314940 -7766483 -5289748 -4217727 -4311153 -2795446 764563 3605332
11539C605332K52945r81995l24793k54157k103864m039230l548697m27712L100945
11530d721226M378889K470954q75949k640730j541887Q39301K425025K877781
11522C212158K443812L97154l085735m992185k711969J378799K287205m46029
11514a516790j999819K71613K930778K211236m24757j760168k217779l547097
11506f052783m059285j264650K605777L165253J012505P17238K915577L376814
11498B416446P44702q88658Q26162K427178P55764j917515k465886k087149k864300
11489c053256l205002j218953R08768P33917M96411K983879N403448L396181j060870
11480E384523k321058k38078K72373j701705j835701Q88492J832972j058086l570766
$$ plain form
11539 3605332 3858277 2876282 2551489 2297332 193468 -3845762 -7394459 -7822171 -4721226
11530 -4721226 -342337 2128617 1252668 -1388062 -2929949 -2090648 334377 3212158
11522 3212158 5655970 6053124 2967389 -2024796 -4736765 -3357966 -1070761 -1516790
11514 -1516790 -3516609 -3244996 -314218 1897018 1472261 -287907 -2505686 -6052783
11506 -6052783 -10112068 -11376718 -8770941 -5605688 -4593183 -3875945 -960368 2416446
11498 2416446 3161148 2272490 3098652 5525830 6281594 4364079 1898193 -188956 -3053256
11489 -3053256 -6258258 -7477211 -6568443 -5834526 -5338115 -2354236 3049212 6445393 5384523
11480 5384523 3063465 2825387 3097760 1396055 -439646 448846 2281818 1223732 -2347034
11471b347034k659277j103488j186340j09747L547846M777791j76053n732096
11463d988398l939340L228192O204021J595387l709679l095450J542993M445162
11455A282888L865119K076787P34666l88085j399103j574442n48428Q47635J039450
11446E936487p70677l081292k968523K98951L451662K785286j127363m188834
11438C35697l705464o23883K538341L752390J980135j767702l948128j745995
11430c184609K809982M495812J276152l281943m741813k703920N7252J347780
11422c925307J087573M96732R27483K546870L576394K027722j318995l122785
11414B295687j454990J681951K690829L29870l331862n101784l316922Q84831
$$ plain form
11471 -2347034 -5006311 -6109799 -7296139 -7405886 -3858040 919751 743698 -4988398
11463 -4988398 -8927738 -5699546 504475 2099862 -1609817 -4705267 -3162274 1282888
11455 1282888 5148007 7224794 7959460 7571375 6172272 4597830 4049402 4897037 5936487
11446 5936487 5165810 2084518 -884005 -585054 2866608 5651894 4524531 335697
11438 335697 -3369767 -3993650 -1455309 2297081 4277216 2509514 -1438614 -3184609
11430 -3184609 -374627 4121185 5397337 2115394 -2626419 -5330339 -5273087 -3925307
11422 -3925307 -2837734 -2341002 -1413519 1133351 4709745 6737467 5418472 2295687
11414 2295687 840697 2522648 5213477 5543347 2211485 -2890299 -6207221 -5322390
11406e322390M397312M673209J680726k602218n893545o482719l913066n5076
11398a3517767J922300J285072Q92081K684813M168771K504163k4211P99983L662199
11389D377404L041237j762004m878504k952141k39360j357209l879607k724923
11381a0375107J520752L690726J686195j419749k232905m81811K070450L467155
11373b074294K558782N9480j883844k243062j868602r90292J345464L970306L323055
11364B196993r12153l596105j215475K361231J839660j035925q28867K118045
11356I27404K421015r43633l068057j599912k2195o56580p29256J694090L426167
11347A449043J543849j448603j852826n01545j31934j41440J547099L587013K788870
$$ plain form
11406 -5322390 -925078 3748131 5428857 2826639 -3066906 -9549625 -13462691 -13517767
11398 -13517767 -11595467 -10310395 -9418314 -6733501 -2564730 -60567 -84778 715205 4377404
11389 4377404 7418641 5656637 778133 -2174008 -2413368 -3770577 -7650184 -10375107
11381 -10375107 -8854355 -5163629 -3477434 -4897183 -7130088 -7611899 -5541449 -2074294
11373 -2074294 484488 543968 -1339876 -3582938 -5451540 -6441832 -5096368 -1126062 2196993
11364 2196993 1284840 -2311265 -3526740 -1165509 674151 -361774 -1190641 927404
11356 927404 3348419 2404786 -663271 -2263183 -2285378 -2941958 -3671214 -1977124 1449043
11347 1449043 2992892 1544289 -308537 -810082 -942016 -1083456 463643 4050656 6839526
11338F839526m83313k606825j946710k52984R53336J935968K396447Q77651k298735
11329E414361m020156k090189J426440K379748k55898k896179j813300J807974
11321d7199L005981l80652m353646l865664L49736L107550K107327O4909p11793
11312g23451j410238k701570k065289J663500M606217K812630j505324l082895
11304b406420j258449J53038l23490k78008J064441R68099j481683k711699j32562
11295f406733L230917L040198J19137j249044j16894K84598j464588k349801k0869
11286d933079K805959K084734j299612k625283k38161K352534K065772L21814
11278E34678m10811p72299k081279k556900j90639K574633K050817l0168R70145
$$ plain form
11338 6839526 6356213 3749388 1802678 1549694 2503030 4438998 6835445 7713096 5414361
11329 5414361 1394205 -695984 730456 3110204 2854306 -41873 -1855173 -47199
11321 -47199 2958782 2578130 -1775516 -5641180 -5291444 -2183894 -76567 -11658 -723451
11312 -723451 -2133689 -4835259 -6900548 -5237048 -630831 2181799 676475 -2406420
11304 -2406420 -3664869 -3511831 -3835321 -4113329 -3048888 -2080789 -3562472 -6274171 -6406733
11295 -6406733 -3175816 -135618 -16481 -1265525 -1382419 -1097821 -2562409 -4912210 -4933079
11286 -4933079 -2127120 -42386 -1341998 -3967281 -4205442 -1852908 212864 534678
11278 534678 123867 -648432 -2729711 -5286611 -5477250 -2902617 -851800 -881968 88177
11269H8177L651820J403129o003595r411262l328700M921841N545374K04275k288137
11260e217078j27366R17629p83882m09767L156189M211982J41074l583512k303000
11251c997731O42799K84962k002097j945272N71984K733496L470980K639127p64443
11242A633805n213783n504613k3318M729331K708369k163097j854404L324906
11234b362804O053134M111392K408662K796842R85959m084729o371817k516330
11226A020309J666144K818m405711m659788r47836R29031n70188j346434M81268
11217g830387J810757O31254m80914J001055L313749L221974N72330k094744k849929
11208b704855j621645O69754K797374L673318K989352J159987j276673l405157
$$ plain form
11269 88177 3739997 5143126 -860469 -10271731 -13600431 -8678590 -3133216 -2928941 -5217078
11260 -5217078 -5344444 -4426815 -5210697 -5620464 -2464275 1747707 1888781 -1694731 -3997731
11251 -3997731 -3354932 -3069970 -5072067 -7017339 -6445355 -3711859 -240879 2398248 1633805
11242 1633805 -3579978 -9084591 -9107909 -4378578 -1670209 -3833306 -5687710 -2362804
11234 -2362804 3690330 7801722 10210384 13007226 13993185 9908456 3536639 1020309
11226 1020309 2686453 2689271 -1716440 -6376228 -7324064 -6395033 -6965221 -8311655 -7830387
11217 -7830387 -6019630 -5388376 -5869290 -4868235 -1554486 1667488 2239818 145074 -2704855
11208 -2704855 -4326500 -3656746 -859372 2813946 5803298 6963285 5686612 2281455
11200B281455l583165j027139K248614K961682M78452k527080l748427l537833
11192f453441k825844j227844J215871K711268K318217J878029K683130K263571
11184B562957j721331n840918m265014K033835N094784J079453l863093k745063
11176g664390J974362K950962m79809k345859l83549J228119K61427J19192K474483
11167a865062L113855n42357l613920j029864L942935M767198J826557N94254
11159G193596J783865Q58384l087786n316181l404058p78086m93424j152529j084581
11150e480800j274217j762681k19487L181214M320590J567303j095086o37644
11142a400808K52037j060372j692787J205313L894597J443731l499597m261710
$$ plain form
11200 2281455 -1301710 -2328849 -80235 2881447 3359899 832819 -2915608 -6453441
11192 -6453441 -9279285 -10507129 -9291258 -6579990 -4261773 -2383744 299386 2562957
11184 2562957 841626 -4999292 -9264306 -7230471 -2135687 -1056234 -4919327 -7664390
11176 -7664390 -5690028 -2739066 -3218875 -5564734 -5948283 -4720164 -4458737 -4339545 -1865062
11167 -1865062 1248793 706436 -2907484 -3937348 5587 4772785 6599342 7193596
11159 7193596 8977461 9835845 6748059 1431878 -1972180 -2750266 -3243690 -4396219 -5480800
11150 -5480800 -6755017 -8517698 -8737185 -5555971 -1235381 331922 -763164 -1400808
11142 -1400808 -1148771 -2209143 -3901930 -2696617 1197980 2641711 -857886 -5119596
11134e119596n52600J750265M72994l13412J760480L505604K121275n22835j842461
11125A259714k164650k141797q29911J142032N16518l406058n922195k786169
11117a4332516L503007O713588M520595L3929k942905l026819n19321L088866
11109b961576M763062K044756l440701o650013m601902J71009K995997K739102
11101d940266K137852K932053L408245J857970j91884p34792j190382l772887
11093d94091o165564l872232J792570L845768n1149l257027j74671M746311L963956
11084C33871j251750l202840M1576K599029Q30795j810703j447019P54631J852472
11075a299938J115883j019607l865305n183461l048639L83083J392489J008597
$$ plain form
11134 -5119596 -5672196 -3921931 -3448937 -3762349 -2001869 1503735 3625010 3102175 1259714
11125 1259714 -904936 -3046733 -3876644 -2734612 -2218094 -5624152 -11546347 -14332516
11117 -14332516 -10829509 -4115921 404674 438603 -2504302 -5531121 -6050442 -2961576
11109 -2961576 1801486 3846242 405541 -6244472 -10846374 -10675365 -7679368 -4940266
11101 -4940266 -2802414 129639 3537884 5395854 5203970 4469178 3278796 -494091
11093 -494091 -6659655 -10531887 -8739317 -4893549 -4944698 -8201725 -8376396 -3630085 333871
11084 333871 -917879 -4120719 -4079143 -1480114 -649319 -2460022 -3907041 -3152410 -1299938
11075 -1299938 -184055 -1203662 -5068967 -10252428 -13301067 -12917984 -11525495 -10516898
11067a0516898L192468O520543M873716j849945n563277k133302J896144N480
11059c575071l759684j948691L833397N649526J437435l206514m137436k717537
11051h424575j056142Q31482K520951K501420Q28593p38480j278255q14579J113816
11042d515769M072261N205144K371878k209330m452549l402492j086041R02838
11034c114060J825149R18974p94970k77847K622855L180195j050355m611568j471823
11025b773450M922950N903345K72898m656184m318673j702576j70337J167437
11017a354590K887164K657806Q6075j306634J37823J295341m8642j235352L58589
11008C477580K624053K397885L49939j199322k275621l641964l833058j385627
$$ plain form
11067 -10516898 -7324430 -803887 4069829 2219884 -3343393 -5476695 -3580551 -3575071
11059 -3575071 -7334755 -9283446 -5450049 199477 1636912 -1569602 -5707038 -8424575
11051 -8424575 -9480717 -8649235 -6128284 -3626864 -2798271 -3536751 -4815006 -5629585 -4515769
11042 -4515769 -443508 4761636 7133514 4924184 471635 -2930857 -4016898 -3114060
11034 -3114060 -1288911 -369937 -1164907 -1442754 1180101 4360296 3309941 -1301627 -2773450
11025 -2773450 2149500 8052845 8325743 3669559 -649114 -2351690 -2522027 -1354590
11017 -1354590 1532574 4190380 4276455 2969821 3107644 4402985 4354343 3118991 3477580
11008 3477580 6101633 8499518 8849457 7650135 5374514 1732550 -2100508 -3486135
11000c486135J762585K337616R8449k284275k681698r76385J679023L386018K544700
10991B379898j24223j843296j254823j17493l16453r29843M1556K313004L450979
10982C599306J852600j475820l833849l270444o45145J070419M04216o28861L12316
10973b615262K032238J659558n63127j568889k38070J474480K228233K603690
10965E012851K329865n1303l625339m636050j302963L373566N076297K647677
10957H824601j493944l626313j605017K405316L079941j295097m963895k064554
10949g38962L885055M175003k018070o338899m133367l98859J18415M45720L835663
10940a168301O141379K771171k395057k827761K9040O0165k485046j868064K410236
$$ plain form
11000 -3486135 -1723550 614066 712515 -1571760 -4253458 -5229843 -3550820 -164802 2379898
10991 2379898 2255675 412379 -842444 -959937 -1276390 -2206233 -2164677 148327 3599306
10982 3599306 5451906 3976086 142237 -3128207 -3773352 -2702933 -2298717 -2927578 -2615262
10973 -2615262 -583024 1076534 513407 -1055482 -1293552 180928 2409161 5012851
10965 5012851 7342716 7291413 3666074 -969976 -2272939 1100627 6176924 8824601
10957 8824601 7330657 3704344 2099327 4504643 7584584 6289487 1325592 -738962
10949 -738962 3146093 7321096 5303026 -1035873 -5169240 -5568099 -5449684 -5003964 -1168301
10940 -1168301 4973078 7744249 5349192 2521431 2550471 2610636 125590 -1742474 667762
10931F67762M329269J438688j562863j274186o60757k536489l877466j044663
10923d520705L410008M056962O04646j928916n36427K114255K132438k78477j799497
10914C254287r51332J69830o91958k666042l109578j086449K033079M552437N231989
10905F736263L037919j396228m656077l927177j307754j255325l563888l218171
10897i550438J499962N467393M021432l01508k041411o14052M04483m25307j179231
10888b718677m64504J238929L295766M693183L187778j747462n956565m530768
10880c002320J301601M913945K512728k622076n090350l609622p38492J285900
10872e048686K170920K024267M28601k318072m098772k526401J867746N068692
$$ plain form
10931 667762 4997031 6435719 4872856 3598670 2937913 401424 -3476042 -4520705
10923 -4520705 -1110697 2946265 3550911 1621995 1085568 3199823 5332261 5053784 3254287
10914 3254287 2302955 2472785 1780827 -885215 -3994793 -5081242 -3048163 1504274 6736263
10905 6736263 9774182 8377954 3721877 -205300 -1513054 -2768379 -6332267 -9550438
10897 -9550438 -8050476 -2583083 1438349 1136841 -904570 -1518622 -1114139 -1539446 -2718677
10888 -2718677 -3183181 -1944252 1351514 6044697 9232475 7485013 1528448 -3002320
10880 -3002320 -1700719 3213226 5725954 3103878 -1986472 -5596094 -6334586 -5048686
10872 -5048686 -2877766 -853499 -424898 -2742970 -6841742 -9368143 -7500397 -2431705
10864b431705L754787l13353k058395M50617L437468K383170k231301n699296
10856b708008m621679l25835K910254K422989K0668j58794K887450N171108K983737
10847H581890j681361l852752k380410l09490O28568J411503J810297J02704k530771
10838A780178k340497Q06788K388956J92870k411060k272559q32165k74492K1760
10829b940221N34412k37592j825713q01781L149369N120190K437673q50255q47223
10820C738859J38323j018418k210155q89770K32737j440956k088628K264153P151429
10811E877574N428295j015500l685435m59044K020869p47611n118595n768168
10803c467615k463842J590327M087035M570488L615032K018763j75092k980477
$$ plain form
10864 -2431705 1323082 1009729 -1048666 -598049 2839419 5222589 2991288 -2708008
10856 -2708008 -7329687 -7655522 -4745268 -2322279 -2301611 -2460405 427045 5598153 8581890
10847 8581890 6900529 3047777 667367 357877 986445 2397948 4208245 4310949 1780178
10838 1780178 -560319 246469 2635425 2828295 417235 -1855324 -2687489 -2961981 -2940221
10829 -2940221 -2405809 -2643401 -4469114 -5270895 -2121526 2998664 5436337 4586082 3738859
10820 3738859 3877182 2858764 648609 -241161 -8424 -1449380 -3538008 -1273855 5877574
10811 5877574 11305869 10290369 6604934 6145890 8166759 7419148 2300553 -3467615
10803 -3467615 -5931457 -4341130 -254095 4316393 7931425 9950188 9775096 6794619
10795F794619m394089k142993J404970Q60323l405613m132525J377055N597303
10787A959050K421254k563618j473996K480641J008374m540386n684320j471622
10779g864623P19937j731736l537916j814881K63304R80521K245717L510248K126088
10770e103341Q3537J558530L833703M81070o164157o633063J94993M670943K114834
10761d962951o32313J513108L540527J056187j273922R38883L246507P87375k668219
10752A545182j872124O35866J37122j607247j013183l44655k873891n295799k902709
10743a3591438J741718K981471J397288J447615K863401K023571l16109j50344
10735a602827K168847K324355m59975k373208j509611k60494q51410k523397l481927
$$ plain form
10795 6794619 2400530 257537 1662507 2522830 -882783 -5015308 -3638253 1959050
10787 1959050 4380304 1816686 342690 2823331 3831705 -708681 -6393001 -7864623
10779 -7864623 -7144686 -8876422 -12414338 -14229219 -13965915 -12985394 -10739677 -7229429 -5103341
10770 -5103341 -5019804 -3461274 372429 853499 -5310658 -11943721 -11748728 -7077785 -4962951
10761 -4962951 -5595264 -4082156 -541629 514558 -759364 179519 3426026 4213401 1545182
10752 1545182 -326942 308924 446046 -1161201 -2174384 -2519039 -5392930 -10688729 -13591438
10743 -13591438 -11849720 -8868249 -7470961 -6023346 -3159945 -1136374 -1452483 -1602827
10735 -1602827 566020 2890375 2430400 57192 -1452419 -1712913 -2564323 -5087720 -8569647
10726h569647k783715n49979J684416K017952J133652J889129M314206M452379
10718C588393O35092l021299k722039o61034n58708j355782j70227J734707J277410
10709a253487o16675q58892L3705p13776k463958k114005J26941R63090k54321
10700g151378p13348P08417J728236Q49405k75208J96778J561275J946567Q39716
10691c09540n81789r24914j55508L05661l55065p28343O67863K229995J111485
10682A259845j905795k965108j006749R15693J049813J157380J867261Q23901
10674A196241k109840k800595P04662M219710L595838O27075j064854j728724
10666B639513k661157j952870J638957M143460J544062l155099l882806m85205
$$ plain form
10726 -8569647 -11353362 -11903341 -10218925 -8200973 -7067321 -5178192 -863986 3588393
10718 3588393 4223485 1202186 -1519853 -2180887 -2739595 -4095377 -4265604 -2530897 -1253487
10709 -1253487 -1870162 -2729054 -2695349 -3409125 -5873083 -7987088 -7860147 -6897057 -7151378
10700 -7151378 -7864726 -7156309 -5428073 -4578668 -4853876 -4657098 -3095823 -1149256 -309540
10691 -309540 -891329 -1816243 -1971751 -1666090 -2021155 -2749498 -2081635 148360 1259845
10682 1259845 -645950 -3611058 -4617807 -3702114 -2652301 -1494921 372340 1196241
10674 1196241 -913599 -3714194 -3009532 1210178 4806016 5433091 4368237 2639513
10666 2639513 -21644 -1974514 -335557 3807903 5351965 2196866 -1685940 -2171145
10658b171145K099277K051034J869520K086324J52184l700116n180154k333035
10650e126111J226905J577110m86375j853612j693728j106129j26112J997819
10642e590233M121208L621190L42467k103167j009694R87365n57867m417153m364198
10633h970082J270079N935833M238281n3794o26485J335659P34259j509076p23772
10624A630902J556870l93045n138893m970382Q98327M386178K103386L41244K733018
10615C147605L434512j641483o280716l860374J977337M028661K387851J176494
10607D369887J35415k883839n514339m176869m43701J812716K277271K232837
10599b190622P53600k241661l320491p00052K112267K043069R87985P07325q68629
$$ plain form
10658 -2171145 -71868 1979166 3848686 5935010 6087194 2387078 -2793076 -5126111
10650 -5126111 -3899206 -2322096 -2808471 -4662083 -6355811 -7461940 -7588052 -5590233
10642 -5590233 -1469025 2152165 2494632 391465 -618229 369136 -188731 -4605884 -8970082
10633 -8970082 -7700003 -1764170 2474111 2420317 1793832 3129491 3863750 2354674 1630902
10624 1630902 3187772 2794727 -2344166 -7314548 -6416221 -2030043 73343 414587 3147605
10615 3147605 6582117 4940634 -1340082 -5200456 -3223119 805542 3193393 4369887
10607 4369887 4505302 1621463 -3892876 -8069745 -8513446 -6700730 -4423459 -2190622
10599 -2190622 -1437022 -3678683 -6999174 -7699226 -5586959 -3543890 -2555905 -1848580 -2717209
10590b717209l729970k848570L318984P986955N793338Q80799j092161j973429
10582E618737m860416o033314j901266K330806N07508l317716j554572L565369
10574e644864L784510j149345l715167j282376J187413P20850N8646J231715K206005
10565b602613Q35020k333754n066532m581429J00742M830704L632945k251511
10557g436428m552671k52417L756076K421655K23365J258741R49334m413423q461410
10548a6507178m393127L423108O742007N668806M663612L169547n37596k721624
10540d92445n31550J441616o49010k454155l91767N80814k817354l784456K455910
10531f642397P905821M463097k229631l331256j473899k752409m040824r27221
$$ plain form
10590 -2717209 -6447179 -9295749 -5976765 2010190 7803528 8684327 7592166 5618737
10582 5618737 758321 -5274993 -7176259 -4845453 -4337945 -7655661 -9210233 -5644864
10574 -5644864 -1860354 -3009699 -6724866 -8007242 -6819829 -6098979 -6040333 -4808618 -2602613
10565 -2602613 -1767593 -4101347 -9167879 -13749308 -13648566 -8817862 -5184917 -7436428
10557 -7436428 -11989099 -12241516 -8485440 -6063785 -5840420 -4581679 -3632345 -8045768 -16507178
10548 -16507178 -20900305 -17477197 -10735190 -5066384 -402772 2766775 2229179 -492445
10540 -492445 -1023995 417621 -231389 -2685544 -3077311 -2496497 -5313851 -9098307 -6642397
10531 -6642397 1263424 5726521 3496890 165634 -1308265 -4060674 -8101498 -9028719
10523i028719J717495m69323j748186J515495J725131m391139o115220J468548
10515a5325918N300172k085134o431500J936206P483096k072456r923337j33429
10507b1252300J0477252K453826q452939p05901R855852p61148j5577765o017804
10499b9980927J1238142K693412j6420534q656203J1015904N01397k3321857j0559392
10491f3490058J6369106j0934033o3286193k1034796J26439499K12323213J12928244
10484C09314982o3965776j25041366n1979297J3120545k712623l0462406j0863732
10477C7410327J5867617M741332j6174053j0870074P01529p573855j5714339j085691
10469G302793J5217352P871800p281218n653488L200728K43814o461307k709969
$$ plain form
10523 -9028719 -7311224 -7780547 -9528733 -8013238 -6288107 -10679246 -16794466 -15325918
10515 -15325918 -10025746 -12110880 -18542380 -16606174 -9123078 -11195534 -21118871 -21252300
10507 -21252300 -10775048 -8321222 -16774161 -17480062 -7624210 -8385358 -23963123 -29980927
10499 -29980927 -18742785 -16049373 -32469907 -41126110 -30110206 -29608809 -52930666 -63490058
10491 -63490058 -47120952 -58054985 -121341178 -142375974 -15936475 196386738 309314982
10484 309314982 245349206 120307840 68328543 81449088 78736465 48274059 37410327
10477 37410327 53277944 58019276 41845223 30975149 31676678 24102823 8388484 7302793
10469 7302793 22520145 30391945 23110727 17457239 20657967 20901781 14440474 11730505
10461A1730505J857080m575382r470919o3402R500645L258960o369466j525615
10453D342406Q147415L937430p927684q863883l54543K947827P73029K750441
10445E752438O230669K116261n173765m862464L03075N43212k050183N87285N075142
10436H521670K928261k391748j713773K831797K940798q1462Q4009R51985k947198
10427A1124339o943570l803030J925193J712671j318670P63275M900866L287120
10419A1648194r77548j60659K200586j897042p596911m135113M774301N592647
10411I448455j967417m667470J267447M589865q16347o325542m018634J541713
10403i47930K712846k35571k612652k173165P67203L899845K839556l081875o253630
$$ plain form
10461 11730505 13587585 9012203 -458716 -522118 8978527 12237487 5868021 4342406
10453 4342406 12489821 16427251 8499567 -364316 -718859 2228968 3001997 5752438
10445 5752438 11983107 14099368 8925603 4063139 4366214 4909426 2859243 3446528 8521670
10436 8521670 11449931 9058183 7344410 10176207 13117005 13035543 13119552 14071537 11124339
10427 11124339 4180769 377739 2302932 4015603 2696933 3460208 8361074 11648194
10419 11648194 10670646 10509987 12710573 10813531 3216620 -918493 3855808 9448455
10411 9448455 7481038 2813568 4081015 8670880 7854533 1528991 -2489643 -947930
10403 -947930 1764916 1529345 -1083307 -3256472 -2489269 1410576 4250132 1168257 -5085373
10394e085373k18506Q269250O999892k839204p551281j742670M368976K173875
10386D374959k788829j967633K305103K302638k218223m869539k823136P13683
10378d970977K479989K423009J776507J473532J978874K560569J673364n27626
10370H867241j693129q27700l97532k682029n486774m448502N08768M098712K644222
10361E83277l74124Q21137N028962M886336j622711o481279l005070L444063L366622
10352F647213k004597l157019J740504M003950q08919n728843m118566M62205
10344b964072J672768J72141n1831R71916J312264J424909J391721q81477m399022
10335a350683m084910N04559K489991j112067l312809J064083N615916K891079
$$ plain form
10394 -5085373 -5303879 2965371 9965263 7126059 -425222 -2167892 2201084 4374959
10386 4374959 1586130 -381503 1923600 4226238 2008015 -2861524 -5684660 -4970977
10378 -4970977 -2490988 -67979 1708528 3182060 5160934 7721503 9394867 8867241
10370 8867241 7174112 6346412 5948880 3266851 -2219923 -6668425 -6159657 -2060945 583277
10361 583277 209153 1030290 6059252 10945588 9322877 2841598 -163472 3280591 6647213
10352 6647213 4642616 1485597 3226101 7230051 6421132 692289 -3426277 -2964072
10344 -2964072 -1291304 -1119163 -1170994 -199078 1113186 2538095 3929816 3048339 -1350683
10335 -1350683 -5435593 -4931034 -2441043 -3553110 -6865919 -5801836 -185920 2705159
10327B705159k717174k667980J306470J617904j072252r5221L825274L548555
10319F450735j215455l272878q74264k21563l495653m698501m22953M047977L161223
10310e41332j255104m124027l423327L8521M190359N451158J754578l201513l610686
10301d721373K24453K706143J847107R79070J362169L96104j588607m31511L602631
10292D376186M229713p60061n002375l545766n70160j564959l809586j624619
10284h271627L240457M219720O43315j765499n49028M82779j108735k274147n28694
10275e911459J327099K99160j158472O98437L882712L280851q66838k905533o54168
10266b008211J502887M02769q07268R60642K605673M13509k605486j578627J268236
$$ plain form
10327 2705159 -12015 -2679995 -1373525 244379 -827873 -923094 2902180 6450735
10319 6450735 5235280 1962402 1088138 866575 -2629078 -7327579 -7750532 -3702555 -541332
10310 -541332 -1796436 -5920463 -9343790 -9305269 -5114910 336248 2090826 -1110687 -4721373
10301 -4721373 -4496920 -1790777 56330 1035400 2397569 2793673 1205066 773555 4376186
10292 4376186 8605899 7845838 2843463 -702303 -1272463 -2837422 -6647008 -8271627
10284 -8271627 -5031170 -811450 -168135 -1933634 -2482662 -1999883 -3108618 -5382765 -5911459
10275 -5911459 -4584360 -4285200 -5443672 -4745235 -862523 2418328 1551490 -1354043 -2008211
10266 -2008211 -505324 -102555 -909823 50819 2656492 3070001 464515 -1114112 154124
10257A54124J57357l771012m060496l68861Q67521j886468k440212J626622M094489
10248e626936J161414j442802J607022N872113M815994M94319j070823j32743
10240E677558q58705k480966q77999L111350M242627Q69393l390087n309088m785527
10231c801444k798492l12366J715510L327057M538293K839881l462062q747066
10223f700689m715230N755700Q927179j73616q594042m266585N832737P595805
10215C661259J470774j500771O37311L43898l125625k579912K144926K845554
10207C897414j745408l180849J146979K942719j853692n191231n94353N793935
10199A215514N427775L71803j723238L65320J809988J90308k486173l775804k729267
$$ plain form
10257 154124 311481 -3459531 -7520027 -7888888 -7021367 -8907835 -11348047 -9721425 -5626936
10248 -5626936 -4465522 -5908324 -4301302 1570811 6386805 6881124 5810301 5677558
10240 5677558 4818853 2337887 1459888 4571238 8813865 9683258 6293171 984083 -3801444
10231 -3801444 -6599936 -6912302 -5196792 -1869735 2668558 5508439 2046377 -6700689
10223 -6700689 -11415919 -5660219 3266960 3093344 -5500698 -9767283 -3934546 3661259
10215 3661259 5132033 3631262 4268573 4612471 1486846 -1093066 1051860 3897414
10207 3897414 2152006 -1028843 118136 3060855 1207163 -3984068 -4578421 1215514
10199 1215514 6643289 7015092 5291854 5657174 7467162 7657470 5171297 1395493 -1333774
10190a333774J00207K337048J956938N76677J149477K542714J194358k148822
10182F374823l265929j926185j779166k707457j037239K015288R42338l311906
10174d695433k770018M172326Q385770L861942l081486m329114j422237J55217
10166B76967M98396J617552R91069l137160n652894j984990L200777K957783p08366
10157a940866j239071P56258k29568l265887k205453K513487L511331r02508l327564
10148f329841M97009M543571K316198k882122l512359P12807L328913J241825
10140h3999j634540j250245Q67344R17759j168968k108307n56404J100037P16078
10131c201245n37845n67066L10745N22158J05099L5287O4889j99476M56964K477955
$$ plain form
10190 -1333774 -1233567 1103481 3060419 3637096 4786573 7329287 8523645 6374823
10182 6374823 3108894 1182709 -596457 -3303914 -4341153 -2325865 -1383527 -4695433
10174 -4695433 -7465451 -3293125 5092645 8954587 5873101 1543987 121750 276967
10166 276967 775363 2392915 3383984 246824 -5406070 -7391060 -4190283 -1232500 -1940866
10157 -1940866 -3179937 -2423679 -2653247 -5919134 -8124587 -5611100 -2099769 -3002277 -6329841
10148 -6329841 -5832832 -1289261 1026937 -1855185 -5367544 -4654737 -1325824 -83999
10140 -83999 -1718539 -2968784 -2101440 -1183681 -2352649 -4460956 -5017360 -3917323 -3201245
10131 -3201245 -3739090 -4306156 -3995411 -3473253 -3368154 -3332867 -3267978 -3467454 -3010490 -532535
10121e32535L031585j28322l600725k098478L166753N399163K138015j462403
10113E913053r78445J226428J100733q13297j713253j289532o30658M32909J642315
10104D890253R21396k176784m420603l377925j205510q38908j221345P2336J957437
10095e399653J678351j36694l24650J713577L342101K831157J160504l05089j400449
10086C159155k097591j767375j32287J889486K605868Q90984k331513m234886
10078b018159k948975m7122J383549Q15089L89319J239041K184947K177471J557313
10069D732473P33315o3702M3771J091414P22966k556670n467781l570588J636884
10060b697918M090772J717491j585595k926052l511181l618771q74109L994224
$$ plain form
10121 -532535 2499050 2370728 -1229997 -3328475 -161722 5237441 7375456 5913053
10113 5913053 4934608 6161036 7261769 6448472 4735219 3445687 2815029 3247938 4890253
10104 4890253 5811649 3634865 -785738 -4163663 -5369173 -6208081 -7429426 -7357090 -5399653
10095 -5399653 -3721302 -3857996 -4182646 -2469069 873032 3704189 4864693 4559604 3159155
10086 3159155 1061564 -705811 -838098 1051388 3657256 4548240 2216727 -2018159
10078 -2018159 -4967134 -5014256 -3630707 -2815618 -2426299 -1187258 997689 3175160 4732473
10069 4732473 5465788 5402086 5445857 6537271 7260237 4703567 -764214 -4334802 -2697918
10060 -2697918 1392854 3110345 1524750 -1401302 -4912483 -8531254 -9405363 -5411139
10052e411139N765319K487933p61142L79597L038888K468790n55313k131979j323152
10043C957802L63240K278577L566648K058226k060421m714699l571921j709303
10035A68149k147235k669929k40242L253229M299927L381757K539244O93159l367733
10026E910326o257419l977287J261447L556138J372736j630977k568535j588754
10018c922325O84558L532073M632358K126621k143883m489035l785720j671281
10010e036634K99936J349872R74950q6437j70044N66397L45198k72679J272281
10001g57160L825410K590126k567510n089902j739251J970566J273104P4020K812005
9992B391408N241096J759056l794296m218012j290236j747703m407741k473389
$$ plain form
10052 -5411139 354180 2842113 2080971 2460568 5499456 7968246 7412933 5280954 3957802
10043 3957802 4321042 6599619 10166267 12224493 10164072 5449373 1877452 168149
10035 168149 -1979086 -4649015 -4889257 -1636028 2663899 6045656 8584900 9278059 5910326
10026 5910326 -347093 -4324380 -3062933 493205 1865941 234964 -2333571 -3922325
10018 -3922325 -3237767 294306 4926664 7053285 4909402 420367 -3365353 -5036634
10010 -5036634 -4736698 -3386826 -2411876 -2498313 -2668357 -2101960 -1756762 -2029441 -757160
10001 -757160 3068250 5658376 3090866 -1999036 -3738287 -1767721 -494617 -420597 2391408
9992 2391408 7632504 9391560 5597264 1379252 89016 -1658687 -6066428 -8539817
9984h539817L161673M466088J46010k136061J060602L845108J746025j619138
9976B130490k059728j084074j014990n87514J094854J922700R60038K17037L81336
9967A960149j21081p69119O16284K367828M33490l729408l857968J046051M677672
9958B623898L334707M60174p49073j507532j882800O16005L932385J776976n044027
9949C560713o843358J52772O448744L549589l050616l521105J097797K899326
9941D293862O15201r10490q24212k045393l439995j373535K428662K924014N23493
9932B191607J1450J753079J766719j42088k02502J485425P55403k435120l242411
9923A941562n66372R03463q97730k012563n5794J398477n63216k933514k120922
$$ plain form
9984 -8539817 -5378144 -912056 -766046 -2902107 -1841505 2003603 3749628 2130490
9976 2130490 70762 -1013312 -2028302 -2615816 -1520962 401738 1361776 1578813 1960149
9967 1960149 1839068 1069949 1686233 4054061 4487551 758143 -3099825 -2053774 2623898
9958 2623898 5958605 6418779 5669706 4162174 2279374 2895379 6827764 8604740 3560713
9949 3560713 -3282645 -3129873 3318871 6868460 3817844 296739 1394536 4293862
9941 4293862 4909063 3998573 3174361 1128968 -2311027 -3684562 -1255900 1668114 2191607
9932 2191607 2203057 3956136 5722855 5580767 5378265 6863690 7619093 5183973 1941562
9923 1941562 1375190 2278653 1380923 -631640 -687434 711043 147827 -2785687 -4906609
9914d906609J41537L86232p59665m30949J457215K719425K523292J521730k5246
9905B626962j810855k625136j911366p61233O4094J314560L174597M144313L415145
9896G631081K145479R72190j217885m366845n840182m113980j329634J55255J145616
9887d818905K850628L507125J335785j292163p52852K035870K802667L21763k208977
9878C780941k129357l85106L59253j882202o921740j0429018n697084P709866
9870a5594447J8875804J5987611J929828q102908o160768m65787j138226n664629
9862c33522n583580q21425J826762O29559k3498J277083J600106Q57153K036032
9853A464670M067413K525629j779650k946904j2230J394169o21133r10853K491565
$$ plain form
9914 -4906609 -4765072 -4378840 -5138505 -5569454 -4112239 -1392814 1130478 2652208 2626962
9905 2626962 816107 -1809029 -3720395 -4481628 -4417534 -3102974 71623 4215936 7631081
9896 7631081 9776560 10748750 9530865 5164020 -676162 -4790142 -6119776 -5964521 -4818905
9887 -4818905 -1968277 1538848 2874633 1582470 829618 2865488 5668155 5989918 3780941
9878 3780941 1651584 1266478 1625731 -256471 -7178211 -17607229 -23304313 -15594447
9870 -15594447 3281357 19268968 21198796 13095888 6935120 6469333 5331107 -333522
9862 -333522 -5917102 -6738527 -4911765 -4282206 -4305704 -3028621 -1428515 -571362 1464670
9853 1464670 5532083 8057712 6278062 3331158 3318928 4713097 4091964 3181111 5672676
9844E672676L634610j071863n877511m831631q23962P38535O59833J624134J481482
9835A206303j621179l201849K80970L397776r5081n753534m882057J264153M166410
9826e238088K290578J666262L560370K831978j136628k612556O3992K144174K035356
9817E605438L332467N490978K798888m359305p336779k432659L083057K751749
9809H933834j40484m89473K34535p85882j745949j175258j720506l682343k318960
9800b890486K895016M529881p99194n193031k059143K457902J91450m484090k192342
9791g544037M978029O881769J943704j756183p03418K07255j665396k581818n02947
9782g43042J410011J149058M15859l69734k798692n375095m380398o32650J053498
$$ plain form
9844 5672676 9307286 8235423 2357912 -2473719 -3297681 -2559146 -1899313 -275179 1206303
9835 1206303 -414876 -3616725 -3335755 62021 -33060 -5786594 -10668651 -9404498 -5238088
9826 -5238088 -2947510 -1281248 2279122 5111100 3974472 1361916 1425908 3570082 5605438
9817 5605438 8937905 14428883 17227771 12868466 5531687 3099028 6182085 8933834
9809 8933834 8793350 8303877 8538412 7752530 6006581 4831323 3110817 -571526 -2890486
9800 -2890486 4530 4534411 3735217 -1457814 -3516957 -1059055 -867605 -5351695 -7544037
9791 -7544037 -2566008 4315761 6259465 4503282 3799864 4007119 2341723 -240095 -743042
9782 -743042 666969 1816027 2231886 1862152 -936540 -6311635 -10692033 -11324683 -10271185
9773a0271185k46506o63843J002559J594730J20075o18941J91282L80750K54771
9764h256308K294351M684431K514127l152520m969751k94402M790383N088478
9756B698789K853151J723304J110864K02749Q06421K220657j46373o560484r787286
9747d878208n323390J120901K109753r32072j910335q0997J076572J319357K702367
9738d796052L635122J046828k807574k480990K008993M770583K764066m48042
9730C692934p95133J002453J926612J102509j10711m96015j28634q5725j284700
9721D823590k975041l008738m71437K864482M466506L213326o44494n420932p340146
9712d492884l283081M189037Q086070N636391J993670K164210L322779R8200n691675
$$ plain form
9773 -10271185 -10517691 -11181534 -10178975 -8584245 -8464170 -9083111 -8891829 -8511079 -8256308
9764 -8256308 -5961957 -1277526 1236601 -1915919 -6885670 -7180072 -2389689 2698789
9756 2698789 5551940 7275244 8386108 8588857 9395278 11615935 11469562 4909078 -4878208
9747 -4878208 -10201598 -9080697 -6970944 -7903016 -9813351 -9894348 -8817776 -7498419 -4796052
9738 -4796052 -1160930 -114102 -2921676 -5402666 -3393673 1376910 4140976 3692934
9730 3692934 2897801 3900254 5826866 6929375 6818664 6322649 6194015 6108290 4823590
9721 4823590 1848549 -1160189 -1631626 1232856 5699362 8912688 8268194 2847262 -4492884
9712 -4492884 -7775965 -3586928 4499142 10135533 12129203 14293413 17616192 17714392 12022717
9703A2022717p068162k631002J228830j47162l461531l167916N97134K987113
9695C60021J331720j884567k680474m28223J761298J235178p45656j059192M78793
9686a631102J005982l58910p41467J568933L750327K738302K0119j241679j431227
9677C679278k795334m300650k725511J648661M595012L483017Q0796k352018k138259
9668h25008L69744K829627K034101k204360n177687k569783L176900N554416K628242
9659E816192j171257k069111j324849j393818j790724j005709L34185N71065m06165
9650b440191j354831j274740O3455J950900K674826J049829j687548k937582j829655
9641e785537O7334R69682N20294l33795L4701K324423M184880J998179l180185
$$ plain form
9703 12022717 4954555 2323553 3552383 3405221 -56310 -3224226 -2627092 360021
9695 360021 1691741 -192826 -2873300 -3301523 -1540225 -305047 -1050703 -2109895 -1631102
9686 -1631102 -625120 -984030 -1725497 -156564 3593763 6332065 6352184 5110505 3679278
9677 3679278 883944 -3416706 -6142217 -4493556 101456 3584473 3665269 1313251 -825008
9668 -825008 -455264 2374363 4408464 2204104 -2973583 -5543366 -2366466 3187950 5816192
9659 5816192 4644935 2575824 1250975 -142843 -1933567 -2939276 -2605091 -2034026 -2440191
9650 -2440191 -3795022 -5069762 -5006307 -3055407 -380581 669248 -1018300 -3955882 -5785537
9641 -5785537 -5718203 -4748521 -4228227 -4562022 -4527321 -2202898 1981982 3980161 799976
9632G99976m717745P25162O625776M618492l094326o487028k291608K142181J016324
9623f62796j913113j125848J890189K860037K284502K832934L020638l13074n385074
9614C488395o984651l681125R33566L370506K847076k1765l228431l229694J031848
9605e474275M831232K854949k719975m302128L36929M576023K529293k485280
9597A46768l150946J040585L426940L22032l605164k407010K425965M454856J750856
9588D404882j226918j527235j868101m149601m155982J738706Q109069O076168
9580G400988l382689r152996m539173M415466P975709M473917o91909l191319
9572C307994k499581K34815K816405K646361M3219j211537O69584K276822K85151
$$ plain form
9632 799976 -3917769 -3192607 3433169 8051661 4957335 -1529693 -3821301 -1679120 -662796
9623 -662796 -2575909 -3701757 -1811568 1048469 3332971 6165905 9186543 8873469 3488395
9614 3488395 -3496256 -7177381 -6243815 -2873309 -26233 -47998 -3276429 -6506123 -5474275
9605 -5474275 -643043 2211906 -508069 -4810197 -4473268 102755 2632048 146768
9597 146768 -3004178 -1963593 1463347 1785379 -1819785 -4226795 -1800830 2654026 4404882
9588 4404882 3177964 1650729 -217372 -4366973 -8522955 -6784249 1324820 7400988
9580 7400988 4018299 -5134697 -9673870 -5258404 2717305 7191222 6499313 3307994
9572 3307994 808413 1043228 3859633 6505994 6549213 5337676 6007260 8284082 8569233
9563H569233l114967l780136j908519o68135o97127k18175Q64729R46109k17198
9554b24186j571290k553209k218223J047133N856702O897605J785285m052618
9546D967199m165208n8336K078231J079187P16393J650068Q56406j256687o59230
9537E208023K496396L067679l05543k503638o36175J095273j083144l912542k597954
9528H28375J570258L858894L013970J059919j098053l463572m359110k259517
9520h48836R87380K231754J236311p6437j113824k204797k156092J44166K523269
9511G22894J705824j436914k507518J0873K522436J875720n2460K22664K073972
9502E137491J827407j139666k888875n90623L019562L117153p50384m266613l912907
$$ plain form
9563 8569233 5454266 1674130 -234389 -902524 -1599651 -1817826 -953097 -6988 -224186
9554 -224186 -1795476 -4348685 -6566908 -5519775 336927 7234532 9019817 4967199
9546 4967199 801991 743655 2821886 3901073 4617466 6267534 7123940 5867253 5208023
9537 5208023 7704419 10772098 10466555 7962917 7326742 8422015 7338871 3426329 828375
9528 828375 2398633 6257527 9271497 10331416 9233363 5769791 1410681 -848836
9520 -848836 138544 2370298 3606609 3530172 2416348 211551 -1944541 -1800375 722894
9511 722894 2428718 991804 -1515714 -1504841 1017595 2893315 2840855 3063519 5137491
9502 5137491 6964898 5825232 2936357 2345734 5365296 8482449 7732065 3465452 -447455
9493d47455m64078L003655M057789J674055l030533o085605l848717J714541M207994
9484G81646J252091j788713M22441N106396N491701P33717l479504l486123j725502
9475C308150j556905k281395j232161J703633L623855K032902j977659m293941
9467f73521k466692O38388M06193k468863k724258P40790K514667k33921k568642
9458f835859k69492K793196K035966P61459L312047N308452Q19057n189034l384059
9449f48267L640039M550187k035256n719288k377803J30442k283325k694809K460739
9440d977341N263729O00057l597559l2559M823219K267108l244876k466448K260519
9431H95849K024039k476833k987784J122374K520424m53420j712110P71052J880126
$$ plain form
9493 -447455 -911533 2092122 6149911 7823966 4793433 -1292172 -5140889 -3426348 781646
9484 781646 2033737 245024 667465 5773861 11265562 11999279 8519775 5033652 3308150
9475 3308150 1751245 -530150 -1762311 -58678 3565177 5598079 3620420 -673521
9467 -673521 -3140213 -2501825 -2095632 -4564495 -7288753 -6547963 -4033296 -4267217 -6835859
9458 -6835859 -7105351 -4312155 -2276189 -1514730 1797317 7105769 7924826 2735792 -648267
9449 -648267 2991772 7541959 5506703 -212585 -2590388 -2459946 -4743271 -7438080 -4977341
9440 -4977341 286388 886445 -2711114 -2743673 2079546 4346654 1101778 -1364670 895849
9431 895849 2919888 443055 -2544729 -1422355 1098069 644649 -1067461 -296409 1583717
9422A583717o35978k615517j758670j012821j660778o89058K579644M014751J456941
9413A262231j687571j982717k89988J256459K156329J863339o66030m142840n023228
9404g254016j736618L411855O669450N400382j92957n527470m552412K377902
9396a403884O844460K926447m354575o593271l799592j590904o41318K067681
9388f544956M259027J024549m386557l252093M151452P344383J537606n194325
9380a060914m632314N66741L524278L183560K124829M91101k209778l691933k116675
9371c821105N76985J830102J603548L77488j804907k817945n1507M039813L819047
9362C751519n75637k857799j044773m60005l322872l954086Q59818N085470L301417
$$ plain form
9422 1583717 947739 -1667778 -3426448 -4439269 -6100047 -6789105 -4209461 -194710 1262231
9413 1262231 -425340 -2408057 -2698045 -1441586 714743 2578082 1912052 -2230788 -7254016
9404 -7254016 -8990634 -5578779 1090671 6491053 6298096 770626 -3781786 -1403884
9396 -1403884 5440576 8367023 4012448 -2580823 -6380415 -7971319 -8612637 -6544956
9388 -6544956 -2285929 -1261380 -5647937 -8900030 -4748578 2595805 4133411 -1060914
9380 -1060914 -5693228 -5126487 -1602209 1581351 3706180 4197281 1987503 -1704430 -3821105
9371 -3821105 -3244120 -1414018 189530 567018 -1237889 -4055834 -4107341 -67528 3751519
9362 3751519 3175882 318083 -726690 -1186695 -4509567 -8463653 -7603835 -2518365 783052
9353G83052j97789O19998L147517J747571j979100l006121k168296k950128l190321
9344g193617P66620M963798K699470l532456m913926l12405K513210K21995j401827
9335f189138J702861N130604L780624o06899l514355l676445j743605J976366
9327c139987N274312M318338o12328m050685l025558j288478k458229l685613
9319h668228q42178L814810M793102J928274R3898J148153J589266j046172m002255
9310a191330l488638p7259K357047J584324r71899k569347k071024m09895J116990
9301e721031K353266L730822M626302L507970K66907k794909l472835k313317
9293A83175j428401j472647j543736j419852j569260j178692R40735L083733J786485
$$ plain form
9353 783052 585263 1205261 4352778 6100349 4121249 1115128 -1053168 -4003296 -7193617
9344 -7193617 -6426997 -1463199 1236271 -2296185 -7210111 -7522516 -5009306 -4787311 -6189138
9335 -6189138 -4486277 644327 4424951 3818052 303697 -3372748 -5116353 -3139987
9327 -3139987 2134325 6452663 5840335 1789650 -1235908 -2524386 -4982615 -8668228
9319 -8668228 -9510406 -5695596 -902494 1025780 1119678 2267831 3857097 2810925 -1191330
9310 -1191330 -4679968 -4757227 -2400180 -815856 -1787755 -4357102 -6428126 -6838021 -5721031
9301 -5721031 -3367765 363057 4989359 8497329 8764236 5969327 2496492 183175
9293 183175 -1245226 -2717873 -4261609 -5681461 -7250721 -8429413 -7488678 -4404945 -2618460
9284b618460k227342l028894K440244Q540222P717411R53186l915556l238567
9276D622244r33812o91773j189032p01971l91027m19551J400316M052747K537200
9267H285341l404294o275958j940682K763591O30926l808139j959251L909346
9259a799120M440735p63226k814734J010265L498835R84525j019723P49293J274434
9250E561284k180609l750327J52004K936876j141707o115522l744036K572948
9242e709089L520603r48972k773181K37380K052869j21492j642138O51664L346022
9233a386334L036361J671675K137505L281373K535313J13542k144649l642983
9225E601803m480453l958396j737209O24767J060794k87196q86038J068513L687185
$$ plain form
9284 -2618460 -4845802 -7874696 -5434452 3105770 10823181 11776367 7860811 4622244
9276 4622244 3688432 2996659 1807627 1105656 714629 295078 1695394 5748141 8285341
9267 8285341 4881047 -1394911 -3335593 -572002 58924 -3749215 -5708466 -1799120
9259 -1799120 2641615 1878389 -936345 73920 3572755 4557280 3537557 4286850 5561284
9250 5561284 3380675 -369652 -217648 2719228 1577521 -4538001 -8282037 -5709089
9242 -5709089 -2188486 -3137458 -5910639 -5673259 -3620390 -3741882 -5384020 -4732356 -1386334
9233 -1386334 1650027 3321702 5459207 8740580 11275893 11389435 9244786 5601803
9225 5601803 1121350 -2837046 -4574255 -3949488 -2888694 -3175890 -4061928 -2993415 693770
9216F93770K987429j504871m649829k058711K956125L429032o96044k188793J855513
9207H23621M978015J795730l077790k671912R09404M13678m167502n445873m33648
9198f876277M978136M736344R3337l622335l546966p07118K226108L181201K310898
9189B773328J558551J539144M14699k323504l609998j452069J004969K21796j681136
9180a554220q11089J076806m14810l469350j926289L789477N688099M16070n013032
9171b218338l608777J726857L801010J780730L06901R43889P27882j553187l017885
9162a110918j468761J289683K291862J133637l96288p29858N18623K709069M162721
9153H399770K967408q36378m333539m458472j652480O61114M70552q25349j505711
$$ plain form
9216 693770 3681199 2176328 -2473501 -4532212 -1576087 1852945 1156901 -1031892 823621
9207 823621 5801636 7597366 4519576 1847664 2757068 3170746 -996756 -6442629 -6876277
9198 -6876277 -1898141 2838203 2931540 -690795 -4237761 -4944879 -2718771 462430 2773328
9189 2773328 4331879 5871023 6285722 3962218 352220 -1099849 -94880 126916 -1554220
9180 -1554220 -2365309 -1288503 -1703313 -5172663 -7098952 -3309475 2378624 2794694 -2218338
9171 -2218338 -5827115 -4100258 -299248 1481482 1788383 2732272 3460154 1906967 -1110918
9162 -1110918 -2579679 -1289996 1001866 2135503 1739215 1009357 1527980 4237049 8399770
9153 8399770 11367178 10530800 6197261 1738789 86309 747423 1217975 392626 -1113085
9144a113085k090589k904495j742546K530472N922411L490648k971758o326939
9136e205881l635584N25616J387502k39944j285000q20360J013812L995024N522859
9127A258044K163714l960852n609737n48986M231079K600684j896653k558912
9119d321619K19042J475148M08110q3727L80640K27022K40409J529993J835923
9110A910941m47255j675354J417398M789008K785971k264806l864291k141370
9102E10242k397888m668310l771860P42774L549151K821484K275512L205098K490675
9093D756878l43226j726159r17834r68326j838700j63905L026613K370993k379811
9084A816523m982903k822528m08702m10283N39696L942660N426372K523871r07899
$$ plain form
9144 -1113085 -3203674 -6108169 -7850715 -5320243 602168 4092816 1121058 -5205881
9136 -5205881 -8841465 -8315849 -6928347 -7168291 -8453291 -9273651 -8259839 -4264815 1258044
9127 1258044 3421758 -539094 -6148831 -6697817 -2466738 133946 -1762707 -4321619
9119 -4321619 -4102577 -2627429 -2219319 -2303046 -1922406 -1695384 -1454975 75018 1910941
9110 1910941 1463686 -211668 1205730 5994738 8780709 6515903 2651612 510242
9102 510242 -1887646 -6555956 -10327816 -9585042 -6035891 -3214407 -938895 2266203 4756878
9093 4756878 4413652 2687493 1769659 801333 -1037367 -1201272 1825341 4196334 1816523
9084 1816523 -3166380 -5988908 -6397610 -6807893 -6268197 -2325537 3100835 5624706 4716807
9075D716807j891368k735377m443687l346907J152994L045977p38459m347193
9067h587213k414412J254107Q58484j678548j265949J247029J838281J081169
9059g667052K042004L690435L044028J119953O80011P75803o31994j496239P66965
9050B323914L189332J192848l298426m199190o10179K399463J963413N45201N15861
9041D022237P50740k11729j537626j963555j662303j280561q08301Q4698J409361
9032a197039K423657J856160k91117j692347p54982O0182k330792n472805l851300
9023a1250383K057520N367438L035374n1712L4888K50773k345507m204271j631427
9014h737307K111324K347532R67581K288527M734894L466020j251349m496447
$$ plain form
9075 4716807 2825439 90062 -4353625 -7700532 -6547538 -3501561 -4240020 -8587213
9067 -8587213 -11001625 -9747518 -8889034 -10567582 -11833531 -10586502 -8748221 -7667052
9059 -7667052 -5625048 -1934613 1109415 2229368 2909379 3685182 3053188 1556949 2323914
9050 2323914 5513246 6706094 3407668 -791522 -1401701 997762 2961175 3506376 4022237
9041 4022237 4772977 4561248 3023622 1060067 -602236 -1882797 -2691098 -2606400 -1197039
9032 -1197039 1226618 3082778 2791661 1099314 344332 404514 -1926278 -7399083 -11250383
9023 -11250383 -9192863 -3825425 -790051 -841763 -806875 -556102 -2901609 -7105880 -8737307
9014 -8737307 -6625983 -4278451 -3310870 -1022343 3712551 7178571 5927222 1430775
9006A430775l728723l64599L527826N670386L512364j751327m210251q71852L200222
8997F414821K141793k219536m367032l443338j774516P06270M043323M373697
8989E875482l71558m618888k547355K237188K437548j049309j899723M5649j13975
8980d941j673662O00506N296760M967456j219559n581338m348899k239789k257135
8971f460601o59755M134401O566946K944462j761019j495133J966811K643852
8963G879964j136457n760936o835369k465818M695606P843181K820644n058686
8955A982129o479163r08302K782377j55077l799540j688746L682025O116479M719297
8946F251479K582093P84644j474661l697901m737664m374213k290340J473678
$$ plain form
9006 1430775 -2297948 -2662547 865279 6535665 10048029 8296702 4086451 3214599 6414821
8997 6414821 8556614 6337078 1970046 -1473292 -3247808 -2541538 1501785 5875482
8989 5875482 5503924 885036 -1662319 574869 3012417 1963108 63385 109034 -4941
8980 -4941 -1678603 -1078097 4218663 9186119 7966560 2385222 -1963677 -4203466 -6460601
8971 -6460601 -7120356 -2985955 3580991 6525453 4764434 3269301 5236112 7879964
8963 7879964 6743507 982571 -5852798 -8318616 -3623010 4220171 7040815 1982129
8955 1982129 -4497034 -5405336 -2622959 -2778036 -6577576 -8266322 -4584297 1532182 6251479
8946 6251479 8833572 9618216 8143555 4445654 -292010 -4666223 -6956563 -5482885
8938e482885M008722J947788k333794k393370K401603M770702M27983n050983
8930a704234m683936l6991K495021J211094m26453K8950J987204L841072L563636
8921F275363k70265n264956o132472j693718K570338K070946n62594l32186K565538
8912g74006M159666K849488K42033j868067k221370j80334K408423K293136k14942
8903F694027j074806P17607J071457j809874l661989j634850L53558j257021k960061
8894c561952p59378J847327k74181m411450m285362m52347J743419J941185L810051
8885d402688O082975L798591j728064l346753K83578K151995j476638m854051
8877c491055k153208L412628M812376J061448l026512m214448l585553l035533
$$ plain form
8938 -5482885 -1474163 473625 -1860169 -4253539 -1851936 2918766 3346749 -1704234
8930 -1704234 -6388170 -6425161 -3930140 -2719046 -3145499 -3116549 -1129345 2711727 6275363
8921 6275363 6005098 740142 -5392330 -7086048 -4515710 -2444764 -3007358 -3339544 -774006
8912 -774006 3385660 6235148 6477181 4609114 2387744 2207410 4615833 6908969 6694027
8903 6694027 5619221 6336828 7408285 5598411 1936422 301572 655130 -601891 -3561952
8894 -3561952 -4321330 -2474003 -2748184 -7159634 -11444996 -11897343 -10153924 -8212739 -4402688
8885 -4402688 1680287 5478878 3750814 404061 687639 2839634 1362996 -3491055
8877 -3491055 -5644263 -2231635 2580741 3642189 615677 -3598771 -7184324 -10219857
8869a0219857k361116k00157L409918N988337M869044R14027j734755r09809Q77250
8860F32882R78418P40039J804941J721987j854017n437741m141872K69826K274940
8851c010597J770076K843173M537736J792083l875683m327992J868937N573512
8843G171245J110648m617440l383395J686170K558885n54787j416132O88700O76354
8834C920248k682845m982078l742114r48715J806188M512423N367746K535850
8826E786703p81953L82671M071242L107750l210624o784132l021868J953225J138211
8817B641225k810644l111804Q6757J426533j39965j089017q19827j791234k719607
8808h327583M66295N916376O120745k97469m647331p50171N215418M015258k599681
$$ plain form
8869 -10219857 -12580973 -12781130 -9371212 -3382875 1486169 2400196 665441 -244368 632882
8860 632882 1611300 2351339 4156280 5878267 4024250 -1413491 -5555363 -5285537 -3010597
8851 -3010597 -1240521 1602652 6140388 7932471 4056788 -271204 1597733 7171245
8843 7171245 8281893 3664453 281058 1967228 4526113 3971326 2555194 3243894 3920248
8834 3920248 1237403 -3744675 -7486789 -8435504 -6629316 -2116893 3250853 5786703
8826 5786703 5004750 5387421 9458663 12566413 9355789 2571657 -450211 1503014 2641225
8817 2641225 -169419 -3281223 -3194466 -1767933 -1907898 -2996915 -3816742 -5607976 -8327583
8808 -8327583 -7861288 -1944912 4175833 3878364 -768967 -1519138 3696280 7711538 5111857
8799E111857n236151j366734K277953J340136p90604r15571j362139l762978m226610
8790h930841J81871N100143M663189K38333k225433j112528L19034P16613J882443
8781H32824L454734K216558k015166m721489k994980K82630R28634q75705k022417
8772d914377j469836r88874j707405k191039m32863L059652M927528K589150j712581
8763b840645k451970K075073O361125M405216j774422m502786q97692L676264
8755D050163L461092q44762m903172o338874m986146j114800L398983M908556
8747b368960K325448n83051l38295J144229J99314k130093j949407N01313J035416
8738b164086j242086k222067K76491K825806K254956Q24385J720207K863295L33066
$$ plain form
8799 5111857 -124294 -1491028 786925 2127061 1336457 420886 -941253 -4704231 -8930841
8790 -8930841 -8748970 -3648827 1014362 1252695 -972738 -2085266 -1766232 -1049619 832824
8781 832824 4287558 6504116 4488950 -232539 -3227519 -2944889 -2016255 -2891960 -4914377
8772 -4914377 -6384213 -7373087 -9080492 -11271531 -11704394 -8644742 -3717214 -1128064 -2840645
8763 -2840645 -5292615 -3217542 3143583 7548799 5774377 1271591 373899 4050163
8755 4050163 7511255 6666493 1763321 -4575553 -9561699 -10676499 -7277516 -2368960
8747 -2368960 -43512 -626563 -964858 179371 378685 -1751408 -3700815 -3199502 -2164086
8738 -2164086 -3406172 -5628239 -5351748 -2525942 -270986 553399 2273606 5136901 5469967
8729E469967l923201l795209J290693M347644J001688l501054k001974L493703
8721B382257M594588r01887n857486m343040P57445L563452L319723K407708N28386
8712F451146l535843o988501n803317j262898J786383K400997L560971N205951
8704A814889L767382n69798k774752j079215J60094j632788k811243n83765J614691
8695b094505N00892r39705P86795K880721J428362j108380m45222J422071J91813
8686B622842k090080p28673J976237J51120m227365l671855J214283J685425l698931
8677f766997n217360J840472Q149874M755554k706089l379692J961821L682224
8669B319807r72829m962500l157264J531990M108168L086474l30139l582022l353327
$$ plain form
8729 5469967 1546766 -2248443 -957750 3389894 4391582 890528 -1111446 2382257
8721 2382257 6976845 6074958 217472 -4125568 -3368123 195329 3515052 5922760 6451146
8712 6451146 2915303 -4073198 -9876515 -11139413 -9353030 -6952033 -3391062 1814889
8704 1814889 5582271 5012473 2237721 1158506 1318600 -314188 -3125431 -3709196 -2094505
8695 -2094505 -1593613 -2533318 -1746523 1134198 2562560 1454180 1008958 2431029 2622842
8686 2622842 532762 -195911 1780326 1931446 -2295919 -5967774 -4753491 -3068066 -6766997
8677 -6766997 -11984357 -10143885 -1994011 2761543 55454 -3324238 -1362417 2319807
8669 2319807 1346978 -3615522 -6772786 -5240796 -1132628 1953846 1623707 -1958315 -5311642
8660e311642P32641L890672K089744j427235p99875K983642L671479n5806k972587
8651B801033k230928r20683j327695j269485N84285J735639Q64747L20685Q80637
8642A438235m17174l969155m792288k35881M699555M777928K564483L146502M884982
8633A2097187K608041k492641m077435j248986q8011l211377n097527j210689
8625b721438M184682M264988k74775k992264j566786j24893j580366k937931n30993
8616d279776L682526M520757P56504l395108l885971j272879J146004J553263
8608a174680P16115J45867M54083J024351O43386j073284k808552l017879k025669
8599g116262j050766M01501L384122N756725L701756j636379l811505l97396K339341
$$ plain form
8660 -5311642 -4579001 -688329 1401415 -25820 -825695 2157947 5829426 5773620 2801033
8651 2801033 570105 -350578 -1678273 -2947758 -2363473 -627834 236913 557598 1438235
8642 1438235 1021061 -2948094 -7740382 -7976263 -3276708 1501220 4065703 7212205 12097187
8633 12097187 14705228 12212587 8135152 6886166 6798155 3586778 -1510749 -2721438
8625 -2721438 1463244 5728232 5453457 2461193 894407 769514 -810852 -3748783 -4279776
8616 -4279776 -597250 3923507 4680011 1284903 -2601068 -3873947 -2727943 -1174680
8608 -1174680 -458565 -312698 141385 1165736 1809122 735838 -2072714 -5090593 -7116262
8599 -7116262 -8167028 -7765527 -4381405 1375320 5077076 3440697 -370808 -768204 1571137
8590A571137j000088n428577k863925M266336N812678l78431n241604k865352
8582f127826J323100R24872j318607O5207L488876M189984K993673L555949M312458
8573A3407686J067931m320688n610885k010351P95835j48505j501642n41579M92525
8564A630327p00729k300341j930982o00579l23469p60606o99449n05969r24643
8555g116440j397395j396107j599014k091748j206169K022706N644752O824314
8547c15101N173669K632041P88499k95214r59032q94756L26157J928248J785949
8538A0170460j352955n369034o175254k717492J189571J863197P20229J325051
8530c46227K987086J620855k899341m936728q13687N205210N973339O44817m616386
$$ plain form
8590 1571137 571049 -4857528 -7721453 -3455117 2357561 1979130 -3262474 -6127826
8582 -6127826 -4804726 -3879854 -5198461 -5133254 -1644378 2545606 5539279 9095228 13407686
8573 13407686 14475617 10154929 4544044 2533693 3329528 3181023 1679381 1137802 1630327
8564 1630327 929598 -1370743 -3301725 -3902304 -4225773 -4986379 -5685828 -6191797 -7116440
8555 -7116440 -8513835 -9909942 -11508956 -13600704 -14806873 -12784167 -7139415 -315101
8547 -315101 4858568 7490609 8279108 7983894 7024862 6130106 6456263 8384511 10170460
8538 10170460 8817505 3448471 -2726783 -5444275 -4254704 -2391507 -1671278 -346227
8530 -346227 2640859 4261714 1362373 -3574355 -4388042 817168 6790507 7435324 2818938
8521B818938m625553p73245K114644K050903J004205P65370L55649j458010l089300
8512h36399k043160P04674J177563j956106m815936l128680K182604O111456N113978
8503B509994J44418m600432m913088l29574M265732L219582k331975m810796m45173
8494g291312M842049L875629j201460k709334O79456K940479J029269j098974
8486A065802q9647J796533J694755N13109m86703k305487m352241l151573J275766
8477d039686K758962k296190p751185n359956L290548Q938953P238245K587680
8469E367371l18156j927616l321689k602929Q39958L198378J507437j279179q41492
8460F22083J323259K66245l986894n813649k490124J730855K224739M09781K10444
$$ plain form
8521 2818938 -1806615 -2579860 -465216 1585687 2589892 3355262 3710911 2252901 -836399
8512 -836399 -2879559 -2174885 -997322 -2953428 -7769364 -10898044 -8715440 -2603984 2509994
8503 2509994 2654412 -1946020 -6859108 -7188682 -2922950 296632 -2035343 -6846139 -7291312
8494 -7291312 -2449263 1426366 224906 -2484428 -1804972 1135507 2164776 1065802
8486 1065802 976155 2772688 4467443 4980552 4493849 2188362 -2163879 -5315452 -4039686
8477 -4039686 -1280724 -3576914 -11328099 -16688055 -13397507 -4458554 2779691 5367371
8469 5367371 5049215 3121599 -200090 -2803019 -1963061 1235317 2742754 1463575 622083
8460 622083 1945342 2211587 -1775307 -7588956 -10079080 -8348225 -6123486 -5713705 -5503261
8451e503261J461317J209628m72959q66909K4212n05833k227752j432175K558772
8442e754960N072611K692000j824563l983438l273555j398342J571694N359969
8434a538584O774931L367291k001375m343265k919677q22611J95609O66290O77655
8425E6264J18284L67473K051401K686922M09269j941168r43667J300173N29045
8416D633996k057833j775270J116392J871963n8159j39926K520306K966110q77877
8407H199702m165508l041354n32519p12440k131826j267933J455459L021007K239934
8398C064522m1346k313496k174332J616094N348951L365469l159813n991137j462436
8389a747524L533843J702592l918343n276876j288395K076663J341495j128508
$$ plain form
8451 -5503261 -4041944 -2832316 -3305275 -4172184 -4147972 -4653805 -6881557 -8313732 -5754960
8442 -5754960 -682349 2009651 185088 -3798350 -7071905 -8470247 -6898553 -1538584
8434 -1538584 5236347 8603638 6602263 2258998 -660679 -1483290 -1287681 -621391 56264
8425 56264 174548 542021 2593422 5280344 5689613 3748445 2804778 4104951 4633996
8416 4633996 2576163 800893 1917285 3789248 3731089 3591163 6111469 9077579 8199702
8407 8199702 4034194 992840 460321 -252119 -2383945 -3651878 -2196419 824588 3064522
8398 3064522 3023176 709680 -1464652 151442 5500393 8865862 5706049 -285088 -1747524
8389 -1747524 1786319 3488911 -429432 -5706308 -6994703 -4918040 -3576545 -4705053
8381d705053k420369k350628j448278K07542J817805K337300K067741J975259
8373b518681K238573K746447L377740K783391m39294m188785m126697l18986J672179
8364A225887j023301l968474k637771M60654O64600j040517p50554J148301J491637
8355d429538N40285O78621R32323j120263l448890j787943K965471N437477L654992
8346C422535Q90723k59347n65177q88734r13089j141545j984900j558873J236482
8337a761925K909511N8379l677501k043323L283950M359939l45303l381764o13139
8328a211176K483597R28050j357808O31542L361357P12996m814866n336606o2189
8319d665103L673820J941775q04290j49074J512905K57752k303671k048646N15767
$$ plain form
8381 -4705053 -7125422 -9476050 -10924328 -10716786 -8898981 -6561681 -4493940 -2518681
8373 -2518681 -280108 2466339 5844079 8627470 8188176 3999391 -127306 -446292 1225887
8364 1225887 202586 -3765888 -6403659 -5943005 -5278405 -6318922 -7069476 -5921175 -4429538
8355 -4429538 -3889253 -3210632 -2278309 -3398572 -6847462 -8635405 -5669934 -232457 3422535
8346 3422535 4313258 4053911 3488734 2600000 1686911 545366 -1439534 -2998407 -1761925
8337 -1761925 1147586 1205965 -2471536 -4514859 -1230909 3129030 2783727 -598037 -1211176
8328 -1211176 1272421 2200471 842663 1474205 4835562 5548558 733692 -4602914 -4665103
8319 -4665103 -991283 950492 146202 -2872 1510033 1767785 -535886 -2584532 -2068765
8310b068765J261403n26863j145750R18911J921477j337617n896430o061572q64370
8301a3799576M941889O709826M229129O05767r58674N12259K808559K370482j288314
8292F131347m264226l470028j124396p66439j136243R77981L542813J605726l335165
8283a838630l827215J863721O058838L153319k108586k740587Q9524P85388j173828
8274B61944k006305r01278l30892q71146r18910k52199K76878R94412J899258
8265a848238J201398j361940k703527j202449L31438R7184J062819M697238O138736
8256F412659J692586l708344l653877n08792n90632l001517k228476J034924J324622
8247c226847j009986m40659L089932L739471K97582j999597r77725r4062n58849
$$ plain form
8310 -2068765 -807362 -1334225 -2479975 -1561064 360413 -977204 -6873634 -12935206 -13799576
8301 -13799576 -8857687 -2147861 2081268 2687035 1728361 2240620 5049179 7419661 6131347
8292 6131347 1867121 -1602907 -2727303 -3493742 -4629985 -3652004 -109191 1496535 -1838630
8283 -1838630 -5665845 -3802124 2256714 5410033 3301447 560860 650384 1435772 261944
8274 261944 -1744361 -2645639 -2976531 -3847677 -4766587 -5018786 -4741908 -3747496 -1848238
8265 -1848238 -646840 -2008780 -4712307 -5914756 -5583318 -5486134 -4423315 273923 6412659
8256 6412659 8105245 4396901 743024 234232 -356400 -3357917 -5586393 -4551469 -3226847
8247 -3226847 -4236833 -4677492 -1587560 2151911 2449493 449896 -527829 -621891 -1180740
8238a180740M38224K505551J747862j082116j015984J319512l6677m591632m503400
8229f399400J498019M463269K31399l087726P32809N043721K183794k913726j483105
8220B69054L717223L352056k444521m513146K45839M541049K301938l465712o297225
8211b293445l979513J061243N001020N065347J543767k163635l153585j825792
8203g44593J18545K081139L125810J343419k572322m345364j938205R42701P40593
8194a248277j94833J687609M075111K186415k875664n176816k578719J155581
8186b969593K774195K948761K682422R94588k195255m312313l205313l7248K212781
8177a106975J961952J42233r97154n1976J948244K439681L40509k551360l745799
$$ plain form
8238 -1180740 -742516 1763035 3510897 2428781 1412797 2732309 2695632 -1896000 -6399400
8229 -6399400 -4901381 -438112 -206713 -3294439 -2561630 2482091 4665885 1752159 269054
8220 269054 3986277 7338333 4893812 380666 626505 5167554 7469492 4003780 -2293445
8211 -2293445 -6272958 -5211715 -210695 4854652 6398419 4234784 1081199 -744593
8203 -744593 -626048 1455091 4580901 5924320 3351998 -993366 -2931571 -1988870 -1248277
8194 -1248277 -1443110 244499 4319610 6506025 3630361 -1546455 -4125174 -2969593
8186 -2969593 -195398 2753363 5435785 6430373 4235118 -77195 -3282508 -3319756 -1106975
8177 -1106975 854977 997210 56 -51920 1896324 4336005 4676514 2125154 -1620645
8168a620645k723807q35514M35113N09704p3336j42440O68360J275294R04150
8159a603121M84040P52854N28959q34849j238381O89244K061770r486k732463
8150a901433j627173J577147J565230j238758j532827J029255J325005j216331
8142b019885j276774J708499J338800l787342n801900n24697M746682L135390
8134b481227p53155M13026M425139M759003J766903l15840k101899n635398p070989
8125f994437k366873L569535L149076j467852j881398K855177N753599L779420
8117F396247Q18308p30984k460451m011796k858724l29426k89190j715862Q830
8108e173048M394627N946140L253845O28305J85827n11531k296431k867094k130532
$$ plain form
8168 -1620645 -4344452 -5179966 -4744853 -4235149 -4308485 -4450925 -3782565 -2507271 -1603121
8159 -1603121 -1119081 -366227 162732 -672117 -1910498 -1221254 840516 831030 -1901433
8150 -1901433 -3528606 -1951459 -386229 -1624987 -3157814 -2128559 -803554 -2019885
8142 -2019885 -3296659 -1588160 -249360 -4036702 -9838602 -10363299 -5616617 -2481227
8134 -2481227 -3234382 -2821356 1603783 6362786 8129689 7813849 5711950 76552 -6994437
8125 -6994437 -9361310 -5791775 -2642699 -4110551 -5991949 -3136772 2616827 6396247
8117 6396247 7214555 6483571 4023120 11324 -2847400 -3176826 -3466016 -5181878 -5173048
8108 -5173048 -778421 5167719 8421564 9049869 9235696 8724165 6427734 3560640 1430108
8099A430108k428697k993601q53208K566370K790465L96343K78916K493509J910016
8090E590221k006335l468843l64121K116272M60634k015941j844426l35293P86017
8081a081815K049660K361145o47639m453608l353932J663071L134909l52176j358132
8072b038517K970521M956329k71919n478501l182392K026824K236298l18731J059703
8063A959615M422859L178809q40187k24167L971518K946734m562934q919558m370456
8054b437767K320682K599791j876280l498206o8819L728146L858364J337259l96484
8045E566686K90729J864690J562911j166557l477100k502705O37633K139721N61252
8036E477260j746877k452380j975182j529097p89716P60674J782541O33725j576796
$$ plain form
8099 1430108 -998589 -3992190 -4845398 -2279028 511437 907780 1186696 3680205 5590221
8090 5590221 3583886 115043 -249078 1867194 2327828 311887 -1532539 -1867832 -1081815
8081 -1081815 967845 3328990 2681351 -1772257 -5126189 -3463118 -328209 -680385 -2038517
8072 -2038517 932004 5888333 5616414 137913 -3044479 -1017655 1218643 899912 1959615
8063 1959615 6382474 9561283 8721096 8496929 12468447 15415181 10852247 1932689 -2437767
8054 -2437767 -117085 2482706 606426 -2891780 -2960599 767547 4625911 5963170 5566686
8045 5566686 5857415 7722105 9285016 8118459 4641359 2138654 2776287 4916008 5477260
8036 5477260 3730383 1278003 -697179 -2226276 -3015992 -2255318 -472777 160948 -1415848
8027a415848j807925N71553K429944J365246l61765P69838L311554K272497k620949
8018D514145n053061j225956L861509L762208K01767p57233Q08365k78340l938913
8009A894491m089070O24806L632692R57716k476787j201599K564057L921501L038867
8000H866674K507060J534620j533764m449498m240220k237679j077209J36470
7992d93546K631210L398154k39620m395183l514836N61592J295277k041936l678176
7983f477064j047659J780529J441921j69147m40890J46053O45645J505549K107356
7974e07707P50927j428379r78298J888893K659471m8881j566212J123111L702401
7965E595326J112510m111918n624263k875980r28563j609862j096623K611772
$$ plain form
8027 -1415848 -3223773 -2652220 -222276 1142970 781205 1551043 4862597 7135094 4514145
8018 4514145 -538916 -1764872 2096637 5858845 6060612 5303379 6111744 5833404 1894491
8009 1894491 -2194579 -1569773 2062919 3020635 543848 -657751 1906306 5827807 8866674
8000 8866674 11373734 12908354 11374590 6925092 2684872 447193 -630016 -493546
7992 -493546 2137664 5535818 5296198 901015 -2613821 -2052229 -756952 -2798888 -6477064
7983 -6477064 -7524723 -5744194 -4302273 -4471420 -4912310 -4766257 -4120612 -2615063 -507707
7974 -507707 243220 -1185159 -2163457 -274564 2384907 2336026 769814 1892925 5595326
7965 5595326 6707836 2595918 -3028345 -5904325 -6832888 -8442750 -9539373 -6927601
7957f927601N388420L107694j809672l796415j876075L1131k97486o63256R13556
7948e929704K581493J974742N09349J217802L651956M330154J953247j094391
7940I194648k748934l451227l446512j500343J698778K259062j559116n233104
7932d786748l290281K593432N243516J729522k932987l211855l20485P93498q21315
7923e003703j283789J567816M390844K862065j997883m662355k087993K599155
7915c615843M498608K969430J086844L73190p79248l280295n058103l995414r11585
7906h712416J960371L627958L858200J931799j885289m864223m202203m75275
7898h761078L067296M238015L425777J949768N64609n90474j764961l037361l326056
$$ plain form
7957 -6927601 -1539181 1568513 -241159 -4037574 -5913649 -5882518 -6180004 -6843260 -5929704
7948 -5929704 -3348211 -1373469 -864120 353682 4005638 8335792 10289039 9194648
7940 9194648 6445714 2994487 -452025 -1952368 -253590 2005472 446356 -4786748
7932 -4786748 -8077029 -5483597 -240081 1489441 -1443546 -4655401 -4975886 -4182388 -5003703
7923 -5003703 -6287492 -4719676 -328832 2533233 535350 -4127005 -6214998 -3615843
7915 -3615843 882765 3852195 4939039 5312229 4532981 1252686 -3805417 -7800831 -8712416
7906 -8712416 -6752045 -3124087 734113 2665912 780623 -4083600 -8285803 -8761078
7898 -8761078 -5693782 -1455767 1970010 3919778 4484387 3893913 2128952 -908409 -4234465
7889d234465j143340K546506L925981R28402l052263k866679J450501M385761
7881A940404J970280l445482o322576l907423J769969O168573N682884N46893
7873D403522m570516m406450J012127N531321L624080k843474o628230l708445
$$ plain form
7889 -4234465 -5377805 -2831299 1094682 2023084 -1029179 -3895858 -2445357 1940404
7881 1940404 3910684 465202 -5857374 -9764797 -7994828 -1826255 3856629 4403522
7873 4403522 -166994 -4573444 -3561317 1970004 5594084 2750610 -3877620 -7586065
$$ [...]
##END NTUPLES=NMR SPECTRUM
##END=
