##TITLE=31Pdec_SR92_V
 d2O, 124 sc
 26.10.2021
##JCAMPDX= 6.0         $$ Bruker NMR JCAMP-DX V2.0
##DATA TYPE= NMR SPECTRUM
##DATA CLASS= NTUPLES
##ORIGIN= UXNMR, Bruker Analytische Messtechnik GmbH
##OWNER= root
$$ XWIN-NMR		Version 3.5
$$ Tue Oct 26 13:40:53 2021 Russian Standard Time (UT+4h)  she@DPX200
##.OBSERVE FREQUENCY= 81.013821
##.OBSERVE NUCLEUS= ^31P
##.ACQUISITION MODE= SIMULTANEOUS
##.ACQUISITION SCHEME= undefined
##.AVERAGES= 124
##.DIGITISER RES= 16
##SPECTROMETER/DATA SYSTEM= spect
##.PULSE SEQUENCE= zgpg30
##.SOLVENT NAME= CDCl3
##.SHIFT REFERENCE= (INTERNAL, CDCl3, 0, 248.564)
##AUDIT TRAIL= $$ (NUMBER, WHEN, WHO, WHERE, WHAT)
$$ ##TITLE= Audit trail, XWIN-NMR		Version 3.5
$$ ##JCAMPDX= 5.01
$$ ##ORIGIN= Bruker BioSpin GmbH
$$ ##OWNER= she
$$ F:/spectra/data/she/nmr/P31/1/pdata/1/auditp.txt
$$ ##AUDIT TRAIL=  $$ (NUMBER, WHEN, WHO, WHERE, WHAT)
(   1,<2021-10-26 13:39:05.93 +0400>,<she>,<DPX200>,
      <continue with go, POWCHK disabled, PULCHK disabled
       configuration hash MD5:
       00 E9 B6 7A A2 85 ED C7 34 08 36 98 17 FE 4E 26
       data hash MD5: 32K
       77 36 F9 B4 4C B3 58 5A BE 92 90 2E BD AA A4 E6>)
(   2,<2021-10-26 13:39:09.46 +0400>,<she>,<DPX200>,
      <Start of raw data processing
       efp BC_mod = 2 LB = 1 FT_mod = 6 PKNL = 1 PHC0 = -8862.505 PHC1 = 139.6693 SI = 64K 
       data hash MD5: 64K
       66 F4 FB 33 01 E8 B0 C9 F9 44 C4 2B F6 05 EA 71>)
(   3,<2021-10-26 13:39:24.48 +0400>,<she>,<DPX200>,
      <pk PHC0 = -2.152022 PHC1 = 0 
       data hash MD5: 64K
       40 D9 06 69 5F 8B F6 05 BB 18 1E 9D 0E 1E DF 24>)
(   4,<2021-10-26 13:39:47.95 +0400>,<she>,<DPX200>,
      <pk PHC0 = -160.5768 PHC1 = 396.8003 
       data hash MD5: 64K
       26 9C 03 FA 72 68 B3 76 DB CC AC 53 AC 16 99 57>)
(   5,<2021-10-26 13:39:51.56 +0400>,<she>,<DPX200>,
      <abs ABSG = 5 
       data hash MD5: 64K
       F2 7B D6 E7 30 14 74 74 7E 48 88 1A E3 2B C7 C3>)
$$ ##END=
$$ 
$$ hash MD5
$$ E7 3E 5E 20 F4 97 3C 08 C9 96 07 A3 CB 54 DD 5D
##$RELAX= 
##$RELAX= 
##$RELAX= 
##$RELAX= 
##$RELAX= 
##$RELAX= 
##$RELAX= 
##$RELAX= 
$$ Bruker specific parameters
$$ --------------------------
##$DU= <F:/spectra>
##$EXPNO= 1
##$NAME= <P31>
##$PROCNO= 1
##$TYPE= <nmr>
##$USER= <she>
##$AMP= (0..31)
100 100 100 100 100 100 100 100 100 100 100 100 100 100 100 100 100 100 
100 100 100 100 100 100 100 100 100 100 100 100 100 100 
##$AQSEQ= 0
##$AQ_mod= 1
##$AUNM= <au_zg>
##$AUTOPOS= <>
##$BF1= 81.014009
##$BF2= 200.13
##$BF3= 200.13
##$BF4= 200.13
##$BF5= 200.13
##$BF6= 200.13
##$BF7= 200.13
##$BF8= 200.13
##$BYTORDA= 1
##$CFDGTYP= 0
##$CFRGTYP= 5
##$CHEMSTR= <none>
##$CNST= (0..31)
1 1 145 1 1 1 1 1 1 1 1 1 1 1 1 1 1 1 1 1 1 1 1 1 1 1 1 1 1 1 1 1 
##$CPDPRG= <waltz16>
##$CPDPRG1= <>
##$CPDPRG2= <waltz16>
##$CPDPRG3= <>
##$CPDPRG4= <mlev>
##$CPDPRG5= <mlev>
##$CPDPRG6= <mlev>
##$CPDPRG7= <mlev>
##$CPDPRG8= <mlev>
##$CPDPRGB= <>
##$CPDPRGT= <>
##$D= (0..31)
0 1 0 0 0 0 0 0 0 0 0 0.03 2e-05 3e-06 0 0 0 0 0 0 0 0 0 0 0 0 0 0 0 0 
$$ [...]
##$SUBNAM3= <"">
##$SUBNAM4= <"">
##$SUBNAM5= <"">
##$SUBNAM6= <"">
##$SUBNAM7= <"">
##$SUBNAM8= <"">
##$SUBNAM9= <"">
##$SW= 501.771253377433
##$SWIBOX= (0..15)
0 1 3 0 0 0 0 0 0 0 0 0 0 0 0 0 
##$SW_h= 40650.406504065
##$TD= 32768
##$TD0= 1
##$TE= 0
##$TE2= 300
##$TE3= 300
##$TEG= 300
##$TL= (0..7)
0 120 53 12 22 120 120 120 
##$TP= (0..7)
150 150 150 150 150 150 150 150 
##$TP07= 0
##$TPNAME0= <>
##$TPNAME1= <>
##$TPNAME2= <>
##$TPNAME3= <>
##$TPNAME4= <>
##$TPNAME5= <>
##$TPNAME6= <>
##$TPNAME7= <>
##$TPOAL= (0..7)
0.5 0.5 0.5 0.5 0.5 0.5 0.5 0.5 
##$TPOFFS= (0..7)
0 0 0 0 0 0 0 0 
##$TUNHIN= 0
##$TUNHOUT= 0
##$TUNXOUT= 0
##$USERA1= <user>
##$USERA2= <user>
##$USERA3= <user>
##$USERA4= <user>
##$USERA5= <user>
##$V9= 5
##$VALIST= <valist>
##$VCLIST= <CCCCCCCCCCCCCCC>
##$VD= 0
##$VDLIST= <DDDDDDDDDDDDDDD>
##$VPLIST= <PPPPPPPPPPPPPPP>
##$VTLIST= <TTTTTTTTTTTTTTT>
##$WBST= 1024
##$WBSW= 4
##$XGAIN= (0..3)
0 0 0 0 
##$XL= 0
##$YL= 0
##$YMAX_a= 5339
##$YMIN_a= -7403
##$ZGOPTNS= <>
##$ZL1= 120
##$ZL2= 120
##$ZL3= 120
##$ZL4= 120
##$ABSF1= 248.5645
##$ABSF2= -253.2056
##$ABSG= 5
##$ABSL= 3
##$ALPHA= 0
##$AQORDER= 0
##$ASSFAC= 0
##$ASSFACI= 0
##$ASSFACX= 0
##$ASSWID= 0
##$AUNMP= <proc_1d>
##$AZFE= 0.1
##$AZFW= 0.5
##$BCFW= 0
##$BC_mod= 2
##$BYTORDP= 0
##$COROFFS= 0
##$CY= -3
##$DATMOD= 1
##$DC= 0
##$DFILT= <>
##$DTYPP= 0
##$F1P= 0
##$F2P= 0
##$FCOR= 1
##$FTSIZE= 65536
##$FT_mod= 6
##$GAMMA= 0
##$GB= 0
##$INTBC= 1
##$INTSCL= 5.30512e-09
##$ISEN= 30
##$LB= 1
##$LEV0= 0
##$LPBIN= 0
##$MAXI= 10000
##$MC2= 0
##$MEAN= 0
##$ME_mod= 0
##$MI= 50
##$NCOEF= 0
##$NC_proc= -7
##$NLEV= 6
##$NOISF1= 182.463
##$NOISF2= 159.3651
##$NSP= 0
##$NTH_PI= 0
##$NZP= 0
##$OFFSET= 248.5645
##$PC= 4
##$PHC0= -9025.234
##$PHC1= 536.4696
##$PH_mod= 1
##$PKNL= yes
##$PPARMOD= 0
##$PSCAL= 0
##$PSIGN= 0
##$REVERSE= no
##$SF= 81.014009
##$SI= 65536
##$SIGF1= 159.3651
##$SIGF2= -187.1042
##$SINO= 113.3802
##$SIOLD= 16384
##$SREGLST= <1H.CDCl3>
##$SSB= 0
##$STSI= 65536
##$STSR= 0
##$SW_p= 40650.406504065
##$SYMM= 0
##$S_DEV= 0
##$TDeff= 32768
##$TDoff= 0
##$TI= <>
##$TILT= no
##$TM1= 0
##$TM2= 0
##$TOPLEV= 0
##$USERP1= <user>
##$USERP2= <user>
##$USERP3= <user>
##$USERP4= <user>
##$USERP5= <user>
##$WDW= 1
##$XDIM= 65536
##$YMAX_p= 279209995
##$YMIN_p= -98344084
$$ End of Bruker specific parameters
$$ ---------------------------------
##NTUPLES= NMR SPECTRUM
##VAR_NAME=  FREQUENCY,     SPECTRUM/REAL,   SPECTRUM/IMAG
##SYMBOL=    X,             R,               I
##VAR_TYPE=  INDEPENDENT,   DEPENDENT,       DEPENDENT
##VAR_FORM=  AFFN,          ASDF,            ASDF
##VAR_DIM=   65536,         65536,           65536
##UNITS=     HZ,            ARBITRARY UNITS, ARBITRARY UNITS
##FACTOR=    0.620285442955139, 1,           1
##FIRST=     20137.2065510759, 0,            0
##LAST=      -20513.1999529892, 0,           0
##MIN=       -20513.1999529892, -98344084,   0
##MAX=       20137.2065510759, 279209995,    0
$$ Real data points
##PAGE= N=1
##DATA TABLE= (X++(R..R)), XYDATA
$$ [...]
##PAGE= N=2
##DATA TABLE= (X++(I..I)), XYDATA
13007e073800N664240K938224k889025m605743j95039N640484P505272M524548
12999A3509161l8629k863222l670927m062166l993590j654058K522050M740647
12991D489266K769623p82459k469470k292918j393844P16938L092335J915382
12983F044853l011133m905336N04367O420220L883163m133846o888631k198383
12975d284726J618141l5290k323881j165800P92528J404093L167681O278492N755784
12966A1207022O7078m533932l030887J146975K334068L81111j864563l392507
12958B314365l523686q47444K853975K923115q82578l143720j541130j72828j068664
12949c088595j85828L800547M871800k89426n231926l624022O19961O61830j933401
$$ y = [-5073800, 590440, 3528664, 639639, -3966104, -4161143, 1479341, 8984613, 13509161, 13470532, 10607310, 6936383, 2874217, -1119373, -2773431, -251381, 4489266, 7258889, 6476430, 4006960, 1714042, 320198, 1037136, 4129471, 6044853, 3033720, -1871616, -1367249, 5052971, 8936134, 4802288, -2086343, -4284726, -2666585, -2701875, -5025756, -6191556, -5399028, -3994935, -827254, 5451238, 11207022, 11274100, 6740168, 3709281, 4856256, 7190324, 7571435, 5706872, 2314365, -1209321, -2056765, 797210, 3720325, 2837747, -305973, -1847103, -2019931, -3088595, -3274423, 526124, 5397924, 5108498, -123428, -3747450, -3127489, -2465659, -4399060]
12940d399060j408740J717800K830369J897355J932067K129608J03959k162293
12932B641065j698437m46464q57565J46026M946934P545598J592873p506864r024282
12923b661116l058351P99899l49689J03375M215669N057932q1301l351812Q98910
12914A573516O209068M146360k449073m430060l76176K428517k66604m011817
12906B823731l013887J655768L995035J095413l691953n617066l995430j201965
12898g950354J581215M292182N058103K122097j449058o39710L079867K773637
12890H867979k557215n283667j518956K245014O22239j197036K396578N916899
12882I491835J913626n099559n960596k745760l689683o164122n27988J0068452
$$ y = [-4399060, -5807800, -4090000, -1259631, 637724, 2569791, 4699399, 4803358, 2641065, 942628, 496164, -361401, -215375, 4731559, 12277157, 13870030, 6363166, -2661116, -5719467, -4919568, -5269257, -5165882, -950213, 4107719, 4026418, 674606, 1573516, 7782584, 11928944, 9479871, 5049811, 4673635, 7102152, 6835548, 2823731, -190156, 1465612, 5460647, 6556060, 2864107, -2752959, -6748389, -7950354, -6369139, -2076957, 2981146, 5103243, 3654185, 3014475, 6094342, 8867979, 6310764, 1027097, -491859, 1753155, 2375394, 1178358, 3574936, 9491835, 11405461, 6305902, 345306, -2400454, -6090137, -12254259, -12782247, -2713795]
12874b713795J0816170r01701r204388l570056N695947M838924k874144n265301
12866c178344p83160K200935L56014j650465r33394J45743j57198n14650K4010
12857d490509Q98735J909896K737421J799337j396475m339096m594805k999341
12849a0474837j550278l12450J341167K541952K124761M85753q66934k28535L272981
12840c666420P141626N913991j533393p373990m069996L576946M155388l189646
12832I54506p556119l463877K098586L165399L454464N767978M475707l074171
12824E822473q212587m225799J202815j537269o996662l661209N737661P878144
12816c992433N10418m400598j62403N451645M020669j613790m285028l039898
$$ y = [-2713795, 8102375, 7200674, -2003714, -5573770, 122177, 4961101, 2086957, -3178344, -3961504, -1760569, -1404555, -3055020, -3988414, -3842671, -3999869, -4514519, -4490509, -3591774, -1681878, 1055543, 2854880, 1458405, -2880691, -7475496, -10474837, -12025115, -12337565, -10996398, -8454446, -6329685, -5843932, -6710866, -6939401, -3666420, 3475206, 9389197, 7855804, 481814, -3588182, -11236, 4144152, 954506, -6601613, -10065490, -7966904, -4801505, -1347041, 4420937, 8896644, 5822473, -2390114, -6615913, -5413098, -6950367, -13947029, -17608238, -11870577, -3992433, -3482015, -7882613, -8045016, -2593371, 1427298, -186492, -4471520, -7511418]
12808g511418j495062j355676j879152j979406l21474L381280O174937M723510
12800b62461O54962j173964K38689J338218L77927n19737p196O09022N75132L96273
12790B226865n80764k890286l990184j546519J419432M51707k413970j453837
12782h777556K709931L693609L11735j385713J401584M075258L592844L270331
12774H892023M877443L971073j717338o272904m101087J164060K527674j39257
12766I201687k007364j747435j776551k594393k681519k342940k679334k242417
12758h870266P93524M483749N205258K685048n16897k988052m595559m454297
12750h257492k262273m3264O48735J397451L673071N253882L521778O9842j843318
$$ y = [-7511418, -9006480, -10362156, -12241308, -14220714, -14542188, -11160908, -4985971, -262461, 392501, -781463, -542774, 795444, 1173371, 653634, 646438, 1255460, 1830592, 2226865, 1646101, -1244185, -5234369, -6780888, -5361456, -4909749, -7323719, -8777556, -6067625, -2374016, -2062281, -3447994, -2046410, 2028848, 5621692, 8892023, 13769466, 17740539, 16023201, 9750297, 5649210, 6813270, 9340944, 9201687, 7194323, 5446888, 3670337, 1075944, -1605575, -3948515, -6627849, -8870266, -8076742, -3592993, 1612265, 4297313, 3780416, 792364, -3803195, -8257492, -10519765, -10563029, -9914294, -8516843, -4843772, 410110, 3931888, 4001730, 2158412]
12741B158412k196330k529940j916553O14230K048086n32362l675620j816505
12733g846582L174543L877180q54080l534834J72957M467191K497656l159656
12725a205625m754123o48109L506024L457942Q84613r57614j611484j895485j206051
12716d429912J106861L094799J678128k891265o114573m317280N67217L473131
12708g832894K893172K043823K896365K938488J94846k237247p82549K051692
12700B165696R18037l649431n391121j688792K598957K489653m82356j594973
12692d634330N57066L634193N097539L843609L81468k800654l025338p98921Q77055
12683C131687J079320J428986J487048j256842n028272l556923L879971Q319182
$$ y = [2158412, -37918, -2567858, -4484411, -3870181, -1822095, -2354457, -6030077, -7846582, -4672039, -794859, -1648939, -5183773, -5010816, -543625, 1954031, -1205625, -5959748, -6607857, -3101833, 356109, 1240722, 283108, -1328376, -3223861, -4429912, -3323051, -228252, 1449876, -1441389, -7555962, -11873242, -11306025, -7832894, -4939722, -2895899, 466, 2938954, 3133800, 896553, 114004, 2165696, 3083733, -565698, -5956819, -7645611, -5046654, -2557001, -3039357, -4634330, -4077264, -443071, 4654468, 8498077, 8879545, 6078891, 3053553, 2254632, 3131687, 4211007, 5639993, 7127041, 5870199, 841927, -2714996, 1164975, 9484157]
12675I484157L080550n253677n652479J124042M281792l29986n051438l305338
12667a622377J292080K318828M5860r49977J131821M426744O012145L160163l853507
12658A1961780q775915m974518L931948O190084j639112q317325m153092M247357
12650a528793M558805k099580m272237N79456K889410k036574o198030k500004
12642a0607547L976916M916131J390323j74910M58550j725019o622813p518371
12634a5906740r15534P757674J0598571O314892O77689p57839J414425K048855
12626A1231993j777953o971832q326326m886039k76474K392831K930016J731818
12618c951966j072632l352024j819183K963287N826780L572064o08444j710461
$$ y = [9484157, 12564707, 7311030, 1658551, 2782593, 7064385, 6734399, 1682961, -1622377, -330297, 1988531, 2034391, 1084414, 2216235, 6642979, 12655124, 15815287, 11961780, 3185865, -1788653, 2143295, 8333379, 6694267, -1623058, -5776150, -1528793, 3030012, 930432, -3341805, -2762349, 127061, -1909513, -8107543, -10607547, -6630631, -1714500, -324177, -499087, -40537, -1765556, -8388369, -15906740, -16822274, -9064600, 1533971, 7848863, 8526552, 7768713, 9183138, 11231993, 9454040, 2482208, -5844118, -10730157, -11006631, -8613800, -5683784, -3951966, -5024598, -8376622, -10195805, -7232518, -1405738, 2166326, 1557882, -152579]
12610a52579P46908L466425L913860J572078k748253o133357m836077N96122M262730
12601F87857K413027j143905j412671m41919k958925o466251l986858L474683
12593i834962O187537J59304n864747l035345M622129O861020K285461j412961
12585c2564k41538J585572N06194q71790J11395J017378n04515j384091J826273
12576B012314N964252M932439j426876p373171r065235p148844k533355M181552
12568a0456924Q750847N705713k851942p180048k338643M865361N873722J923035
12560D291121l18524Q7741q05441k815949j953368J193775J701181o35915n26297
12551B18324L065433M338425N57532l039244k173865l94085j934068l863737j582493
$$ y = [-152579, 594329, 4060754, 7974614, 9546692, 6798439, 665082, -4170995, -3574873, 687857, 3100884, 1956979, 544308, 102389, -2856536, -9322787, -13309645, -9834962, -3647425, -3488121, -9352868, -12388213, -7766084, -905064, 1380397, -32564, -274102, 1311470, 1817664, 945874, 1057269, 2074647, 1570132, 186041, 2012314, 7976566, 12909005, 11482129, 4108958, -4956277, -12105121, -14638476, -10456924, -1706077, 3999636, 1147694, -6032354, -8370997, -3505636, 2368086, 4291121, 3972597, 4060338, 3254897, 438948, -1514420, -320645, 1380536, 744621, 218324, 3283757, 7622182, 8179714, 5140470, 2966605, 2572520, 638452, -3225285, -4807778]
12542d807778K625033L316764Q87527N4294J419380J161966j680847l651491k717623
12533c392775o54663Q11734J919196K464738J401567m60464o45901J357363L220703
12524F021498K852539K56176l293439n713064m692904n59658K445005R40136k419790
12515d163501k178948K063138N126376L802514P64598k81366K94024j51085k076392
12506C199358l359498k322869K67023J989134J250867r31986k283646k459946
12498d651563l053959l867510k298153J636306L368830M75660k230566N18785
12490a0102170N403692M933225n58755l114869J83818K879662L4566m185754m250428
12481h777013j958066j506710j252194K364914O267272M307395j924560m070495
$$ y = [-4807778, -2182745, 1134019, 2021546, 2075840, 3495220, 4657186, 2976339, -675152, -3392775, -4047438, -3235704, -1316508, 1148230, 2549797, 2089333, 1443432, 2800795, 6021498, 8874037, 9130213, 5836774, 123710, -4569194, -5128852, -2683847, -1743711, -4163501, -6342449, -4279311, 847065, 4649579, 5414177, 5132811, 5426835, 5275750, 3199358, -160140, -2483009, -2215986, -226852, 1024015, 92029, -2191617, -4651563, -7705522, -11573032, -13871185, -12234879, -8866049, -8390389, -10620955, -10102170, -4698478, 234747, -324008, -3438877, -3255059, -375397, -340831, -4526585, -8777013, -10735079, -12241789, -13493983, -11129069, -4861797, -554402, -2478962, -6549457]
12473f549457M53391M668124L374324R26290K756717N247481J507808o042107
12465F342571p621847q08678N084488K517855l472031l505485K220804N418370
12457F176047K526459j615124k710273k351962k710353k187881N04063K698999
12449C29975J637204j433273l723318m293073k881372Q75371M720513M424888
12441c43085k5783l122509j760029K29945q46667k193991l09233J896026J65081
12432f310245k945018k032294K056887M239865L733586L254140K120917j732228
12424B385610m683496j292048N424223O741227J535048k505822k012877k260535
12416C331330n706933o429680r19674M620315M132654J275881J954875L639582
$$ y = [-6549457, -6096066, -1427942, 1946382, 2872672, 5629389, 10876870, 12384678, 6342571, -1279276, -2087954, 2996534, 5514389, 2042358, -1463127, 757677, 6176047, 8702506, 7087382, 4377109, 2025147, -685206, -2873087, -2369024, 329975, 1967179, 533906, -3189412, -7482485, -10363857, -9488486, -4767973, -343085, -368868, -3491377, -5251406, -5021461, -5868128, -8062119, -8371352, -6475326, -6310245, -9255263, -11287557, -9230670, -4990805, -1257219, 1996921, 4117838, 2385610, -2297886, -3589934, 1834289, 8575516, 10110564, 7604742, 5591865, 3331330, -2375603, -8805283, -9724957, -5104642, -971988, 303893, 2258768, 5898350]
12408E898350M25974n541233o384340n32964N045419M592723k63294m531987n459460
12399f750812l274811K44182K863439L400273K564521J497508K74166j232268
12391d13802k283503k204405j249432J30024J528234J907139O01344r35434p26953
12382c646788M79876L79792p32612m69511J084813J386911K00896j08639N93238
12373h32024N5157j113471K85640L357448K960569j697045m734733k745568J50866
12364d313161o1237j089159j06018O51319p12167p88127K677638M957153J736469
12355B952710k639640j755555K274244K810128o4250q75993Q15713K38595k913033
12346H42919l163720J348471N476538M899442J454562j195007k240035k281975
$$ y = [5898350, 6324324, 783091, -5601249, -6134213, -1088794, 3503929, 3240635, -1291352, -6750812, -10025623, -9781441, -6918002, -3517729, -953208, 544300, 818466, -413802, -2697305, -4901710, -6151142, -6021118, -4492884, -2585745, -1984401, -2919835, -3646788, -3166912, -2787120, -3519732, -3989243, -2904430, -1517519, -1316623, -1425262, -832024, -776867, -1890338, -1604698, 1752750, 4713319, 3016274, -1718459, -4464027, -4313161, -4374398, -5463557, -5569575, -4918256, -5630423, -6418550, -3740912, 1216241, 2952710, 313070, -1442485, 831759, 3641887, 3577637, 2701644, 3517357, 3755952, 842919, -2320801, -972330, 4504208, 9403650, 10858212, 9663205, 7423170, 5141195]
12338E141195j342721M3538Q39373J357887K370847K618210M48858k541360l166493
12329E769334j614846j013546k214174k797865j436455K45041N44310m23904j800983
12320d743088k569277j517380J099114K712284J447878j205300k622900k097467
12312i496136j4743L072711M698533K045927k195788j163891N072894O715917
12304H735424j069803q090435l378594O721828P234761k379935q161589m116341
12296d504684L53805j511686l088029J620272N884133J773121n487529n368022
12288a0328619J605827N680269K945609p68119k75298K339764K454751q31866
12280B822318m526642n189294k094703J910246L417324K592577K301907L158640
$$ y = [5141195, 3798474, 3842012, 4681385, 6039272, 8410119, 11028329, 11477187, 8935827, 5769334, 4154488, 3140942, 926768, -1871097, -3307552, -3062511, -2518201, -2942105, -4743088, -7312365, -8829745, -7730631, -5018347, -3570469, -4775769, -7398669, -9496136, -9510879, -6438168, -1739635, 306292, -1889496, -3053387, 2019507, 8735424, 7665621, -424814, -3803408, 2918420, 10153181, 7773246, -388343, -4504684, -4150879, -5662565, -8750594, -7130322, -1246189, 526932, -4960597, -10328619, -8722792, -3042523, -96914, -865033, -1140331, 1199433, 3654184, 2822318, -1704324, -6893618, -8988321, -7078075, -3660751, -1068174, 1233733, 4392373]
12272D392373K784007L95990j857639k865226l485846k906612O35505M500653
12264A593205L323213j980089l720652R59005N048863K491282k921036m864489
12256g0698m089141m137031l340732J220153O176607O074654J962399j215302
12248B580909k560442l654064k772970J436081L912398k67956n870618l750087
12240a0946749M403313P985583L942094K48980J351803J559408k862779n644681
12232C6972j261240M693002L883354j923689m520717j839644R50426O89466o07481
12223A00449r82358p99806Q8178K218120L437771Q01974l860326m826134l06484
12214d128616M454813L895290r93094m778531m474041j788516M19371J405298
$$ y = [4392373, 7176380, 7572370, 5714731, 2849505, -636341, -3542953, -2907448, 1593205, 4916418, 2936329, -784323, 174682, 5223545, 7714827, 4793791, -70698, -4159839, -8296870, -11637602, -10417449, -4240842, 1833812, 3796211, 2580909, 20467, -3633597, -6406567, -4970486, -1058088, -1326044, -7196662, -10946749, -6543436, 1442147, 5384241, 5633221, 6985024, 8544432, 5681653, 36972, -1224268, 3468734, 7352088, 5428399, 907682, -931962, 18464, 707930, 100449, -881909, -1681715, -1593537, 624583, 4062354, 4864328, 1004002, -3822132, -4128616, 326197, 4221487, 3228393, -1550138, -6024179, -7812695, -7393324, -5988026]
12206e988026K043097K766066K929031J766141n28058k631906l010355j328874
12198c982884R63561J928151J214248K06673k05294p81034j796341j393088J457734
12189b388274L559110J007811l845442l942229K084704O368116K668288m028188
12181A483896m799003j20745J843880j220077k748470J008307M694000K778245
12173B920033k167624m691102m283363l076856p85221K554386L220361o59798
12165f969184l881856j083528M198562M689157J138574M96710L412816L035132
12157E036383k432064n425678j081175M548807L843027j194731l450850j708593
12149a864874l95034j393571k692190l431164m205140l401315Q47414N437111
$$ y = [-5988026, -3944929, -1178863, 1750168, 3516309, 2988251, 356345, -2654010, -3982884, -3019323, -1091172, 123076, 329749, 124455, -656579, -2452920, -3846008, -2388274, 1170836, 2178647, -1666795, -5609024, -3524320, 2843796, 5512084, 1483896, -3315107, -3435852, -1591972, -2812049, -5560519, -4552212, 141788, 2920033, 752409, -3938693, -8222056, -11298912, -12084133, -9529747, -6309386, -6969184, -10851040, -11934568, -7736006, -3046849, -1908275, -1411565, 2001251, 5036383, 2604319, -2821359, -3902534, 646273, 4489300, 3294569, -156281, -1864874, -2259908, -3653479, -6345669, -9776833, -13981973, -17383288, -16535874, -11098763]
12141a1098763M937705Q5017k008307K150993P217164O508245Q17953l664650
12133D945357l684840j553073m50255l19126R06016L603200N225510L077676j915931
12124I834534n290546l774286Q58584L858141K723386r02832l680772l384946
12116B41263k12802K980230K779714o30249k872770j224445R96428n41836l643656
12107b128123k213624M000821P973815M977461j464923n267389m904507k294744
12099a321213J201286M244766M233829L19922m186038n365816l156316j99635
12091d229215J795389K469710J660559N6260o47039N6149Q01727Q71227J038027
12082C872794J162367J03829j116921Q802K501129K253621j029252k692557j146263
$$ y = [-11098763, -6161058, -6076041, -8084348, -5933355, 1283809, 7792054, 8610007, 4945357, 1260517, -292556, -742811, -1061937, -155921, 3447279, 8672789, 11750465, 9834534, 4543988, 769702, 1628286, 5486427, 8209813, 7306981, 3626209, 241263, 28461, 3008691, 5788405, 5158156, 2285386, 1060941, 2057369, 1515533, -2128123, -4341747, -340926, 7632889, 12610350, 11145427, 5878038, 973531, -1321213, -119927, 4124839, 8358668, 8678590, 4492552, -873264, -4029580, -4229215, -2433826, 35884, 1696443, 1752703, 1105664, 1161813, 1963540, 2834767, 3872794, 5035161, 5138990, 4022069, 4030871, 6532000, 8785621, 7756369, 5063812, 3917549]
12073C917549o33948k685289k181937K798369M932290q43383o716721k902106
12065d315176O007941P224438m98014n681025k477460K008978J068584k026894
12057A311372k070776m51833m80079j170921n86113K0984o82348j438546j451590
12048f999850j445841l16343L547778O731206L824982k682398m035130J009539
12040c66057L586102m88869l842141j135838J297445k327645n473901m72061O756064
12031b466901N637158j263470k674684K647842N076627Q97205k897647j542037
12023C414093J188221J567133Q65548k87116l212379n109081j149194N360030
12015B637255M936933l025596p531733k556307M016147L855507N93847J058207
$$ y = [3917549, 3283601, 598312, -1583625, 1214744, 6147034, 5303651, -1413070, -4315176, 1692765, 8917203, 8419189, 2738164, 260704, 2269682, 3338266, 1311372, -759404, -1211237, -1691316, -2862237, -3448350, -3427366, -4109714, -5548260, -6999850, -8445691, -8762034, -5214256, 1516950, 5341932, 2659534, -1375596, -366057, 3220045, 2731176, -1110965, -2246803, -949358, -3277003, -8750904, -9222965, -2466901, 3170257, 1906787, -767897, 1879945, 6956572, 7853777, 4956130, 3414093, 4602314, 6169447, 7034995, 6747879, 3535500, -1573581, -2722775, 2637255, 7574188, 4548592, -2983141, -5539448, -1523301, 2332206, 2926053, 3984260]
12007C984260K921257N20038l708115l599435l73884K63796j402437q76009J122009
11998a148520M05838j604350k07442K561121M06710m993467m956061J649361N662071
11989b224739K596275l51471K555383N475456J481807n105793n906440j953690
11981c433212l88720j833660r84856K470092L450218J545184J985710N364902
11973H175658N232211j189889p389155o581734o15762L992941M293236J621695
11965G539201j881793m089478l476517j488696j131192j678046O82833N195374
11957c28314N557169l6647m252644j240935L899344L023076k384177m369938j278676
11948a411742J119903j4024j310973m75812M79686K93043L99245P53461m98235
$$ y = [3984260, 6905517, 7425555, 3717440, 118005, -255879, 7917, -1394520, -2270529, -1148520, -742682, -2347032, -2554474, 6647, 413357, -4580110, -9536171, -7886810, -2224739, 371536, 20065, 2575448, 8050904, 9532711, 4426918, -1479522, -3433212, -3821932, -5655592, -6640448, -4170356, -720138, 825046, 2810756, 8175658, 13407869, 12217980, 4828825, -1752909, -2368671, 1624270, 5917506, 7539201, 5657408, 1567930, -1908587, -3397283, -4528475, -6206521, -5523688, -328314, 5228855, 5192208, 939564, -301371, 3597973, 6621049, 4236872, -133066, -1411742, -291839, -305863, -1616836, -2092648, -1612962, -1319919, -920674, -167213, -665448]
11939f65448k310386j488100J063023R46761j862089k405532L39660J060105k466303
11930g788309m631144j092254L671478L494226K01004j97783K476176L046926
11922h19680q0278k633568j318700J837789L167128K201537J279575J813061K376087
11913G822951Q03523k257374l489975j633390J52776q28780k070640j87962K327803
11904F38932O59267l396475l393402Q54766K558657m03223j972222Q31713K246380
11895a375607j524706m517792q12410N162371N954570K688479J139767J378609
11887H093281j02881k217936j936722j411741l662998m646868Q23364Q013993
11879B951492P428500m14292n677069m230917j667767j788495j507199P76409
$$ y = [-665448, -2975834, -4463934, -3400911, -2454150, -4316239, -6721771, -6382111, -5322006, -7788309, -12419453, -13511707, -9840229, -6346003, -6144999, -6342782, -3866606, -819680, -899958, -3533526, -4852226, -3014437, 152691, 2354228, 3633803, 5446864, 7822951, 8626474, 6369100, 2879125, 1245735, 1398511, 569731, -1500909, -1688871, 638932, 1298199, -2098276, -5491678, -4636912, -2078255, -2481478, -4453700, -3621987, -1375607, -2900313, -7418105, -8230515, -3068144, 2886426, 5574905, 6714672, 8093281, 7990400, 5772464, 3835742, 2424001, -1238997, -5885865, -5062501, 2951492, 10379992, 9965700, 4288631, 57714, -1610053, -3398548, -4905747, -4129338]
11871d129338J438712p07079j530169N05771J392703m34360q55764J932760L649548
11862A262784J643007p88386j207751j860602l158787j196648L886229N125181
11854C705027k48042m812850k409311J910203R84943k277705r12086L316556L237762
11845B494497q92537k044410J357693L300136O22444k606076k479146l26462J063507
11836D89646Q07185j408107m907552n823823q00999O281869P005612l70091p496977
11827f223237o271540J476861P327913O294068R30205k760179j663068J520744
11819F31767J590660k198801m414826j062003L798892L655771l15762j125042
11811E60656K528241M058425l3661m312991l206419O00777J462185n05795j522517
$$ y = [-4129338, -2690626, -3397705, -4927874, -4422103, -3029400, -3463760, -4319524, -2386764, 1262784, 2905791, 2117405, 909654, -950948, -4109735, -5306383, -1420154, 3705027, 3456985, -1355865, -3765176, -1854973, -870030, -3147735, -4059821, -743265, 2494497, 1601960, -442450, 915243, 4215379, 4837823, 2231747, -247399, -573861, 489646, 1296831, -111276, -5018828, -10842651, -11643650, -5361781, 1643831, 1273740, -6223237, -12494777, -11017916, -3690003, 2604065, 3534270, 774091, -888977, 631767, 2222427, 23626, -4391200, -5453203, -1654311, 2001460, 1685698, 560656, 3088897, 7147322, 7113661, 2800670, -405749, 195028, 1657213, 1151418, -371099]
11802c71099j144618j302446j140200J096078K878689M21341l893766l504492
11794f960513K372923O751721M544307r48430l663262k537132o39427M2651l32525
11785a369687j254254j774001m78806J919713J964309j736119m922761k453111
11777a0104717M237094Q077027N010340j320953m464617k512429P66820J043864
11769G32429j543029k768952J42608M133696L544839j867342n281234j497477
11761d404462N502668P451668K554348l063701m064087j423677J196850K179138
11753E928745J689103M16170O9441J877219L493874J114851m082212o030841k428114
11744B048236J385956M38116k513062k125478P57754J062218k035496m258520
$$ y = [-371099, -1515717, -2818163, -3958363, -2862285, 16404, 437745, -3456021, -6960513, -4587590, 2164131, 6708438, 5760008, 2096746, -440386, -1079813, -1037162, -1369687, -2623941, -4397942, -4876748, -2957035, -992726, -2728845, -7651606, -10104717, -5867623, 2209404, 7219744, 5898791, 1434174, -1078255, -311435, 732429, -810600, -3579552, -3436944, 696752, 4241591, 2374249, -2906985, -4404462, 1098206, 8549874, 11104222, 8040521, 3976434, 2552757, 3749607, 5928745, 7617848, 8034018, 8103459, 9980678, 13474552, 14589403, 10507191, 4476350, 2048236, 3434192, 3872308, 1359246, -766232, -8478, 1053740, -981756, -5240276]
11736e240276k970846K23790L180532M945075M105800j3534m417155n039870k524482
11727g750966j075821j338991M96606N231906P641827L952484j813037k984647
11719B359361O98288L288599J093906k686952k717602J174419L452444Q512n641802
11710A029173n919322N63447N876045K914494m358386n969524J20196N489407
11702b54470L593344j763047l435400j070020O09380R8174O1710J383174J569001
11693G91846m90033k315525j731651n3626K24966r93685j801443j142119K31941
11684g279329J202406J419732J032785M04960M39359K049807M346816M393421
11676H009957O40725l829325m127066k01575K360532n81l395821k088943K671277
$$ y = [-5240276, -8211122, -7987332, -4806800, 138275, 4244075, 4230541, -186614, -5226484, -7750966, -8826787, -10165778, -9669172, -4437266, 3204561, 7157045, 5344008, 2359361, 3057649, 6346248, 7440154, 4753202, 2035600, 3210019, 6662463, 6670975, 1029173, -4890149, -4326702, 1549343, 4463837, 105451, -5864073, -5743877, -254470, 3338874, 1575827, -1859573, -2929593, -2320213, -2222039, -2160329, -777155, 791846, 301813, -2013712, -3745363, -3798989, -3574023, -4567708, -6369151, -7511270, -7279329, -6076923, -4657191, -3624406, -3219446, -2780087, -730280, 3616536, 8009957, 8650682, 4821357, 694291, 492716, 2853248, 2852667, -543154, -2632097, 39180]
11667C9180M070759l94023n206603m429605O92270M127566K753799q91017k606972
11658a844646j265774O24430L59963j402979j358537J719619M563032L577245
11650D972353P7016j548606l35398J67967k003110l659265j289552K962043L460127
11641B803575j150052n338485l445258K590267N186409J237221l197685j256865
11633b570873M571050N981203J280420k701086k019968j015128k991915l689723
11625c156020J00044K951456j95513l977064j198872L985372K850249k098052
11617g38400j288011M091903L202068m825642p815407r41067M819298J272361
11609b222897l855605j406534L910999L659702P45261K104490M682246J809300
$$ y = [39180, 4109939, 3715916, -1490687, -5920292, -5228022, -1100456, 1653343, 762326, -1844646, -3110420, -2485990, -2126027, -3529006, -4887543, -3167924, 1395108, 4972353, 5049369, 3500763, 3165365, 3333332, 1330222, -2329043, -3618595, -656552, 2803575, 1653523, -3684962, -7130220, -4539953, 646456, 1883677, -1314008, -2570873, 2000177, 7981380, 9261800, 6560714, 4540746, 3525618, 533703, -3156020, -3055976, -104520, -300033, -4277097, -5475969, -1490597, 1359652, -738400, -2026411, 2065492, 5267560, 441918, -7373489, -8314556, -3495258, -2222897, -6078502, -7485036, -3574037, 85665, 830926, 2935416, 7617662, 9426962]
11601I426962k839855j385594K660880p83446j0055843j2460535l854902N488658
11593a3803675P041731M492375M214004N178996L473630n22187m246138o733109
11585i04373o846023k946360K764566M713326J602958j245159J32712K865961
11577A37608K704432L67730j028093j147311j442213j694774q10193O32855J016588
11568a263371j78026j961097k414804K02634M933801P323543M163390j352506
11560I453564k857322O72645L529350J246266l650977n410134k076521K644022
11552C550893L420996q77389n013178l086906K790731L969580j919195n790585
11544b955053n82854O508137M592958l122162m369864J761550L681554k468048
$$ y = [9426962, 6587107, 5201513, 7862393, 7078947, -2976896, -15437431, -19292333, -13803675, -6761944, -2269569, 1944435, 7123431, 10597061, 10074874, 5828736, -904373, -7750396, -10696756, -7932190, -3218864, -1615906, -2861065, -2728353, 137608, 2842040, 3209770, 2181677, 1034366, -407847, -2102621, -2912814, -2279959, -1263371, -1441397, -3402494, -5817298, -5614664, -680863, 6642680, 10806070, 9453564, 6596242, 7268887, 10798237, 12044503, 8393526, 2983392, 906871, 3550893, 6971889, 6094500, 1081322, -2005584, 785147, 4754727, 2835532, -2955053, -3537907, 2970230, 7563188, 4441026, 71162, 1832712, 5514266, 3046218]
11536C046218o404761k079428K033314j133386m154629J168522P811891M555423
11528D843164m406427n309547L341774Q777507L622538m645738o149480r62059
11520h88268M271649N226693K337410j190788k085230o32987r75759m642453o459793
11511e039526j888577M596090N164231L82692k323184n29515J086704M1681j027118
11502D63478j153990k352299l201507K12470N424398M798395j845725n239684
11494b894464j087430L054704O45213l353677j975347J969564K154692P1121P13999
11485g01625K191347l40374m041396k094212L873990N362471P45967k352287K42030
11476B885911L115271O24105m860626p430487n030362J73229M364302L673893
$$ y = [3046218, -3358543, -5437971, -3404657, -4538043, -8692672, -7524150, 287741, 4843164, 436737, -4872810, -1531036, 7246471, 10869009, 6223271, 73791, -888268, 3383381, 8610074, 10947484, 9756696, 7671466, 7038479, 6062720, 1420267, -5039526, -6928103, -2332013, 2832218, 3214910, 891726, 362211, 1448915, 1490596, 463478, -690512, -3042811, -6244318, -6031848, -607450, 4190945, 2345220, -2894464, -3981894, -927190, -281977, -3635654, -5611001, -3641437, -1486745, -1415624, -701625, 1489722, 1149348, -2892048, -4986260, -1112270, 4250201, 4996168, 2643881, 2885911, 6001182, 6625287, 1764661, -5665826, -10696188, -10522959, -6158657, -2484764]
11468b484764k018488o188558k276337O019862P900082P30424n460419k435689
11460f213887M588768N347213j086067o767370o067938m71718N267871O841962
11452A438834K666048l301851l887343K046074O396462K833278l275393k724656
11444B191453L294878N346957N37403m072326l562473j766255k873655m089302
11436d993320j333479L204937M323577J310718k074231k930295j229943J621138
11428b100898L478616K348841j064678l128526j509361J752080L018109J530778
11420D324961l58916l11936J704278L341725J895022k322877n180064l474612
11412c82419L42227J391877m37089r44947P74380P07017k637501m869067k760293
$$ y = [-2484764, -4503252, -10691810, -12968147, -6948285, 951797, 1682221, -3778198, -6213887, -1625119, 3722094, 2636027, -4131343, -10199281, -10670999, -5403128, 1438834, 4104882, 803031, -3084312, -1038238, 5358224, 8191502, 4916109, 2191453, 5486331, 10833288, 11370691, 7298365, 3735892, 1969637, -904018, -4993320, -6326799, -3121862, 1201715, 2512433, 438202, -2492093, -3722036, -2100898, 1377718, 3726559, 2661881, -466645, -1976006, -223926, 2794183, 4324961, 3966045, 3654109, 5358387, 8700112, 10595134, 8272257, 3092193, -382419, -40192, 1351685, 914596, -30351, 744029, 1451046, -1186455, -6055522, -8815815]
11403h815815N11029J018682L33601J445648K574691P50079j515785L52626M428146
11394A082902L920363k226290o523570k916256M911155Q273033M102293k076718
11386H546912l243251R71991M165953J154251n248304p551905l356325J669692
11378b890986J884237j005480j676117Q44702K997602K640793J015165m03672
11370C406244j332989j389341n23895k73254j704127k859754j250003J916886
11362d010233L142557J573276n69815j624222j311783Q81553M261089M964488
11354G306910K11407n831680n688754J158228O750262N079375o62231l681584
11346D641933k286758J75391R39923r9842k027551l516740k828229M25264M048766
$$ y = [-8815815, -8304786, -7286104, -6952503, -5506855, -2932164, -2182085, -3697870, -3345244, 1082902, 5003265, 2776975, -3746595, -6662851, -1751696, 6521337, 10623630, 8546912, 5303661, 6275652, 10441605, 11595856, 6347552, -1204353, -4560678, -2890986, -1006749, -2012229, -3688346, -2843644, 153958, 2794751, 3809916, 3406244, 2073255, 683914, 160019, -113235, -1817362, -4677116, -5927119, -4010233, -867676, 705600, 135785, -1488437, -2800220, -1918667, 2342422, 7306910, 7518317, 1686637, -4002117, -2843889, 3906373, 8985748, 8323517, 4641933, 2355175, 2530566, 3470489, 3370647, 1343096, -2173644, -5001873, -4576609, -527843]
11337e27843N288023L501044R8713k966955l960935k204754P67733K149177Q10427
11328B954630j765680l723781m306371k907445Q41458N041895O062662K805492
11320E002860j428098k959646j815445p8565J704856L722144L975843p6759o566747
11311A480443r221631m388104L700423P160094L559321j641136k384728P03380
11303a031938K470855R37510p43466j13745O67504j179754l909003l266054J352710
11294d815381N537581M852316k99660m965642m398344Q81422M887498K644146
11286D323936l295717n555435j519001L517655M137929J442033p15685j732454
11278F03261k580859k016904O51608K044344p77574m594847m082708L92507M170924
$$ y = [-527843, 4760180, 8261224, 8359937, 5392982, 1432047, -772707, -4974, 2144203, 2954630, 1188950, -2534831, -6841202, -9748647, -8907189, -3865294, 2197368, 5002860, 3574762, 615116, -1200329, -1278894, 425962, 4148106, 8123949, 8047190, 1480443, -7741188, -12129292, -8428869, -1268775, 2290546, 649410, -1735318, -1031938, 1438917, 2376427, 1632961, 1519216, 2186720, 1006966, -2902037, -6168091, -4815381, 722200, 5574516, 5274856, 309214, -4089130, -3207708, 1679790, 4323936, 1028219, -4527216, -6046217, -2528562, 1609367, 3051400, 2335715, 603261, -1977598, -3994502, -3342894, -1298550, -2076124, -6670971, -10753679, -10361172, -6190248]
11269f190248N366073N111329L122643q05142l128196j230633M94187k904219
11261a64206o676771k385380O794529Q307098o22321p849223m448650L089968
11253c954956M824425J481865r23105j880055l143965j958374L180692N897726
11245C524253P94852n808021m161162L396933N898019Q21857l254119j258510
11237d5898J659162M03897k144382j484847J102096J984733J223240J027652J292258
11228E017911J23054k776485n283272m677741k44348M738049M994026l36477n152735
11219c598018l744903J350330L430260J559184L57367J011998o5126k908895k229241
11210d837044L133191O187370J949731m131498l738385K355193O166379M055811
$$ y = [-6190248, -824175, 4287154, 7409797, 6604655, 3476459, 2245826, 2740013, -164206, -6840977, -9226357, -2431828, 5875270, 5252949, -2596274, -7044924, -3954956, 869469, 2351334, 1428229, -451826, -3595791, -5554165, -2373473, 3524253, 4319105, -1488916, -5650078, -2253145, 3644874, 4466731, 1212612, -45898, 1613264, 2017161, -127221, -1612068, -509972, 1474761, 2698001, 3725653, 5017911, 5140965, 2364480, -2918792, -7596533, -7840881, -3102832, 1891194, 1554717, -3598018, -7342921, -5992591, -2562331, -1003147, -645780, 366218, 301092, -2607803, -4837044, -1703853, 4483517, 6433248, 2301750, -1436635, 918558, 7084937, 11140748]
11202A1140748J67211j071202k21838K53633j67271j048401k515416l793382k661520
11193H2562J337354M704453L511202j401647n040592m265455j119312N40624k89155
11184a939966j818450k310326r04813K602077O142537N397132p09152o011345
11176D47694l867980K629813L869960j879046n234345l81721N321912L035909
11168C942196l406766m140772Q72742L143970K97504j525413M12623J775860O99364
11159B071308Q65726K716167J498289k658858k739222K600209M578299j404289
11151G527629o763544l151413L810345L956789j378877l547744j344226j98044
11143a089085n74814J070475K397761j633105o985985m435595M550723Q386211
$$ y = [11140748, 11307959, 10236757, 10014919, 10268552, 10101281, 9052880, 6537464, 2744082, 82562, 1419916, 6124369, 9635571, 8233924, 3193332, -1072123, -2191435, -1650811, -1939966, -3758416, -6068742, -6973555, -4371478, 1771059, 7168191, 6459039, 447694, -3420286, -790473, 3079487, 1200441, -4033904, -4415625, 906287, 3942196, 535430, -3605342, -2732600, 411370, 708874, -816539, -403916, 1371944, 2071308, 2937034, 5653201, 7151490, 4492632, 1753410, 4353619, 8931918, 7527629, 764085, -2387328, 1423017, 5379806, 4000929, 453185, -891041, -1089085, -1663899, -593424, 1804337, 171232, -6814753, -11250348, -6699625, 1686586]
11135A686586L444840j139589J02000P78366l648021o420546j759218M041167
11127b914415L158250p88135k17193L196103L093840L03326l35789r9144k743721
11118B653122n017647j882285K348976k0629n512272l743283M670162Q056294
11110A552438K716948j685163P96596L236743l93444m383378k194425J788637
11102A434952O41245k699777j166183L715765M364287p02415n483843n596620
11094e492589k333118J031201K172754O73759n76612K102334O627572O047413
11086A0252714o92967n401227l003390P7738k934376o817811k793975O110436
11078e202858R208304M549527P1969k34173m58156k889527m107540k440678p44278
$$ y = [1686586, 5131426, 3991837, 4093837, 4872203, 1224182, -5196364, -6955582, -2914415, 243835, -544300, -761493, 2434610, 5528450, 5831776, 5495987, 5396843, 2653122, -2364525, -4246810, -1897834, -1918463, -7430735, -11174018, -6503856, 1552438, 4269386, 2584223, 3380819, 6617562, 6224118, 1840740, -353685, 1434952, 2076197, -623580, -1789763, 1926002, 6290289, 5587874, 104031, -5492589, -7825707, -6794506, -4621752, -3947993, -4524605, -2422271, 4205301, 10252714, 9559747, 4158520, 1155130, 1232868, -1701508, -8519319, -11313294, -5202858, 4005446, 8554973, 8626942, 8392769, 7934613, 5045086, 937546, -1503132, -2247410]
11069b247410j52673J333648K928845J274882k356486k632443P49453J955975
11061H53791j360842m405673l091123P79543L674074L913030O77174m471941n673384
11052i105351M12103O891905M467869l844646o176649j25549M226320J543706
11044a710292j184333J396349L780290P72326k993838k174960q837r23505k230606
11035e277406n80681J091041Q5933l29493J639460J461099k347163l156734J841567
11026e572377M567529p9060l712522J119273O315778J678780n957245l135452
11018d775296O890739Q564890j076084q819664o523699m97739J971543J640416
11010b624894L45441k653895m585950n47359O416054P074062K47999m918843l173364
$$ y = [-2247410, -2400083, -1066435, 1862410, 3137292, 780806, -1851637, -1102184, 853791, -507051, -4912724, -8003847, -7224304, -3550230, 362800, 1039974, -3431967, -9105351, -8693248, -1801343, 2666526, -1178120, -7354769, -7480318, -3253998, -1710292, -2894625, -1498276, 2282014, 3054340, 60502, -2114458, -2123295, -3046800, -5277406, -5858087, -4767046, -4681113, -5010606, -3371146, -1910047, -4257210, -7413944, -5572377, -1004848, -1083908, -4796430, -3677157, 2638621, 4317401, -1639844, -4775296, 2115443, 10680333, 9604249, 784585, -5739114, -6236853, -4265310, -2624894, -2279453, -4933348, -9519298, -10066657, -3650603, 3423459, 3671458, -1247385, -4420749]
11001d420749O84127K266675L531158M949149K365020l841426o146515j524706
10993b137267K900183R95052l376960l670722j16694L036350L846133K280433
10985C756508j012388k809127j20630L389893R37781n956730q121895k841216
10977a2777804K363324K946028L503910O242903M912989k704655p240731j884514
10969d638550N246607L301019m390336o753126k414981Q99563N18209R25927L514806
10960c790862M515036K843522J509298J255192O210j691831j265448L40529j98955
10951C522691k439536k718156j92054K603040M071142L922056J248850l026108
10943F991925m444976j009471K128240k06799m706538m848308j279807P41067
$$ y = [-4420749, -3736622, -1469947, 2061211, 7010360, 9375380, 5533954, -612561, -2137267, 762916, 1757968, -1618992, -5289714, -5406408, -2370058, 1476075, 3756508, 2744120, -65007, -185637, 3204256, 4142037, -1814693, -9936588, -12777804, -10414480, -7468452, -3964542, 2278361, 7191350, 4486695, -2754036, -4638550, 608057, 3909076, -481260, -7234386, -9649367, -8749804, -8231595, -7305668, -3790862, 724174, 3567696, 5076994, 6332186, 6338396, 4646565, 3381117, 3721646, 3522691, 1083155, -1635001, -1827055, 775985, 4847127, 8769183, 10018033, 6991925, 2546949, 1537478, 3665718, 3458919, -1247619, -6095927, -7375734, -6634667]
10935f634667J174874L652106O438606M685946M54663K10443K653831J49652o701375
10926F084079p944470r84051L679925p14888n846202k165741N293753N421447
10918B823852j251255m667853j476481J899405J270405l72514o10831j295432
10910c680704k497980p28883L716696M645047n77034n297631k653147L929330
10902c144306N504296N84646l153861k04329N469142O543922J801577l476460
10894I924627m522702j712038J189151J367538o99419k434061k396877j853978
10886a137759k291326k290220O18717M908718N309809p2773n930952n989443q64175
10877g739404L674147M573469L731760L310054L010142K147883Q68060j043178
$$ y = [-6634667, -5459793, -1807687, 4630919, 9316865, 9771528, 9981971, 12635802, 12785454, 6084079, -1860391, -2844442, 835483, 120595, -5725607, -7891348, -2597595, 2823852, 1572597, -3095256, -4571737, -2672332, -1401927, -1774441, -2385272, -3680704, -6178684, -6907567, -3190871, 1454176, 877142, -4420489, -7073636, -3144306, 2359990, 2944636, -209225, -413554, 5055588, 11599510, 13401087, 9924627, 5401925, 3689887, 4879038, 6246576, 5547157, 3113096, 716219, -1137759, -3429085, -5719305, -5100588, -191870, 5117939, 5045166, -885786, -6875229, -7739404, -4065257, 508212, 4239972, 7550026, 10560168, 12708051, 13576111, 12532933]
10869A2532933l538986m678422k855422j70575K00407o31209Q66792L884367L957673
10860I567558O51140j711118j894369l219529n301298k554831N065180Q233047
10852H835780J540419o729851o188716L22556K397233j408955l352492n69594
10844e153620J662980R37117J562809N178124O602765K609452k560024m225132
10836F614471l566426l231103k368106j7812J484062N15304n60495K64425J025273
10827A59593P5153k3103K959538N799157L706589k699552p985325q050101l206979
10818i265030L023873O198236M261303K13300j128722J66670j70909k310956j047135
10809e9370M215569N574365j347376q107819m627787M988773P774312P79414n906715
$$ y = [12532933, 8993947, 4315525, 1460103, 1289528, 1489935, 858726, 1725518, 5609885, 9567558, 10218698, 8507580, 6613211, 3393682, -1907616, -4462447, 602733, 8835780, 10376199, 3646348, -2542368, -2219812, 177421, -1231534, -4584026, -5153620, -3490640, -2553523, -990714, 4187410, 10790175, 13399627, 10839603, 6614471, 3048045, -183058, -2551164, -2568976, -1084914, -569610, -1130105, -865680, 159593, 234746, 211643, 3171181, 8970338, 12676927, 9977375, 1992050, -6058051, -9265030, -6241157, -42921, 4218382, 4431682, 3302960, 3469630, 3298721, 987765, -59370, 4156199, 9730564, 8383188, 275369, -4352418, 636355, 8410667, 9190081, 3283366]
10800C283366n167971j438731p02942j486965n44445L18269r73606j189737K588515
10791e314247O311530M577368k76701j484743J590983L040032K35289k429656
10783F249855j085254J699557J328740k044593m285940l039148m1112J813498
10775E95603J825594J493923J959800K335387J180921q76535j654642q83209j005174
10766D971668l192540m780155k988157N91314K211794J444752R93025J652513
10758I04214J338989n03917j353481K98500K618532L716688M037649L568395J57848
10749A4783417o179551j0146948o807371Q69828M728270J891895j923229j062561
10741c846250K285254K326527j085992k268636J393462N048861L160827k467327
$$ y = [3283366, -1884605, -3323336, -4026278, -5513243, -6057688, -5739419, -6713025, -7902762, -5314247, 997283, 5574651, 5297950, 3813207, 5404190, 8444222, 8679511, 6249855, 5164601, 6864158, 8192898, 6148305, 1862365, -1176783, -1217895, 595603, 2421197, 3915120, 5874920, 8210307, 9391228, 8514693, 6860051, 5976842, 4971668, 1779128, -3001027, -5989184, -5397870, -3186076, -1741324, -748299, 904214, 2243203, 1739286, 385805, 684305, 3302837, 7019525, 11057174, 14625569, 14783417, 8603866, -1543082, -8350453, -7480625, -2752355, -860460, -2783689, -3846250, -1560996, 765531, -320461, -2589097, -1195635, 3853226, 7014053, 4546726]
10733D546726n031600j849451K651261L426036Q91742j097132p89693L12184M74228
10724C534301l74221j251521j008456R59206L621673M501250K125965k120592
10716I987605n266094n169557j651421L030746M692658J014611m419456n415474
10708c196382j810141j20386k975392l849287K322629Q924140O332377k713954
10700B913604o287705q83555M377324K588147j753691j994235P91541K050989
10692A802419J065253q58192l626895n385391k229173M566607P150087J968717
10684D453432m102696m069122q35747l07812r34610J533415M254802J824554l152369
10675a336153l790146o24795L12125p34444J934207P188696O710194j162877p501344
$$ y = [4546726, -484874, -2334325, 316936, 3742972, 4634714, 3537582, 2747889, 3060073, 3534301, 3160080, 1908559, 900103, 1859309, 5480982, 9982232, 12108197, 9987605, 4721511, -448046, -2099467, 931279, 5623937, 6638548, 2219092, -3196382, -5006523, -5126909, -8102301, -11951588, -9628959, -704819, 5627558, 2913604, -3374101, -4257656, 119668, 2707815, 954124, -1040111, -248570, 1802419, 2867672, 2009480, -1617415, -7002806, -9231979, -4665372, 2484715, 4453432, 350736, -3718386, -4554133, -4861945, -5796555, -4263140, -8338, 1816216, -1336153, -5126299, -5751094, -5438969, -6173413, -4239206, 2949490, 9659684, 8496807, 995463]
10666I95463o188570k069940j182998j315899J554001M351397K021747k795556
10658d630355k967657K092354N556586L433227k84420n82649J046588k95395m513320
10649a145041n861840j484913L552068L112065r52310j775945J584868K763566
10641b07482j181577m575176k149157K903825M720658L317009J852574J82193
10633D862867k596175l403671R5793L561982J925411j890721j709521J399466
10625B245431J647049p95214p28735J628259N45978m541631p130536l837732J190299
10616i776832L605596L761967L019170J470987L04134O71104K69753l020138n304502
10607d998761j704722M144043M146508j470320m697910k816649q65344o01754
$$ y = [995463, -5193107, -7263047, -8446045, -9761944, -8207943, -3856546, -1834799, -4630355, -7598012, -5505658, 50928, 3484155, 3199735, 2617086, 3663674, 3368279, -1145041, -7006881, -8491794, -4939726, -1827661, -2779971, -4555916, -2971048, -207482, -1389059, -5964235, -8113392, -5209567, -488909, 2828100, 4680674, 4862867, 2266692, -1136979, -1041186, 2520796, 4446207, 2555486, 845965, 2245431, 3892480, 3097266, 2368531, 3996790, 4542768, 1137, -7129399, -10967131, -9776832, -6171236, -2409269, 609901, 2080888, 2385022, 3056126, 3325879, 305741, -4998761, -6703483, -2559440, 1587068, 116748, -4581162, -7397811, -8263155, -8864909]
10599h864909J986089O274651N496466q06611l702797R71019N502668L033720
10591I890296j972926k542972j73824K06077n89242P29964K657070J708082j161006
10582H751519k446900j495548k9092R09538Q63717k65933j045990l91533k65517
10573D584261k019432j885585L182662P463619L461058m583635n364120J405959
10565F244787M147013j620555o694416m290891K58103J134369J043583K456766
10557B678759J540279k362374k293900L964418P578608K360276m906259n457363
10549C102444r17178K459747L312749K476205o63967l472549p39644N189094N122280
10540A5869181j805466n445183j763792P93798k094382k340443M445920R087238
$$ y = [-8864909, -6878820, -604169, 4892297, 4085686, 382889, 1353908, 6856576, 9890296, 7917370, 5374398, 5200574, 5406651, 4817409, 5547373, 8204443, 9912525, 8751519, 6304619, 4809071, 4779979, 5689517, 6553234, 6287301, 5241311, 4849778, 4584261, 2564829, 679244, 3861906, 11325525, 14786583, 10202948, 4838828, 6244787, 10391800, 8771245, 2076829, -2214062, -1955959, -821590, 221993, 2678759, 4219038, 1856664, -437236, 3527182, 11105790, 13466066, 8559807, 3102444, 2185266, 4645013, 7957762, 10433967, 9770000, 6297451, 5557807, 10746901, 15869181, 14063715, 8618532, 6854740, 7648538, 5554156, 3213713, 7659633, 16746871]
10532A6746871M273149l588259o898811p838811q412717l985456M513671P094668
10524A904305K162561J192515P349138Q010395j516048p399122k183809J647244
10516A1167179l404727m860839L871065P485607k564153r012365R6865P675082
10508A0453714n24796p660720K328080J2261581L286543q428927k231487P109318
10500A6593306o53250r319816J815305J2934594L72069j1887760M680438K0421227
10492C4956113j321321k1881455J2692433N0922320r140833j37328105j71330277
10485b42431125m4992086J01065057J12573359K5907786j8348291J1777449L1905618
10478b2542233L750904j8497945r76900J7156711M401261j2171659n206871P039481
$$ y = [16746871, 21020020, 17431761, 10532950, 2694139, -5718578, -9704034, -5190363, 1904305, 4066866, 5259381, 12608519, 20618914, 19102866, 11703744, 9519935, 11167179, 7762452, 2901613, 6772678, 14258285, 11694132, 2681767, 2778632, 10453714, 9928918, 2268198, 4596278, 16857859, 20144402, 11715475, 9483988, 16593306, 15940056, 6620240, 8435545, 21370139, 21742208, 9854448, 14534886, 34956113, 33634792, 11753337, 24445770, 75368090, 66227257, -71100848, -242431125, -287423211, -186358154, -73784795, -47877009, -66225300, -54447851, -22542233, -18791329, -37289274, -38266174, -21109463, -16708202, -28879861, -34086732, -27047251]
10470b7047251K561447n875230j538667N750589L680254M17541M042082O159751
10462a1849484J555981m35310L723982L785136k386968k804621M457028N459773
10454A505517l048022o017227K120875O671110k97081n953315j060525L995769
10446b082899j26913n277774k747498J273178n38321l199690r02585K186286J943000
10437i473216J736632K555369m44492n539938l611553M649033O753705m98110
10429c872570m847784O713M326183J215971j948869M67005K097026n60772J40
10420c116957N926979O559903k099338p452497j487867M794022R97868m893922
10412g71809k728972J276474j724183m881127J220184Q683119M330667o846969
$$ y = [-27047251, -24485804, -30361034, -31899701, -26149112, -22468858, -22051317, -18009235, -11849484, -10293503, -10728813, -7004831, -3219695, -5606663, -8411284, -3954256, 1505517, -1542505, -7559732, -5438857, 1232253, 935172, -5018143, -6078668, -2082899, -2209812, -7487586, -10235084, -8961906, -9500227, -12699917, -13602502, -11416216, -9473216, -7736584, -5181215, -5625707, -11165645, -14777198, -10128165, -3374460, -3872570, -8720354, -8713641, -4387458, -3171487, -5120356, -4653351, -2556325, -3117097, -3116957, 2810022, 9369925, 7270587, -181910, -1669777, 3124245, 4122113, -771809, -3500781, -2224307, -3948490, -8829617, -7609433, 1073686, 5404353, -1442616]
10404a442616q830676K63983P288875N085852q25250m683054o252076n113263
10396a4508225m73319L889631L441751L15975l59469J270249K028520K280370
10388b114517L261076K284844k185235n303060k877883J095328R96640j408072
10380f250879j628861p03052j341763j266686J925353M517295K860097M06633
10372a481863J156475K082532j07355j303520K064364M160465j036185p713191
10364b178278o531569R5767K660356M28513N08165L742448L823637m28530l270388
10355a149879k615222k260127l216662k205864P24632J786211R84386J778518
10347f174007L200591Q48199l959785m737068n56811K166504K37001j900763m96413
$$ y = [-1442616, -10273292, -10009309, -2720434, 2365418, 1540168, -3142886, -9394962, -14508225, -14981544, -11091913, -7650162, -7334187, -7693656, -6423407, -4394887, -2114517, 1146559, 3431403, 1246168, -4056892, -6934775, -5839447, -4842807, -6250879, -7879740, -8582792, -9924555, -11191241, -9265888, -4748593, -1888496, -1481863, -325388, 1757144, 1649789, 346269, 2410633, 6571098, 5534913, -2178278, -8709847, -8614080, -5953724, -5525211, -5017046, -1274598, 2549039, 2120509, -1149879, -3765101, -6025228, -9241890, -11447754, -10723122, -8936911, -7952525, -6174007, -2973416, -2125217, -6085002, -10822070, -11378881, -9212377, -8975376, -10876139, -11372552]
10338a1372552J970324K287523J401430J096372Q46216K16318J13806J60230j175024
10329d455357l024901k753750m74480J150363J454155J758486J506916m82149
10321e320717j608201J632639O424822N912271l24961m791986l138371j32638
10313a347142j157102l578866j647615L833156O356358K916285k335165m014589
10305i74680j722452J066600K149835K151202J436127j242380n150057n670174
10297g955979k02774N770226M293674l446143p713740l905418J558093K113420
10289i488641K03126M21839Q92515j304513k377561J739588O020384L196074l255913
10280c953102l392631L400924P441713L817695j716035l547425l332132l370975
$$ y = [-11372552, -9402228, -7114705, -5713275, -4616903, -3770687, -3554369, -3440563, -3280333, -4455357, -7480258, -10234008, -10708488, -9558125, -8103970, -6345484, -4838568, -5320717, -6928918, -5296279, 1128543, 7040814, 6715853, 1923867, -1214504, -1347142, -2504244, -6083110, -7730725, -3897569, 2458789, 5375074, 3039909, -974680, -2697132, -1630532, 519303, 2670505, 4106632, 2864252, -2285805, -7955979, -8158753, -2388527, 1905147, -1540996, -9254736, -13160154, -11602061, -9488641, -9285515, -8863676, -7971161, -9275674, -11653235, -9913647, -3893263, -697189, -3953102, -7345733, -3944809, 3496904, 7314599, 5598564, 2051139, -1280993, -4651968]
10272d651968j594843K658792N024705K707012j030054k684684l293430l920108
10264f784578k271933J960347M001701J233387j446720Q57383M490785K845870
10256D886242k480923l634934J074901M048282l20788o950502o709566J113544
10248h973744P517240N078447k952592p067936l265469L030886N100474L124332
10240A591638J651442J874974Q73450k360294m694929l490976l8697K774221L549235
10231A730064K168030r15472l930639m427011j904910J549797L682553L612884
10223A565296J199012k759026n556718m540157p26955J933223J593147L31351
10215f960827J87964J80212j197880k865201k633259m66573J523392J739115O49042
$$ y = [-4651968, -6246811, -3588019, 1436686, 4143698, 3113644, 428960, -2864470, -6784578, -9056511, -7096164, -3094463, -1861076, -3307796, -2450413, 2040372, 4886242, 2405319, -1229615, -154714, 3893568, 3572780, -3377722, -10087288, -8973744, -1456504, 3621943, 669351, -6398585, -9664054, -6633168, -1532694, 1591638, 3243080, 5118054, 5991504, 3631210, -1063719, -4554695, -4593392, -1819171, 1730064, 3898094, 2982622, -948017, -5375028, -7279938, -5730141, -2047588, 1565296, 2764308, 5282, -5551436, -10091593, -10818548, -8885325, -7292178, -6960827, -6772863, -6592651, -7790531, -10655732, -13288991, -13755564, -12232172, -10493057, -9844015]
10206i844015J3684R71437K582177K599124L43837k028069k259094p99190P48896
10197g671213K399812M431707M822485J732187k212545k353958J141835L229256
10189E519566J587375l32062L55926J233982o15204k944478j896573J124818J082253
10180E115603k694563m824698j594290L199646L112906j787105m407228l18490
10172d198219N435839M907064j101202l656713J034594N638316L161909j959962
10164I261626j763541J092240k265707j0036090r930320J042811R515677N240620
10156B157316l293029k646288M774649O288728J7650l671099l71544K637404O97875
10147F591662j152853L18319j07969m711144n486981K817271J0897756P042883
$$ y = [-9844015, -9830331, -8858894, -6276717, -3677593, -3333756, -5361825, -7620919, -8420109, -7671213, -5271401, -839694, 3982791, 5714978, 3502433, 1148475, 2290310, 5519566, 7106941, 6774879, 7130805, 8364787, 7749583, 4805105, 2908532, 4033350, 5115603, 2421040, -2403658, -3997948, -798302, 2314604, 527499, -3879729, -4198219, 1237620, 6144684, 5043482, 1386769, 2421363, 8059679, 11221588, 9261626, 7498085, 8590325, 6324618, -3711472, -13641792, -12598981, -3083304, 2157316, -1135713, -3782001, 992648, 7281376, 7299026, 3627927, 3256383, 5893787, 6591662, 5438809, 5757128, 5649159, 938015, -4548966, -1731695, 9166061, 16208944]
10139A6208944m585218r527855m030658J378009p08408m840766l346111K361475
10131g090588N695919L977936n01225m062233l499008J417272N456604K831302
10123D225979l881294n763470o77721K892390r11832n823042l547342L104559
10115a0381773N336047K122307j3461J488574K640304J072692r94355k045267
10107g74932k796937k389692O38528L776903L296015J063932J693451L586807
10099H094075J118561m118325l886041K819390O417283J437495m810422m162698
10091B909318K02771Q83964j437229j366007O06375j74083l233521l721189p91963
10082f121564J946890K998135L400958K096298k313181o197283m285804J737992
$$ y = [16208944, 11623726, 2095871, -1934787, -556778, -1265186, -6105952, -9452063, -7090588, -1394669, 2583267, 2082042, -1980191, -5479199, -4061927, 1394677, 4225979, 344685, -5418785, -6096506, -3204116, -4115948, -9938990, -13486332, -10381773, -5045726, -2923419, -2936880, -1448306, 1191998, 2264690, 1270335, -774932, -3571869, -5961561, -5323033, -1546130, 1749885, 2813817, 4507268, 8094075, 9212636, 5094311, 1208270, 4027660, 10444943, 11882438, 7072016, 2909318, 3112089, 3996053, 2558824, 1192817, 1799192, 1625109, -1608412, -5329601, -6121564, -4174674, -1176539, 2224419, 4320717, 2007536, -4189747, -8475551, -6737559]
10074f737559M611041J729991k207069l179036k094080k32137K948491N658347
10066D97989L854738j724481m420327j079748K622486O81099l879889l657531
10058g105664J874009N695952L247766k071651m427660k710226j73842O85793
10050d985523L82808K88759N37258Q37832J871284M123680N771634L991981q30677
10041A1989036m316103l213767L16386J758160L10223q90699m7866R79807J96636
10032G081813j495067k153630j699702j293354j021173P8502K006302L113114
10024D616805J786796j534871m286147l930846m79878L185401L818613Q63319
10016D039192k877900l727388p83791K755109K794787o52033l117910j608019
$$ y = [-6737559, -2126518, -396527, -2603596, -5782632, -7876712, -8108849, -5160358, 497989, 4352727, 2628246, -1792081, -2871829, -249343, 431756, -3448133, -7105664, -5231655, 464297, 3712063, 1640412, -2787248, -5497474, -5671316, -4985523, -4602715, -4313956, -3776698, -2938866, -1067582, 3056098, 8827732, 12819713, 11989036, 7672933, 4459166, 4775552, 6533712, 6843935, 5953236, 5905370, 6885177, 7081813, 5586746, 3433116, 1733414, 440060, -581113, -502611, 1503691, 4616805, 6403601, 4868730, 582583, -3348263, -3828141, -642740, 3175873, 4039192, 1161292, -2566096, -3349887, -594778, 2200009, 1547976, -1569934, -3177953]
10008c177953J030288L48634k655336k872065Q08110L553123K084876n47442l07681
9999a735446J714518J993879K56910j319646k259253l301434l521434j680453
9991i852359Q14273J735878J653200K425254L340907K282572k93993k103400k792613
9982b790281l290964k484858J077581M712272L821236q42615l090506j14365L224826
9973B22326J670188k712422l916778p54495K026463Q95663j903840k035884J070896
9964e437883L876690L393151M45747k044688k720589k448658j795537K71228M153393
9955b307146P289554N944578k72282o857609q505271m616834L04634K055152J085620
9946e879604K47059L2301q60129j302680J189734M653307L637447j679163l542433
$$ y = [-3177953, -2147665, -1799031, -4454367, -7326432, -6518322, -2965199, -880323, -1427765, -1735446, -20928, 1972951, 2229861, 910215, -1349038, -4650472, -8171906, -9852359, -9038086, -7302208, -5649008, -3223754, 117153, 2399725, 2105732, 2332, -2790281, -6081245, -8566103, -7488522, -2776250, 1044986, 202371, -2888135, -3002500, 222326, 1892514, -819908, -4736686, -5491181, -3464718, -2569055, -4472895, -6508779, -5437883, -1561193, 1831958, 2277705, 233017, -2487572, -4936230, -6731767, -6460539, -2307146, 4982408, 10926986, 10654704, 3797095, -4708176, -9325010, -9020376, -6965224, -5879604, -5632545, -5600244, -6460373, -7763053, -6573319, -1920012, 1717435, 38272, -3504161]
9937c504161J815618O878017L664162l691002n633963j973790Q9587n72130Q75918
9928b051744L335187P94348m532486l568782L205858M759848j549590m883518
9920d490879k35927K816821j295005k975060L763090P180917k323046j2162813
9912i721902n990877Q505362J0975257N50179n162432M8815M050631l5062l830516
9903f10545j232107J885144Q41976j79674J103823M15928k148863J40619P060806
9894G277107Q667446J554387m670939k964893J070883P13703j642391j896753
9886H108550j343045q67214J770003M616059K456428j871540l9542N331988K935314
9877B1097001n008486l083919P618804M080929k0233978l5724523j7556145J3840485
$$ y = [-3504161, -1688543, 5189474, 8853636, 5162634, -471329, -2445119, -2355532, -2927662, -2051744, 1283443, 2077791, -2454695, -6023477, -2817619, 1942229, 392639, -4490879, -4726806, -1909985, -3204990, -6180050, -2416960, 4763957, 2440911, -9721902, -15712779, -7207417, 3767840, 4318019, -844413, -795598, 3255033, 3219971, -610545, -1842652, 42492, 884468, 704794, 1808617, 2224545, 75682, 216301, 7277107, 15944553, 17498940, 12828001, 9863108, 10933991, 11647694, 10005303, 8108550, 6765505, 5898291, 7668294, 12284353, 14740781, 12869241, 12829699, 18161687, 21097001, 16088515, 13004596, 20623400, 24704329, 4470351, -31254172, -48810317, -34969832]
9869c4969832K0966957L576308o792920J232850O738417k519098j0215193k539035
9861b4521546Q294259O654983j208339j307110L925868K972462l325254m244180
9853a2758857K120536O732510M275754q75051k977966j419833J196005K289935
9845a416967R06917j020989n95666J345970R73241j598012j347455K963777N078640
9836E289456N72561n479471n693718j060262J581904n8942j845583m67071K495917
9827d665209L625407J433423k627529m893701k493973K696493N150451K471617
9819F96979j515995k381098o09676R70649J799607K255710R43072k625171n136788
9810e602711l455645M63260K525576K307888J878717J124006r04826j946294N29632
$$ y = [-34969832, -14002875, -10426567, -17219487, -15986637, -9248220, -11767318, -21982511, -24521546, -16227287, -9572304, -10780643, -12087753, -8161885, -5189423, -8514677, -12758857, -10638321, -3905811, 369943, -505108, -3483074, -4902907, -3706902, -1416967, -510050, -1531039, -2126705, -780735, 192506, -1405506, -2752961, 210816, 5289456, 5862017, 382546, -5311172, -6371434, -4789530, -4848472, -6694055, -7161126, -4665209, -1039802, 393621, -2233908, -7127609, -9621582, -6925089, -1774638, 696979, -819016, -3200114, -3809790, -2839141, -1039534, 1216176, 2159248, -465923, -5602711, -9058356, -8595096, -6069520, -3761632, -1882915, -758909, -1663735, -3610029, -3080397]
9801c080397L568356K134096k098351k195676K810557N316459N82944n821999
9793A215989o406831k085770J241939J963317K343115K174722q7678j720303J263299
9784i8201N951163N104376j147119m145298M1767M106326J093619m588675m747609
9775A570349n94283K69854k952032l471631R16948L909157J213895k555191j501076
9766c194010K559542L386310p23185n431608o115119k207987L104847N789046
9758b832164M511290J867676Q20377O97137o37326j987842p44984J090487j220182
9749A564469o549669p802475k572123K834123L375495K424444M108206N170309
9741B552779J238379m063423m143600m0620J997199J062095J434551L181384J565269
$$ y = [-3080397, 487959, 2622055, 523704, -1671972, 1138585, 6455044, 7037988, 1215989, -5190842, -7276612, -6034673, -4071356, -1728241, 446481, 358803, -1361500, -98201, 5852962, 10957338, 9810219, 5664921, 5706688, 9813014, 10906633, 6317958, 1570349, 976066, 1245920, -1706112, -5177743, -4260795, -351638, 862257, -1692934, -3194010, -634468, 2751842, 2028657, -3402951, -9518070, -11726057, -8621210, -2832164, 1679126, 3546802, 4367179, 5064316, 4426990, 2439148, 1694164, 2784651, 1564469, -4985200, -12787675, -15359798, -12525675, -9150180, -6725736, -2617530, 2552779, 3791158, -272265, -4415865, -4456485, -2459286, -1397191, 37360, 3218744, 4784013]
9732D784013l595980o007979k392494K745403M327793K970346J371513l60955
9724C841660k497328k955151k78977L406951N066664M096978J356835k276254
9716I761378m703293l303880P66295K120363j943896o637065n469619P02285M437263
9707d270169J440814m049074m951594k6499N296268N874603K303816j150624k029566
9698a562025j145600K61773J877419K624500Q16063k584105l709522r90633J863900
9689b548230Q44859k449684l170584j26961L085327L197799L86162l285401n541800
9680i608513m288166O70670O076432P843039N477764K018764o0487q39797j408698
9671E881008k538910m398145n632710l740786J370786N480945M521263p4659l338014
$$ y = [4784013, 1188033, -4819946, -7212440, -4467037, -139244, 2831102, 4202615, 3841660, 1344332, -1610819, -1889796, 1517155, 6583819, 10680797, 12037632, 9761378, 5058085, 1754205, 2520500, 4640863, 2696967, -3940098, -9409717, -8707432, -4270169, -2829355, -6878429, -11830023, -11856522, -6560254, -685651, 1618165, 467541, -1562025, -2707625, -2445852, -568433, 2056067, 2872130, 288025, -3421497, -4412130, -2548230, -1703371, -4153055, -7323639, -7450600, -4365273, -1167474, -781312, -4066713, -9608513, -13896679, -13226009, -7149577, 693462, 6171226, 8189990, 8129503, 7289706, 5881008, 3342098, -1056047, -6688757, -10429543, -9058757, -3577812, 943451, 868792, -2469222]
9662b469222k964288n31152K116734M064488L966235J398951j107752j104023
9654C369971k50720j265767k381829k21928K856381J030345m858593o638532p42078
9645i102750N697076M658576j923008n741376l046910K426870N225262L186408
9637A380148j777808n206195l760655R20621L864078L160750J677673J299054
9629A557666j74556l851751n942735l103191J887382M159821L636396L284975
9621A454007L008525O17802k564766k713893Q371J113842j297780l740305k721921
9612f836118Q73419M266995O239427O299464L460671j707636n870684o205462
9604E20076l723096j484914o65713l11992k9935m96469j303562n50785K382995
$$ y = [-2469222, -5433510, -5964662, -3847928, 216560, 4182795, 5581746, 4473994, 3369971, 3119251, 1853484, -528345, -750273, 2106108, 3136453, -1722140, -8360672, -9102750, -3405674, 1252902, -670106, -6411482, -9458392, -7031522, -1806260, 1380148, -397660, -5603855, -9364510, -8443889, -4579811, -1419061, 258612, 1557666, 1383110, -2468641, -8411376, -11514567, -9627185, -5467364, -1830968, 1454007, 4462532, 5080334, 2515568, -198325, -189954, 923888, -373892, -4114197, -6836118, -5962699, -1695704, 4543723, 10843187, 14303858, 12596222, 6725538, 520076, -3203020, -4687934, -5353647, -5665639, -5695574, -6192043, -7495605, -8046390, -5663395]
9595e663395N049828M397851O59496k567974k471144j94819J042953L18451j66696
9586D04551J017258J693192q30901m586605l986295K472482Q173745N588570l259949
9577F686048p979636k935796N074773N860947p48227n924237m720991j306883
9569e994002m30021m20281J782842M109193L058220L15223L145J451448M69390
9560D345157l048823m493938j956703Q12969L26438j830769k067007K35514K665100
9551e012062K855956N06719k299937k639008j19588J991735J197875o7463J734780
9542a850993M473157K611404l448878o307355k330546K090965l70025o611857
9534a1744128o918035J175205Q986468Q147003J209488k687843k28181K724038
$$ y = [-5663395, -613567, 3784284, 4443780, 1875806, -595338, -790157, 252796, 571247, 404551, 1421809, 3115001, 2284100, -2302505, -6288800, -3816318, 4357427, 9945997, 6686048, -1293588, -4229384, 845389, 6706336, 5958109, 33872, -4687119, -5994002, -6424023, -6844304, -5061462, -952269, 2105951, 2421174, 2424319, 3875767, 4345157, 1296334, -3197604, -5154307, -4341338, -4014900, -5845669, -7912676, -7677162, -5012062, -2156106, -1649387, -3949324, -6588332, -6707920, -4716185, -3518310, -3585773, -1850993, 2622164, 5233568, 1784690, -4522665, -6853211, -4762246, -5132271, -11744128, -18662163, -17486958, -8500490, -353487, 856001, -1831842, -2060023, 664015]
9526F64015O26954l419119k536637L102230N744030R98581n825577p033867k119750
9517i799140L539684O119961N212415J218013l986164n818620j895644L116962
9509b292533K987890q75733j698715J890113M193818K068027q44360j330110j388244
9500B710153k915108l563178j520633N60181J99596n52786R05383L051380L102362
9491A977350J462425J59974l58381k94295P37559J856828J014607j249774j857199
9482C449094o22384j088538l919167m682499j066145K973671L534892J891048
9474D69972k9782l121760n982100l372410M448359P976424J594482o113745m403971
9465h534531K921220L964819j863286l569790K885046Q298520N040035k390336
$$ y = [664015, 1290969, -2128150, -4664787, -1562557, 4181473, 5180054, -645523, -7679390, -9799140, -6259456, -139495, 5072920, 6290933, 2304769, -3513851, -5409495, -2292533, 695357, -180376, -1879091, 11022, 4204840, 6272867, 5428507, 4098397, 2710153, -204955, -3768133, -5288766, -4728585, -4528989, -5081775, -4176392, -1125012, 1977350, 3439775, 3599749, 3241368, 2947073, 3684632, 5541460, 6556067, 5306293, 3449094, 2826710, 1738172, -2180995, -6863494, -7929639, -4955968, -1421076, 469972, 440190, -2681570, -8663670, -12036080, -7587721, 388703, 1983185, -4130560, -8534531, -5613311, -1648492, -3511778, -7081568, -4196522, 4101998, 9142033, 6751697]
9457F751697n738600l631508M43459L965680N047657J996797k960332m306281
9449A568569o68922K860967K199732p64367k775013l419989k396961J629054O405898
9440D638968O133604j61401n673884n106214j515314K38228J009370L038620L758678
9431F360655O08292k488153p76496K642469J458153l050685l992200l31358J914210
9422B344887R83k064697j616513j288365k588780k520189J79726J709123j9310
9413e863135j008050J763932M072699J035011l992807l800719J568233M937406
9405a287430K734712q69293j499105l44522r7696m5469J393571K731896J753405
9396D470069m69194j467069j622658k812436l941688k105733J779450K960936
$$ y = [6751697, 1013097, -2618411, -2174952, 1790728, 6838385, 8835182, 5874850, 1568569, 899647, 3760614, 5960346, 5195979, 2420966, -999023, -3395984, -1766930, 4638968, 10772572, 10611171, 4937287, -168927, -1684241, -1446013, -436643, 2601977, 6360655, 6968947, 4480794, 3704298, 6346767, 7804920, 4754235, 762035, 430677, 2344887, 2345870, 281173, -1335340, -2623705, -5212485, -7732674, -7552948, -5843825, -5863135, -6871185, -5107253, -1034554, 457, -3992350, -7793069, -6224836, -1287430, 1447282, 577989, -921116, -1265638, -1363334, -1408803, -15232, 2716664, 4470069, 4000875, 2533806, 911148, -1901288, -5842976, -7948709, -6169259, -3208323]
9388c208323j46439l041335j823797P86469O8371k656226j909078K705918N010625
9379d213815J561007k875292k539311Q49069J591561q17613j704552O32938K688310
9370d827698K289368J790163K743002K419531j163690m816855m603953j596736
9362g766868O86699J794712K980578K886693k19521l569871k909227L65181R01062
9353d850562j842754k705663M76749L696894M077939L761894L715358O50305n347529
9344A632631o962899j53262P011379M453866m479663p176279j99707O262871L972482
9335D361419k464382m365667j316233J073280Q64372P92204J866676J882707Q9497
9326B783873j198393m60957P70789O79891j58609l99882o26887k247253m061976
$$ y = [-3208323, -3354762, -6396097, -8219894, -7433425, -7365054, -10021280, -11930358, -9224440, -4213815, -2652808, -5528100, -8067411, -7218342, -5626781, -6444394, -8148946, -7516008, -4827698, -2538330, -748167, 1994835, 4414366, 3250676, -1566179, -6170132, -7766868, -7080169, -5285457, -2304879, 581814, 362293, -3207578, -6116805, -5751624, -4850562, -6693316, -9398979, -8922230, -5225336, -1147397, 2614497, 6329855, 6980160, 1632631, -5330268, -5483530, 1527849, 5981715, 1502052, -5674227, -5873934, 388937, 4361419, 1897037, -2468630, -3784863, -2711583, -1847211, -1055007, 811669, 2694376, 2783873, 1585480, 1124523, 1895312, 2575203, 2416594, 2016712, 1389825, -857428, -4919404]
9317d919404k546708K935150P222807M814357k317990o242588l271572J487335
9309b838613J969420o94203j654573l61725N8645q28578o53105N44373M04291
9300d054068q30528o70414N12593J0588j523680n17986K794391L888937J370685
9291I80518r44960j012240j559220l685041l586488O80427M534476L278158j108001
9282b422371l699474l294195j364067J814184N595237O871854M050208L96315
9274G947691o71362p88433k951364n570599n070978k176249n74614p62813Q077
9265a0610644K430232M047203L244322J061910p04908r39194L15306J125835o20617
9256f50555l273800k436776J999847M236724J284498j753288n5288K442037m9298
$$ y = [-4919404, -7466112, -4530962, 2691845, 7506202, 5188212, -1054376, -4325948, -2838613, -869193, -1563396, -3217969, -3579694, -3521049, -4349627, -5002732, -4458359, -4054068, -4884596, -5555010, -5042417, -5031829, -6555509, -7073495, -4279104, -390167, 980518, 35558, -976682, -2535902, -6220943, -9807431, -9127004, -4592528, -1314370, -2422371, -6121845, -9416040, -10780107, -8965923, -3370686, 3501168, 7551376, 7947691, 7276329, 6487896, 3536532, -2034067, -7105045, -9281294, -9855908, -10618721, -10610644, -8180412, -4133209, -888887, 173023, -531885, -1471079, -1155773, -29938, -650555, -3924355, -6361131, -4361284, -124560, 1159938, -593350, -648638, 1793399, 1744101]
9247A744101m080076j785026N337428P367681J191990m665971l129658J740415
9239C720884K400351j351431m284643l843762j334707J793272M276052L894813
9231E270829J68804l273973k630462Q34122K752295J935913J046832J112768m97806
9222F719322m815216p414677l668780L465947N684349M84817m609564k384530
9214f538332L554232M285620q87084l880022p64106K840051J693536j405146k091428
9205c192679j703459k665231k635868M29368K630673M57251j906951Q59916N558739
9196b168241N637450K337124J501528K221561j009833o385402o112719P3503L636941
9187b68088J086971j501626l80387J51965k116345j973988K720865M861820m08993
$$ y = [1744101, -2335975, -4121001, 1216427, 8584108, 9776098, 5110127, 1980469, 3720884, 6121235, 4769804, 485161, -3358601, -4693308, -2900036, 1376016, 5270829, 5439633, 2165660, -464802, 369320, 3121615, 5057528, 6104360, 7217128, 6719322, 1904106, -5510571, -9179351, -5713404, -29055, 455762, -4153802, -6538332, -2984100, 1301520, 414436, -3465586, -4229692, -1389641, 303895, -1101251, -3192679, -4896138, -7561369, -10197237, -9767869, -7137196, -6679945, -8586896, -7726980, -2168241, 3469209, 5806333, 7307861, 9529422, 8519589, 2134187, -3978532, -3905029, -268088, 818883, -682743, -1063130, -911165, -3027510, -5001498, -2280633, 2581187, 2172194]
9178B172194o312456m684053J231931K967306L05412o89997Q16571M42373j934672
9169e685391j816014J148455K104971n36091k462926o35431K666274M438158M626912
9160C848917L788392J656011m00443J94162K501139J939051k703157o012525l169671
9151A641876K523944L702627q56970m785211l272983P88566K009966J94492r59628
9142I86679n39916q31861j681220r3766L347858L492443j035186m140908j439363
9133a935240K195868N40119l161269j545602L734165M030697j829541n377473
9125c348276k416271Q79687o50547k958807j272242J351972N46232r78518J038269
9116g808501L651780J327682m125500n819405k040100K415855L938732L324972
$$ y = [2172194, -4140262, -8824315, -7592384, -4625078, -4319666, -5009663, -4193092, -3750719, -5685391, -7501405, -6352950, -4247979, -4784070, -7246996, -7882427, -5216153, -777995, 3848917, 7637309, 9293320, 8892877, 9087039, 11588178, 13527229, 10824072, 4811547, 1641876, 4165820, 7868447, 7011477, 2226266, -1046717, -258151, 1751815, 1946307, 986679, 446763, -385098, -2066318, -2160084, 1187774, 4680217, 3645031, -495877, -1935240, 260628, 800747, -2360522, -3906124, -171959, 3858738, 2029197, -3348276, -5764547, -4884860, -5535407, -8494214, -9766456, -8414484, -7868252, -8846770, -7808501, -4156721, -2829039, -6954539, -12773944, -14814044, -12398189, -8459457, -5134485]
9108e134485K181735J235922J579820L343998M102542K264271K46351L96866K38665
9099A0455685l378970p608955o730575p71556M377802M845884J940295j764856
9091A364754m558163m450664r01546K613395K345625n1914l13678J080014P7492
9082b794685k984685l164021O16355L313900J753310r88462j488936q48900q35209
9073g421333j16151K224629L528941J569328j449547k194166q23901N58542J386021
9064b737637J715008N07768k121020l351952j488312Q98200R01907J28201J753601
9055c794236M564251M568409J863219Q61981K790507K764515k846913r549429
9047A222304r377031j368579O657921P634178L156255m31019j203860k642198
$$ y = [-5134485, -2952750, -1716828, -137008, 3206990, 7309532, 9573803, 9820154, 10217020, 10455685, 7076715, -532240, -7262815, -8034371, -3656569, 1189315, 3129610, 1364754, -3193409, -7644073, -8545619, -5932224, -3586599, -3638513, -3952191, -2872177, -2794685, -5779370, -8943391, -8327036, -5013136, -3259826, -4248288, -5737224, -6586124, -7421333, -7537484, -5312855, -1783914, -214586, -1664133, -3858299, -4682200, -4123658, -2737637, -1022629, -514861, -2635881, -5987833, -7476145, -6577945, -5676038, -5547837, -3794236, 770015, 5338424, 7201643, 8063624, 10854131, 13618646, 10771733, 1222304, -8154727, -9523306, -2865385, 4768793, 7925048, 7494029, 6290169, 3647971]
9039C647971n893261o313426o41740O116449N919127j298700o816143m221216
9031i500939K841164O143316L042784j691583k606073O67152M075922L811649
9023F783392J77506k660351j370013K046989K307552j791224m733418j564958
9015h04525M336255M994716j005210n971491l660747J988092K831658j540750
9007A167998l675035R3028M064690K002167l548508n563685k917648n00161l15458
8998i192612R03844M299623N548831J983510k183769k100140K15020k37442k797481
8989c560616k399824J589471M015228K225391K9048R85783K499305M05074l734643
8980B054217m552118r39157K252718J195204j825961k190468N95923K896577K364428
$$ y = [3647971, -2245290, -8558716, -9200456, -3084007, 2835120, 1536420, -5279723, -9500939, -6659775, -516459, 2526325, 834742, -1771331, -1104179, 2971743, 6783392, 6960898, 4300547, 2930534, 4977523, 7285075, 5493851, 760433, -804525, 3531730, 8526446, 7521236, 1549745, -2111002, -122910, 2708748, 1167998, -2507037, -2414009, 1650681, 3652848, 104340, -5459345, -8376993, -8877154, -9192612, -8288768, -3989145, 1559686, 3543196, 1359427, -740713, -525693, -763135, -3560616, -5960440, -4370969, -355741, 1869650, 1898698, 2884481, 5383786, 5788860, 2054217, -2497901, -3437058, -1184340, 10864, -1815097, -4005565, -3409642, -513065, 1851363]
8971A851363M45818p93266j528279k374757k084652L22786K552187J532188j345680
8962a422292j224348K950009N838224K891103k779489m428934j106410J289362
8954B007225j202256m842459l673492J777181M944173K132992k549678k945391
8946d351705R76873L829623K610132r8605j166017j025461q58314L80057K948371
8937C244954L788328J097092j557484n11427J440507k70818l239015j610899K948194
8928E329432K852150k289546m096063K10854K149845l696304r239279n076627
8920a3855538M327375P502536K959790j025763n99782K35475n01494M57598L754946
8911C255143M928552K130703p27833j014422j323671l595658m789433j952588
$$ y = [1851363, 2297181, 1503915, -24364, -2399121, -4483773, -4160987, -1608800, -76612, -1422292, -2646640, 303369, 6141593, 9032696, 6253207, 1824273, 717863, 2007225, 804969, -4037490, -7710982, -5933801, -989628, 1143364, -1406314, -4351705, -3374832, 454791, 3064923, 2966318, 1800301, 774840, -83474, 296583, 3244954, 7033282, 8130374, 6572890, 6061463, 7501970, 7231152, 3992137, 2381238, 5329432, 8181582, 5892036, 1795973, 2006827, 4156672, 460368, -8778911, -13855538, -9528163, -2025627, 934163, -91600, -691382, -455907, -957401, -499803, 3255143, 8183695, 10314398, 9586565, 8572143, 7248472, 3652814, -1136619, -3089207]
8903c089207K290966K754896j836473p371858q172435k220760N785726P863153
8895c995992J888925m611410l624825K686814N744469L002305j52474k62178R0903
8886G66537q35177l92316K394423L553980M92643l360343l620794o80546K403566
8877G21973M084442M067370K372004M97673J54828j08049k945354o499109n997796
8868c652018j817107M05960q64204q23180K123350K659582j426166l721429K08325
8859f906887M162951J046147m880297m568334J284091M005305J075025j125662
8851e907661J358368M486035L511821p42700m692471o061369l985176O55621M353354
8842g024178M211138J944476R76086Q18259q50311k087071Q72350N549463M955378
$$ y = [-3089207, -798241, 1956655, 120182, -7251676, -15424111, -17644871, -11859145, -3995992, -2107067, -6718477, -10343302, -7656488, -1912019, 1090286, 937812, 675634, 766537, -68640, -460956, 1933467, 5487447, 5980090, 2619747, -1001047, -1681593, 721973, 4806415, 8873785, 11245789, 11743462, 11898290, 11790241, 8844887, 2345778, -3652018, -5469125, -5063165, -5927369, -6750549, -4627199, -1967617, -3393783, -7115212, -6906887, -2743936, -1697789, -6578086, -11146420, -9862329, -5857024, -4781999, -5907661, -4549293, -63258, 3448563, 2705863, -1986608, -8047977, -12033153, -11377532, -7024178, -2813040, -868564, 107522, 925781, 75470, -2011601, -1139251, 4410212, 9365590]
8833I365590j444369n815869l549777K46043k57869k595423j468159J898143K496646
8824a125044L88433j69230J120041L55842k524213k429873K067244M858436J304802
8815C846438l768649k871171K269305K748777l703658q409845m290028L541492
8807a0637339N266907K85076l297231j211879K417015L370552K841047K453564
8799A487712N58812k723943k652056K859175P745188N489459j038453l773416
8791G952478j264021N17547j533775l482991j751920J210391J382788q28683k152959
8782D8855j522019p10159r79799j229765L87161L757874O205471N215470J614948
8773A2788037j450580k793695l937888m967769l301929J291041M345549K777814
$$ y = [9365590, 7921221, 2105352, -1444425, -1198382, -1456251, -4051674, -5519833, -3621690, -1125044, -736611, -905841, 214200, 570042, -1954171, -4384044, -2316800, 2541636, 3846438, 77789, -2793382, -524077, 2224700, -1478958, -9888803, -14178831, -10637339, -5370432, -5085356, -8382587, -9594466, -7177451, -3806899, -965852, 1487712, 2046524, -677419, -3329475, -470300, 7274888, 12764347, 11725894, 7952478, 6688457, 7206004, 5672229, 2189238, 437318, 1647709, 3030497, 2201814, 48855, -1473164, -2183323, -3163122, -4392887, -4005726, -247852, 5957619, 11173089, 12788037, 11337457, 8543762, 4605874, -361895, -3663824, -2372783, 1972766, 4750580]
8765D750580k56138p11936j74587j684687k630722J046741N890547M588439j885625
8756H932612m618277n12358L139237Q54325k759689j869874Q29506k01157l442288
8747C52037l409398j12951J738864R24242L40979N05643j033585l649588l152961
8738g496718J174915M289090K592350o93109o71989J589239Q22704l829210o424088
8729h646816k380799M099722M831452r06753m757940j006768N112346N366931
8721A711375P74178r72667J735733K679214o73398k843474o22552Q77784k241346
8712D24847m754349j218958L504369J631271m010526l965383K356831N724301
8704c07597K038441j959485o42164K042322P58785k086689j452597J540262K403038
$$ y = [4750580, 4494442, 3782506, 3607919, 1923232, -707490, 339251, 6229798, 10818237, 8932612, 4314335, 3801977, 6941214, 7795539, 5035850, 3165976, 3995482, 3794325, 352037, -3057361, -3170312, -1431448, -507206, -166227, 339416, -694169, -4343757, -7496718, -6321803, -2032713, 559637, -133472, -805461, 783778, 1606482, -2222728, -8646816, -11027615, -6927893, -2096441, -3003194, -7761134, -8767902, -3655556, 1711375, 2485553, 1512886, 3248619, 5927833, 5254435, 2410961, 1788409, 2666193, 424847, -4329502, -5548460, -2044091, -412820, -4423346, -8388729, -6031898, -307597, 1730844, -228641, -870805, 1171517, 1930302, -156387, -1608984, -68722, 2334316]
8695B334316J283765J709318L302340K042808k415131n161913l025982R13554
8687I83075J828745m69470j975110j22876L218233M538724K895340J77788k049995
8678I024454l979819n383426m354177k18289L935922M383990J613473p16048r84931
8669C321149n82576j01309J459848L162784J995949k096795m758882k997007P20536
8660A23697K458165J967320J289108R66925N97680Q78539K107509K545178J046525
8651A3980646o03718o65347m85647j584654k316158j190706q43540l780807o311238
8642c801169k848786M472947P170572K369544l047600k706572P30518J265470
8634C604924r59941j235109J314275K527598J13214k796817k206613J393875L744459
$$ y = [2334316, 3618081, 5327399, 8629739, 10672547, 8257416, 3095503, 69521, 983075, 2811820, 2342350, 367240, 244364, 3462597, 8001321, 10896661, 11074449, 9024454, 5044635, -338791, -4692968, -4911257, -975335, 3408655, 5022128, 4306080, 3321149, 2738573, 2637264, 4097112, 7259896, 9255845, 7159050, 2400168, -596839, 123697, 2581862, 4549182, 5838290, 6805215, 7402895, 8281434, 10388943, 12934121, 13980646, 13376928, 12711581, 12225934, 10641280, 8325122, 7134416, 6290876, 2510069, -3801169, -6649955, -2177008, 4993564, 7363108, 4315508, 1608936, 2339454, 3604924, 2644983, 1409874, 2724149, 5251747, 5364961, 2568144, 361531, 1755406, 5499865]
8625E499865J703703l428653p027120n484282J17952M835072M773333R54780k031017
8616h6367r57549K728881M507319J847634k521604l568119m43094K168002O66628
8607D341731k236653k191864n87900j931139m931283l142206M014438Q020981
8599A356105L187500m218485m737972Q05724L783214J101133j903610j504359
8591b130750n28319j371268j129349K520411N911885M554825K13674j897055q36640
8582E307414k89980k162585m005657l072974J17132K821807K695539n35472m151907
8573c276683l882482J171498N681658L665302k895963n254989N43832P557395
8565C309568O950867k10357n206005l914436q20931n69706j771969j668408j421870
$$ y = [5499865, 7203568, 3774915, -3252205, -8736487, -8618535, -3783463, 989870, 1944650, -86367, -1043916, 1684965, 6192284, 8039918, 5518314, 1950195, 1507101, 3675103, 4341731, 2105078, -86786, -674686, -2605825, -7537108, -10679314, -6664876, 1356105, 4543605, 325120, -4412852, -3607128, 176086, 1277219, -626391, -2130750, -2659069, -4030337, -5159686, -2639275, 3272610, 7827435, 8041109, 6144054, 5307414, 5017434, 2854849, -1150808, -4223782, -4106650, -1284843, 1410696, 875224, -3276683, -7159165, -5987667, -306009, 3359293, 463330, -4791659, -4247827, 3309568, 10260435, 10050078, 4844073, 929637, 108706, -461000, -2232969, -3901377, -5323247]
8556e323247k564905k411260J691805O288404N715875O10737l140780l101154
8548b234525j967824q90958K012725N379502M173991j527109m321088n04654L169304
8539C289364j71579o003822n089881J948088N595382J857559k931645k757070
8531d263604K12235J014350q12413k580372k815642j370527J540149M150565L900469
8522a024790J111602r27601p52334l31837q18026o24946O30921N20890j506592
8513c722713k040044N90434K527450K78000l022966k048075K317208M186826J383496
8504D49616j939231j661507J377643L786945L807731J806775j126089l643378
8496B858505m515745l672188k310625j474463r05863L81440K417958L372748J212254
$$ y = [-5323247, -7888152, -10299412, -8607607, -2319203, 3396672, 4007409, 866629, -2234525, -4202349, -5093307, -3080582, 2298920, 6472911, 4945802, 624714, 120060, 3289364, 3117785, -2886037, -7975918, -6027830, -432448, 1425111, -1506534, -4263604, -4051369, -3037019, -3849432, -6429804, -9245446, -10615973, -9075824, -4925259, -1024790, 86812, -840789, -1593123, -1924960, -2742986, -3367932, -2737011, -2216121, -3722713, -5762757, -5172323, -2644873, -2366873, -5389839, -7437914, -5120706, -933880, 449616, -1489615, -3151122, -1773479, 2013466, 5821197, 7627972, 6501883, 2858505, -1657240, -5329428, -7640053, -9114516, -10020379, -9638939, -7220981, -3848233, -2635979]
8487b635979k984488m704222j157399M133681N110596J426892j078090Q57739
8479a031270L176124J145908l214867m333776j162979K106523K152125j98838
8471a361050k146676j724834Q74528K990764J985970n71433q7783L639797M340798
8462G940081j473198p404489n341573K244857N483024J336295l137644k364165
8454b716812N23681N05449j731908k639570j499421L01693K134347L268120K188627
8445C34206p68546k897998l007886k688547k400316l78572K829809L505979J067363
8436d404508K79026L547367N879467K356359l508641m633436o94738K362931J399285
8427B583112j046662k094962j574355l2207J920538K602446J363380P43238K643824
$$ y = [-2635979, -5620467, -10324689, -11482088, -7348407, -2237811, -810919, -1889009, -1031270, 2144854, 3290762, 75895, -4257881, -5420860, -3314337, -1162212, -1361050, -3507726, -5232560, -4358032, -1367268, 618702, 47269, -40514, 3599283, 7940081, 6466883, -937606, -6279179, -4034322, 1448702, 2784997, -352647, -2716812, -2193131, -1687682, -3419590, -6059160, -7558581, -7256888, -5122541, -1854421, 334206, -434340, -3332338, -6340224, -9028771, -11429087, -11807659, -8977850, -5471871, -4404508, -4125482, -578115, 5301352, 7657711, 4149070, -484366, -1179104, 1183827, 2583112, 1536450, -558512, -2132867, -2165074, -244536, 2357910, 3721290, 4464528, 7108352]
8418G108352L867795K63347n890861q064233m553531M9795K282375K988622K810612
8409H62273N71820k590226l110674o36473J322757J561548K426615L771608K240362
8400F419610j443660j721714K111415L079864k027729o118817l105316J507781
8392a298566k40010m942689l318901M054388P408615L242010j279792n14226K257265
8383E368094K099239n34719k910053l890999k303970K666265P319561N766371
8375A3579789j209811n714833l770654m25393p12681k280556j488063m06851j893672
8366d322725k977081J60912M413908L776313j226532m408098k819791O55897K578359
8357d168838K119542P795j621953J48889M619674N976955Q58537n121047m239256
$$ y = [7108352, 10976147, 11239494, 5348633, -2715600, -7269131, -7219336, -4936961, -1948339, 862273, 1434093, -1156133, -4266807, -4903280, -3580523, -2018975, 407640, 4179248, 6419610, 4975950, 3254236, 5365651, 8445515, 6417786, 298969, -2806347, -1298566, -1538576, -6481265, -9800166, -5745778, 1662837, 4904847, 3625055, 3110829, 5368094, 7467333, 6932614, 4022561, 131562, -2172408, 493857, 7813418, 13579789, 12369978, 6655145, 2884491, 2459098, 1746417, -534139, -2022202, -2429053, -4322725, -7299806, -7138894, -2724986, 1051327, -175205, -4583303, -7403094, -6747197, -4168838, -2049296, -2041501, -3663454, -3514565, 1105109, 7082064, 7940601, 2819554, -1419702]
8348a419702J868196M411381L94123l958390l605364j347154j403355k442899
8340g503164j095656J826248L062298K445960K655371M336374M783530J939894
8332A2450855k249144l743980j403735J247696M87991k425390l324523k011732
8324i71962k598004n661002n625568K76370N753340M067768j272927j820882K501187
8315e351680L784061q89951n300947m100859M49592L741919M394136K532768j427524
8306b168485m114971j215370N358821P888132L061821l511551n581165l715248
8298c998016j703415p93013p11390j676863k376153l98832K944703L226663M07123
8289e079193k32321K817127M134825Q99811j705274M49439L042946J071148k399372
$$ y = [-1419702, 448494, 4859875, 5253998, 1295608, -2309756, -3656910, -5060265, -7503164, -8598820, -6772572, -3710274, -1264314, 1391057, 5727431, 10510961, 12450855, 10201711, 6457731, 5053996, 6301692, 6789683, 4364293, 1039770, -971962, -3569966, -9230968, -14856536, -14580166, -8826826, -4759058, -6031985, -7852867, -5351680, -1567619, -2457570, -7758517, -11859376, -11409784, -7667865, -3273729, -740961, -2168485, -6283456, -7498826, -2140005, 5748127, 8809948, 5298397, -282768, -3998016, -5701431, -6494444, -7205834, -8882697, -11258850, -11657682, -8712979, -5486316, -5079193, -5311514, -2494387, 1640438, 2540249, 834975, 1284414, 4327360, 5398508, 2999136]
8280B999136k136478K74634O78338M15267K333567L393908l28362n133813m931206
8271b435009j740618j844845m043157j602038N245562Q681720N575179J258397
8263I095191j90682j020328l169184m088741j881378J282275L010239L174660
8255F212052J819936m89378n94285L133864N437972J65673q793582j0955139m318365
8246h381252J982909J989585M59650K546465N074393L512507J4550j519613k100861
8237C578333l515341l340797j02348K012633n3055j788965J517967N464839K646521
8228F419787m833798p491887k310233L364337K752894j891198l893227q85189
8220h768514L432446M114320K90581l660843k911755J402850L188400K06413k179926
$$ y = [2999136, 862658, 1137292, 1815630, 2230897, 4564464, 7958372, 7630010, 2496197, -2435009, -4175627, -6020472, -10063629, -11665667, -6420105, 2261615, 7836794, 9095191, 8904509, 7884181, 4714997, 626256, -1255122, 27153, 3037392, 6212052, 8031988, 7542610, 6948325, 10082189, 15520161, 15685834, 6892252, -4062887, -8381252, -6398343, -4408758, -3949108, -1402643, 3671750, 7184257, 7198807, 5679194, 3578333, 62992, -3277805, -3380153, -1367520, -1420575, -3209540, -1691573, 3773266, 6419787, 1585989, -5905898, -8216131, -4851794, -2098900, -3990098, -7883325, -8768514, -5336068, -1221748, -931167, -4592010, -7503765, -6100915, -2912515, -2706102, -4886028]
8211d886028N84486M446886K937833k116172l284788M61532K404009n21367k916698
8202b890307m87516K692698J460485j432755j11028L991613L812415k025438o628364
8193a618197m944454l56615J686817J366086J565460J580194n01566j984480R46249
8184b260506N039803L077681l934457o047256P22810O929304L275909n222210
8176A581078o977577q74738M037298L199901O98299n49598k397190m043635j124761
8167f450923M847459N707214l98822m296994K88538O496304N251106q25005l078434
8158G540443q37160j43887j951433j480509J805764K747458m06785l183890k521623
8149A568378p15424k32892l24700l63435j285972k088811K3331M059424M744836
$$ y = [-4886028, -4301542, 145344, 3083177, 967005, -2317783, -1856251, 547758, 26391, -2890307, -3377823, -685125, 775360, -657395, -768423, 3223190, 7035605, 5010167, -1618197, -6562651, -6919266, -5232449, -3866363, -2300903, -720709, -1222275, -3206755, -2260506, 2779297, 5856978, 1922521, -4124735, -3401925, 3527379, 6803288, 1581078, -5396499, -6271237, -2233939, 965962, 1664261, 1114663, -1282527, -5326162, -6450923, -1603464, 4103750, 3704928, -592066, -303528, 6192776, 11443882, 10618877, 7540443, 6703283, 6559396, 4607963, 3127454, 4933218, 7680676, 7273891, 4090001, 1568378, 852954, 620062, 295362, -68073, -1354045, -3442856, -3419525, 639899, 5384735]
8140E384735J80538m377761l578092O62353K326387n54565m264014m578523q99317
8131i698259L992512O323045M185432l58843k692509n93381K786872K343803k744247
8122C544425p571323o867366j067452M095023M283999J449105M53712J956483
8114B76606J922557j351865l825874j893253J582771J613115r51539j083561J766005
8105a945038K657112l05799k381074L7991L198747K031924j370556j198436K017250
8096B742121J675970l639879o002584N56682R475868R054836j202155q955484
8088C705375n384837L442294N914037N01270m510704m228533k260128k268046
8080e089272k037534Q45903L377261J923883j334554j799411K67317R34123l53001
$$ y = [5384735, 5565273, 1187512, -2390580, -1728227, 598160, 43595, -4220419, -8798942, -9698259, -5705747, 617298, 4802730, 4443887, 1751378, 1157997, 3944869, 6288672, 3544425, -4026898, -10894264, -11961716, -7866693, -3582694, -2133589, -1679877, 276606, 2199163, 847298, -2978576, -4871829, -3289058, -1675943, -2627482, -3711043, -1945038, 712074, 406275, -1974799, -1936808, 1261939, 3293863, 1923307, 724871, 2742121, 4418091, 778212, -5224372, -4667690, 4808178, 13863014, 12660859, 3705375, -1679462, 1762832, 7676869, 8178139, 3667435, -561098, -2821226, -5089272, -7126806, -6280903, -2903642, -979759, -2314313, -4113724, -3846407, -2912284, -3265285]
8071c265285p2071K963224N028127K717418k280234n289130l876578J34041K904967
8062a035521K208938p22329k858184k771023j442805K53578K728683N383240N620068
8053G364645K225005k130385m034198l374021j972839q6869K702528M570285L073789
8044H337940p11744l008887k419094j297846j722447k789156k723723j547178
8036g882135n59132l80212l07979P32526K588704L379854J780447k73927M00250
8027e21604K915454K548507j776875m397058j093692L446739J999183l863085
8019g42431n648735o19377M494191L837407O5776j264009K70284J297194L38314
8010B028614j617241l734907n284993m832278k109519R38589K892465M409329
$$ y = [-3265285, -3337356, -374132, 4653995, 7371413, 5091179, -197951, -4074529, -3940488, -1035521, 1173417, 451088, -2407096, -5178119, -6620924, -6367346, -3638663, 1744577, 7364645, 9589650, 7459265, 3425067, 51046, -1921793, -2008662, 693866, 5264151, 8337940, 7626196, 4617309, 2198215, 900369, -822078, -3611234, -6334957, -7882135, -8441267, -8821479, -9129458, -8396932, -5808228, -2428374, -647927, -921854, -521604, 2393850, 4942357, 3165482, -1231576, -2325268, 1121471, 3120654, -742431, -6391166, -7010543, -2516352, 1321055, 1386831, 122822, 393106, 1690300, 2028614, 411373, -3323534, -8608527, -13440805, -15550324, -14611735, -11719270, -7309941]
8002g309941N192390K665847l107915o330399k142210N276685O805966N94657
7994A645080n354285m412714J41005J398503n53935Q3384M494027O519571J888102
7985E848738m803172n950450r35540L880518L963483J269627j27391O09181J513073
7976E268067J033686q21774k894604l236204o63499K990369L880414O61386l535819
7967B682022m947345l582340k350993k892758l736920k226588K315267O946260
7959g793395P162100K035878l506045m023354m91993J549408L77327j65909J876372
7950b979611K921838L42891k441412j345981J906449L032651J627013j7880j463384
7941A582574k814497j729993K918826O578720L972125k616196n609598k356436
$$ y = [-7309941, -2117551, 548296, -2559619, -8890018, -11032228, -5755543, 1050423, 1645080, -3709205, -8121919, -7980914, -6582411, -7136346, -7052962, -2558935, 3960636, 5848738, 1045566, -4904884, -5840424, -1959906, 2003577, 3273204, 3145813, 3754994, 5268067, 6301753, 5479979, 2585375, -650829, -1314328, 1676041, 5556455, 6217841, 2682022, -2265323, -5847663, -8198656, -11091414, -14828334, -17054922, -14739655, -7793395, -631295, 1404583, -2101462, -6124816, -6616809, -5067401, -4690074, -4855983, -2979611, -57773, 285118, -2156294, -3502275, -1595826, 1436825, 3063838, 3045958, 1582574, -1231923, -2961916, -43090, 6535630, 10507755, 7891559, 2281961, -74475]
7933g4475K122885K828246M22159j698929j978117r98865J35647P18336J022903
7924B499790J669266J754003k92099k937870k302103J195065J711259k799286
7916D98025n645589j327049M799110M344503q46268k324599Q57117J758380j677164
7907D36466l794738k006917n31504j283265l46249L334917M378226J99706l629585
7898c242943j793657L137909N619224M294385Q15767l215443n066381j979444
7890a430583L651094N467415J881738j998440l012694l763969n567491n237251
$$ y = [-74475, 2048410, 4876656, 5298815, 3599886, 1621769, 622904, 758551, 1476887, 2499790, 4169056, 5923059, 5630960, 2693090, 390987, 1586052, 3297311, 498025, -5147564, -6474613, -1675503, 2669000, 1822732, -501867, 355250, 2113630, 436466, -3358272, -5365189, -5896693, -7179958, -7526207, -4191290, 186936, 386642, -3242943, -5036600, -1898691, 3720533, 8014918, 8830685, 5615242, 548861, -1430583, 2220511, 7687926, 9569664, 7571224, 4558530, 794561, -4772930, -10010181]
$$ [...]
##END NTUPLES=NMR SPECTRUM
##END=
