##TITLE=31Pdec_SR92
 dmso, 124 sc
 28.10.2021
##JCAMPDX= 6.0         $$ Bruker NMR JCAMP-DX V2.0
##DATA TYPE= NMR SPECTRUM
##DATA CLASS= NTUPLES
##ORIGIN= UXNMR, Bruker Analytische Messtechnik GmbH
##OWNER= root
$$ XWIN-NMR		Version 3.5
$$ Thu Oct 28 10:44:31 2021 Russian Standard Time (UT+4h)  she@DPX200
##.OBSERVE FREQUENCY= 81.013821
##.OBSERVE NUCLEUS= ^31P
##.ACQUISITION MODE= SIMULTANEOUS
##.ACQUISITION SCHEME= undefined
##.AVERAGES= 124
##.DIGITISER RES= 16
##SPECTROMETER/DATA SYSTEM= spect
##.PULSE SEQUENCE= zgpg30
##.SOLVENT NAME= DMSO
##.SHIFT REFERENCE= (INTERNAL, DMSO, 0, 248.564)
##AUDIT TRAIL= $$ (NUMBER, WHEN, WHO, WHERE, WHAT)
$$ ##TITLE= Audit trail, XWIN-NMR		Version 3.5
$$ ##JCAMPDX= 5.01
$$ ##ORIGIN= Bruker BioSpin GmbH
$$ ##OWNER= she
$$ F:/spectra/data/she/nmr/P31/1/pdata/1/auditp.txt
$$ ##AUDIT TRAIL=  $$ (NUMBER, WHEN, WHO, WHERE, WHAT)
(   1,<2021-10-28 10:42:45.00 +0400>,<she>,<DPX200>,
      <continue with go, POWCHK disabled, PULCHK disabled
       configuration hash MD5:
       00 E9 B6 7A A2 85 ED C7 34 08 36 98 17 FE 4E 26
       data hash MD5: 32K
       C7 AD FA 51 11 0C 12 BA 53 E7 6F 68 B2 2A A0 F7>)
(   2,<2021-10-28 10:42:52.60 +0400>,<she>,<DPX200>,
      <Start of raw data processing
       efp BC_mod = 2 LB = 1 FT_mod = 6 PKNL = 1 PHC0 = -8984.781 PHC1 = 409.2694 SI = 64K 
       data hash MD5: 64K
       95 3F B4 D5 D6 29 81 31 9B D9 39 41 6B BB A1 B3>)
(   3,<2021-10-28 10:43:45.60 +0400>,<she>,<DPX200>,
      <pk PHC0 = -3.002959 PHC1 = 0 
       data hash MD5: 64K
       0B EE 70 65 FF 0F 80 CB 03 4A 75 71 58 3E 42 8B>)
$$ ##END=
$$ 
$$ hash MD5
$$ 26 9F D2 C9 E4 BD 33 CF 6A 88 1E CD CD 61 9B E1
##$RELAX= 
##$RELAX= 
##$RELAX= 
##$RELAX= 
##$RELAX= 
##$RELAX= 
##$RELAX= 
##$RELAX= 
$$ Bruker specific parameters
$$ --------------------------
##$DU= <F:/spectra>
##$EXPNO= 1
##$NAME= <P31>
##$PROCNO= 1
##$TYPE= <nmr>
##$USER= <she>
##$AMP= (0..31)
100 100 100 100 100 100 100 100 100 100 100 100 100 100 100 100 100 100 
100 100 100 100 100 100 100 100 100 100 100 100 100 100 
##$AQSEQ= 0
##$AQ_mod= 1
##$AUNM= <au_zg>
##$AUTOPOS= <>
##$BF1= 81.014009
##$BF2= 200.13
##$BF3= 200.13
##$BF4= 200.13
##$BF5= 200.13
##$BF6= 200.13
##$BF7= 200.13
##$BF8= 200.13
##$BYTORDA= 1
##$CFDGTYP= 0
##$CFRGTYP= 5
##$CHEMSTR= <none>
##$CNST= (0..31)
1 1 145 1 1 1 1 1 1 1 1 1 1 1 1 1 1 1 1 1 1 1 1 1 1 1 1 1 1 1 1 1 
##$CPDPRG= <waltz16>
##$CPDPRG1= <>
##$CPDPRG2= <waltz16>
##$CPDPRG3= <>
##$CPDPRG4= <mlev>
##$CPDPRG5= <mlev>
##$CPDPRG6= <mlev>
##$CPDPRG7= <mlev>
##$CPDPRG8= <mlev>
##$CPDPRGB= <>
##$CPDPRGT= <>
##$D= (0..31)
0 1 0 0 0 0 0 0 0 0 0 0.03 2e-05 3e-06 0 0 0 0 0 0 0 0 0 0 0 0 0 0 0 0 
0 0 
##$DATE= 1635403196
##$DBL= (0..7)
120 120 120 11 120 120 24 19 
##$DBP= (0..7)
150 150 150 150 150 150 150 150 
##$DBP07= 0
##$DBPNAM0= <>
##$DBPNAM1= <>
##$DBPNAM2= <>
##$DBPNAM3= <>
##$DBPNAM4= <>
##$DBPNAM5= <>
##$DBPNAM6= <>
##$DBPNAM7= <>
##$DBPOAL= (0..7)
0.5 0.5 0.5 0.5 0.5 0.5 0.5 0.5 
##$DBPOFFS= (0..7)
0 0 0 0 0 0 0 0 
$$ [...]
##$SUBNAM2= <"">
##$SUBNAM3= <"">
##$SUBNAM4= <"">
##$SUBNAM5= <"">
##$SUBNAM6= <"">
##$SUBNAM7= <"">
##$SUBNAM8= <"">
##$SUBNAM9= <"">
##$SW= 501.771253377433
##$SWIBOX= (0..15)
0 1 3 0 0 0 0 0 0 0 0 0 0 0 0 0 
##$SW_h= 40650.406504065
##$TD= 32768
##$TD0= 1
##$TE= 0
##$TE2= 300
##$TE3= 300
##$TEG= 300
##$TL= (0..7)
0 120 53 12 22 120 120 120 
##$TP= (0..7)
150 150 150 150 150 150 150 150 
##$TP07= 0
##$TPNAME0= <>
##$TPNAME1= <>
##$TPNAME2= <>
##$TPNAME3= <>
##$TPNAME4= <>
##$TPNAME5= <>
##$TPNAME6= <>
##$TPNAME7= <>
##$TPOAL= (0..7)
0.5 0.5 0.5 0.5 0.5 0.5 0.5 0.5 
##$TPOFFS= (0..7)
0 0 0 0 0 0 0 0 
##$TUNHIN= 0
##$TUNHOUT= 0
##$TUNXOUT= 0
##$USERA1= <user>
##$USERA2= <user>
##$USERA3= <user>
##$USERA4= <user>
##$USERA5= <user>
##$V9= 5
##$VALIST= <valist>
##$VCLIST= <CCCCCCCCCCCCCCC>
##$VD= 0
##$VDLIST= <DDDDDDDDDDDDDDD>
##$VPLIST= <PPPPPPPPPPPPPPP>
##$VTLIST= <TTTTTTTTTTTTTTT>
##$WBST= 1024
##$WBSW= 4
##$XGAIN= (0..3)
0 0 0 0 
##$XL= 0
##$YL= 0
##$YMAX_a= 3256
##$YMIN_a= -3163
##$ZGOPTNS= <>
##$ZL1= 120
##$ZL2= 120
##$ZL3= 120
##$ZL4= 120
##$ABSF1= 0
##$ABSF2= 0
##$ABSG= 0
##$ABSL= 0
##$ALPHA= 0
##$AQORDER= 0
##$ASSFAC= 0
##$ASSFACI= 0
##$ASSFACX= 0
##$ASSWID= 0
##$AUNMP= <proc_1d>
##$AZFE= 0.1
##$AZFW= 0.5
##$BCFW= 0
##$BC_mod= 2
##$BYTORDP= 0
##$COROFFS= 0
##$CY= -3
##$DATMOD= 1
##$DC= 0
##$DFILT= <>
##$DTYPP= 0
##$F1P= 0
##$F2P= 0
##$FCOR= 1
##$FTSIZE= 65536
##$FT_mod= 6
##$GAMMA= 0
##$GB= 0
##$INTBC= 1
##$INTSCL= 5.30512e-09
##$ISEN= 30
##$LB= 1
##$LEV0= 0
##$LPBIN= 0
##$MAXI= 10000
##$MC2= 0
##$MEAN= 0
##$ME_mod= 0
##$MI= 50
##$NCOEF= 0
##$NC_proc= -6
##$NLEV= 6
##$NOISF1= 182.463
##$NOISF2= 159.3651
##$NSP= 0
##$NTH_PI= 0
##$NZP= 0
##$OFFSET= 248.5645
##$PC= 4
##$PHC0= -8987.784
##$PHC1= 409.2694
##$PH_mod= 1
##$PKNL= yes
##$PPARMOD= 0
##$PSCAL= 0
##$PSIGN= 0
##$REVERSE= no
##$SF= 81.014009
##$SI= 65536
##$SIGF1= 159.3651
##$SIGF2= -187.1042
##$SINO= 113.3802
##$SIOLD= 16384
##$SREGLST= <1H.CDCl3>
##$SSB= 0
##$STSI= 65536
##$STSR= 0
##$SW_p= 40650.406504065
##$SYMM= 0
##$S_DEV= 0
##$TDeff= 32768
##$TDoff= 0
##$TI= <>
##$TILT= no
##$TM1= 0
##$TM2= 0
##$TOPLEV= 0
##$USERP1= <user>
##$USERP2= <user>
##$USERP3= <user>
##$USERP4= <user>
##$USERP5= <user>
##$WDW= 1
##$XDIM= 65536
##$YMAX_p= 245892594
##$YMIN_p= -250413103
$$ End of Bruker specific parameters
$$ ---------------------------------
##NTUPLES= NMR SPECTRUM
##VAR_NAME=  FREQUENCY,     SPECTRUM/REAL,   SPECTRUM/IMAG
##SYMBOL=    X,             R,               I
##VAR_TYPE=  INDEPENDENT,   DEPENDENT,       DEPENDENT
##VAR_FORM=  AFFN,          ASDF,            ASDF
##VAR_DIM=   65536,         65536,           65536
##UNITS=     HZ,            ARBITRARY UNITS, ARBITRARY UNITS
##FACTOR=    0.620285442955139, 1,           1
##FIRST=     20137.2065510759, 0,            0
##LAST=      -20513.1999529892, 0,           0
##MIN=       -20513.1999529892, -250413103,  0
##MAX=       20137.2065510759, 245892594,    0
$$ Real data points
##PAGE= N=1
##DATA TABLE= (X++(R..R)), XYDATA
$$ [...]
##PAGE= N=2
##DATA TABLE= (X++(I..I)), XYDATA
13128b80024j812852J74031K293531J281130p56750k32132J536540R71316j101240
13119B073550r86438J089077J397277n53338j247373M77821J499214l2110j785818
13110A931862j467382o2175O88041O54335j34292j976175l339169j709331K052488
13101c361798L742336J714717q58518j263860p94732q41668K56947L140181M116861
13092E850466L29267m579244m741193l54119K906432J873981j078778k749886
13084b543074k716189j723334J6462J873300K645281K178342J355585L86584r97243
13075D75714j942925j345211n3354K23276j05050O07176J655276O55290j922711
13066a752519k609190l91188J387678L89951j011869m4202J595216P36626j584074
$$ y = [-280024, -2092876, -1918845, 374686, 1655816, 899066, 666934, 2203474, 3174790, 2073550, 1087112, 2176189, 3573466, 3020128, 1772755, 2250576, 3749790, 3717680, 1931862, 464480, 402305, 1090346, 1744681, 1610389, -365786, -3704955, -5414286, -3361798, 380538, 2095255, 1236737, -27123, -821855, -1663523, -1406576, 1733605, 5850466, 6179733, 1600489, -3140704, -3494823, -588391, 1285590, 206812, -2543074, -5259263, -6982597, -6966135, -5092835, -2447554, -269212, 1086373, 1472957, 475714, -1467211, -2812422, -2865776, -2642500, -2747550, -2140374, -485098, 170192, -1752519, -4361709, -4752897, -3365219, -2975268, -3987137, -4031339, -2436123, -1699497, -3283571]
13057c283571j563320J183063K944221J661767k58506n3696J352916J300334m27206
13048B856002j498465n18895J099543J047804r49767k695430k024542O11534K637037
13039E64821K421470R20557j97182q36572j685223k192348j273568L20995N05317
13030a451733r13705j532271J92259K465580K493280J82104j873833j493279J037323
13021h94275L449688L274523m2442l974039m879390k162867P27688P65354p03294
13012d439054n45958J067702J315104j59636n87243Q78852J373946o37428k164656
13003c898371m32356K165854J679568q74778j084460J637509L174325J452979
12995C820270n54077j26820J078894P26257P0979J157276K375338Q22451k351074
$$ y = [-3283571, -4846891, -3663828, -719607, 942160, 683654, 629958, 1982874, 3283208, 2856002, 1357537, 838642, 1938185, 2985989, 2036222, -659208, -2683750, -2072216, 564821, 2986291, 3906848, 3709666, 2873094, 1187871, -1004477, -2278045, -1957050, -1451733, -2365438, -3897709, -3705450, -1239870, 1253410, 1435514, -438319, -1931598, -894275, 2555413, 5829936, 5787494, 1813455, -3065935, -5228802, -4501114, -3735760, -4439054, -4985012, -3917310, -2602206, -2761842, -3349085, -2470233, -1096287, -1733715, -3898371, -4330727, -2164873, -485305, -1360083, -2444543, -807034, 2367291, 3820270, 3266193, 3139373, 4218267, 4944524, 5015503, 6172779, 8548117, 9370568, 7019494]
12986G019494l086059n75849J545068O66362j537095k371314j677158n95366O63145
12977E1228J847330J510566q44213k836295j869515J008535K269726O79955j366114
12968D51203j510887k67981O00934P00193O90015O26801J35216m04345k55563
12959G65586L54059N65301L98751O04486R24571P8307j852204k588023o61105
12950a410271J806493J372033j902049m090126k507835Q48947K363665J647133
12942a872010J165024J873994J888557j06678k445606k781921j254643K32044
12934c301239R19048J581226K345000K020046J60832j616075j457484K58206J390813
12925B300373Q21430k93847l90674K94029L05870o28531j090143k46414O19743
$$ y = [7019494, 3933435, 3357586, 4902654, 5569016, 4031921, 1660607, -16551, -611917, 51228, 1898558, 3409124, 2564911, -271384, -2140899, -1132364, 1137362, 1817317, 451203, -1059684, -1327665, -726731, -26538, 663477, 1290278, 1425494, 1021149, 765586, 1119645, 1684946, 2083697, 2688183, 3612754, 3691061, 1838857, -749166, -1410271, 396222, 1768255, -133794, -4223920, -6731755, -5882808, -3519143, -1872010, -706986, 1167008, 3055565, 2948887, 503281, -2278640, -3533283, -3301239, -2382191, -800965, 1544035, 3564081, 3724913, 2108838, 651354, 909560, 2300373, 3121803, 2827956, 2437282, 2731311, 3037181, 2408650, 1318507, 1072093, 1691836]
12916A691836L7417j044516m11278J742450K494264N00692j480625m14861K146964
12907E262343J989903j336949l449024j568733J230015P47115j855101k014900
12899i95331Q86609K507715M56302k007549j314481Q83182Q53604j010010j275975
12890a015934M39713J007760n01909j187864K92008J008100j049642k828443r03055
12881d739266K492981K591738l28654j368058J224968L549698K366346m54331
12873E335422j813742j984852k526543k546722m96964K111102K289594O2760j700025
12864a269970j542681o79146j42248M43035Q79037j3215j826112k010007N75784
12855e585523L349344L067453J37698j945151j089748J076658J666212J76552
$$ y = [1691836, 1729253, 684737, 273459, 2015909, 4510173, 5010865, 3530240, 3115379, 5262343, 7252246, 5915297, 2466273, 897540, 2127555, 2874670, 1019569, -995331, -108722, 2398993, 2855295, 847746, -466735, 416447, 1270051, 260041, -1015934, -576221, 431539, -70370, -1258234, -966226, 41874, -1007768, -3836211, -4739266, -2246285, 345453, 16799, -1351259, -126291, 3423407, 5789753, 5335422, 3521680, 1536828, -989715, -3536437, -4033401, -1922299, 367295, 430055, -1269970, -2812651, -3491797, -3634045, -3191010, -2311973, -2325188, -4151300, -6161307, -5585523, -2236179, 831274, 968972, -976179, -2065927, -989269, 676943, 853495]
12847H53495j174798n31930J142540J498548K25094n54342K11121N53346j261191
12838I61883l177346j856720J915035L596016J138877k216776k653998n45900
12830b838929J267685J624358J239236N45101l12696n65624j0336L3906j137786
12821a55085j939295j070775q9800p27867j357746L96535K901925K600101J49066
12812G07059l39440J623194J888896r05032k373164L24617L224116J719825k038349
12803C831722k863699p07389L06730q46384j415959o20562m71640q77772M99950
12794c165003K749759J734946k558202m199755M7356N046014M409708l64281k743571
12785I56971p58296J455152Q38526q24636r53017j6033J72981n76490j117072
$$ y = [853495, -321303, -853233, 289307, 1787855, 2012949, 1458607, 1669728, 2223074, 961883, -2215463, -4072183, -2157148, 1438868, 2577745, 360969, -2293029, -2838929, -1571244, 53114, 1292350, 1837451, 1524755, 959131, 948795, 982701, -155085, -2094380, -3165155, -3254955, -3982822, -5340568, -4944033, -2042108, 557993, 707059, 367619, 1990813, 3879709, 2974677, 601513, 926130, 4150246, 5870071, 3831722, 968023, 260634, 567364, -279020, -1694979, -2315541, -2787181, -3664953, -3165003, -415244, 1319702, -1238500, -5438255, -5390899, -344885, 4064823, 3700542, 956971, 198675, 1653827, 2492353, 1667717, 714700, 698667, 871648, 295158, -821914]
12776h21914p36885L79614J539996J935263J370398N82794J45588m11329j430940
12767B552585j940525j053461K54454M65082j14810j64561K40658K04612K47325
12758F91359J314195K042345K04485k989360l503117l26220K639463K157193J9599
12749B249942m08632O96530Q81597j23301m68296K02386K73928q09851j615972
12740H78331j196311m98867o93215j468485j610706m81793J369652K591956K131441
12731A022003M09734r17766p91673J82808Q27755O94685j36554j348828j800577
12722a858413j33177K899520M198853J976837j606100l137908k106570n45837
12714c12795K17703K64409m10200j585408j744965J12484K164484J932723K09329
$$ y = [-821914, -1558799, -1179185, 360811, 2296074, 3666472, 4249266, 4394854, 3983525, 2552585, 612060, -441401, -186947, 278135, 163325, -1236, 239422, 444034, 691359, 2005554, 4047899, 4252384, 1263024, -2240093, -2566313, 73150, 2230343, 2249942, 1841310, 2537840, 3419437, 3296136, 2827840, 3030226, 3304154, 2494303, 878331, -317980, -816847, -1510062, -2978547, -4589253, -5071046, -3701394, -1109438, 1022003, 1431737, 513971, -277702, -94894, 732861, 1427546, 1290992, -57836, -1858413, -1991590, 907930, 5106783, 7083620, 5477520, 2339612, 233042, -312795, -95092, 169317, -240883, -1826291, -3571256, -3458772, -1294288, 638435, 847764]
12705H47764j80858Q81002Q47970o52554j034136L12525M90592j666199k891679
12696c045573q31476J534016N46945j903225j322057J957184L208435P96267j575731
12687f35215r66722P18024O34813m66422k84961Q45871Q58475k37533m86036L57736
12677C38030J81123j744193k813181o42294K886867L507001K90003k860395k353214
12668c210253M32831J513794N8067q70981P13245K734604K262843k69997j892985
12659A471168j124202N80594J093538J763j299391j174339M96695J874360J079147
12650B999333j225373k300141r43176Q07890O84914n74088p15681M37277J052205
12641B23160M24273j92333L5612L18514r1084o52381o27348k20803K503k5121
$$ y = [847764, 666906, 1547908, 2395878, 1743324, 709188, 1021713, 1512305, -153894, -3045573, -3877049, -2343033, -1796088, -3699313, -5021370, -3064186, 144249, 940516, -635215, -1601937, -883913, -249100, -715522, -1000483, -154612, 703863, 466330, -19706, 338030, 519153, -1225040, -4038221, -4680515, -1793648, 1713353, 2003356, -857039, -3210253, -2777422, -1263628, -1205561, -2076542, -1363297, 1371307, 3634150, 3364153, 1471168, 346966, 927560, 2021098, 2022861, 723470, -450869, 45826, 1920186, 2999333, 1773960, -526181, -1469357, -661467, 23447, -550641, -1266322, -829045, 223160, 647433, 455100, 490712, 809226, 718142, 65761, -561587, -782390, -779887, -805008]
12631h05008o3154M1434L71616P98969Q64156L76322j43414k82509m65889r68573
12621b76050r45571K29330J349424Q05552q07957j388521l77900Q63740J561437
12612A013484K114309K092861K86191k536398l501320j541947Q13716J068968
12604a90136J16185J90541J285430J736493J104227L51568m6979l30467m18592
12595C798270k17119k88413q34116q79151R5734P65193j29928j584782j946306
12586a220618j557739j489322q15856J774440M290362L045607j572785m526751
12578b072662k708598J005952K208054P22615n83135n60411k74203m0761Q15149
12569a488000J659042R64477q24362j488257m74351M41672N53268J423306L348478
$$ y = [-805008, -868162, -826728, -455112, 343857, 1208013, 1584335, 1440921, 1158412, 692523, -276050, -1221621, -992291, 357133, 1162685, 354728, -1033793, -1411693, -547953, 1013484, 3127793, 5220654, 5506845, 2970447, -530873, -2072820, -1259104, -190136, -73951, 116590, 1402020, 3138513, 4242740, 4594308, 4547329, 4216862, 3798270, 3581151, 3292738, 2458622, 1579471, 1675205, 2440398, 2310470, 725688, -1220618, -2778357, -4267679, -5083535, -3309095, 981267, 4026874, 2454089, -2072662, -4781260, -3775308, -1567254, -844639, -1427774, -1988185, -2262388, -2303149, -1488000, 171042, 1135519, 311157, -1177100, -1651451, -1209779, -656511, 766795, 4115273]
12560D115273L561099M03697l083877l042883o72564k96764k265934k426936O42396
12551c066493K810955J204415p15210J073603L899283K419082k169250l397732
12543B058653R5296K174086q76936m347201k877739R69139J352726j200066j208182
12534c860224K253770M056593J504491j586961j258769R64650J626648P40491
12526D440689K78735J0456j432216k949107k157926L70860J431649n4063j539733
12517a600656r23233M50501L41229p57579o13814J037568J975124Q07548r77888
12508b61200j120516M28979J753667J526082Q6470j656166k942546k769963m94680
12499e449873K474135L171059N74301k536965k783012m15538J433400J213347
$$ y = [4115273, 7676372, 8080069, 4996192, 1953309, 1280745, 983981, -1281953, -3708889, -3066493, -255538, 948877, 233667, 1307270, 5206553, 7625635, 5456385, 2058653, 2153949, 4328035, 3451099, -896102, -3773841, -2804702, -1451976, -2652042, -3860224, -1606454, 2450139, 3954630, 2367669, 1108900, 2073550, 3700198, 4440689, 4719424, 4729880, 3297664, 348557, -1809369, -1438509, -6860, -60923, -1600656, -2523889, -2073388, -1732159, -2489738, -3103552, -2065984, -90860, 716688, -261200, -1381716, -952737, 800930, 2327012, 2413482, 757316, -2185230, -4955193, -5449873, -2975738, 195321, 769622, -1767343, -4550355, -4965893, -3532493, -2319146]
12491b319146N13439R52286J649498R33991p96785j421341M6721K022468K044605
12482C625736m17100l145098l399835q91693J972606K842221J591880m13337j901604
12473a36224j920724q0700K207789K313183j71024k157421j233952P14897P50137
12464B85961j81765O50744K200214J070186j945993k326587M18552J347340j513367
12455E285l347511o13500K709491J819186q59853m21245J590903J61179l692437
12446b648502m164183o29265J446599J59218l5559K783384L807061n7341l995339
12437c333927k537470J951813L490378J456655k81725m97465j051763j799796
12429b603300p10356J453024J680094m3844p08813K74837K58819j320863j524135
$$ y = [-2319146, -1805707, -853421, 796077, 1730068, 933283, -488058, -441337, 1581131, 3625736, 3208636, 63538, -3336297, -4227990, -2255384, 586837, 2178717, 1765380, -136224, -2056948, -2137648, 70141, 2383324, 2212300, 54879, -1179073, -464176, 285961, 104196, 754940, 2955154, 4025340, 2079347, -247240, 171312, 1518652, 5285, -3342226, -3955726, -1246235, 572951, -286902, -708147, 882756, 1043935, -2648502, -6812685, -7441950, -5995351, -5836133, -5871692, -3088308, 718753, 661412, -3333927, -5871397, -3919584, -429206, 1027449, 745724, 248259, -803504, -2603300, -3313656, -1860632, -180538, -224382, -933195, -658358, -399539, -1720402, -3244537]
12420c244537P01412K171286P67813q86123M2064J801701J298873n51278p18869
12411A382342M54083q538k128315k426575M47126L262784K848134L34201j049773
12402C115469l20598J029764J603011R87125p87404k812270l153261r94807J656224
12393C23253K222766R49326J4226j82405j105336k416915j607695J393891K597765
12384B188876l89439l753163k276123K769991M907880J474831l043159l795439
12376a915745j636941k35040m57636o57046k91885r4098O3423O97538J104147
12367c423283O25576M03388J408986K030184M84704j635132j638802n22834j419376
12358c686589l701410l271923O62593L763598L025096P50077l792J60994k52453
$$ y = [-3244537, -2543125, -371839, 395974, -490149, -448085, 1353616, 2652489, 2101211, 1382342, 1836425, 1827887, -300428, -2727003, -2279877, 982907, 3831041, 4165242, 3115469, 2794871, 3824635, 5427646, 6414771, 5627367, 2815097, -338164, -1332971, 323253, 2546019, 3495345, 3509571, 3327166, 2221830, -195085, -1802780, -408889, 2188876, 1799437, -1953726, -4229849, -1459858, 3448022, 4922853, 1879694, -1915745, -3552686, -3787726, -4245362, -4902408, -5194293, -5288391, -5224968, -4527430, -3423283, -2797707, -2394319, -985333, 1044851, 1529555, -105577, -1744379, -2267213, -3686589, -7387999, -10659922, -9997329, -6233731, -3208635, -2458558, -2462350, -2301356, -2553809]
12349b553809l38878N45384L75894j641870k123093J263568M627381L003653j607627
12340A550603l026873l47227J484717K33497p69556O56713J902728Q00466n95161
12331A889907k06987L58094p05715j853717j224466r0101j72369l28564Q83940
12322a449978J878083O86143j171248r90380N60138P02667p54963j371126j10278
12313b020942J556567K275043K028152J035895m21224j409012j284576o52685
12305A107218r5273P73330J635180Q66753j460627k330891j47189K084337J224119
12296C656957p50811j12825K023472J507101j560702k842305j073612J34640j116890
12287a34975j762966P57571L937662L773853J00018l820646m986165k642058J337706
$$ y = [-2553809, -2892687, -2347303, -1971409, -3613279, -5736372, -4472804, 154577, 3158230, 1550603, -1476270, -1823497, -338780, -105283, -874839, -218126, 1684602, 2485068, 1889907, 1682920, 2041014, 1335299, -518418, -1742884, -1832985, -2005354, -2333918, -1449978, 428105, 1114248, -57000, -1047380, -487242, 215425, -539538, -1910664, -2020942, -464375, 1810668, 3838820, 4874715, 4453491, 3044479, 1759903, 1107218, 1011945, 1785275, 3420455, 4287208, 2826581, 495690, 348501, 2432838, 3656957, 2906146, 2793321, 4816793, 6323894, 4763192, 1920887, 847275, 981915, -134975, -1897941, -1140370, 2797292, 6571145, 6671163, 2850517, -2135648, -4777706, -3440000]
12278c440000L286947J246641k022427k186295N27494J825152J52324j276513
12270a886677k38824J188457Q84748N2164Q4166p8717j071898j236103j5548M50827
12260a867405m74737j88029J939949K078891j623164m484242j907752L096618
12252c429871M363114J734197Q1944J025917J403000o72987l313483m363223l366644
12243f538036m15910L310907M689126K100645j219297j177854J005580R59347
12235B714508j582010k605697n56265J669872J743852M55443j143823k942674
12227b246794l737595k077028N11348J073870O8941M73725K196873K188032L07133
12218a241495j83180J274311J421035n03580r68368J286226K429444R2582k394248
$$ y = [-3440000, -153053, 1093588, -928839, -3115134, -2587640, -762488, -610164, -1886677, -2125501, -937044, -52296, -132, 84034, 5317, -1066581, -2302684, -2318232, -1867405, -2342142, -2530171, -590222, 1488669, -134495, -4618737, -6526489, -3429871, 933243, 2667440, 2749384, 3775301, 5178301, 4505314, 1191831, -3171392, -6538036, -6953946, -3643039, 1046087, 3146732, 1927435, 749581, 1755161, 2714508, 1132498, -1473199, -2029464, -359592, 1384260, 1839703, 695880, -2246794, -5984389, -8061417, -7550069, -6476199, -6407258, -5933533, -3736660, -1548628, -1241495, -1424675, -150364, 1270671, 767091, -201277, 1084949, 3514393, 3606975, 1212727]
12209A212727j683866K88569M08081l58622J74293R00707Q215r56974R4920J425839
12199A513889K26948k218806k403150k71987J023328L25889k47027Q54527K387483
12190A191094K259523q589k754228l363914q73796K248114K631016N67133n20869
12181A375484M58237Q86471m82140j279859k51431K19681j038220j165334J274624
12172b487K590516J2961k865244j758511J128781J307921j36003O35791K423868
12163C337593J181022j932518k153841K65131O57232j145632m11882L237031M177764
12154G211900L98437k827509j908586n11355k168506l703930j158873K773882
12146a894540K924895j84555j794531l64555J248880Q62550p22215j841763j610246
$$ y = [1212727, -471139, -182570, 225511, -133111, 41182, 941889, 950104, -6870, 88050, 1513889, 1740837, -477969, -2881119, -3153106, -2129778, -1803889, -2050916, -1196389, 1191094, 3450617, 3442028, 687800, -2676114, -3549910, -1301796, 1329220, 1896353, 1375484, 1833721, 2720192, 2238052, 958193, 706762, 926443, -111777, -1277111, -2487, 2588029, 2600990, -264254, -2022765, -893984, 413937, 277934, 913725, 3337593, 4518615, 2586097, 432256, 697387, 1354619, 208987, -202895, 3034136, 7211900, 7610337, 4782828, 2874242, 2362887, 194381, -3509549, -4668422, -1894540, 1030355, 845800, -948731, -1313286, -64406, 798144, 75929, -1765834, -3376080]
12137c376080j44844J053729K86517j513990j384916R37702K026196L64529q14016
12128b565173Q80585K501609Q34154j617408p13407K016228J871905r42345j855000
12119D11148P6667R40492o90116j282723R40032K333110r2825l355559k992497
12110c712271K95351K362116J860535R49620R58898R83017N30141M34504P63145
12101E425056L48849q99830j320723j33079R16120r2792k292746k993275j324460
12092b366880N58577L92178j139719j361158O88639K813930K524363L65940q56256
12083A619614R9781J357639P12915j291553k278691j346486M4323M84411L84019
12074b14028O69153R94124M65721o25090j211384j212418j376569j477575m19668
$$ y = [-3376080, -3520924, -2467195, -2180678, -3694668, -5079584, -4141882, -2115686, -1751157, -2565173, -1684588, 817021, 1651175, 33767, -679640, 1336588, 3208493, 2266148, 411148, 487815, 1428307, 738191, -544532, 395500, 2728610, 2635785, -719774, -3712271, -3416920, -1054804, 805731, 1755351, 2714249, 3697266, 4227407, 4661911, 5425056, 5773905, 4874075, 3553352, 3420273, 4336393, 4243601, 1950855, -1042420, -2366880, -1808303, -1416125, -2555844, -3917002, -3228363, -414433, 2109930, 2475870, 1619614, 1719395, 3077034, 3789949, 2498396, 219705, -1126781, -1082458, -598047, -214028, 455125, 1449249, 1914970, 1289880, 78496, -1133922, -2510491, -3988066, -4407734]
12065d407734J503224K297216J106924l37892l64465J84484j77121p41750Q6446
12056h50668J640711J722718Q8768j322908j551474j436075j176704J01116J749353
12047a035163J501777p93462k088417n03508J690104J589032j1621l94730O18998
12038E73010R01666j77491j011758o20300J30120K80870j19251p63780j404670
12029b211584j507291r38220o00175r63317o92968J387365L656749L371335O95216
12020B197110j438075j537562j014068j032197o71212P32838J895765J688731
12012H21330R09768N02224r4137j249996j695287o60507K18772o36078j757702
12003c641613o56815K042179L213477J717277l44170j063281r24777q85314n56022
$$ y = [-4407734, -2904510, -607294, 499630, 161738, -202727, -18243, -195364, -937114, -850668, 790043, 2512761, 2601529, 1278621, -272853, -1708928, -2885632, -2784516, -1035163, 466614, -326848, -2415265, -2918773, -1228669, 360363, 348742, -45988, 573010, 1474676, 1297185, 285427, -334873, -204753, 76117, -43134, -806914, -2211584, -3718875, -4657095, -5257270, -6220587, -6913555, -5526190, -1869441, 1501894, 2197110, 759035, -778527, -1792595, -2824792, -3496004, -2763166, -867401, 821330, 1731098, 2233322, 2139185, 889189, -806098, -1466605, -1247833, -1883911, -3641613, -4298428, -2256249, 957228, 2674505, 2330335, 1267054, 342277, -543037, -1099059]
11994a099059M40020J061721L64088p16396o34575L97102Q17399J93917j96312
11985F27905M88372J187354M45448j276774j931439o23366J017852R68065m03486
11976D99931r60329K1187R76907P77479M59452J041626J362913M8346j696881
11967B530631j741005o48433p64587j958636j579604P96885K036280L61522j600481
11958b567428j008139O80876L80411j450223j728774K57010K143821K355202J604696
11949F67452O42240o19300j575036j212975j91359r5602m81691N19868K351743
11940E340K038265r85896l293908k310398K03304J455169J610600J996355J811509
11931B530340k15863k518531k338315M9705J674610J136242k4555j81443M43298
$$ y = [-1099059, -659039, 402682, 766770, 50374, -584201, -187099, 630300, 824217, 627905, 1116277, 2303631, 2749079, 1472305, -459134, -1082500, -64648, 903417, 499931, -460398, -439211, 537696, 1315175, 1774627, 2816253, 4179166, 4227512, 2530631, 789626, 141193, -623394, -2582030, -4161634, -3364749, -1328469, -966947, -2567428, -3575567, -2894691, -2514280, -3964503, -5693277, -5436267, -3292446, -937244, 667452, 1309692, 690392, -884644, -2097619, -2288978, -2384580, -2866271, -2346403, 5340, 2043605, 1057709, -2236199, -4546597, -4343293, -2888124, -1277524, 718831, 2530340, 2314477, -204054, -2542369, -2492664, -818054, 318188, 293633, 112190, 555488]
11922E55488R44449R71769M68488m44118j168927j257842j105721j084962o83067
11913b804443L16071P71620r2626r04997p2387J378771J218775l42903j024626
11904a556745k07714M42086J74239J39235O89578N26272n64532q53328K03353
11895a007556N95797q19284j963923p46486J372832J524916k36188j326124n89063
11886c195079N62079O89225o5265q78551j048715l288J900630K795746J261759
11877B018541j262154j943348n12904M15347m89291j147136N34133L104713L416241
11868D134142Q63459k194253l544598k807201o28771J733455K359468M85257j569984
11859a169026p10896K294856L164165J05233l312074l106334j54998J945889K083739
$$ y = [555488, 1499937, 2471706, 2940194, 2496076, 1327149, 69307, -1036414, -2121376, -2804443, -2488372, -1716752, -1809378, -2714375, -2786762, -1407991, -189216, -532119, -1556745, -1764459, -1322373, -1148134, -1008899, -319321, 206951, -357581, -1210909, -1007556, -411759, -1231043, -3194966, -3941452, -2568620, -1043704, -1279892, -2606016, -3195079, -2633000, -1943775, -2009040, -2887591, -3936306, -3939594, -2038964, 756782, 2018541, 756387, -1186961, -1699865, -1284518, -1773809, -2920945, -2386812, 717901, 4134142, 4997601, 2803348, -741250, -3548451, -4177222, -2443767, -84299, 400958, -1169026, -1879922, 414934, 3579099, 3684332, 372258, -2734076, -2889074, -943185, 1140554]
11850A140554J625333R11969o66139k032697j498314m8102k4620q66718l8566
11841a497300J871326J459743j387964k473797m4450K075797O77887j769016j556152
11832b643926M22606J071241L96080M16829J005022O56679l06424p16739r90559
11823f89191j462054n08518K234294L336488M15845k901012j755884K131742K906335
11814C708045l71862k922251k171667o76982n60242m90909M80472Q54897K1111
11805b129388m11667M718m11710j890356k283493p98259P93389J474153K054247
11796c598366K446761J572397K81701L94954P99099r32687l123125j706934K291597
11787a574603L312840M16868j003888J259081K345210o50337l095081j068422
$$ y = [1140554, 2765887, 3677856, 3011717, 979020, -519294, -567396, -592016, -1458734, -1497300, 374026, 1833769, 445805, -2027992, -2072442, 3355, 681242, -1087774, -2643926, -2221320, -1150079, -753999, -337170, 667852, 1324531, 1018107, 301368, -689191, -2151245, -2659763, -425469, 2911019, 3326864, 425852, -1330032, 801710, 3708045, 3336183, 413932, -1757735, -2434717, -2994959, -3485868, -3005396, -2150499, -2129388, -2541055, -2536337, -2948047, -4838403, -7121896, -7920155, -7126766, -5652613, -3598366, -1151605, 420792, 702493, 1097447, 1896546, 963859, -2159266, -3866200, -1574603, 1738237, 2155105, 1151217, 2410298, 4755508, 4105171, 1010090, -58332]
11779e8332J559754K21817k130232p27367K091635J250335j540134o89723L142359
11770C120112L851350l9367l511225l410335k065854j754941j410603k04332M86466
11761d938729K11061N89471K039223K669983J437185l79985j396597j397784m40585
11752a606757R50734J235867n7356p86605N34430J589614q8065k155284p30970
11743a114392K695176L017863j75679j792533M58903K525655P60973k601603l516014
11734B58349j948759n78527k97710J8228Q02110J306291J096456M45374l67650
11725G34162j275876k117605k275921p23517K587015N131274L658730j154735
11717D563527m308567k733564O34090J668283J002649J414007K050073K71889
$$ y = [-58332, 1501422, 1723239, -406993, -1134360, 957275, 2207610, 667476, -22247, 3120112, 6971462, 6932095, 3420870, 10535, -2055319, -3810260, -5220863, -5425195, -4938729, -4727668, -4138197, -2098974, 571009, 2008194, 1628209, 231612, -1166172, -1606757, -656023, 579844, 522488, -264117, 270313, 1859927, 1771862, -383422, -1114392, 1580784, 4598647, 4422968, 2630435, 3089338, 5614993, 6375966, 3774363, 258349, -1690410, -2268937, -2566647, -2548419, -1746309, -440018, 656438, 1101812, 734162, -541714, -2659319, -4935240, -5658757, -3071742, 2059532, 5718262, 4563527, 254960, -2478604, -1844514, -176231, 826418, 2240425, 4290498, 4562387]
11709D562387k545426k541533R4987J428773K67249q31464q48987j267433j660260
11700c341707J42177K998138L136746O23391n37859L93994j97907k782686k814023
11691b379736J090794L687493J377837k045702k042883k20693k2849n39460L85723
11682g09476J248797K01389o69824N35600J048541j509659l514745r90625K697803
11673a662199J928910j213694j72422M360155M777474q52562n219269l318617
11665a372224K31803l61959k783061j431727K903734M545240J947700p74935j003691
11656A900880r71769k727025m015107j853418K300366M102928K248263o0688J0960
11647I35390J110878L64892j869709k438220j97823K134664J703273p81249k278387
$$ y = [4562387, 2016961, -524572, -429585, 999188, 1266437, 434973, -414014, -1681447, -3341707, -3199530, -201392, 2935354, 3558745, 3020886, 3414880, 3216973, 434287, -2379736, -1288942, 2398551, 3776388, 1730686, -312197, -532890, -555739, -1095199, -709476, 539321, 740710, 70886, 606486, 1655027, 145368, -3369377, -4360002, -1662199, 266711, -946983, -1119405, 3240750, 8018224, 7165662, 1946393, -1372224, -1140421, -1502380, -4285441, -5717168, -2813434, 1731806, 3679506, 2904571, 1900880, 929111, -1797914, -5813021, -7666439, -5366073, -1263145, 985118, 924430, 935390, 2046268, 2411160, 541451, -1896769, -2094592, 40072, 1743345, 962096, -1316291]
11638a316291j224112J082915K301701J393006n63682j529083p35207M72076O13791
11629D95114J65799L27871N16396p10283k544394k450156j58115J601535J173723
11620a582510P6687q9360l0249m88285l49481R11695J424978Q323j209468p1233
11610a398903J625284O63980k343745l630181j690400J061690K073172J408157
11602b230946M15043p8494K69479J325251J946995R15292j188417k278002j294907
11593b198706N83539J546089J099393J74299q2534N54298J119531M13148j521783
11584A687274l156482k978865j000510J272636K072471Q78207p72880o47677J117749
11575a528077J464273j335212m150632k665702K035969M282908J670586j787739
$$ y = [-1316291, -2540403, -1457488, 844213, 2237219, 1673537, 144454, -590753, -118677, 495114, 660913, 988784, 1505180, 794897, -1749497, -4199653, -4357768, -2756233, -1582510, -1505823, -1595183, -1625432, -2113717, -2463198, -1551503, -126525, -118202, -1327670, -1398903, 226381, 890361, -1453384, -5083565, -6773965, -5712275, -3639103, -2230946, -1815903, -1894397, -1624918, -299667, 1647328, 2562620, 1374203, -903799, -2198706, -1615167, -69078, 1030315, 1204614, 1122080, 1676378, 2795909, 3209057, 1687274, -1469208, -4448073, -5448583, -4175947, -2103476, -1225269, -1998149, -2645826, -1528077, -63804, -1399016, -5549648, -8215350, -6179381, -1896473, -225887, -2013626]
11567b013626j796845O18866J913211J291520M05884Q5726P8177L64024N62396
11558A509333k93624j665927j376820O61125J286197j043567l110561j635783
11550e669627J552536K516565J099264N0600J01871j60539q12265p42607k87160
11541b351362l29205K5589J529929K133893Q8463j910673k26639L271249L371431
11532E602675l20174k753487j397369N00078K196j055501K1780K283029L085586
11523E968813J810440m08341k422159l084861j729989K63718N84037o29684j004166
11514f52192M454L74399l98644o1472K074211L121316J136321j442096j514545
11505B641752K2794K10441j213230j882963o65880R68577J096973o32852k766021
$$ y = [-2013626, -3810471, -3191605, -1278394, 13126, 419010, 504736, 582913, 946937, 1509333, 1215709, -450218, -1827038, -1165913, 120284, -923283, -4033844, -5669627, -4117091, -1600526, -501262, -450662, -348791, -509330, -1321595, -2064202, -2351362, -2680567, -2654978, -1125049, 1008844, 1097307, -813366, -1040005, 2231244, 5602675, 5282501, 2529014, 1131645, 1631723, 1633919, 578418, 600198, 2883227, 5968813, 7779253, 7370912, 4948753, 1863892, 133903, 397621, 981658, 351974, -652192, -647738, -273339, -671983, -733455, 1340756, 4462072, 5598393, 4156297, 2641752, 2664546, 2874987, 1661757, -221206, -887086, 81491, 1178464, 545612, -2220409]
11496b220409l133615r91158J667014K254249J038866M41177R48596O41800p37170
11487i0650q13080R65284J651102j64210j325188P15402L053381J754169j513578
11478D232632k068215J95958J013047r55437k296799j041825K41068o39413j696626
11469c015610m87902J642449K028218R57948L99387L04310n23604j163758J82203
11460C23641K149687J269693k293347l787354m88206L830101L834588j08386l004895
11451A725522k440252r25303r03531j191428J3972J513175R87876j127446k146345
11442d493760q47240J300073K369268J885715O08539l87295m60042l1765k02848
11433b59355j186793j809745j233403k61481m5810m19374m89585P793Q21704J619035
$$ y = [-2220409, -5354024, -6345182, -4678168, -2423919, -1385053, -943876, 4720, 646520, -90650, -903730, 61554, 1712656, 1548446, 223258, 938660, 3992041, 5746210, 4232632, 2164417, 2360375, 3373422, 2417985, 121186, -920639, -679571, -1318984, -3015610, -3503512, -1861063, 167155, 1125103, 1524490, 1828800, 1305196, 141438, 323641, 2473328, 3743021, 1449674, -2337680, -2825886, 1004215, 4838803, 4730417, 1725522, -714730, -1640033, -2543564, -3734992, -3721020, -2207845, -1219969, -2347415, -4493760, -5341000, -4040927, -1671659, 214056, 822595, 435300, -24742, -56507, -259355, -1446148, -3255893, -4489296, -4750777, -4796587, -5215961, -5705546, -5697753, -4876049, -3257014]
11423c257014J606719J84560j334455p90023J013054M81956k857749m131666j84385
11414i269003M457272L613059r89788k268301J189483L440023J110923j830383
11406e46715j483021P2590j53809m01982J827070M131265K662520j368054l433571
11397A306293k283027n10584K24498N37982O97083K89587k7741M54636N34700
11388A223427q71703j940662o05408J232138K31578k487153k601166L86853K296357
11379c135739J140689j69221M12372N68594j424986k728116o07463K460804K554969
11370i28097N33116P2777J410766J719377N95394L28580R99481K02057j816217
11361C117234j623549J322793K765148K78386k434323j330195J437140J154813
$$ y = [-3257014, -1650295, -1465735, -2800190, -3590213, -2577159, -2095203, -4952952, -9084618, -9269003, -4811731, -1198672, -2188460, -4456761, -3267278, 172745, 1283668, -546715, -2029736, -1957146, -2110955, -2512937, -685867, 3445398, 6107918, 4739864, 1306293, -976734, -1487318, -1262820, -724838, -27755, 261832, 234091, 688727, 1223427, 351724, -1588938, -2194346, -962208, -730630, -3217783, -5818949, -5432096, -3135739, -1995050, -2164271, -1751899, -1183305, -2608291, -5336407, -5943870, -3483066, -928097, -394981, -322204, 1088562, 2807939, 3403333, 3731913, 4731394, 4933451, 3117234, 1493685, 2816478, 5581626, 5860012, 3425689, 2095494, 3532634, 4687447]
11353D687447j736923k600562k32938J561848M02010j291783q04522Q05160J269999
11344B059736Q08032Q20979J015561L20738o58306l88491J091939K203872J907284
11335I181344M74437j270632k426395k334748j328187n29721l16618M2605O80392
11326B172477M93172q74216j924041j435076l10561O3282o7335J29095K69784
11317a483419k18800m77201M20923J416123Q08241r72900j836731q50774R93945
11308b200593K315105K245565O13044j333822j418641O03117J913765L42846k113838
11299I66548j973387O14687K300288J451269l42509j431971j777090j358796J11503
11290a439458J427349O21921j780882k786975j109770J004417J184637N2609l29834
$$ y = [4687447, 2950524, 349962, 117024, 1678872, 2080882, 789099, -15423, 789737, 2059736, 2867768, 3688747, 4704308, 5025046, 4366740, 3978249, 5070188, 7274060, 9181344, 9655781, 8385149, 5958754, 3624006, 2295819, 1766098, 1449480, 1492085, 2172477, 2665649, 1791433, -132608, -1567684, -1878245, -1814963, -1882298, -1753203, -1483419, -1702219, -2179420, -1758497, -342374, 465867, -507033, -2343764, -3194538, -2200593, 114512, 2360077, 2973121, 1639299, 220658, 823775, 2737540, 3080386, 966548, -1006839, -392152, 1908136, 3359405, 3016896, 1584925, -192165, -1550961, -1439458, -12109, 609812, -1171070, -3958045, -5067815, -4063398, -2878761, -2826152, -3155986]
11281c155986N62686J568070J501450J01653j716316k151884k13708K618956L682960
11272B797881K258125J45281q49759n48183L76826J097085N51338j519331l358330
11263I50933k851241n28360R75478N93772r1594K68427J006504J175666J063551
11254B563136J078158P40268l17209j518136k073592j635586k39623J327972J528165
11245A453553j30950j855604j788246o78457l13804l01331Q75487K381833J873781
11236A516262m33001j868188j519221r60796o47865O86018K481022K149110m31149
11227I72192k016800j108757k29362j158306j558023R34219M199096M332964J032124
11218E399347k353117l003277j051961J151794J123887j233486k877849j191459
$$ y = [-3155986, -2593300, -1025230, 476220, 577873, -1138443, -3290327, -3504035, -885079, 2797881, 5056006, 5201287, 4351528, 3803345, 4180171, 5277256, 5828594, 4309263, 950933, -1900308, -2428668, -1453190, -859418, -951012, -682585, 323919, 1499585, 2563136, 3641294, 4381562, 4064353, 2546217, 472625, -1162961, -1402584, -74612, 1453553, 1322603, -533001, -2321247, -2999704, -3313508, -3614839, -2739352, -357519, 1516262, 1083261, -784927, -2304148, -3264944, -3912809, -3226791, -745769, 1403341, 972192, -1044608, -2153365, -2382727, -3541033, -5099056, -4164837, 34259, 4367223, 5399347, 3046230, 42953, -1009008, 142786, 1266673, 33187, -2844662, -4036121]
11210d036121J894089K163637n63474k149150o92407J012432Q81300O87314J587725
11201G85345J246911j412663k980512r74366J380947J97509k568899k478784K18938
11192f585574J893227J952966K567510L231918J212283k685029m016560j292848
11184c722107J680410J447498o56430j402815k59120Q56047P25971l780k09102
11175a543428K02730K61096o40380j573966j195738R4602O35408K53210M27503
11166c078963J260935R33692p97347j483996J5698J391162P87706j26073N19441
11157e77745J385082P66808l4741M66586N40314j487123l093216j120083K468365
11148f85753L081226M61302j498302j058798j53785l118K85920O32199l30102
$$ y = [-4036121, -2142032, 21605, -541869, -2691019, -3383426, -2370994, -1489694, -802380, 785345, 2032256, 619593, -2360919, -3335285, -1954338, -1756829, -4325728, -6804512, -6585574, -4692347, -2739381, -171871, 3060047, 4272330, 1587301, -2429259, -3722107, -2041697, -594199, -1250629, -2653444, -2912564, -2056517, -1330546, -1334326, -1543428, -1340698, -1079602, -1719982, -3293948, -4489686, -4395084, -3759676, -3506466, -3078963, -1818028, -884336, -1681683, -3165679, -3149981, -1758819, -971113, -1097186, -577745, 807337, 1574145, 1539404, 2005990, 2546304, 1059181, -2034035, -3154118, -685753, 2395473, 2856775, 1358473, 299675, 145890, 142772, 428692, 1060891, 730789]
11139G30789k022533k057963j23622J472080J433872P04913Q1801m17588o1062
11130b59313J570359K430626L10420k976101l330805k75600K479716K452128P93222
11121C194652q08970j968260k121649q29543K67022o04111j601249L63891L671105
11112d37112L435305n16100k620333j70785K534125J297677j735338k452476j115551
11103a780588k84185J65068J574806K554618Q97243k040459k837542j042921O91095
11094b102865R03960O42110P56651P01211J79384k41092m30384r00578j515016
11085b006619j400279l70755O05498N91304k74070r89099p30185J75087M65552
11076c933566l73590j117544m85472P79843J054495M80204L82388N04021m10812
$$ y = [730789, -1291744, -3349707, -3473329, -2001249, -567377, 137536, 219337, -198251, -259313, 1311046, 3741672, 4052092, 1075991, -2254814, -2530414, -50698, 2401430, 3194652, 2385682, 417422, -1704227, -2533770, -2266748, -2870859, -4472108, -4108217, -437112, 2998193, 2482093, -138240, -309025, 2225100, 3522777, 1787439, -665037, -1780588, -2064773, -1899705, -324899, 2229719, 3126962, 1086503, -1751039, -2793960, -2102865, -1198905, -556795, 199856, 901067, 1080451, 839359, 408975, -491603, -2006619, -3406898, -3777653, -3172155, -2580851, -2854921, -3844020, -4574205, -4399118, -3933566, -4307156, -5424700, -5910172, -5130329, -4075834, -3595630, -3213242, -2709221, -3120033]
11067c120033j326754K88763L511235L662405q56178m919480l170146K385125
11059c545063N149706K783227q67065k174325j797156j525683r28635O85408J631581
11050e88005M5770k500469k409732R50868M055513L757940J100189p43039q06629
11041B862406o29205j050659j189989p10735o59362j266091j151042R6748O94946
11032c002983m15659j484380p30960P02560Q81314L77366P55955J345780O08015
11023i62992n12332J9323J436324J201060n83152j379661n64909R7857J74145
11014a074337Q15686J258921n57578l304351k884088R33815L217200J245094j431328
11005a780966j048264O74549N03688n51882J24518J361913L26680j870087j625845
$$ y = [-3120033, -4446787, -4158024, -646789, 3015616, 2159438, -2760042, -5930188, -3545063, 1604643, 4387870, 3520805, 1346480, -450676, -1976359, -2904994, -2219586, -588005, -542235, -3042704, -5452436, -4501568, -446055, 3311885, 4412074, 3669035, 2862406, 2233201, 1182542, -7447, -718182, -1377544, -2643635, -3794677, -3697929, -3002983, -3418642, -4903022, -5633982, -4931422, -4050108, -3672742, -2916787, -1571007, -962992, -1475324, -1456001, -19677, 1181383, 598231, -781430, -1346339, -1248482, -1074337, -258651, 1000270, 442692, -2861659, -5745747, -4811932, -1594732, -349638, -1780966, -2829230, -2154681, -1650993, -2202875, -2078357, -716444, -389764, -2259851, -3885696]
10996c885696R86763K170259M51667j445752j355353n52731p16408j068341j90401
10987e605993J404786K141704J592083O33126J57537L52970P31067N42083l91938
10978A557425j294115j406003j048595r83211j068114n09221O82786J419892Q76969
10969a772187m50916j190456m71408J014397J525839L90064p68820o1032J714364
10960g0155J946513J52064j266969r48452o30433j676107k143026N1897L031640
10951a553028L289076R70447o19365k95937j31212j020186q57505J422604L159435
10942D364329J628300j712151l100512j387764J155045K215031J557896P7677
10934D797851j384696k107623j780563r99045n37110k14989N12166J158258P99552
$$ y = [-3885696, -2898933, -728674, -277007, -1722759, -3078112, -3630843, -4347251, -5415592, -5605993, -4201207, -2059503, -467420, 165706, 323243, 676213, 1407280, 1949363, 1557425, 263310, -1142693, -2191288, -3174499, -4242613, -4751834, -4069048, -2649156, -1772187, -2223103, -3413559, -3884967, -2870570, -1344731, -954667, -1723487, -1784519, -70155, 1876358, 2028422, 761453, -186999, -817432, -2493539, -4636565, -4584668, -1553028, 1736048, 2706495, 2087130, 1791193, 1659981, 639795, -217710, 1204894, 4364329, 5992629, 4280478, 1179966, -207798, 947247, 3162278, 4720174, 4797851, 3413155, 1305532, -475031, -1474076, -2011186, -2226175, -1714009, -555751, 243801]
10925B43801r3059j47438M06706k20837k069713k398016L31117L300187K702801
10916B055549p62046k626951p77258J975940K141943q4623k010004k116943r48265
10907c152658M56871J413717J487453P46767j58676p53150j048567q75003O1670
10898a821576J071579P88977o59592j168517N68976K942120L336076J338226j136982
10889E259287k302374k024107j283173q95649o62360K49109J688958J961380J40522
10880B131593j830462j459636M28308R19830j44449p5602J510633J541861j105001
10871A917075l166721k190829l04860r1022m41034L09049P79021k30350m34087
10862c853758J808228L398810J307342j599424r04363J846266J925732m08147
$$ y = [243801, 150742, 3304, 410010, 189173, -1880540, -4278556, -3947439, -647252, 2055549, 1293503, -1333448, -2110706, -134766, 2007177, 1922554, -87450, -2204393, -3152658, -2695787, -1282070, 205383, 952150, 793474, 40324, -1008243, -1883246, -1821576, -749997, 38980, -620612, -1789129, -1220153, 1721967, 5058043, 6396269, 5259287, 2956913, 932806, -350367, -1246016, -1908376, -1659267, 29691, 1991071, 2131593, 301131, -1158505, -730197, 189633, 45184, -30418, 1480215, 3022076, 1917075, -1249646, -3440475, -3745335, -3836357, -4277391, -3968342, -3189321, -3419671, -3853758, -2045530, 1353280, 2660622, 1061198, 156835, 2003101, 3928833, 3520686]
10854C520686j050265N8294q04939l389659l206848K51897K046662K53217p51309
10845c072264J858319M232042K209342j994584l462847j483823Q75661J607807
10837G69653J063979J72703l10236j2020L96350R4254k21492L64448N44856j249052
10827A613443l030944j503873K014227K664568m38361k815849j842247j33143
10819c472179k9327L6328J301073J811078N91560K8687J159540J122505j557496
10810I91769l622709k446714l97178j80299j34767J763889L319390K015109j97163
10801A111327n56404l63601j473822j629908J238183L446620O22222m143169m023937
10792e772489R55407L923674J618375j702971j786115M3269P58161L56846L22415
$$ y = [3520686, 2470421, 2528715, 1723776, -1665883, -4872731, -4620834, -2574172, -2320955, -3072264, -1213945, 3018097, 5227439, 3232855, -229992, -1713815, -838154, 769653, 1833632, 2006335, 1696099, 1684079, 2080429, 2174683, 1953191, 2317639, 2862495, 1613443, -1417501, -2921374, -907147, 1757421, 1319060, -1496789, -3339036, -3472179, -3501506, -3465178, -2164105, -353027, 238533, 267220, 1426760, 2549265, 991769, -2630940, -5077654, -5474832, -5655131, -5789898, -4026009, -706619, 1308490, 1111327, 554923, 191322, -1282500, -2912408, -1674225, 1772395, 2394617, -1748552, -5772489, -4817082, -893408, 724967, -978004, -2764119, -2720850, -1962689, -1605843, -1283428]
10783a283428P37670J009047J025336K83653j831637l990177l581404m36635K386044
10774e681531K565419J198294M83975O65676N79166j46526p25622l75906Q49117
10765e87938J949297J649653j37482j706551j323232N75103J898259J466664R5370
10756C879143p93285p46026m17807o98164j640241k071393q20591J409068K316487
10747D17191P76247j531176k087052m83351J396302J702028M71369o44074k75291
10738b57807R09313P99258j205460k738043j408714J535923K590411P96233j159167
10729a38053r26127O95483J593357J007183m39034j728790j836324n47106P77330
10720a542081O49854m15782q67389p58258j229704j769412p31062J410837K215306
$$ y = [-1283428, -545758, 463289, 1488625, 1772278, -59359, -4049536, -7630940, -8067575, -5681531, -3116112, -1917818, -1433843, -768167, -189001, -335527, -1061149, -1437055, -587938, 1361359, 3011012, 2873530, 1166979, -156253, 418850, 2317109, 3783773, 3879143, 3085858, 2339832, 1922025, 1223861, -416380, -2487773, -3308364, -1899296, 417191, 1193438, -337738, -2424790, -2908141, -1511839, 190189, 661558, 17484, -257807, 651506, 1450764, 245304, -2492739, -3901453, -2365530, 224881, 1021114, -138053, -1064180, -368697, 1224660, 2231843, 1792809, 64019, -1772305, -2319411, -1542081, -892227, -1308009, -2175398, -2933656, -4163360, -5932772, -6663834, -5252997, -3037691]
10711c037691J047219o3926K05850R45006J329579J768544K130188J375056m42098
10702E257727k011618k732871k657436j089517J889900L371929Q30729l131412
10694b72569l456816M6403K504624J379810n67441n32922N90892R97789O33967
10685A323737l3478o59812j67377J490671J557283j419314l340352o5872M463366
10676C148852K927476l309768n408697r49570K610024N70157k235653j076034
10668c723213J034161L64030n82787J162263K867548J392535j004798j361433
10660A48306j175817k104807j925473N36444J952034N43638j33098J925782K643248
10651B410257o73875l546414j696176J637053J664509j89989m24275M428q03940
$$ y = [-3037691, -1990472, -2054398, -1848548, -903542, 426037, 2194581, 4324769, 5699825, 5257727, 3246109, 513238, -2144198, -3233715, -1343815, 2028114, 2858843, -272569, -3729385, -3682982, -1178358, 201452, -365989, -898911, -308019, 689770, 1323737, 1290259, 630447, 463070, 1953741, 3511024, 2091710, -1248642, -1314514, 3148852, 6076328, 2766560, -2642137, -3591707, -981683, -411526, -2647179, -3723213, -2689052, -2325022, -2907809, -1745546, 1122002, 2514537, 1509739, 148306, -1027511, -3132318, -5057791, -4521347, -2569313, -2025675, -2158773, -232991, 2410257, 1736382, -1810032, -3506208, -1869155, -204646, -394635, -818910, -814482, -1618422]
10642a618422q74488J131654J861199o00660k098094L72416K742496J174804j000256
10633A090649r4401P87454j470471k770652O53356L896279J304832l144803k577730
10624b325487J000581J189533j239590j007608J366031J509971J51372R50382
10616A595185K393146O19941k499392k432830k06081K67596k98670O27985J027134
10607A094014j398203k909583J82196L736058K428839q21335p72952L18633j773072
10598H4595l688191p97112K595695M55485l081018q31679L704670K446484k242825
10589a353896k084409J668056J382288j666873J93827N427661M997340j225828
10581G338166m075088j018502J152346j74058l72406J386809N92499k355133k098538
$$ y = [-1618422, -2492910, -1361256, 499943, -100717, -2198811, -1826395, 916101, 2090905, 1090649, 996248, 1783702, 313231, -2457421, -1804065, 2092214, 3397046, 252243, -2325487, -1324906, -135373, -1374963, -2382571, -1016540, 493431, 644803, 1595185, 3988331, 4608272, 2108880, -323950, -530031, -262435, -561105, 66880, 1094014, -304189, -3213772, -3031576, 704482, 3133321, 2311986, 1539034, 1857667, 84595, -3603596, -4400708, -1805013, -1349528, -4430546, -5262225, -1557555, 888929, -1353896, -3438305, -1770249, -387961, -2054834, -1861007, 3566654, 8563994, 7338166, 3263078, 2244576, 3396922, 3222864, 2850458, 4237267, 4829766, 2474633, 376095]
10572C76095J031503J508320m74556L01868L184201K636449q70951j972790q23451
10563D896688j541866k835649j258431q296k700083l613937K543050P541284J894026
10554D916786o470467l909963M738183M239792l692679l983112L698380M760634
10546D297554k620915m488392K109461L978257k515485m767455J373530L698230
10538A064785k580131n636613M04474N036161J816198j037006J330951J484106
10530A882925l237527l978093J685185L916280m37198k072434J717319J989197
10522A465654k576357k084242M024131M512992j303494j758333L153077J019794
10514F453222o624565m778594M929372M816386m624572m286355N648969M278468
$$ y = [376095, 1407598, 2915918, 2441362, 2743230, 5927431, 8563880, 7692929, 5720139, 4896688, 3354822, 519173, -739258, -747554, -3447637, -7061574, -4518524, 3022760, 4916786, -1553681, -5463644, -725461, 3514331, -178348, -4161460, -463080, 4297554, 1676639, -2811753, -702292, 3275965, 760480, -4006975, -2633445, 1064785, -1515346, -7151959, -6747485, -1711324, 104874, -932132, 398819, 1882925, -1354602, -5332695, -3647510, 268770, -168428, -2240862, -523543, 1465654, -1110703, -3194945, 829186, 5342178, 4038684, 2280351, 5433428, 6453222, -171343, -4949937, -20565, 4795821, 171249, -4115106, 1533863, 5812331]
10506E812331q095121p434542P156811Q792150n283708o470289Q214141P125512
10498I817285j1842788j0390108J4726277J5915149j4580511j8529889J9209089
10491D324504K7135311j8967583j7537715R6263713J95177948J13175940r2520419
10484C07051699j95156929j09327128J2894758K6276212k2999937k5914613J0263830
10477C087892J3906531j2095206j3160806R269701J0691615q088383r132163P350331
10469A829512Q334001o383588p748091M442652M343457p471161o663158O107857
10461c208519P276091l529306m326385N716254N911143m737977n942454M470742
10453A629589P035290k229019o007917P19832L609778j635031k808712K602317
$$ y = [5812331, -2282790, -9717332, -2560521, 6231629, 947921, -5522368, 2691773, 9817285, -2025503, -12415611, 2310666, 18225815, 3645304, -14884585, 4324504, 31459815, 12492232, -5045483, 91218230, 286396178, 399572118, 307051699, 111894770, 2567642, 15462400, 41738612, 18738675, -7175938, 3087892, 16994423, 4899217, -8261589, 1008112, 11699727, 3611344, -5520819, 1829512, 10163513, 3779925, -3968166, 474486, 4817943, -2653218, -9316376, -3208519, 4067572, 538266, -3788119, 1928135, 7839278, 3101301, -2841153, 1629589, 8664879, 6435860, 427943, 1147775, 4757553, 3122522, 313810, 2916127]
10445B916127K728763l876467m883146J342387K738531k350908k294060L958378
10437B79605M052214l387287m949023K640059O212633J39708m487432q59913K847689
10428B488253N63337j549997R58572K446729n40975k413635J48628K254297Q72543
10419E227752l25076M19912K4177j653811j268304M2235j644745l955598j602685
10410d736143K734280K420594o02481K20814K565904l77989n030581k433551M160108
10401a079045L429053l521859m453066K140751M739046M5285k000727K117078
10393A416516L129983k472578n020008M12058M789961J606327k215292k66546
10385A380421K081156p04716l615101j230641K091317J120553o16804J308615
$$ y = [2916127, 5644890, 1768423, -3114723, -1772336, 966195, -1384713, -3678773, 279605, 4331819, 944532, -4004491, -1364432, 4848201, 4987909, 500477, -359436, 2488253, 3051590, 1501593, 2460165, 4906894, 4365919, 1952284, 2100912, 4355209, 5227752, 4902676, 5322588, 5346765, 3692954, 2424650, 2466885, 822140, -3133458, -4736143, -2001863, 418731, -183750, 37064, 2602968, 2224979, -2805602, -5239153, -1079045, 2350008, -1171851, -5624917, -3484166, 1254880, 1300165, -700562, 1416516, 4546499, 2073921, -2946087, -2534029, 2255932, 3862259, 1646967, 1380421, 3461577, 2756861, -858240, -2088881, 2436, 1122989, 506185, 1814800]
10377A814800L277113Q06010k798097k661228n83523k24695l28748R83052J167092
10368A451776j563383l509059j333075K290980L356323K066805J82513k073326
10360H69554l492396j697232J927626K750940M06115l70103J824498K699606L98468
10351E317076j313263m36456m3371j586516k104059o90836n29293j984077j122292
10342d493087K368648L478621P13277j215221j97563l9803k090294k140010Q97540
10333b717892J911634q69758j950003J409328L816690J361485j680895j085092
10325A95497K96997p07882j418613M06634J399726n48193j393420J293762K837678
10316B362186k09067l334878k051156L63262j66578o76818K310077M813565J933174
$$ y = [1814800, 5091913, 5897923, 3099826, 438598, -144925, -369620, -698368, 284684, 1451776, -111607, -3620666, -4953741, -2662761, 693562, 2760367, 2942880, 869554, -2622842, -4320074, -2392448, 358492, 764607, 394504, 2219002, 4918608, 5317076, 4003813, 3567357, 3523986, 1937470, -166589, -857425, -1386718, -3370795, -4493087, -2124439, 1354182, 2067459, 852238, 654675, 614872, -1475422, -3615432, -2717892, -806258, -1676016, -3626019, -2216691, 1599999, 2961484, 1280589, 195497, 492494, -215388, -1634001, -1227367, 172359, -375834, -1769254, -475492, 2362186, 2153119, -1181759, -3232915, -2869653, -3036231, -3713049, -1402972, 3410593, 5343767]
10307E343767l042279l962538j549844k73914k9778J520612K567060P54635p21664
10298F06057J735795M486176J956027l522555n070379k020471L89478K09807J78813
10289a051252J149532J088734k3365l28234k96501j387356j871010N29830L376728
10280A187106K600314n40495j351130O09718J496619k2216j536983j892773k129091
10271a578931j937143k13107J401893M29207j639414j316506Q30810J173246n43655
10262c393600j028307N33078J530653J080134R83056J284040L7343j917708j179028
10253b070339K100960L366586O11431k452584k264554k48523O83696P08558J209773
10244A645004J320253l21865k259872j881941M63075J740569N12414j223395j026662
$$ y = [5343767, 2301488, -1661050, -3210894, -3484808, -3514586, -1993974, 573086, 1327721, 606057, 2341852, 6828028, 8784055, 5261500, 191121, -1829350, -1439872, -1230065, -1051252, 98280, 1187014, 1163649, 835415, 538914, -848442, -2719452, -2189622, 1187106, 3787420, 3246925, 1895795, 2505513, 4002132, 3979916, 2442933, 550160, -1578931, -3516074, -3729181, -2327288, -1898081, -3537495, -4854001, -4023191, -2849945, -3393600, -4421907, -3888829, -2358176, -1278042, -294986, 989054, 1026397, -891311, -2070339, 30621, 3397207, 4008638, 1556054, -708500, -957023, -273327, 435231, 1645004, 2965257, 2643392, 383520, -1498421, -1035346, 705223, 1217637, -5758, -1032420]
10235a032420O39917J245613j00293j294826m05969J103614L78562k046778k360249
10226c872829P88488L624056K355902j450789l324515j992165k259P11351P13758
10217b449002P67476N47548K8082j15566O3048j83444n07394M26449K497220L506781
10207D581198J925416r52200k599738k242989j232038p78801m76316M65954J371991
10198F2477P85123r97166j702747l11692J068950K47450j466974j143183J103464
10189b354298K235751J001029n37915p13881m76511p92008o56412O30614J582625
10180h1006Q67662l11062j52443Q27681P28576q27981k345340k419710r48507
10171d662130J042018K053389J318070j88894p80766k46242J80231N3246K70571
$$ y = [-1032420, -392503, 853110, 752817, -542009, -947978, 155636, 534198, -1512580, -3872829, -3084341, 539715, 2895617, 1444828, -1879687, -3871852, -3874111, -3162760, -2449002, -1681526, -1133978, -1105896, -1221462, -1158414, -1341858, -1849252, -1422803, 1074417, 4581198, 6506614, 5554414, 2954676, 711687, -520351, -1299152, -1775468, -1309514, 62477, 847600, -149566, -1852313, -2164005, -1095055, -847605, -2314579, -3457762, -2354298, -118547, 882482, 344567, -369314, -845825, -1637833, -2294245, -1663631, -81006, 786656, 475594, 323151, 1150832, 1879408, 1051427, -1293913, -3713623, -4662130, -3620112, -1566723, -248653, -437547, -1218313, -1464555, -1284324, -1231078, -960507]
10162i60507J101045J452915P33205j57338l61319k20412l53650p93615j301459
10153h61135j379245j68578K160450L355207J439139k089336l596260j826502
10145b966260J007673K505606K249717Q91757o25154j059526j92599L08549o45963
10136A473800j478807p94326l20603j465411j333003K715245O554987M056650
10128I408532k447261m179974P64587M279672J023659l687733l256075M0505L20484
10119B266396j939823k090364Q8702P58265q18708j485282O9215J646436J583106
10110G7943P20491J76144j54503p50780j705128k456047j736362P85987K722024
10101b320231J476570j223736j054201J944259K823875k00536k425028l02148
$$ y = [-960507, 140538, 1593453, 2326658, 2169320, 1808001, 1587589, 1233939, 440324, -861135, -2240380, -2408958, -248508, 3106699, 4545838, 2456502, -1139758, -2966260, -1958587, 547019, 2796736, 3688493, 3063339, 2003813, 1811214, 2119763, 1473800, -5007, -799333, -1119936, -2585347, -3918350, -1203105, 5351882, 9408532, 6961271, 2781297, 3545884, 7825556, 8849215, 5161482, 1905407, 1945912, 2266396, 326573, -1763791, -1675089, -916824, -1735532, -3220814, -3151599, -1505163, 77943, 798434, 974578, 820075, 69295, -1635833, -4091880, -5828242, -5042255, -2320231, -843661, -2067397, -3121598, -1177339, 1646536, 1446000, -979028, -1281176]
10093a281176K799730K461852R8641p35345p20129k131096l311777j496314J452579
10084b863035J773011K27935K45005J313632J8229l198516l959629p70471K886850
10075d326989L767297K252807K01071j123629p25407J421610L132419K057004
10067F656183j070714l371982l478518k220319o05052P47900J155191P86531Q47097
10058e53683J369472Q01899p00642m94621J887185K751481j7769k795068j726026
10049E22228R07363N60547k045537k507772l1903K034773J873224P28610l61860
10040A679673j207813q38795Q91710J447649p80966k825897j338598J603028J711142
10031C41133m35321r30646M10606L85604j170854j245406M02109Q77632k53587
$$ y = [-1281176, 1518554, 3980406, 4079047, 3343702, 2623573, 492477, -2819300, -4315614, -2863035, -1090024, -862089, -617084, 696548, 714777, -2483739, -6443368, -7213839, -4326989, -559692, 1693115, 1894186, 770557, 45150, 1466760, 4599179, 6656183, 5585469, 2213487, -1265031, -3485350, -4090402, -3342502, -2187311, -1400780, -553683, 815789, 1617688, 917046, 422425, 2309610, 5061091, 5043322, 2248254, 522228, 1429591, 1990138, -55399, -2563171, -2595074, -560301, 1312923, 2041533, 1679673, 471860, -366935, 524775, 1972424, 1191458, -1634439, -2973037, -1370009, 341133, -94188, -1024834, -614228, -228624, -1399478, -2644884, -2242775, -1365143, -1618730]
10022a618730m73425N22921N38025j96474P06502K437821J638044j194945j877013
10013D82726J06122N67282j716224k588679N3318K428074J431497l63527K40666
10004F41255J673151J065020o83735j139054o67021r62308j550499r39017M93986
9995b068222J331079J309071P35165o07062k242188k408755l44903K248064L255558
9986A207807K335108M08306j376700j776245m82258O99488j86105k061906k102346
9977c334851j58729J121242Q09250Q90425K156630K393584J59271k534329k992431
9968a489938j105016J372109K828887K346536L08627j067740j9598J777916J075437
9959F027220k005772l836623k401978M83265K494418L173321K438229J1990k755238
$$ y = [-1618730, -2092155, -1569234, -1031209, -1227683, -521181, 1916640, 3554684, 2359739, 482726, 588848, 1156130, -560094, -3148773, -3095455, -667381, 764116, 400589, 641255, 2314406, 3379426, 2695691, 1556637, 889616, -72692, -1623191, -2562208, -2068222, -737143, 571928, 1307093, 700031, -1542157, -3950912, -4295815, -2047751, 1207807, 3542915, 3951221, 2574521, 798276, 316018, 1015506, 829401, -1232505, -3334851, -3493580, -2372338, -1563088, -672663, 1483967, 3877551, 4036822, 1502493, -1489938, -2594954, -1222845, 1606042, 3952578, 4261205, 3193465, 3173867, 4951783, 6027220, 4021448, 184825, -2217153, -1733888, 760530, 3933851, 6372080, 6384070, 3628832]
9950C628832l485403k074225o89028n4368J194792L040281L369868J552995m25185
9941F058559j171454j254810r44472K34546J371780R52366q8018K99313J030481
9932F488291o84128l634633l421201K83709K650472J341232j60661R27727K070978
9923E861786L57882k427108l072760j718791k50508J020302K272191K464735J152045
9914E659774k58245p34580q43164q60476l29275J69770j24589J24182J974244
9905D777641K618437o85735m356770k876262J427562J234706l120973l560644
9897d542038J702813M714079J636643r86260J193742K629637n91343k452878J455893
9888D760288M505130Q00071l401877r38540K888595M08775l672151j253235L437551
$$ y = [3628832, 143429, -1930796, -2619824, -2674192, -1479400, 1560881, 4930749, 6483744, 6058559, 4887105, 3632295, 2687823, 2922369, 4294149, 5246515, 5158497, 5457810, 6488291, 5804163, 2169530, -1251671, -967962, 1682510, 3023742, 2863081, 3790808, 5861786, 6219668, 3792560, 719800, -998991, -1249499, -229197, 2042994, 4507729, 5659774, 5401529, 4666949, 3823785, 2963309, 2634034, 2803804, 2679215, 2803397, 4777641, 7396078, 6710343, 2353573, -522689, 904873, 2139579, -981394, -4542038, -2839225, 1874854, 3511497, 2525237, 3718979, 6348616, 5757273, 3304395, 4760288, 9265418, 10065489, 6663612, 5725072, 8613667, 9022442, 5350291, 4097056, 7534607]
9879G534607K136240q76089K677336O874430J677409m342717M805622K0196760
9871D0683598J4216530j5391311l5128659k2103464L458478J0037976j055555
9864e282407n999714J508961O269600J199004l643477j785672M60194j141589
9856h415100j444059J963726L258010K349j653712J459029L393276K1167l398461
9847d813775j616290J865711J789751j04504J95303J349410L15651j112011J27709
9838b003045J958244N75008k478851k555555N96443K879959K219014K77077j302300
9829A65994k292446k197105p41519N14312M5002r88657o66364L66914L63399j98826
9819e629296R7236M87869l07811p66811J079215L127869J640125k266563l434736
$$ y = [7534607, 9670847, 8794758, 11472094, 18346524, 20023933, 15681216, 20486838, 40683598, 54900128, 39508817, 4380158, -17723306, -14264828, -4226852, -5282407, -11282121, -9773160, -3503560, -2304556, -5948033, -7733705, -7273511, -8415100, -9859159, -7895433, -4637423, -4635074, -6288786, -4829757, -1436481, -1415314, -4813775, -6430065, -4564354, -2774603, -2879107, -2683804, -1334394, -1018743, -2130754, -2003045, -44801, 530207, -1948644, -4504199, -3907756, -1027797, 1191217, 1468294, 165994, -2126452, -4323557, -5065076, -4550764, -4505762, -5494419, -6160783, -5793869, -5430470, -5629296, -5532060, -5044191, -5352002, -6118813, -5039598, -1911729, -271604, -2538167, -5972903]
9810e972903l92560K529463K005573J26097Q1297J403382J940478J371523L51561
9801C443911j090554k134845r63356J796253K425747m11092k617649n01059L102161
9792C049517K775555j345464m090701k948211m68872R28946J796479K416067J216602
9783C329918j646092k811193l58983K773711K656021l67509k843866l058806j997152
9774d323951n05161J566798L465052L392675J068174j307536j640567m56067J17785
9765A377202p40424j642461r99023P99528J769122Q29786p17623q00043O27571
9756E03635J394929J00229j703101j410369R37733K350167P88174j932839k467848
9747a439290m56885J163006N03773p19089j48701J541554K014832J116890P07371
$$ y = [-5972903, -6365463, -3836000, -1830427, -1704330, -1623033, -219651, 1720827, 3092350, 3443911, 2353357, 218512, -744844, 1051409, 3477156, 3066064, 448415, -52644, 3049517, 5825072, 4479608, 388907, -2559304, -3028176, -2099230, -302751, 2113316, 3329918, 1683826, -1127367, -1486350, 1287361, 3943382, 3575873, 732007, -2326799, -4323951, -4829112, -3262314, 202738, 3595413, 4663587, 3356051, 1715484, 1259417, 1377202, 636778, -1005683, -2004706, -1205178, 563944, 1393730, 676107, -123936, 503635, 1898564, 1998793, 295692, -1114677, -176944, 2173223, 2961397, 1028558, -1439290, -1896175, -733169, -229396, -948485, -1097186, 444368, 2459200, 3576090, 4283461]
9738D283461J042192K79168j859959k806056r93567J284225Q80184j799769l414439
9729c104560j972040J131707L011383K146891l93077k063248j552568j99443K28207
9720b766748L45158J633150K903955J678529r42400j079361J307312J524977j964577
9711B639995m077255j225267K238038R46015k536640k290826P44546Q03365k226405
9702d984434k584899J049334L100259O42218j893824m64582K340352K392089L53895
9693d9592q42249q95573r62734p31578K48342R20461P55539Q08187J028802k93250
9683a3645k719651k990000k14574K105075J629793P86360J980704L170586J695542
9674E430190r39841j825041j230486q47873k44263J297253K002570L33976j837887
$$ y = [4283461, 5325653, 5604821, 3744862, 938806, -54761, 1229464, 2109648, 309879, -3104560, -5076600, -3944893, -933510, 1213381, 820304, -1242944, -2795512, -2994955, -2766748, -2421590, -788440, 2115515, 3794044, 2851644, 1772283, 3079595, 4604572, 2639995, -1437260, -2662527, -424489, 521526, -2015114, -4305940, -3561394, -2758029, -4984434, -7569333, -6519999, -3419740, -2777522, -4671346, -5135928, -2795576, -403487, -49592, -891841, -1787414, -2750148, -3481726, -3233384, -2312923, -1557384, -749197, 279605, -13645, -2733296, -5723296, -5937870, -3832795, -2203002, -1416642, 564062, 3734648, 5430190, 4490349, 2665308, 1434822, 586949, 342686, 1639939, 3642509, 3976485, 2138598]
9665B138598k185431j592792j566621q45165J616394L174665J380521j240480
9657H79689r85416P56929J51246k067505j856078Q90447K094316M10514j041191
9648g67049m97991j00032j276735j931600j99200K226026K564622O75650j244957
9639e51266j422899j25425P65732j41546j641688j093539J611570L327648K205139
9630B933726K98802l00986p40301k024473j925319Q16891K609339K69135k789413
9621h52599j436697K428634K616226j212137l178899q39832J729387J381219J3642
9612F48944k66100l05001n19074L80468J701124R19035j149035p14126K088882
9603B785117K582205l68105j976992J62473J885606L9846k101333j375026n84534
$$ y = [2138598, -46833, -1639625, -3206246, -4051411, -2435017, 739648, 2120169, 879689, -105727, 651202, 802448, -1265057, -3121135, -2230688, -136372, 274142, -767049, -1265040, -1365072, -2641807, -4573407, -4772607, -2546581, 18041, 693691, -551266, -1974165, -2099590, -1333858, -1475404, -3117092, -4210631, -2599061, 728587, 2933726, 3232528, 2931542, 2191241, 166768, -1758551, -941660, 1667679, 1936814, -852599, -2289296, 139338, 2755564, 1543427, -1635472, -2475304, -745917, 635302, 648944, 382844, 77843, -441231, -60763, 1640361, 2559396, 1410361, 696235, 2785117, 5367322, 4999217, 3022225, 3184698, 5070304, 5110150, 3008817, 1633791, 1049257]
9594A049257k492421l545995J6637M361822L453324j033594k495101K7271J403555
9585G44755l98982j882133j096518n37431j545706j543040R14360K945910J868323
9576e30462n35300r53828O26797J507723K95866j616482k058219n45215J107327
9567b701793P11540j347927k006922N10267L777109M062272J204907j607788k239465
9558C62200j325470k1639J257181J754792O44010j130006j578442p49625p49760
9549a536759j994468j980825P70596L729486L429808K75564j954148j034296J279638
9540I84596K124005J154668J22676k11820q68301k115100k157218O1728K181512
9531A276746J145911j863745k377961Q05202L323406J420890k485158l378971
$$ y = [1049257, -1443164, -4989159, -4972522, -610700, 2842624, 1809030, -686071, -658800, 744755, 345773, -1536360, -2632878, -3170309, -4716015, -6259055, -5344695, -2398785, -530462, -1065762, -2019590, -1392793, 114930, 410796, -1205686, -3263905, -3809120, -2701793, -1990253, -3338180, -5345102, -4834835, -1057726, 3004546, 4209453, 2601665, 362200, -963270, -984909, 272272, 2027064, 2671074, 1541068, -37374, -786999, -1536759, -3531227, -5512052, -4741456, -1011970, 2417838, 2693402, 739254, -295042, 984596, 3108601, 4263269, 4385945, 4174125, 3305824, 1190724, -966494, -904766, 1276746, 2422657, 558912, -1819049, -1013847, 2309559, 3730449, 1245291, -2133680]
9523b133680p96461J161439J50822j615278j206961J193706L163727K899160N78233
9514C394707j844631k082182O3672K046410J646314r1731p82349n05443j045438
9505G99329k071976j489529L31146M00298j836221k981465j043466J170288O86832
9496f034764o50349N77544L310834L466086N55747j502125n33831R44659K85997
9487D19798j219286j026087M82797J145193O68324L69873K68529p29198k041041
9478a661098j604665P27132K446243J871282K23721p73197j211481j511879p79192
9469b273134J275998K544488J222185r65976j112230K15408p333j920959k303616
9460c325169j10010J452395K05037j228690J99622K633648K051767j290071l103018
$$ y = [-2133680, -2930141, -1768702, -1617880, -3233158, -4440119, -3246413, -82686, 2816474, 3394707, 1550076, -532106, -468434, 1577976, 3224290, 3132559, 2350210, 1844767, 799329, -1272647, -2762176, -2431030, -2030732, -3866953, -6848418, -7891884, -6721596, -6034764, -6685113, -6107569, -2796735, 669351, 1225098, -277027, -810858, 133801, 419798, -799488, -1825575, -1342778, -197585, 470739, 840612, 1109141, 379943, -1661098, -3265763, -2538631, -92388, 1778894, 2002615, 1229418, 17937, -1493942, -2273134, -997136, 1547352, 2769537, 1803561, 691331, 906739, 899406, -1021553, -3325169, -3435179, -1982784, -1777747, -3006437, -2806815, -173167, 1878600, 588529, -2514489]
9451b514489j399461J009751R83840q44421j668048l31811J710781K320721Q39299
9442A06162j173647j432778K25312J217827l32382k500109k003919Q52604K399969
9433b640961R18235j163469j321659m09201l62801p87695j58033J174559J681656
9424c069369J405257J523200J684698L43491k128798l077764j100663J902637
9416b517311L183117K194770K34245j559840k560016k157015n35044P20396M32836
9407b563862j50800J022012L261579L402527L49493k776414k631811j54566J115372
9398H73530J87354o01374J94798J029856M08160n11559r0458Q85645O33541n07342
9388B502151p37857P567l9172j306811j901711n46373J305807J422437l19999
$$ y = [-2514489, -3913950, -2904199, -1920359, -2764780, -4432828, -4764639, -3053858, -733137, 106162, -1067485, -2500263, -2274951, -1057124, -1389506, -3889615, -5893534, -5040930, -2640961, -1722726, -2886195, -4207854, -4617055, -4979856, -5767551, -5925584, -4751025, -3069369, -1664112, -140912, 1543786, 1887277, -241521, -3319285, -4419948, -2517311, 665806, 2860576, 3094821, 1534981, -1025035, -3182050, -3717094, -2996698, -2563862, -2714662, -1692650, 1568929, 4971456, 5320949, 2544535, -87276, -241842, 873530, 1060884, 459510, 654308, 1684164, 2092324, 1580765, 1490307, 2375952, 3009493, 2502151, 1764294, 1771861, 1732689, 425878, -1475833, -2022206, -716399, 706038, 386039]
9379C86039k100034k435906j335693L22898J663417K211305J977026J164130j72745
9370A680437j769472k589112j535305R36331K731481K218904l5058j967390j999702
9361b328886k13102J773175K022136K56249j373933p34626J050079P15466k195323
9352a028765l944294j833927J546104K105907M87080O99249L221683L904930O63341
9343E821308k907683k832348l40758P96588p507n78276m65000j133556k202795
9334c850027j281148J842527L973960K715629l51566j968755j062325P70100J387221
9325B175616o8540k398008k999426n30816K871234L563450Q58360k187713k782381
9316a498224j287636L59712J002743L33034j222854j874936m7374K586892K436408
$$ y = [386039, -1713995, -4149901, -5485594, -5162696, -3499279, -1287974, 689052, 1853182, 1680437, -89035, -2678147, -4213452, -3277121, -545640, 1673264, 1638206, -329184, -2328886, -2541988, -768813, 1253323, 1509572, 135639, -598987, 451092, 1166558, -1028765, -4973059, -6806986, -5260882, -3154975, -2667895, -1968646, 1253037, 5157967, 5821308, 2913625, 81277, -259481, 537107, 529600, -48676, -513676, -1647232, -3850027, -5131175, -3288648, 685312, 3400941, 3049375, 1080620, 18295, 788395, 2175616, 2107076, -290932, -3290358, -3821174, -949940, 2613510, 3471870, 1284157, -1498224, -2785860, -2426148, -1423405, -1090371, -2313225, -4188161, -4235535, -1648643, 787765]
9307G87765n02994j847617N49652K917642J572110j049863o96176J359196P31643
9298C821358k136699k540697L70760K135183N23420j162973k32514J103538K95151
9289B176527j043911m35159J082079J168783J34915l78668m35735p73235q18616
9280F76980k40240k95029j215423p97766J609111K505111p25676m610394l823605
9271f916931R22390L886679K539939J59627m9038R01903O94059o34349j480130
9262B4149r22131Q07279K431947K047918o93341l052862k116548J061070K767983
9253B355464J759484J70194m72805q17838j089226m21691O10111K31402j051349
9244A273746p89155P94851O06266j616094j959632J044108L108208Q89915k246293
$$ y = [787765, 284771, -1562846, -1013194, 1904448, 3476558, 2426695, 1730519, 3089715, 3821358, 1684659, -856038, -485278, 1649905, 2173325, 1010352, 777838, 1881376, 2176527, 1132616, 697457, 1779536, 2948319, 3083234, 2704566, 2268831, 1495596, 676980, 436740, 141711, -1073712, -1871478, -262367, 2242744, 1517068, -3093326, -6916931, -5994541, -2107862, 432077, 591704, 542666, 1444569, 2138628, 1504279, 24149, -897982, -90703, 2341244, 4389162, 3695821, 642959, -1473589, -412519, 2355464, 4114948, 4285142, 3812337, 2994499, 1905273, 1483582, 2093693, 2325095, 1273746, 484591, 1279442, 1885708, 269614, -1690018, -645910, 2462298, 3352213, 1105920]
9235A105920j590179J277721J480731r15640j447436R70327K507326R55975j209745
9226C135000j393352l09120N06760J081469J474996R11502k18118k15849R38105
9217E911393J186967j4429o89326p7004j01484j466689j726560L64788J837846
9208E225502o554k816788k614462Q221J191518P4297n67788L29159M31326j503976
9198b49545l168391k335181j34356J119250J224473J329327J462293Q03409m42305
9189c91026j121101p35430J66365R28160J256169R86765R9714j046897j810659
9180a667940j612663l78189J053604J375112L60642m83966J66518J366888J152512
9171A332518m12634j266550n54220K06743k33147j035919j116956r56634j206874
$$ y = [1105920, -484259, 793462, 2274193, 1358553, -88883, 881444, 3388770, 4344745, 3135000, 1741648, 1432528, 1939288, 3020757, 4495753, 5407255, 5189137, 4973288, 5911393, 7098360, 7083931, 6394605, 6317601, 6216117, 4749428, 3022868, 3387656, 5225502, 5218948, 2402160, -212302, -204081, 987437, 1061734, 493946, 823105, 1254431, -249545, -3417936, -5753117, -5887473, -4768223, -3543750, -2214423, -752130, 51279, -391026, -1512127, -2247557, -2081192, -1153032, 103137, 1089902, 1189616, 142719, -1667940, -3280603, -3658792, -2605188, -1230076, -869434, -1353400, -1186882, 180006, 1332518, 919884, -346666, -900886, -694143, -927290, -1963209, -3080165, -4036799, -5243673]
9162e243673j134058j09384P52131L59551p7541J235603L341969L343531O29505
9153C097634j922721j683172M75373J674758O72732j136185j863236j185717q3735
9144a954269P76502J611055K393075K125778K44755j805577j937864l64853N51672
9135A640274k13815r55322k09994R03806P99611K8791j33612j37750r94135j928190
9125a200336j543426l03846M85358J092708K171241K341073J59873k378941k056077
9116a232373K55299O33397j372415j939721K16315J229721j268089l564318j672586
9107h714770K049761K698422N82691Q8881K187384L276285J423717r54886j487204
9098A150281r02897m38547L36396J504036J612793L38255k54253R27609J738901
$$ y = [-5243673, -6377731, -6487115, -5734984, -5375433, -5452974, -4217371, -875402, 2468129, 3097634, 1174913, -508259, -32886, 1641872, 2314604, 1178419, -684817, -1870534, -1954269, -1177767, 433288, 2826363, 4952141, 5196896, 3391319, 1453455, 1088602, 1640274, 1426459, 471137, 261143, 1164949, 1964560, 1993351, 1859739, 1721989, 727854, -1200336, -2743762, -3047608, -2562250, -1469542, 701699, 3042772, 3202645, 823704, -1232373, -977074, -343677, -1716092, -3655813, -3439498, -2209777, -3477866, -7042184, -8714770, -6665009, -3966587, -3383896, -3295015, -1107631, 2168654, 3592371, 2637485, 1150281, 247384, -191163, 145233, 1649269, 3262062, 3600317, 3346064, 4273673, 6012574]
9089F012574J97294j893889j502567Q39501J850662N07127q31556m94540J96481
9080D881087l23863j257193j193994o72058j016233j785607j522278m44065j23712
9071c457916n58684J6272J815331K509827R72038l27514R75276K861474J624340
9062F430444k027656l430537r17196J669334J054759o54152j74672J120229j53622
9053B916931k822757k368070J462320L439144O93765k903650k906167q44571p83128
9044d116183k314557j814166Q32979J953903N10753k23265J391567K417549O64549
9035f96871j128319K34072K911891K951754N10118j038568q37530j032125k090160
9026b15738j984153k57122J096177J334463J726140K034945M16654k197174k152432
$$ y = [6012574, 6209868, 4315979, 2813412, 3652913, 5503575, 6010702, 5179146, 4684606, 4881087, 4557224, 3300031, 2106037, 1433979, 417746, -1367861, -2890139, -3334204, -3457916, -4016600, -4000328, -2184997, 324830, 1296868, 969354, 1944630, 4806104, 6430444, 4402788, 972251, 55055, 1724389, 2779148, 2124996, 1950324, 3070553, 2916931, 94174, -2273896, -811576, 2627568, 3321333, 417683, -2488484, -3333055, -4116183, -6430740, -8244906, -7411927, -5458024, -4947271, -5170536, -3778969, -1361420, -696871, -1825190, -1591118, 1320773, 4272527, 4782645, 3744077, 2906547, 1874422, -215738, -2199891, -2457013, -1360836, -26373, 1699767, 3734712, 4151366, 1954192, -198240]
9017a98240P99239K125150k94152k446121j061174O87641r23878l011882r17419
9008e240836L096400L017687q72188k510979j55065J451676j29941j271775N07348
8999b107673K100287P96156q93644j84142R37618k34308j930793j140532R90078
8990a666953J310049l5941n03224L24431P40275J91096n22414j115322j339018
8981b617021j91275J969835K492717K83506j614386l98452J792448J296608q91201
8972B122779p61425J945255L169589P46938k783743m193796l218136j479502k36325
8963d688366J87165M33289J533161K963935K376788q53911l410082k088704J322887
8954b223838K441672M88179j360842j081607K77301J372911J843826J106893q59220
$$ y = [-198240, 600999, 2726149, 2431997, -14124, -1075298, -387657, -1311535, -4323417, -5240836, -2144436, 873251, 1063, -2509916, -2664981, -1213305, -1343246, -2615021, -2107673, -7386, 788770, -104874, -289016, 648602, 414294, -1516499, -2657031, -1666953, -356904, -392845, -896069, -571638, 168637, 359733, -162681, -1278003, -2617021, -2808296, -838461, 1654256, 1937762, 323376, -75076, 1717372, 3013980, 2122779, 1361354, 3306609, 6476198, 7223136, 4439393, 245597, -2972539, -4452041, -4688366, -4501201, -4067912, -2534751, 429184, 2805972, 1952061, -1458021, -3546725, -2223838, 217834, 706013, -654829, -1736436, -1459135, -86224, 1757602, 2864495, 2005275]
8945B005275j982226o32296J111259M24287j126663l2380K411733J489293k610148
8936A058134m069710n91784K820636J912208o38949p52962L02931p15351k716665
8927c391512k308849L30476K208310K426673K228172J540812n25782k610791k263137
8918b365628J10585J541869O62527q77205j008703O35181K783326L279474Q10071
8909E571497k726658l273213J32601L183682J834910k018771l475644j519759
8901b291355O11879Q06742j1149q66473j866161k234318o44840J995637L029808
8892a470230J754607O101j071875j925929k092831j40764L092841M391742K520340
8883E064002j05824j310578j824016k550376k184575J15944K094810J223563j336594
$$ y = [2005275, 23049, -609247, 502012, 926299, -200364, -232744, 2178989, 3668282, 1058134, -3011576, -3603360, -782724, 1129484, 490535, -262427, 40504, -674847, -3391512, -5700361, -5369885, -3161575, -734902, 1493270, 3034082, 2508300, -102491, -2365628, -2255043, -713174, -50647, -927852, -1936555, -1301374, 1481952, 4761426, 5571497, 2844839, -428374, -295773, 2887909, 4722819, 2704048, -771596, -2291355, -1679476, -872734, -883883, -1750356, -3616517, -5850835, -6495675, -4500038, -1470230, 284377, 290478, -781397, -2707326, -4800157, -4940921, -1848080, 2543662, 5064002, 4958178, 3647600, 1823584, -726792, -2911367, -2795423, -700613, 522950, -813644]
8874h13644k243355n66840J454566J778430O82510l42867l40217M42103P58028
8865H08714l33387j820250j494186P91192K165197N87993j843120j666404R02604
8856a901647K401853J257805l97069n33825j07247p49289j704303j062268J039416
8847a756574K388464J636683j67659j144048p40920J586q1548q85108j246215
8838a995339n90668J27188k05666r94134o88443O70935J322356O77002M63593
8829a213176J777837K789710J374811j291991k274822j296698q04385j657120
8821b595834j781879K1559J779527J486133K34470J29902Q65608P56833o4396
8812H31923o0056P48693P50676m07573j200860p02407K45444O68462N17818k29788
$$ y = [-813644, -3056999, -3623839, -2169273, -390843, 291667, -51200, -391417, 50686, 808714, 475327, -1344923, -2839109, -2047917, 117280, 705273, -1137847, -2804251, -1901647, 500206, 1758011, 1360942, 827117, 719870, -29419, -1733722, -2795990, -1756574, 631890, 2268573, 2100914, 956866, 215946, 217532, 135984, -749124, -1995339, -2586007, -2458819, -2664485, -3658619, -4347062, -3676127, -2353771, -1676769, -1213176, 564661, 3354371, 4729182, 3437191, 1162369, -134329, -938714, -2595834, -4377713, -4356154, -2576627, -1090494, -856024, -726122, 139486, 896319, 831923, 771867, 1520560, 2271236, 1863663, 662803, -39604, 205840, 874302, 1392120, 1162332]
8802A162332j713226k903644k023265Q24775K993247K398344J35888j109010l50839
8793e85398J053266J373806K08625j329140j583009j07705J299656M23557k072949
8784a319291k736164J51766L633594L559531J07250k482405j584524P90010J473204
8775A592971N12213K06762R66640O61033j573723l159554j413301K150687L205319
8766C149047L29197l010939l220276j188331j85429p91469p95512M74680J039009
8757d200023P4855l00655J309259K734659J459900j113613j494531O81455K226317
8748A377623J224340m88186n38992N62494P74503j84059p43166j12954P12897
8739B584500P28251L24174K70434K07773p61469k228048k423399n13998J915273
$$ y = [1162332, -550894, -3454538, -5477803, -4653028, -1659781, 738563, 874451, -234559, -585398, 467868, 1841674, 2050299, 721159, -861850, -969555, 330101, 753658, -1319291, -4055455, -3903689, -270095, 3289436, 3396686, 914281, -670243, 119767, 1592971, 2105184, 2311946, 3278586, 3939619, 2365896, -793658, -2206959, -56272, 3149047, 3478244, 467305, -2752971, -3941302, -4126731, -4918200, -5713712, -5239032, -4200023, -4125168, -4425823, -3116564, -381905, 1077995, -35618, -1530149, -848694, 1377623, 2601963, 2113777, 1574785, 2137279, 2911782, 2727723, 1984557, 1871603, 2584500, 3312751, 3636925, 3907359, 4115132, 3353663, 1125615, -1297784, -1811782, 103491]
8730A03491K578731J220530m23250j105897j131220q28766L11332K060357K535183
8721E320491N05307k275615k945075j384640j67709n44824p72484N76411J807200
8712A19062O13236j964724k620657m83786J772260J939925J020310Q23268R29694
8703B148588o0308j656252k082304j086445l2099M90532J036423J372199M47126
8694E77460j299840j810046m05921J053346J035553M72578P48044J282681P45624
8685B399479o23992j493105j274570k64409R90579J453349J72234j810817j965707
8676b416959n7116Q54733q35572k137942p5636K980339K676824k48277j109738
8667c69344J010833J890452o53369l141241k072461Q71503J998631R00445l29181
$$ y = [103491, 2682222, 3902752, 3479502, 2373605, 1242385, 413619, 724951, 2785308, 5320491, 5825798, 3550183, 605108, -779532, -947241, -1492065, -2264549, -1688138, 119062, 732298, -1232426, -3853083, -4336869, -2564609, -624684, 395626, 1218894, 2148588, 2088280, 432028, -1650276, -2736721, -2768820, -2278288, -1241865, 130334, 577460, -722380, -2532426, -2938347, -1885001, -849448, -376870, 371174, 1653855, 2399479, 1775487, 282382, -992188, -1256597, -266018, 1187331, 1359565, -451252, -2416959, -2474075, -1619342, -2454914, -4592856, -4668492, -1688153, 988671, 740394, -369344, 641489, 2531941, 1878572, -1262669, -3335130, -2463627, -464996, 435449, 106268]
8658A06268q64278j204227j015733L24119J850359J896194M25300j066375j476420
8649a024793p85152M70044J396712J179655J42955m57453k99888m95559j543287
8640a416766k147410j059746J036371K439585K301379R23531p84545j619452r77790
8631a304843J50815K54648n12453p10082j46739k9233m30372Q588J365167J980029
8621F25525J467864J483448K413055K118915m81405l209693l773672k735360j577053
8612c668376k27416J503691K317833J410547J04269l80403p28568j382902j040233
8603b091558O65620J498813k510j818520j479503M75102K249536L375825L327834
8594F200639P88898k909166l232304J029182M309572J854377k686784k769080
$$ y = [106268, -758010, -1962237, -2977970, -2653851, -803492, 1092702, 1518002, 451627, -1024793, -1809945, -1339901, 56811, 1236466, 1379421, 921968, 622080, 126521, -1416766, -3564176, -4623922, -3587551, -1147966, 1153413, 2076944, 1292399, -327053, -1304843, -1154028, -899380, -1411833, -2121915, -2268654, -2297887, -2728259, -2719671, -1354504, 625525, 2093389, 3576837, 5989892, 8108807, 7627402, 4417709, 644037, -2091323, -3668376, -3895792, -2392101, -74268, 1336279, 1440548, 1060145, 331577, -1051325, -2091558, -1425938, 72875, 70365, -1748155, -3227658, -2752556, -503020, 2872805, 6200639, 6989537, 4080371, 848067, 1877249, 6186821, 8041198, 5354414, 2585334]
8586B585334Q19689J792763j211282l090054j123076J293955R65613p13366j396759
8577g7183j121166l42594J273958K674846J815568n78825j359628j7707N22871
8568B790140q20945j461388n5892R77694j02336j263959m46300R00694N58780
8559A076488q59752j443864r72493l54085J63120O95368J092807J344095J142552
8550A884236o05352l532527m111799M1594M944887M322770r98196l546814k61939
8541a863140L128094J408631k441078k898462k50056J420045Q60624k95194j188140
8532b118676j408717K45119L060512L436839J99942k443987j143048J102951K73437
8523A204372j619114m73004K105328J503851j524206k094164K56177J141471o36128
$$ y = [2585334, 3405023, 5197786, 3986504, 896450, -226626, 1067329, 2032942, 1319576, -77183, -1198349, -1540943, -266985, 2407861, 4223429, 3644604, 2284976, 2267269, 2790140, 1969195, 507807, 451915, 1429609, 1327273, 63314, -382986, 517708, 1076488, 216736, -1227128, -2199621, -2553706, -2390586, -1695218, -602411, 741684, 1884236, 1278884, -2253643, -6365442, -6323848, -1378961, 2943809, 1945613, -1601201, -1863140, 1264954, 2673585, 232507, -2665955, -2916011, -1495966, -635342, -930536, -2118676, -3527393, -3282274, -221762, 3215077, 3415019, 971032, -172016, 930935, 1204372, -414742, -887746, 1217582, 2721433, 1197227, -896937, -640760, 500711, -135417]
8514a35417j342193N67934J857940O27422o29673j42211J8597j644328k934521
8505c756450j875990j1582P12786J021781J870667K052899P24811m24031O9070
8496C83961R32560N92508k52747n69105j057419k068616j886959L67148K305339
8487a253330J510217o15887j108424m7117J24892j102129j740484p39692O34863
8478d337091R66742K45222p93513j304219n08009J316190K419397J627618J96804
8469a70859j5448N42961J42409r35742p96785M27900L24976j609862k431145r7017
8459d618612L037050L426601J324646j76403l9118j10858j219629j683602o29084
8450f89009J15796p91862j507360O7952K333475J958805r10834k509060p24351
$$ y = [-135417, -1477610, -909676, 948264, 1575686, 946013, 803802, 822399, -821929, -3756450, -5632440, -5644022, -4931236, -3909455, -2038788, 14111, 738922, 314891, 383961, 1316521, 1909029, 1656282, 1087177, 29758, -2038858, -3925817, -3558669, -1253330, 256887, -359000, -1467424, -1514541, -1389649, -2491778, -4232262, -4971954, -4337091, -3370349, -3125127, -3918640, -5222859, -5730868, -4414678, -1995281, -367663, -170859, -186307, 356654, 499063, -436679, -1233464, -805564, -480588, -2090450, -4521595, -4618612, -1581562, 1845039, 3169685, 2993282, 2954164, 2843306, 1623677, -59925, -689009, -573213, -1365075, -2872435, -2804483, -471008, 1487797, 576963, -1932097, -2656448]
8441b656448K240003L268353K014975O4016j507874k271960j773791k65352J007790
8432A19712J408966J622222J858500J041707q89984j751839j77511J661354Q68400
8423E761527j704424k518746m84863J636809J258448q14199j882823o17117J782765
8414B417377K875247J381898j166227j898944m45855J74861j980726m240448k910935
8405e793752R09670K633955R44272n61043P98883K879972K340258n61574k865435
8396G25206k788003q76323J368279K480228J715813o987p57442k2479N74213l18743
8386B093762j894900k501004j679321j92862R37240R75995J63682n3193J119204
8377a031397K014908O51279j627465j609499N29295J130737q11697j650562O29381
$$ y = [-2656448, -416445, 2851908, 4866883, 4930899, 3423025, 1151065, -622726, -888078, 119712, 1528678, 3150900, 5009400, 6051107, 5161123, 3409284, 3231773, 4893127, 5761527, 4057103, 1538357, 1053494, 2690303, 3948751, 3134552, 1251729, 634612, 2417377, 5292624, 6674522, 5508295, 3609351, 3163496, 3338357, 1357631, -2882817, -5793752, -4884082, -2250127, -1305855, -1866898, -1068015, 1811957, 4152215, 3590641, 725206, -2062797, -2939120, -1570841, 909387, 2625200, 2618213, 1860771, 1838292, 2412505, 2093762, 198862, -2302142, -3981463, -4174325, -3237085, -2261090, -2097408, -2150601, -1031397, 983511, 1634790, 7325, -1602174, -1072879, 57858, -753839, -2404401, -1775020]
8368a775020K429455L62704k692818k017771J255593K249471M28506k88771R88179
8359I39528O81636k196808l419576m84435K754367J909093j258813k026080M8756
8350c052332J377579L94493q76589r73717r01350j329700j073414M58669J712533
8341d263828J319766K43990J79245J107878J838564J925893J596122O07327j124217
8332C430740k236685j176386J169977K014213M60845j084319m75000R25232M52266
8323C480883j617376k502907j177732M28688P72429O28863P46676Q6297j869480
8314a023659l061487j407710J777247L214000J931114M9688m37634K20863P29795
8305A992217N31263R7421K77795J235197J599157k94063l484793m380074j390407
$$ y = [-1775020, 654435, 1017139, -1675679, -3693450, -2437857, -188386, 240120, -48651, 939528, 1621164, -575644, -3995220, -4479655, -1725288, 183805, -1075008, -3101088, -3052332, -1674753, -1280260, -2156849, -3130566, -4031916, -5361616, -6435030, -5976361, -4263828, -2944062, -2700072, -2520827, -1412949, 425615, 2351508, 3947630, 4554957, 3430740, 1194055, 17669, 1187646, 3201859, 3662704, 2578385, 2103385, 3028617, 3480883, 1863507, -639400, -1817132, -1388444, -616015, 12848, 759524, 845821, -1023659, -4085146, -5492856, -3715609, -501609, 1429505, 1479193, 1041559, 1262422, 1992217, 2523480, 2620901, 2898696, 4133893, 5733050, 5438987, 1954194, -2425880, -3816287]
8296c816287K120427K081193n12965j394885K97156J202629k68538j476629m29665
8287b197564Q97193M02343l68434P91897K584222K254029P8765j311156r69723
8278B161572j56547L62214Q78367J124479M63304o60515j409623k047139k823322
8269b107210k419483N1683K442807J928040n18668j180373Q62880K551455J775248
8260C386379J99306p6581L13448n318m65530p0781K75998o54841j755832r33088
8250B13160J405381K454030P60349j852580k683009j352377J51390J45198q17980
8241a576438r09887N31275K238153K756919K047813Q63528m51807j629043j930568
8232A939945j189436m89728m17824K51001K274596L624924K092690p50861j519880
$$ y = [-3816287, -1695860, 385333, -127632, -1522517, -1225361, -22732, -291270, -1767899, -2197564, -1300371, -898028, -1266462, -474565, 2109657, 4363686, 4442451, 3131295, 2161572, 2005025, 2367239, 3245606, 4370085, 4833389, 4172874, 2763251, 716112, -2107210, -4526693, -4475010, -2032203, -104163, -622831, -1803204, -940324, 1611131, 3386379, 3585685, 3509104, 3822552, 3817234, 3351704, 3280923, 3556921, 2902080, 1146248, 213160, 1618541, 4072571, 4832920, 2980340, 297331, -1055046, -903656, -758458, -1576438, -2486325, -1955050, 283103, 3040022, 5087835, 5951363, 5499556, 3870513, 1939945, 750509, 260781, -157043, 93958, 2368554, 5993478, 8086168, 7335307, 5815427]
8223E815427m89983j142986l873722m625552j474712J711670J043032j533098
8215d569924j716721N03615J724713R30987L21456J033350J715910J362003N81336
8206A886725j09076q35654j172293n30136L55689K65225m73086o17446j12320
8197a342372L37684R34886J866862J761298l19359k300547j536196Q98469J649027
8188A949752K83162n97372k10858m76509j657457j399872P52513K004777J090997
8179A739133M28563J457142J810569j36637j684462k89464J600257L97086k340293
8170B981894k166807R81153K527602K08480k913409l164064o54006K082277L176163
8161C059283K090520n84381k911396k928464j054637L41105K75093K06986J081466
$$ y = [5815427, 5325444, 4182458, 308736, -4316816, -5791528, -4079858, -3036826, -4569924, -6286645, -5783030, -4058317, -3127330, -2805874, -1772524, -56614, 1305389, 1886725, 1777649, 941995, -230298, -760434, -404745, -139520, -612606, -1230052, -1342372, -1004688, -69802, 1797060, 3558358, 3238999, 938452, -597744, 300725, 1949752, 2232914, 1635542, 1424684, 948175, -709282, -2109154, -1356641, 648136, 1739133, 2167696, 3624838, 5435407, 5298770, 3614308, 3324844, 4925101, 5322187, 2981894, 815087, 1796240, 4323842, 4532322, 1618913, -1545151, -2199157, -116880, 3059283, 5149803, 4565422, 1654026, -1274438, -2329075, -1987970, -1712877, -1505891, -424425]
8152d24425J465390R2892j493394r04812J386410K407496O68205j982435k918335
8143a703008j792469k35351N53277P86110R86704J050071P04012J61510j72137
8134C38719k36341j86594p9165J5903k8878j02823k6748j39932q56224j439181
8124b741264n72898J261333J736500J99066p94403N33915J792814J37933k404237
8115h51241j639602J592724K154272q73232k123450J228065M123205J451411l195888
8106A866264k543721K993342N505194J056466m999029n880003j911727J505357
8098b407857J319894q26500k045003j262067P35902K444630K676555J410549j95352
8089A850751r04486m54762M02175N76630m52578j941086k383057j269866J07389
$$ y = [-424425, 1040965, 1133857, -359537, -1264349, 122061, 2529557, 3197762, 1215327, -1703008, -3495477, -3730828, -3177551, -2391441, -1404737, -354666, 349346, 510856, 338719, 102378, -84216, -163381, -147478, -176356, -279179, -305927, -445859, -1302083, -2741264, -3314162, -2052829, -316329, -117263, -911666, -377751, 1415063, 1552996, -851241, -2490843, -898119, 1256153, 382921, -1740529, -512464, 3610741, 5062152, 1866264, -677457, 2315885, 7821079, 8877545, 3878516, -2001487, -3913214, -2407857, -1087963, -1914463, -3959466, -5221533, -4485631, -2041001, 635554, 2046103, 1850751, 946265, 491503, 893678, 1470308, 1017730, -923356, -3306413, -4576279, -4468890]
8080d468890L78142O3860O66767K065771K245485L4269k858092l302565j76232
8071e351485L968839N072278J882453k231607k844363K50291K883288J942798
8063E572492j014484k614290k117403j217533r12454p57694m07185N0992P51825
8054b665734J504212J341336O8840p89399j85632O14267K56885j94618N97685
8045E47842J190552m16443k696371k386550K33184J709528R45792L07141P96988
8036B31663M25591j404069k107138n21207N51314r59199k535493j126717J682880
8027e762375K207743M76741k74403J052982K180199J407383k18675j029822p23145
8018f83372J29451P65672L07294j247919k224385j133581Q61621J240001j91010
$$ y = [-4468890, -4090748, -4026888, -3360121, -1294350, 951135, 985404, -1872688, -5175253, -5351485, -1382646, 3689632, 5572085, 3340478, 496115, 746406, 3629694, 5572492, 4558008, 1943718, -173685, -1391218, -2303672, -3061366, -3468551, -3417559, -2665734, -1161522, 179814, 248654, -540745, -726377, -112110, 144775, -49843, 547842, 1738394, 1321951, -1374420, -3760970, -3527786, -1818258, -872466, -565325, 231663, 657254, -746815, -2853953, -3375160, -2823846, -3783045, -6318538, -7445255, -5762375, -3554632, -3077891, -3352294, -2299312, -119113, 1288270, 1069595, 39773, -683372, -553921, 211751, 519045, -728874, -2953259, -4086840, -3225219, -1985218, -2176228]
8009b176228j027884O995J292860J101262J39345j4185N89391Q97920P79697O28884
7999B218057l025j471441k374424j050521J400810K058171N70730j04892J401351
7990B644816K144203m79884l829559l487987j66760J350398j35434o66636J655660
7981i71183L047289M42716k963009k624947L12937J556537P20866P10541J652886
7972A884633R49142j140994j406102M77404J174865l44315j122206P6538M15941
7963I64906j444179k272376J72682K778320K006918l40521m33595J258868J348082
7954D039105n98826j868548j286187k35951M39957J140285J456855N23599q20417
7945B789872r98093m91246r41726j872363j263231P50928J803492J117779M28727
$$ y = [-2176228, -3204112, -3197117, -1904257, -802995, -663650, -677835, -88444, 809476, 1589173, 2218057, 2215032, 743591, -1630833, -2681354, -1280544, 777627, 1348357, 1243465, 2644816, 4789019, 4309135, 479576, -3008411, -3175171, -1824773, -1960207, -2626843, -971183, 2076106, 2518822, -444187, -3069134, -2756197, -1199660, -478794, 231747, 1884633, 2833775, 1692781, 286679, 764083, 1938948, 1594633, 472427, 548965, 964906, -479273, -2751649, -2578967, 199353, 2206271, 1865750, 1432155, 2691023, 4039105, 3440279, 1571731, 285544, 49593, 489550, 1629835, 3086690, 3610289, 2789872, 1791779, 1300533, 358807, -1513556, -2776787, -2025859, -222367, 895412, 1324139]
7936A324139N76988J31106j584512k733911j686941N26965J895037J916259J153022
7927A518152j42210j501207j639183l0317J690917J450716n13845j974784j656565
7918b798326n67630j28455j68350L01006R96564M98307j253443k055339k78610
7909e454276K356178K688299M38888j565697j656705j209979j319577m79450K201750
7900d000569L935255J745766k323138l300638l84420J902832N34018j740056j087298
7891d718248J398688J729592m73524j407218P23585K587695Q16070k373796k010126
7882c727282K002349L989160M52751m513491m648937j27101L158016K080186k87100
7873a621449m14739P11895N18211n85389n35378O45753J439630J681289J962115
$$ y = [1324139, 1901127, 2032233, 447721, -2286190, -3973131, -3446166, -1551129, 365130, 1518152, 1375942, -125265, -1764448, -1794765, -103848, 1346868, 833023, -1141761, -2798326, -3365956, -3494411, -3662761, -3361755, -2365191, -1866884, -3120327, -5175666, -5454276, -3098098, -409799, 29089, -1536608, -3193313, -4403292, -5722869, -6202319, -4000569, -65314, 1680452, -642686, -3943324, -4327744, -2424912, -1890894, -3630950, -4718248, -3319560, -1589968, -2063492, -3470710, -2747125, -159430, 656640, -1717156, -3727282, -1724933, 2264227, 2716978, -1796513, -6445450, -6572551, -3414535, -1334349, -1621449, -2036188, -1324293, -806082, -1391471, -1926849, -1281096, 158534, 1839823, 3801938]
7864C801938J360882j225703m132026m286164j497748J186483J614380P24792
7856b453166K49975L39960K30482k40035n66336k41882P36607J509142R21018
7847D85765q53252k042979j526182k80629M34937Q55787J254644O11392j131471
7838b191988j478632J010627L299415J775330j719365k190886O81067J991472
7830A177040m82347k864869j575734J347110K147580R87313L97739P53257O56046
7821B543135M8859j23472j09505n94328q69861j13721O42630J26757p38727m07479
7811D04288L73024j46222j323311q99899J103714K096322Q17172r60001j276252
$$ y = [3801938, 5162820, 3937117, -194909, -4481073, -5978821, -4792338, -3177958, -2453166, -2203191, -1863231, -1632749, -1872784, -2439120, -2681002, -1944395, -435253, 485765, -367487, -2410466, -3936648, -4217277, -3782340, -2926553, -1671909, -1060517, -2191988, -3670620, -2659993, 639422, 2414752, 695387, -1495499, -814432, 1177040, 694693, -2170176, -3745910, -2398800, -251220, 736093, 1133832, 1887089, 2543135, 2591994, 2468522, 2359017, 1764689, 894828, 781107, 1423737, 1550494, 811767, 404288, 777312, 631090, -692221, -1592120, -488406, 1607916, 2425088, 1465087, 188835]
$$ [...]
##END NTUPLES=NMR SPECTRUM
##END=
