##TITLE=31Pdec_SR91_rm4
 , 100 sc
 1.10.2021
##JCAMPDX= 6.0         $$ Bruker NMR JCAMP-DX V2.0
##DATA TYPE= NMR SPECTRUM
##DATA CLASS= NTUPLES
##ORIGIN= UXNMR, Bruker Analytische Messtechnik GmbH
##OWNER= root
$$ XWIN-NMR		Version 3.5
$$ Fri Oct  1 10:11:41 2021 Russian Standard Time (UT+4h)  she@DPX200
##.OBSERVE FREQUENCY= 81.013821
##.OBSERVE NUCLEUS= ^31P
##.ACQUISITION MODE= SIMULTANEOUS
##.ACQUISITION SCHEME= undefined
##.AVERAGES= 100
##.DIGITISER RES= 16
##SPECTROMETER/DATA SYSTEM= spect
##.PULSE SEQUENCE= zgpg30
##.SOLVENT NAME= CDCl3
##.SHIFT REFERENCE= (INTERNAL, CDCl3, 0, 248.564)
##AUDIT TRAIL= $$ (NUMBER, WHEN, WHO, WHERE, WHAT)
$$ ##TITLE= Audit trail, XWIN-NMR		Version 3.5
$$ ##JCAMPDX= 5.01
$$ ##ORIGIN= Bruker BioSpin GmbH
$$ ##OWNER= she
$$ F:/spectra/data/she/nmr/P31/1/pdata/1/auditp.txt
$$ ##AUDIT TRAIL=  $$ (NUMBER, WHEN, WHO, WHERE, WHAT)
(   1,<2021-10-01 10:10:51.35 +0400>,<she>,<DPX200>,
      <created by zg, POWCHK disabled, PULCHK disabled
       configuration hash MD5:
       00 E9 B6 7A A2 85 ED C7 34 08 36 98 17 FE 4E 26
       data hash MD5: 32K
       6A 21 53 8F CC 6D DC 9F 73 74 8A 62 5A 59 76 59>)
(   2,<2021-10-01 10:10:55.15 +0400>,<she>,<DPX200>,
      <Start of raw data processing
       efp BC_mod = 2 LB = 1 FT_mod = 6 PKNL = 1 PHC0 = -8846.37 PHC1 = 134.869 SI = 64K 
       data hash MD5: 64K
       A5 D8 68 1F F8 C3 7F 60 80 41 ED 69 B7 36 ED D1>)
(   3,<2021-10-01 10:11:11.90 +0400>,<she>,<DPX200>,
      <pk PHC0 = 37.27442 PHC1 = -105.4 
       data hash MD5: 64K
       30 72 40 CB 61 57 8C EB BF 79 16 C0 ED 83 94 E6>)
$$ ##END=
$$ 
$$ hash MD5
$$ 04 08 99 66 A6 31 45 66 41 49 6A 80 FA F8 05 09
##$RELAX= 
##$RELAX= 
##$RELAX= 
##$RELAX= 
##$RELAX= 
##$RELAX= 
##$RELAX= 
##$RELAX= 
$$ Bruker specific parameters
$$ --------------------------
##$DU= <F:/spectra>
##$EXPNO= 1
##$NAME= <P31>
##$PROCNO= 1
##$TYPE= <nmr>
##$USER= <she>
##$AMP= (0..31)
100 100 100 100 100 100 100 100 100 100 100 100 100 100 100 100 100 100 
100 100 100 100 100 100 100 100 100 100 100 100 100 100 
##$AQSEQ= 0
##$AQ_mod= 1
##$AUNM= <au_zg>
##$AUTOPOS= <>
##$BF1= 81.014009
##$BF2= 200.13
##$BF3= 200.13
##$BF4= 200.13
##$BF5= 200.13
##$BF6= 200.13
##$BF7= 200.13
##$BF8= 200.13
##$BYTORDA= 1
##$CFDGTYP= 0
##$CFRGTYP= 5
##$CHEMSTR= <none>
##$CNST= (0..31)
1 1 145 1 1 1 1 1 1 1 1 1 1 1 1 1 1 1 1 1 1 1 1 1 1 1 1 1 1 1 1 1 
##$CPDPRG= <waltz16>
##$CPDPRG1= <>
##$CPDPRG2= <waltz16>
##$CPDPRG3= <>
##$CPDPRG4= <mlev>
##$CPDPRG5= <mlev>
##$CPDPRG6= <mlev>
##$CPDPRG7= <mlev>
##$CPDPRG8= <mlev>
##$CPDPRGB= <>
##$CPDPRGT= <>
##$D= (0..31)
0 1 0 0 0 0 0 0 0 0 0 0.03 2e-05 3e-06 0 0 0 0 0 0 0 0 0 0 0 0 0 0 0 0 
0 0 
##$DATE= 1633068540
##$DBL= (0..7)
120 120 120 11 120 120 24 19 
##$DBP= (0..7)
150 150 150 150 150 150 150 150 
##$DBP07= 0
##$DBPNAM0= <>
##$DBPNAM1= <>
##$DBPNAM2= <>
##$DBPNAM3= <>
##$DBPNAM4= <>
##$DBPNAM5= <>
##$DBPNAM6= <>
##$DBPNAM7= <>
##$DBPOAL= (0..7)
0.5 0.5 0.5 0.5 0.5 0.5 0.5 0.5 
##$DBPOFFS= (0..7)
0 0 0 0 0 0 0 0 
$$ [...]
##$SUBNAM2= <"">
##$SUBNAM3= <"">
##$SUBNAM4= <"">
##$SUBNAM5= <"">
##$SUBNAM6= <"">
##$SUBNAM7= <"">
##$SUBNAM8= <"">
##$SUBNAM9= <"">
##$SW= 501.771253377433
##$SWIBOX= (0..15)
0 1 3 0 0 0 0 0 0 0 0 0 0 0 0 0 
##$SW_h= 40650.406504065
##$TD= 32768
##$TD0= 1
##$TE= 0
##$TE2= 300
##$TE3= 300
##$TEG= 300
##$TL= (0..7)
0 120 53 12 22 120 120 120 
##$TP= (0..7)
150 150 150 150 150 150 150 150 
##$TP07= 0
##$TPNAME0= <>
##$TPNAME1= <>
##$TPNAME2= <>
##$TPNAME3= <>
##$TPNAME4= <>
##$TPNAME5= <>
##$TPNAME6= <>
##$TPNAME7= <>
##$TPOAL= (0..7)
0.5 0.5 0.5 0.5 0.5 0.5 0.5 0.5 
##$TPOFFS= (0..7)
0 0 0 0 0 0 0 0 
##$TUNHIN= 0
##$TUNHOUT= 0
##$TUNXOUT= 0
##$USERA1= <user>
##$USERA2= <user>
##$USERA3= <user>
##$USERA4= <user>
##$USERA5= <user>
##$V9= 5
##$VALIST= <valist>
##$VCLIST= <CCCCCCCCCCCCCCC>
##$VD= 0
##$VDLIST= <DDDDDDDDDDDDDDD>
##$VPLIST= <PPPPPPPPPPPPPPP>
##$VTLIST= <TTTTTTTTTTTTTTT>
##$WBST= 1024
##$WBSW= 4
##$XGAIN= (0..3)
0 0 0 0 
##$XL= 0
##$YL= 0
##$YMAX_a= 25707
##$YMIN_a= -32770
##$ZGOPTNS= <>
##$ZL1= 120
##$ZL2= 120
##$ZL3= 120
##$ZL4= 120
##$ABSF1= 0
##$ABSF2= 0
##$ABSG= 0
##$ABSL= 0
##$ALPHA= 0
##$AQORDER= 0
##$ASSFAC= 0
##$ASSFACI= 0
##$ASSFACX= 0
##$ASSWID= 0
##$AUNMP= <proc_1d>
##$AZFE= 0.1
##$AZFW= 0.5
##$BCFW= 0
##$BC_mod= 2
##$BYTORDP= 0
##$COROFFS= 0
##$CY= -3
##$DATMOD= 1
##$DC= 0
##$DFILT= <>
##$DTYPP= 0
##$F1P= 0
##$F2P= 0
##$FCOR= 1
##$FTSIZE= 65536
##$FT_mod= 6
##$GAMMA= 0
##$GB= 0
##$INTBC= 1
##$INTSCL= 5.30512e-09
##$ISEN= 30
##$LB= 1
##$LEV0= 0
##$LPBIN= 0
##$MAXI= 10000
##$MC2= 0
##$MEAN= 0
##$ME_mod= 0
##$MI= 50
##$NCOEF= 0
##$NC_proc= -6
##$NLEV= 6
##$NOISF1= 182.463
##$NOISF2= 159.3651
##$NSP= 0
##$NTH_PI= 0
##$NZP= 0
##$OFFSET= 248.5645
##$PC= 4
##$PHC0= -8809.096
##$PHC1= 29.469
##$PH_mod= 1
##$PKNL= yes
##$PPARMOD= 0
##$PSCAL= 0
##$PSIGN= 0
##$REVERSE= no
##$SF= 81.014009
##$SI= 65536
##$SIGF1= 159.3651
##$SIGF2= -187.1042
##$SINO= 113.3802
##$SIOLD= 16384
##$SREGLST= <1H.CDCl3>
##$SSB= 0
##$STSI= 65536
##$STSR= 0
##$SW_p= 40650.406504065
##$SYMM= 0
##$S_DEV= 0
##$TDeff= 32768
##$TDoff= 0
##$TI= <>
##$TILT= no
##$TM1= 0
##$TM2= 0
##$TOPLEV= 0
##$USERP1= <user>
##$USERP2= <user>
##$USERP3= <user>
##$USERP4= <user>
##$USERP5= <user>
##$WDW= 1
##$XDIM= 65536
##$YMAX_p= 513616309
##$YMIN_p= -61108401
$$ End of Bruker specific parameters
$$ ---------------------------------
##NTUPLES= NMR SPECTRUM
##VAR_NAME=  FREQUENCY,     SPECTRUM/REAL,   SPECTRUM/IMAG
##SYMBOL=    X,             R,               I
##VAR_TYPE=  INDEPENDENT,   DEPENDENT,       DEPENDENT
##VAR_FORM=  AFFN,          ASDF,            ASDF
##VAR_DIM=   65536,         65536,           65536
##UNITS=     HZ,            ARBITRARY UNITS, ARBITRARY UNITS
##FACTOR=    0.620285442955139, 1,           1
##FIRST=     20137.2065510759, 0,            0
##LAST=      -20513.1999529892, 0,           0
##MIN=       -20513.1999529892, -61108401,   0
##MAX=       20137.2065510759, 513616309,    0
$$ Real data points
##PAGE= N=1
##DATA TABLE= (X++(R..R)), XYDATA
$$ [...]
$$ plain form
44281 -1466679 -1633949 -1642313 -1615425 -2042466 -2838030 -2951717 -1747352 -344565 -505765 -2380577
44271 -2380577 -4492484 -5799641 -6349487 -5903585 -3823382 -984703 149732 -1274449
44263 -1274449 -2854051 -2222076 -637299 -1048840 -3428055 -4679876 -3219055 -1077946
44255 -1077946 -706390 -1830723 -2719881 -2863687 -2787383 -2326243 -907530 806307 1198175
44246 1198175 -92304 -1380909 -948748 798791 1820601 832089 -1370809 -2967020
44238 -2967020 -2942112 -1680757 -294850 189195 -532815 -1563571 -1398655 179721 1309737
44229 1309737 349812 -1471183 -1419607 790991 2491241 1961695 599777 153827 58377
44220 58377 -820932 -1814744 -1956060 -2215592 -3831944 -5672016 -5766902 -4484082 -3581430
$$ packed form
44281a466679j67270q364K6888m27041p95564j13687J204365J402787j61200j874812
44271b380577k111907j307157n49846M45902K080203K838679J134435j424181
44263a274449j579602O31975J584777m11541k379215j251821J460821K141109
44255a077946L71556j124333q89158j43806P6304M61140J418713J713837L91868
44246A198175j290479j288605M32161J747539J021810r88512k202898j596211
44238b967020K4908J261355J385907M84045p22010j030756J64916J578376J130016
44229A309737r59925j820995N1576K210598J700250n29546j361918m45950r5450
44220E8377q79309r93812j41316k59532j616352j840072r4886J282820R02652
$$ plain form
44211 -3581430 -2974430 -1337958 583269 414142 -1941945 -3706846 -3051346 -1040710 684602
44202 684602 1722509 1880677 787235 -748053 -1228648 -944773 -1635669 -3130094 -3038384
44193 -3038384 -784094 903828 145630 -1020724 120449 2642699 3328586 1192584
44185 1192584 -1516102 -2361216 -1284238 -357381 -1633452 -4723005 -6524334 -4638517
44177 -4638517 -880129 711276 -546746 -1222844 632541 2464599 1675898 -18631
44169 -18631 409351 2308404 2761419 1564554 1309438 2991226 4648130 4567830 3398913
44160 3398913 2571836 2330140 1813171 182575 -2260889 -3620616 -2078275 1189159 2375556
44151 2375556 -223206 -3558814 -3915881 -1958958 -1049418 -1906599 -2264878 -1263410 -632890
$$ packed form
44211c581430O07000J636472J921227j69127k356087j764901O55500K010636J725312
44202F84602J037907J58168j093442j535288m80595K83875o90896j494425R1710
44193c038384K254290J687922p58198j166354J141173K522250O85887k136002
44185A192584k708686q45114J076978R26857j276071l089553j801329J885817
44177d638517L758388J591405j258022o76098J855385J832058p88701j694529
44169a8631M27982J899053M53015j196865k55116J681788J656904q0300j168917
44160C398913q27077k41696n16969j630596k443464j359727J542341L267434J186397
44151B375556k598762l335608l57067J956923R09540q57181l58279J001468O30520
$$ plain form
44142 -632890 -1181321 -1372652 -400905 141314 -891645 -1993704 -1423064 -130067 -326600
44133 -326600 -2145677 -3641141 -3744141 -3429605 -3601824 -3323600 -1384202 1016966 983740
44124 983740 -2028937 -4618442 -3723003 -1262236 -1589088 -4663420 -5590520 -2128897 1358101
44115 1358101 276246 -3238844 -3846349 -1307685 -419427 -3313384 -6617630 -6936803 -5043576
44106 -5043576 -3307338 -2402828 -2180808 -2866068 -3625708 -2506999 350811 1793607 21141
44097 21141 -2203130 -1178790 2379424 4261980 2321941 -1339878 -3666940 -4036171 -3872883
44088 -3872883 -4344451 -5252711 -5624577 -4841761 -3270843 -1921024 -1502676 -1828723 -1955055
44079 -1955055 -815336 1761586 4243024 4352135 1766575 -837646 -794435 1019087 1401486
$$ packed form
44142f32890n48431j91331R71747N42219j032959j102059N70640J292997j96533
44133c26600j819077j495464j03000L14536j72219K78224J939398K401168l3226
44124I83740l012677k589505Q95439K460767l26852l074332r27100L461623L486998
44115A358101j081855l515090o07505K538664Q88258k893957l304246l19173J893227
44106e043576J736238R04510K22020o85260p59640J118709K857810J442796j772466
44097B1141k224271J024340L558214J882556j940039l661819k327062l69231J63288
44088c872883m71568r08260l71866P82816J570918J349819M18348l26047j26332
44079a955055J139719K576922K481438J09111k585560k604221M3211J813522L82399
$$ plain form
44070 1401486 -629009 -2660227 -2743708 -2274653 -3688753 -6747407 -8753605 -7887965 -5071362
44061 -5071362 -2641238 -1944968 -2309368 -2152872 -1016588 -44573 -132951 -528218 -312485
44052 -312485 -314259 -1768647 -3701469 -3885621 -2243329 -850310 -387000 614934 2230826
44043 2230826 1890668 -1573040 -5146507 -5224951 -2235564 553778 1351260 657080 -923557
44034 -923557 -3042203 -4504849 -4395045 -4060551 -5627168 -8497407 -9526090 -7032890 -2748810
44025 -2748810 696187 2512578 3366792 3798907 3932502 3767033 3018387 1377787 -606867
44016 -606867 -1661909 -1278943 -422859 -297984 -986010 -1770062 -2272934 -2623506 -2709967 -1971443
44006 -1971443 -257873 1421668 1637349 263159 -1131373 -1252514 -880990 -1553834 -2803301
$$ packed form
44070A401486k030495k031218q3481M69055j414100l058654k006198Q65640K816603
44061e071362K430124O96270l64400J56496J136284R72015q8378l95267K15733
44052c12485j774j454388j932822j84152J642292J393019M63310J001934J615892
44043B230826l40158l463708l573467p8444K989387K789342P97482o94180j580637
44034i23557k118646j462646J09804L34494j566617k870239j028683K493200M284080
44025b748810L444997J816391Q54214M32115J33595j65469p48646j640600j984654
44016f06867j055042L82966Q56084J24875o88026p84052n02872l50572q6461P38524
44006a971443J713570J679541K15681j374190j394532j21141L71524o72844j249467
$$ plain form
43997 -2803301 -2486783 -280290 1032735 -1013532 -5199778 -8083409 -7842254 -5336950
43989 -5336950 -2355135 -361452 -170317 -1161220 -1384188 7992 1197310 368975 -971694
43980 -971694 128350 3276933 4779265 2934796 411388 141114 1382573 1620002 353530
43971 353530 -1113400 -2216906 -3176353 -3323948 -1671342 995199 2488866 1940697 719926
43962 719926 344307 675623 625745 -283864 -1616237 -2696613 -3108667 -2775412 -1888975
43953 -1888975 -809573 -38058 -127009 -1170665 -2294810 -2242922 -797275 882463 1612731
43944 1612731 1260748 225247 -1188832 -2293944 -2007527 -333001 1064250 962803 380827
43935 380827 794757 1456985 536008 -1533135 -2274651 -948453 361451 199181 -92870
$$ packed form
43997b803301L16518K206493J313025k046267m186246k883631K41155K505304
43989e336950K981815J993683J91135r90903k22968J392180J189318q28335j340669
43980i71694J100044L148583J502332j844469k523408k70274J241459K37429j266472
43971C53530j466930j103506r59447j47595J652606K666541J493667n48169j220771
43962G19926l75619L31316m9878r09609j332373j080376m12054L33255Q86437
43953a888975J079402P71515q8951j043656j124145N1888J445647J679738P30268
43944A612731l51983j035501j414079j105112K86417J674526J397251j01447n81976
43935C80827M13930O62228r20977k069143p41516J326198J309904j62270k92051
$$ plain form
43926 -92870 1053695 2842983 3820192 4269970 4795443 4158766 1204090 -2168210 -2971157
43917 -2971157 -1638590 -1387784 -2876613 -2878546 485862 4261501 4569584 1796121 -649069
43908 -649069 -1268565 -1438218 -2169691 -2702325 -2516491 -2454034 -3110633 -3761007 -3692759 -3382294
43898 -3382294 -3512293 -3677604 -2856258 -731651 1886341 3622905 3451027 1597659 -423918
43889 -423918 -1292374 -1288943 -1434436 -1465717 -78742 2502408 3768206 1849815 -1753568
43880 -1753568 -3674675 -2556009 -375672 2682 -2233129 -5391125 -7085751 -6296877
43872 -6296877 -4000790 -2035026 -1437275 -1934749 -2682614 -2897802 -1967881 90005 2094049
43863 2094049 2617055 1815706 1319081 1821492 2020329 742682 -1216343 -2596097 -3687653
$$ packed form
43926i2870J146565J789288R77209M49778N25473o36677k954676l372300q02947
43917b971157J332567K50806j488829j933L364408L775639L08083k773463k445190
43908f49069o19496j69653p31473n32634J85834O2457o56599o50374O8248L10465
43898c382294j29999j65311Q21346K124607K617992J736564j71878j853368k021577
43889d23918q68456L431j45493l1281J386975K581150J265798j918391l603383
43880a753568j921107J118666K180337L78354k235811l157996j694626P88874
43872f296877K296087J965764N97751m97474p47865k15188R29921K057886K004044
43863B094049N23006q01349m96625N02411J98837j277647j959025j379754j091556
$$ plain form
43854 -3687653 -5145443 -5921399 -4646813 -2478175 -2057246 -3668413 -4913575 -4460048 -3444841
43845 -3444841 -2519071 -531686 2302440 2844815 -816208 -5775189 -7717698 -6394642
43837 -6394642 -4763971 -3988520 -2765920 -1013288 -428106 -1050592 -795701 700569 1037313
43828 1037313 -880960 -2839325 -3054466 -2966927 -4144516 -5110654 -3947181 -1852034 -1143889
43819 -1143889 -1455321 -979513 -77500 -376681 -1356703 -1291344 -881965 -2258236 -4554253
43810 -4554253 -4363421 -1183115 1216604 -24103 -3468170 -6378187 -7999152 -8352618
43802 -8352618 -6811930 -3975587 -2472301 -3650047 -5400270 -5254927 -3731449 -2603263
43794 -2603263 -1792533 -283994 1477607 2431847 2870534 3504138 3851501 3462805 3253719
$$ packed form
43854c687653j457790p75956J274586K168638M20929j611167j245162M53527J015207
43845c444841R25770J987385K834126N42375l661023m958981j942509J323056
43837f394642J630671P75451J222600J752632N85182o22486K54891J496270L36744
43828A037313j918273j958365k15141Q7539j177589r66138J163473K095147P08145
43819a143889l11432M75808R02013k99181r80022O5359M09379j376271k296017
43810d554253J90832L180306K399719j240707l444067k910017j620965l53466
43802h352618J540688K836343J503286j177746j750223J45343J523478J128186
43794b603263Q10730J508539J761601R54240M38687O33604L47363l88696k09086
$$ plain form
43785 3253719 3665399 3250528 1332585 129395 1495853 3469196 3314109 2231672 3118032
43776 3118032 4952043 3974125 79644 -2590504 -1871031 -10893 949449 1825112 2764020
43767 2764020 1360583 -3145716 -7108466 -6743661 -2835160 1085509 2924362 2212899
43759 2212899 -1274513 -6177252 -8802764 -6896915 -3031669 -1493634 -2762717 -3762694
43751 -3762694 -2813653 -1413044 -1127749 -1338285 -748736 660514 2033432 2990163 3869393
43742 3869393 4855470 5139916 3435485 12933 -2389227 -1381736 1541265 2612555
43734 2612555 1216353 751169 3015718 5129107 4268991 2223518 1927024 2174181 -15099
43725 -15099 -3544954 -4471504 -2451017 -1320770 -2933760 -4685571 -4112708 -2091141 -131052
$$ packed form
43785C253719M11680m14871j917943j203190J366458J973343j55087j082437Q86360
43776C118032J834011r77918l894481k670148P19473J860138R60342Q75663R38908
43767B764020j403437m506299l962750L64805L908501L920669J838853p11463
43759B212899l487412m902739k625512J905849L865246J538035j269083r99977
43751c762694R49041J400609K85295k10536N89549J409250J372918R56731Q79230
43742C869393R86077K84446j704431l422552k402160J007491K923001J071290
43734B612555j396202m65184K264549K113389q60116k045473k96494K47157k189280
43725a5099l529855r26550K020487J130247j612990j751811N72863K021567J960089
$$ plain form
43716 -131052 1973861 4102162 4578121 2977984 1483942 1458522 1161587 -1052631 -3711417
43707 -3711417 -4782454 -4999530 -5854157 -6175606 -3952843 -380827 1238563 175193 -1192325
43698 -1192325 -1379338 -1341831 -1726755 -1530217 -466353 -167459 -1658314 -3613474 -4571987
43689 -4571987 -5122397 -6154050 -6432304 -4176660 -355778 1939617 1551988 652221 1383153
43680 1383153 2834352 2710981 955032 -37450 1321322 3870099 5471301 5453453 4360397
43671 4360397 2269980 -1025636 -4281543 -4992130 -2283905 1389039 2704611 1252285
43663 1252285 -360757 -118912 1055257 1110993 -172159 -1226189 -1150996 -764287 -1048456
43654 -1048456 -1651086 -1497555 -255300 1370627 2430951 2455957 1800216 1566692 2621456
$$ packed form
43716a31052K104913K128301M75959j600137j494042k5420k96935k214218k658786
43707c711417j071037k17076q54627l21449K222763L572016J619390j063370j367518
43698a192325j87013L7507l84924J96538J063864K98894j490855j955160r58513
43689d571987n50410j031653k78254K255644L820882K295395l87629q99767P30932
43680A383153J451199j23371j755949r92482J358772K548777J601202j7848j093056
43671D360397k090417l295616l255907p10587K708225L672944J315572j452326
43663A252285j613042K41845J174169N5736j283152j054030P5193L86709k84169
43654a048456o02630J53531J242255J625927J060324K5006o55741k33524J054764
$$ plain form
43645 2621456 4288012 4747212 3369106 1814255 1790287 2491514 1799223 -367886 -1779174
43636 -1779174 -1188537 -63636 -276724 -1667516 -2995840 -4016760 -5267862 -6674137
43628 -6674137 -7670675 -8124677 -8039809 -6955035 -4739742 -2418525 -1120462 -766935 -810972
43619 -810972 -1464856 -2875636 -3908099 -3440217 -2288205 -1987776 -2107752 -946413 1207598
43610 1207598 1952355 385423 -1533058 -2170682 -2532925 -3959114 -5475427 -5352539 -3906861
43601 -3906861 -2711660 -1946661 -605761 1150414 1882236 1087081 -196675 -1147549 -1966670
43592 -1966670 -2643186 -2423705 -1149598 27640 -1366 -1021638 -2106906 -2755066 -2881481
43583 -2881481 -2459781 -1854856 -1865887 -2664509 -3210664 -2593943 -1571193 -1736450 -3257498
$$ packed form
43645B621456J666556M59200j378106j554851k3968P01227o92291k167109j411288
43636a779174N90637J124901k13088j390792j328324j020920j251102j406275
43628f674137r96538m54002Q4868J084774K215293K321217J298063L53527m4037
43619h10972o53884j410780j032463M67882J152012L00429j19976J161339K154011
43610A207598P44757j566932j918481o37624l62243j426189j516313J22888J445678
43601c906861J195201P64999J340900J756175P31822p95155j283756r50874q19121
43592a966670o76516K19481J274107J177238k9006j020272j085268o48160j26415
43583b881481M21700O04925j1031p98622n46155O16721J022750j65257j521048
$$ plain form
43574 -3257498 -4540322 -4418389 -3653969 -3622513 -4294687 -4460898 -3554511 -2247018 -1328825
43565 -1328825 -998203 -1402264 -2839527 -4883300 -6096091 -5347594 -2998682 -308567 1762704
43556 1762704 2686699 2176374 780841 -84167 130958 37493 -1534188 -2945402 -1511251
43547 -1511251 2107837 3828387 1490653 -2035191 -2898643 -1544866 -1412465 -3438355
43539 -3438355 -4853893 -3581170 -1142747 -199363 -1172681 -2620933 -3540341 -3819012 -3281053
43530 -3281053 -1744951 245237 1753393 2344389 2059936 1043308 -63399 -34856 1459930
43521 1459930 2700281 1619092 -1280090 -3022007 -1622716 1573718 3643126 3402315
43513 3402315 2265334 2250771 3832110 5610777 5655754 3230971 -527424 -3646617 -5008501
$$ packed form
43574c257498j282824J21933P64420L1456o72174j66211R06387J307493R18193
43565a328825L30622m04061j437263k043773j212791P48497K348912K690115K071271
43556A762704R23995n10325j395533q65008K15125r3465j571681j411214J434151
43547a511251L619088J720550k337734l525844q63452J353777J32401k025890
43539c438355j415538J272723K438423R43384r73318j448252r19408k78671N37959
43530c281053J536102J990188J508156N90996k84453j016628j106707K8543J494786
43521A459930J240351j081189k899182j741917J399291L196434K069408k40811
43513C402315j136981j4563J581339J778667M4977k424783l758395l119193j361884
$$ plain form
43504 -5008501 -4892373 -4196071 -3787095 -4440939 -6355425 -8418534 -8955315 -7731850 -6276654
43495 -6276654 -5593359 -4698363 -2509537 -111772 507019 -574002 -1318540 -751486 -78378
43486 -78378 -454366 -1362597 -2000882 -2790962 -4302732 -5688911 -5586834 -4184263 -3186988
43477 -3186988 -3683348 -4835027 -4899517 -3156885 -626212 1073123 1470344 1553411 2168194
43468 2168194 2741913 2328907 1304733 737080 412520 -796167 -2468967 -2527442 -385751
43459 -385751 1616481 1217695 -829185 -2290984 -2545059 -2352994 -1740463 -367277 584920
43450 584920 -670301 -3574608 -5308093 -4380487 -2412041 -1594756 -1857494 -1579330 -122025
43441 -122025 1455681 1826562 792015 -649093 -1274275 -688834 548626 1726719 2431869
$$ packed form
43504e008501J16128O96302M08976o53844j914486k063109n36781J223465J455196
43495f276654O83295Q94996K188826K397765O18791j081021p44538N67054O73108
43486g8378l75988r08231o38285p90080j511770j386179J02077J402571R97275
43477c186988m96360j151679o4490J742632K530673J699335L97221Q3067O14783
43468B168194N73719m13006j024174n67653l24560j208687j672800n8475K141691
43459c85751K002232l98786k046880j461799k54075J92065O12531J373186R52197
43450E84920j255221k904307j733485R27606J968446Q17285k62738K78164J457305
43441a22025J577706L70881j034547j441108o25182N85441J237460J178093P05150
$$ plain form
43432 2431869 2180364 630698 -1272463 -1593690 24603 1291017 379266 -1052096 -247736
43423 -247736 2070358 2561379 726088 74161 2596919 5228304 4145704 313956 -2118877
43414 -2118877 -1623716 -496764 -702687 -1386877 -1057476 -13528 472186 16609 -859665
43405 -859665 -1759384 -2583547 -3124610 -3142856 -2705360 -2156107 -1896394 -2256612 -3249555 -4284479
43395 -4284479 -4433858 -3291342 -1512505 -288796 -169026 -472343 -85466 1097504 1880259
43386 1880259 1234200 -255474 -980465 -221476 1112515 1602334 607916 -1456247 -3464869
43377 -3464869 -4289576 -3890719 -3546768 -4127170 -4450200 -2732066 367786 1894220 329973
43368 329973 -2464173 -3879268 -3511357 -2339983 -592263 1801395 3689366 3574881 1630340
$$ packed form
43432B431869k51505j549666j903161l21227J618293J266414r11751j431362Q04360
43423b47736K318094M91021j835291o51927K522758K631385j082600l831748k432833
43414b118877M95161J126952k05923o84190L29401J043948M85714m55577q76274
43405h59665q99719q24163n41063j8246M37496N49253K59713l60218r92943j034924
43395d284479j49379J142516J778837J223709J19770l03317L86877J182970P82755
43386A880259o46059j489674p24991P58989J333991M89819r94418k064163k008622
43377c464869q24707L98857L43951n80402l23030J718134L099852J526434j564247
43368C29973k794146j415095L67911J171374J747720K393658J887971j14485j944541
$$ plain form
43359 1630340 -548602 -1716654 -1393885 493643 2841164 3320781 1180547 -779119
43351 -779119 509098 3723730 4726512 2678084 1148277 2293794 3460887 1575622
43343 1575622 -2051242 -4080629 -4163489 -4444831 -5366900 -5297466 -3928850 -2917931 -2865654
43334 -2865654 -2399084 -939636 29806 -526215 -1476819 -1551567 -1357132 -1916239 -2536724
43325 -2536724 -1779333 192063 1660100 1424169 -138431 -1713232 -2059338 -936423 354774
43316 354774 115911 -1384136 -1686460 713231 3986292 5053840 3269663 606162 -1141779
43307 -1141779 -1716096 -1455510 -780719 -489571 -986952 -1364558 -757159 -182944 -1055833
43298 -1055833 -2207690 -973890 2474548 4656055 3593999 1500087 1218950 2394722
$$ packed form
43359A630340k178942j168052L22769J887528K347521M79617k140234j959666
43351g79119J288217L214632J002782k048428j529807J145517J167093j885265
43343A575622l626864k029387q2860k81342r22069O9434J368616J010919N2277
43334b865654M66570J459448R69442n56021r50604p4748J94435n59107o20485
43325b536724P57391J971396J468037k35931j562600j574801l46106J122915J291197
43316C54774k38863j500047l02324K399691L273061J067548j784177k663501j747941
43307a141779n74317K60586O74791K91148m97381l77606O07399N74215q72889
43298a055833j151857J233800L448438K181507j062056k093912k81137J175772
$$ plain form
43290 2394722 2998153 2502525 1376234 -667304 -3387998 -4532757 -2422314 1007106
43282 1007106 2485841 1895508 1627169 2201741 1903504 705245 929607 3093476 4386354
43273 4386354 2931474 860757 1027194 2646870 2587414 -131589 -3301200 -4510658 -3460007
43264 -3460007 -1463629 -511 157772 -707817 -1571088 -1670349 -1196276 -892140 -1212696
43255 -1212696 -1831395 -1659978 256685 3167174 4488366 2512845 -1063026 -2849793
43247 -2849793 -1938430 -650002 -978966 -2284271 -3140082 -3460385 -3625873 -3212913 -2065639
43238 -2065639 -1364623 -2109110 -3380913 -3431553 -1885062 124049 1323416 990799 -874857
43229 -874857 -3148329 -4096689 -3153255 -1556386 -729256 -895759 -1609207 -2337821 -2094405
$$ packed form
43290B394722O03431m95628j126291k043538k720694j144759K110443L429420
43282A007106J478735n90333k68339N74572k98237j198259K24362K163869J292878
43273D386354j454880k070717J66437J619676n9456k719003l169611j209458J050651
43264c460007J996378J463118J58283q65589q63271r9261M74073L04136l20556
43255a212696o18699J71417J916663K910489J321192j975521l575871j786767
43247b849793R11363J288428l28964j305305q55811l20303j65488M12960J147274
43238b065639P01016p44487j271803n0640J546491K009111J199367l32617j865656
43229h74857k273472r48360R43434J596869Q27130j66503p13448p28614K43416
$$ plain form
43220 -2094405 -130664 2337539 2955866 1608830 769809 1353676 1002196 -1419911 -2542007
43211 -2542007 860395 5976263 6953324 3020610 -631444 -344679 1686466 1845134 352085
43202 352085 -70471 1529645 3719149 5093257 5406663 4919595 4027366 3313052 3141479
43193 3141479 3290447 3171547 2071938 -610040 -4521556 -7844158 -8656843 -6938610 -4431462
43184 -4431462 -2675454 -2071808 -2439525 -3132014 -2872792 -1055758 832022 674883 -1355329
43175 -1355329 -3004324 -3128882 -2845909 -3226026 -3813756 -4038167 -4208488 -4319875 -3653050
43166 -3653050 -2447989 -2216516 -3347328 -4074878 -2974831 -888969 774130 1911536
43158 1911536 2561473 1814386 -192312 -942865 1288519 4083898 3421130 -922310 -5110930
$$ packed form
43220b094405J963741K468203O18327j347036q39021N83867l51480k422107j122096
43211b542007L402402N115868R77061l932714l652054K86765K031145J58668j493049
43202C52085m22556J600116K189504J374108L13406m87068q92229p14314j71573
43193C141479J48968j18900j099609k681978l911516l322602q12685J718233K507148
43184d431462J756008O03646l67717o92489K59222J817034J887780j57139k030212
43175a355329j648995j24558K82973l80117n87730k24411j70321j11387O66825
43166c653050J205061K31473j130812p27550J100047K085862J663099J137406
43158A911536O49937p47087k006698p50553K231384K795379o62768m343440m188620
$$ plain form
43149 -5110930 -6287286 -5264579 -3859087 -2237345 -188813 1049801 176902 -1861977
43141 -1861977 -2566755 -727034 2355668 4343806 3940124 1716139 -533477 -1321547 -726909
43132 -726909 -99806 -447092 -1452142 -2242132 -2549940 -2586012 -2168966 -795648 1359901
43123 1359901 3165918 3583174 2673000 1302352 134630 -756925 -1481479 -1980716 -2123803
43114 -2123803 -1870061 -1285676 -563177 43572 481019 881773 999003 51790 -2199714
43105 -2199714 -4530877 -5385995 -4840375 -4210224 -3618940 -1657876 1743340 3942536 2814135
43096 2814135 83430 -799807 495048 970362 -945850 -3046330 -2828677 -1153496 -548304
43087 -548304 -1192470 -875933 1261721 3054791 2185118 -581738 -2353553 -1899880 -1058975
$$ packed form
43149e110930j176356J022707J405492J621742K048532J238614q72899k038879
43141a861977p04778J839721L082702J988138m03682k223985k249616p88070N94638
43132g26909O27103l47286j005050p89990l07808l6072M17046J373318K155549
43123A359901J806017M17256r10174j370648j167722q91555p24554m99237j43087
43114b123803K53742N84385P22499O06749M37447M00754J17230r47213k251504
43105b199714k331163q55118N45620O30151N91284J961064L401216K199196j128401
43096B814135k730705q83237J294855M75314j916212k100480K17653J675181O05192
43087e48304o44166L16537K137654J793070q69673k766856j771815M53673Q40905
$$ plain form
43078 -1058975 -1866980 -3502202 -3512762 -1623579 -389801 -1492377 -3188601 -2836572 -658411
43069 -658411 813360 293984 -1156466 -2266977 -2874580 -3045227 -2639633 -2094371 -2149289
43060 -2149289 -2468033 -1926829 -575736 137609 -476692 -1352901 -1326601 -554794 151149
43051 151149 267736 -374925 -1192619 -528579 2514885 5770262 5690313 2002480 -1493958
43042 -1493958 -1804532 -294724 -60810 -1838918 -4239944 -6162870 -6908221 -5442504 -1870652
43033 -1870652 1374283 1970550 589191 -500999 -691690 -776864 -462458 1163140 3036851
43024 3036851 2784782 332340 -1556688 -1099386 126750 -380620 -2702515 -4647676 -4362060
43015 -4362060 -2012581 592732 1652173 990180 -12427 -462733 -1278785 -3510907 -6025165
$$ packed form
43078a058975q08005j635222j0560J889183J233778j102576j696224L52029K178161
43069f58411J471771n19376j450450j110511o07603j70647M05594N45262n4918
43060b149289l18744N41204J351093P13345o14301q76209K6300P71807P05943
43051A51149J16587o42661q17694O64040L043464L255377p9949l687833l496438
43042a493958l10574J509808K33914j778108k401026j922926p45351J465717L571852
43033a870652L244935N96267j381359j090190j90691q5174L14406J625598J873711
43024C036851k52069k452442j889028M57302J226136n07370k321895j945161K85616
43015d362060K349479K605313J059441o61993j002607m50306q16052k232122k514258
$$ plain form
43006 -6025165 -6415828 -4080454 -896896 1223789 2050209 2174277 1938921 1682817 1840104
42997 1840104 2256486 2289378 1872354 1561716 1326578 308708 -1902769 -4628928 -6922099
42988 -6922099 -8148641 -7694100 -5228276 -1651169 1130797 1822818 637375 -1397575
42980 -1397575 -3339333 -4693145 -5648783 -6699675 -7338902 -5983885 -2502294 224472
42972 224472 -573557 -3476970 -4601101 -3267180 -2738076 -4564602 -5687112 -3193506 915089
42963 915089 2545838 1149401 -536223 -1151201 -1836754 -2965134 -2864207 -588910 2193472
42954 2193472 3110345 1626457 -907996 -2733840 -2865533 -1738591 -916111 -1383093 -2217934
42945 -2217934 -1867492 -443094 539262 536102 523306 1005175 1117460 230982 -1087132 -2414367
$$ packed form
43006f025165l90663K335374L183558K120685Q26420J24068k35356k56104J57287
42997A840104M16382L2892m17024l10638k35138j017870k211477k726159k293171
42988f922099j226542M54541K465824L577107K781966O92021j185443k034950
42980a397575j941758j353812r55638j050892o39227J355017L481591K726766
42972B24472p98029k903413j124131J333921N29104j826526j122510K493606M108595
42963I15089J630749j396437j685624o14978o85553j128380J00927K275297K782382
42954B193472R16873j483888k534453j825844j31693J126942Q22480m66982q34841
42945b217934L50442J424398R82356l160j2796M81869J12285q86478j318114j327235
$$ plain form
42935 -2414367 -4193215 -6035596 -5852694 -2423697 2079021 4105308 3029724 1559960
42927 1559960 1626495 1799482 -131480 -3461790 -5236927 -4178581 -2136723 -1179013 -795244
42918 -795244 694819 2830517 3025558 197912 -3293748 -4498008 -3575805 -3081711 -4052468
42909 -4052468 -4742905 -3609636 -1720624 -1022390 -1467142 -1428715 -351465 655944 770810
42900 770810 453452 182481 -440899 -1689205 -2901147 -3447386 -3612175 -3724548 -3359124
42891 -3359124 -2487677 -2523816 -4585621 -7088583 -6983269 -3801694 -778136 -951776 -3410158
42882 -3410158 -4763388 -3625767 -2036761 -2368411 -4175741 -4880838 -3007093 116727
42874 116727 2016971 1921952 1325952 1628828 2006744 521680 -2963186 -6206655 -7195866
$$ packed form
42935b414367j778848j842381J82902L428997M502718K026287j075584j469764
42927A559960O6535J72987j930962l330310j775137J058346K041858R57710L83769
42918g95244J490063K135698J95041k827646l491660j204260R22203M94094r70757
42909d052468o90437J133269J889012O98234m44752L8427J077250J007409J14866
42900G70810l17358k70971o23380j248306j211942n46239j64789j12373L65424
42891c359124Q71447l6139k061805k502962J05314L181575L023558j73640k458382
42882c410158j353230J137621J589006l31650j807330p05097J873745L123820
42874A16727J900244r5019n96000L02876L77916j485064l484866l243469r89211
$$ plain form
42865 -7195866 -6172881 -4496287 -2719141 -909258 136349 -327684 -1320434 -921120 1048054
42856 1048054 2591283 2334581 1446570 1807745 3165275 3383965 1349216 -1446432 -2575149
42847 -2575149 -1417527 229163 254487 -1395688 -2802250 -2470184 -1028462 -106086 -111827
42838 -111827 -103750 347978 500283 105734 470300 2620773 5077302 5055981 2094160 -944733
42828 -944733 -1310195 255041 867424 -398667 -1567132 -1079673 -77978 -225939 -912665
42819 -912665 -556405 371021 94998 -1032351 -664147 1459646 2419460 507079 -1886619
42810 -1886619 -1925493 -719992 -1276814 -3531473 -4605365 -3362418 -1542198 -404980 697544
42801 697544 1985780 2375391 1730390 1366737 1425653 448013 -1296704 -1024774 2144015
$$ packed form
42865g195866J022985J676594J777146J809883J045607m64033r92750L99314J969174
42856A048054J543229k56702q88011L61175J357530K18690k034749k795648j128717
42847b575149J157622J646690K5324j650175j406562L32066J441722R22376n741
42838a11827Q077M51728J52305l94549L64566K150473K456529k1321k961821l038893
42828i44733l65462J565236O12383j266091j168465M87459J001695j47961o86726
42819i12665L56260R27426k76023j127349L68204K123793R59814j912381k393698
42810a886619l8874J205501n56822k254659j073892J242947J820220J137218J102524
42801F97544J288236L89611o45001l63653N8916r77640j744717K71930L168789
$$ plain form
42792 2144015 4783477 3803793 1190076 866377 2474823 2127291 -1147609 -3694724 -2818314
42783 -2818314 -682837 -702155 -2361232 -2216374 830569 3742750 3305727 207216 -2108648
42774 -2108648 -1966810 -1106885 -1369396 -1612555 174626 2852647 3187125 993469 -113248
42765 -113248 1618257 3057794 1403286 -601877 1420533 6180459 7935433 4633662
42757 4633662 364227 -955297 -118062 607869 1355909 2879130 3894725 3042506 1505961
42748 1505961 1156790 1723434 2116707 2901845 4859425 6464877 5602980 2870062 464468
42739 464468 -1384962 -3927066 -6361011 -6147548 -3127213 -159877 1174897 2535397
42731 2535397 5127659 6860583 5363532 1864313 -420900 -597739 -332739 -352417 705157
$$ packed form
42792B144015K639462r79684k613717l23699J608446l47532l274900k547115Q76410
42783b818314K135477j9318j659077J44858L046943K912181m37023l098511k315864
42774b108648J41838Q59925k62511k43159J787181K678021L34478k193656j106717
42765a13248J731505J439537j654508k005163K022410M759926J754974l301771
42757D633662m269435j319524Q37235P25931P48040J523221J015595q52219j536545
42748A505961l49171N66644L93273P85138J957580J605452q61897k732918k405594
42739D64468j849430k542104k433945K13463L020335K967336J334774J360500
42731B535397K592262J732924j497051l499219k285213j76839K65000j9678J057574
$$ plain form
42722 705157 3430064 5652411 4693762 860966 -2529305 -2718212 -384474 1487570 1210732
42713 1210732 -25531 -326314 353577 859995 1104643 1898876 2762418 1982245 -555270
42704 -555270 -2459877 -1856730 193069 1533958 1754207 1609883 902444 -943285 -2863066
42695 -2863066 -3025822 -1722136 -1254261 -2491613 -3452711 -2205737 359320 1834197 1336389
42686 1336389 48399 -680114 -636940 -321262 -68204 207198 654448 976865 526601
42677 526601 -691601 -1458298 -716934 549349 94802 -2484670 -4701962 -4172563 -1648285
42668 -1648285 165569 96889 -679738 -983582 -1036006 -1134716 -521697 1242666 2682619
42659 2682619 1750088 -1201167 -3138753 -1787705 1496471 3365607 2606406 1283635
$$ packed form
42722G05157K724907K222347r58649l832796l390271j88907K333738J872044k76838
42713A210732j236263l00783O79891N06418K44648P94233Q63542p80173k537515
42704e55270j904607O03147K049799J340889K20249j44324p07439j845729j919781
42695b863066j62756J303686M67875j237352r61098J246974K565057J474877m97808
42686A336389j287990p28513M3174L15678K53058K75402M47250L22417m50264
42677E26601j218202p66697P41364J266283m54547k579472k217292N29399K524278
42668a648285J813854o8680p76627l03844n2424r8710O13019J764363J439953
42659B682619r32531k951255j937586J351048L284176J869136p59201j322771
$$ plain form
42651 1283635 1572677 2938555 3436054 2649476 1810345 1570617 1334333 694340 -94003
42642 -94003 -1210020 -3177699 -5307617 -5979734 -5178697 -4930784 -6088995 -6500746 -4134855
42633 -4134855 -583958 822479 -370836 -1436918 -677405 401748 -207674 -1965676
42625 -1965676 -2623961 -1232367 679199 762936 -1574822 -4222274 -4411727 -2103799 -448940
42616 -448940 -1892647 -4831275 -5861418 -4608346 -3889826 -5078458 -6070561 -4922178 -3058114
42607 -3058114 -2956071 -4267857 -4472383 -2666879 -687641 -507527 -2000350 -3487841 -3559083
42598 -3559083 -2228298 -874119 -931376 -2285470 -3426003 -3535898 -3491540 -4038184 -4136921
42589 -4136921 -2565838 -313919 516121 -126512 -259304 716790 837357 -1120772 -3057822
$$ packed form
42651A283635K89042J365878M97499p86578q39131k39728k36284o39993p88343
42642i4003j116017j967679k129918o72117Q01037K47913j158211m11751K365891
42633d134855L550897J406437j193315j066082P59513J079153o09422j758002
42625a965676o58285J391594J911566Q3737k337758k647452j89453K307928J654859
42616d48940j443707k938628j030143J253072P18520j188632r92103J148383J864064
42607c058114J02043j311786k04526J805504J979238J80114j492823j487491p1242
42598c559083J330785J354179n7257j354094j140533j09895M4358n46644r8737
42589d136921J571083K251919Q30040o42633j32792R76094J20567j958129j937050
$$ plain form
42580 -3057822 -2157439 948729 2757714 1493285 -879077 -1778519 -1344501 -1334508 -1932787
42571 -1932787 -1581782 282587 2240881 3079392 3297273 3544970 3133711 1573260 311270
42562 311270 877237 2023954 1193764 -1214273 -1800224 744787 3173872 2171887 -784121
42553 -784121 -1635465 387681 2008348 809691 -1882508 -3681657 -4326143 -4809210 -5002238
42544 -5002238 -3964418 -1946848 -499539 -589602 -1642974 -2518969 -2605608 -1805298 -232509
42535 -232509 1613607 2861825 3013766 2488111 1969870 1456478 668051 315073 1766741
42526 1766741 4798593 6775993 5464046 2117966 167853 943776 2478535 2796724
42518 2796724 2306945 1957372 1083768 -1045230 -2977870 -2674351 -711439 320771 -532953
$$ packed form
42580c057822R00383L106168J808985j264429k372362q99442M34018R993n98279
42571a932787L51005J864369J958294Q38511K17881K47697m11259j560451j261990
42562C11270N65967J146717q30190k408037n85951K545011K429085j001985k956008
42553g84121q51344K023146J620667j198657k692199j799149o44486m83067j93028
42544e002238J037820K017570J447309r0063j053372q75995q6639Q00310J572789
42535b32509J846116J248218J51941n25655n18241n13392p88427l52978J451668
42526A766741L031852J977400j311947l346080j950113P75923J534759L18189
42518B796724m89779l49573q73604k128998j932640L03519J962912J032210q53724
$$ plain form
42509 -532953 -1611621 -1443171 -519042 239291 897707 1480465 1126140 -459677 -1825231
42500 -1825231 -1447216 2533 368620 -1149673 -2951292 -3083559 -1654445 -651974 -1448041
42491 -1448041 -3036420 -3326018 -1996997 -1015379 -1868748 -3501670 -4107251 -3860921 -4098576
42482 -4098576 -4503978 -3470945 -1281021 -383868 -1701523 -2976912 -2185637 -579458 -459814
42473 -459814 -1474507 -1379262 391489 2162405 2687447 2331907 1598704 414538 -719449
42464 -719449 -535821 1270328 3206980 3553682 2067364 -184697 -1892919 -2144852 -929565
42455 -929565 513049 611773 -723878 -1794765 -1100528 872810 2311069 2049387 427527
42446 427527 -1375979 -2268409 -1780639 -355348 835710 809514 -285436 -1309040 -1317501
$$ packed form
42509e32953j078668J68450R24129P58333O58416N82758l54325j585817j365554
42500a825231L78015J449749L66087j518293j801619j32267J429114J002471p96067
42491a448041j588379k89598J329021R81618q53369j632922o05581K46330k37655
42482d098576m05402J033033K189924Q97153j317655j275389P91275J606179J19644
42473d59814j014693R5245J770751J770916N25042l55540p33203j184166j133987
42464g19449J83628J806149J936652L46702j486318k252061j708222k51933J215287
42455i29565J442614R8724j335651j070887O94237J973338J438259k61682j621860
42446D27527j803506q92430M87770J425291J191058k6196j094950j023604q461
$$ plain form
42437 -1317501 -484635 277188 456808 342276 187485 -482378 -2100419 -3845268 -4150057
42428 -4150057 -2657995 -785605 149944 505382 1256259 2142158 1963912 342084 -1875227
42419 -1875227 -3710651 -4554861 -3881712 -1764440 355066 816798 -9026 84530 2162566
42410 2162566 4593242 5293447 4482748 4068068 4898795 5850405 5590883 4367105 3708219
42401 3708219 4583300 6016615 5835041 3214209 110557 -859687 117138 174924 -2193845
42392 -2193845 -4903354 -5274059 -3779063 -2912736 -3245987 -2940500 -1124604 544835 437411
42383 437411 -714293 -1143834 -447455 577767 1581293 2733140 3529938 2938421 1016282
42374 1016282 -596381 -488864 602019 466396 -1753174 -4043202 -3665574 -670473 1921726
$$ packed form
42437a317501Q32866P61823J79620j14532j54791o69863j618041j744849l04789
42428d150057J492062J872390R35549L55438P50877Q85899j78246j621828k217311
42419a875227j835424q44210O73149K117272K119506M61732q25824R3556K078036
42410B162566K430676P00205q10699m14680Q30727R51610k59522j223778o58886
42401C708219Q75081J433315j81574k620832l103652r70244R76825N7786k368769
42392b193845k709509l70705J494996Q66327l33251L05487J815896J669439j07424
42383D37411j151704m29541O96379J025222J003526J151847P96798n91517j922139
42374A016282j612663J07517J090883j35623k219570k290028L77628K995101K592199
$$ plain form
42365 1921726 1876501 341315 -365133 -151507 -398810 -809075 221392 2153968 2312360
42356 2312360 218840 -1092684 232788 1787394 1060487 45123 2041129 5611997
42348 5611997 6173797 3160754 968447 1947310 2943433 898492 -1966572 -1713473 1267808
42339 1267808 3296154 2860900 1598801 669544 -524461 -2104524 -3080924 -3260808 -3448697
42330 -3448697 -3490429 -2377009 -641411 -343395 -1972826 -3450616 -3061696 -1472627 84007
42321 84007 1691108 3551042 4610980 3939563 2315403 1105706 564262 351630 554758
42312 554758 926183 339772 -1452578 -2555073 -1114025 1972187 4131696 4210155 2878128
42303 2878128 760439 -1831262 -3762062 -3847359 -2793765 -2474024 -3227450 -3779277 -3823343
$$ packed form
42365A921726m5225j535186p06448K13626k47303m10265J030467J932576J58392
42356B312360k093520j311524J325472J554606p26907j015364J996006L570868
42348E611997N61800l013043k192307R78863R96123k044941k865064K53099K981281
42339A267808K028346m35254j262099r29257j194005j580063r76400j79884j87889
42330c448697m1732J113420J735598K98016j629431j477790L88920J589069J556634
42321H4007J607101J859934J059938o71417j624160j209697n41444k12632K03128
42312E54758L71425n86411j792350j102495J441048L086212K159509P8459j332027
42303B878128k117689k591701j930800q5297J053594L19741p53426n51827m4066
$$ plain form
42294 -3823343 -4378455 -5196371 -4418102 -1957213 -765127 -2802922 -5656298 -5610140 -2938076
42285 -2938076 -1389047 -2642270 -3997861 -2444531 1056135 2964780 1804504 -373172
42277 -373172 -1119314 -623619 -775281 -2156626 -3450790 -3788477 -4058255 -5036539 -5572455
42268 -5572455 -4173444 -1594731 -11539 55511 12348 412753 183075 -805310 -755694
42259 -755694 1129056 2720903 1734044 -1055823 -3184069 -3817652 -3699773 -2866338 -835891
42250 -835891 1354718 1710097 128903 -1175834 -577621 966932 1153695 -1319235 -5463367
42241 -5463367 -8213933 -6717930 -1795879 1825230 708571 -2696052 -3172342 117428
42233 117428 2803656 1809836 -874848 -2183044 -2407185 -3400269 -4845578 -5039634 -3915191
$$ packed form
42294c823343n55112q17916P78269K460889J192086k037795k853376M6158K672064
42285b938076J549029j253223j355591J553330L500666J908645j160276k177676
42277c73172p46142M95695j51662j381345j294164l37687k69778r78284n35916
42268e572455J399011K578713J583192O7050m3163M00405k29678r88385M9616
42259g55694J884750J591847r86859k789867k128246o33583J17879Q33435K030447
42250h35891K190609L55379j581194j304737N98213J544553J86763k472930m144132
42241e463367k750566J496003M922051L621109j116659l404623m76290L289770
42233A17428K686228r93820k684684j308196k24141r93084j445309j94056J124443
$$ plain form
42224 -3915191 -2806285 -2089593 -1106392 257727 1616771 3011477 4349150 4783178 4034101
42215 4034101 3286333 3343171 3151395 1791626 460359 387516 242518 -1753016 -4265597
42206 -4265597 -4465131 -2621331 -1877312 -3429919 -5044728 -4809457 -3425708 -2009563 -391175
42197 -391175 1316937 1941359 1272354 736441 996138 1060585 789389 1752645 4127877
42188 4127877 5283207 3487231 855308 284240 1279641 1358033 147118 -592702 -70875
42179 -70875 963995 2070765 3128953 3095820 1192552 -1046483 -1337709 -66645 272332
42170 272332 -999589 -1909606 -1187324 74098 733654 1148952 1443799 531878 -1713775
42161 -1713775 -3225479 -2385127 -550605 -252390 -1793553 -3176784 -2757788 -633572 2028686
$$ packed form
42224c915191J108906P16692R83201J364119J359044J394706J337673M34028p49077
42215D034101p47768N6838j91776j359769j331267p2843j44998j995534k512581
42206d265597j99534J843800P44019j552607j614809K35271J383749J416145J618388
42197c91175J708112O24422o69005n35913K59697O4447k71196R63256K375232
42188D127877J155330j795976k631923n71068R95401P8392j210915p39820N21827
42179g0875J034870J106770J058188l3133j903268k239035k91226J271064L38977
42170B72332j271921r10017P22282J261422O59556M15298K94847r11921k245653
42161a713775j511704Q40352J834522K98215j541163j383231M18996K124216K662258
$$ plain form
42152 2028686 3732275 3166281 332430 -2929407 -4567841 -4394491 -3734230 -3361457 -2934640
42143 -2934640 -2382780 -2470607 -3433078 -4074557 -3148658 -1148541 229162 303152 108658
42134 108658 564042 949934 224579 -777071 -74438 2347077 3881885 2733269 511607
42125 511607 -124667 778170 1154308 586423 646768 1537085 1274612 -713251 -1784257
42116 -1784257 230916 3468017 4506042 3203550 2511240 3871502 5282686 4374957
42108 4374957 1533356 -866275 -1199810 117805 1423814 1481755 687060 451416 1021057
42099 1021057 724748 -1512506 -3795215 -3353525 -745279 414485 -1513486 -3816824
42091 -3816824 -3488439 -1591678 -1336120 -3055906 -3852081 -2165263 -135860 -433541 -2576373
$$ packed form
42152B028686J703589n65994k833851l261837j638434J73350O60261L72773M26817
42143b934640N51860q7827r62471o41479R25899K000117J377703P3990j94494
42134A08658M55384L85892p25355j001650P02633K421515J534808j148616k221662
42125E11607o36274R02837L76138n67885O0345Q90317k62473j987863j071006
42116a784257K015173L237101J038025j302492o92310J360262J411184r07729
42108D374957k841601k399631l33535J317615J306009N7941p94695k35644N69641
42099A021057k96309k237254k282709M41690K608246J159764j927971k303338
42091c816824L28385J896761K55558j719786p96175J686818K029403k97681k142832
$$ plain form
42082 -2576373 -3945208 -3467967 -2531964 -2313320 -1852061 308918 3493811 5339707 4945372
42073 4945372 4223782 5241003 7183662 7460692 5444248 3240143 2337801 1465774 -919173
42064 -919173 -3643127 -4387228 -3349017 -2876385 -3521671 -3034064 -137485 2958880 3462745
42055 3462745 1831069 720152 1030765 1147675 -95334 -1756889 -2565612 -2737947 -3151226
42046 -3151226 -3731766 -3584049 -2245669 -232970 1353546 1551705 348354 -1109815 -1728579
42037 -1728579 -1890130 -2698934 -3675179 -2643676 1222772 5520757 7159105 6009156 4539414
42028 4539414 4324328 4608070 4267981 3430111 2578061 1454891 -253595 -1940265 -2501617
42019 -2501617 -1340130 1185247 3603694 3780203 926299 -2547228 -2906566 279314
$$ packed form
42082b576373j368835M77241R36003K18644M61259K160979L184893J845896l94335
42073D945372p21590J017221J942659K77030k016444k204105r02342q72027k384947
42064i19173k723954p44101J038211M72632o45286M87607K896579L096365N03865
42055C462745j631676j110917L10613J16910j243009j661555q08723j72335m13279
42046c151226n80540J47717J338380K012699J586516J98159j203351j458169o18764
42037a728579j61551q08804r76245J031503L866448M297985J638348j149949j469742
42028D539414k15086K83742l40089q37870q52050j123170j708486j686670n61352
42019b501617J161487K525377K418447J76509k853904l473527l59338L185880
$$ plain form
42011 279314 3079840 2166719 -800406 -1811877 -206972 1096150 602850 229881 1528914
42002 1528914 2845736 2032893 -39560 -846125 74737 820880 27340 -1631132 -2606870
41993 -2606870 -1850890 664868 3615427 4952266 4115474 3106900 3925028 5492917 5025263
41984 5025263 2236642 -19622 268127 1757967 2148756 1251610 349666 -71864 -367304
41975 -367304 -388738 338817 1461034 2004473 1588998 682057 -47038 -101579 520653 859248
41965 859248 -264376 -2293937 -2809613 -497748 2738039 4089299 3442301 2891838 3185668
41956 3185668 2807384 836869 -1271226 -1712522 -844768 -556520 -1683978 -2934409 -2400426
41947 -2400426 162082 2806792 3490970 2556910 2179186 3154587 3759739 2667518 1214561
$$ packed form
42011B79314K800526r13121k967125j011471J604905J303122m93300l72969J299033
42002A528914J316822q12843k072453q06565R20862P46143p93540j658472r75738
41993b606870P55980K515758K950559J336839q36792j008574Q18128J567889m67654
41984E025263k788621k256264K87749J489840L90789q97146r01944m21530k95440
41975c67304k1434P27555J122217N43439m15475r06941p29095n4541O22232L38595
41965H59248j123624k029561n15676K311865L235787J351260o46998n50463K93830
41956C185668l78284j970515k108095m41296Q67754K88248j127458j250431N33983
41947b400426K562508K644710O84178r34060l77724R75401O05152j092221j452957
$$ plain form
41938 1214561 1068509 1325254 385194 -670785 225854 1908749 1288733 -1109652 -1152210
41929 -1152210 2339161 5288367 4647414 2881483 3154627 3777330 1689640 -1260330 -627472
41920 -627472 3262892 5380558 3464826 708069 78285 372395 -243751 -612663 765222
41911 765222 2286535 1631790 -65373 427945 3547968 6100239 5472719 2720270 1021883
41902 1021883 2354867 6006042 9401124 10181155 8210492 5640474 4430372 4094309
41894 4094309 2840846 663569 -261355 1223345 3155281 2885859 728122 -570527
41886 -570527 202199 1238247 794753 -109859 488236 2379147 3793959 4255509 4591993
41877 4591993 4560674 3072436 1002221 985017 3400229 5161491 4103452 2226698 2456949
$$ packed form
41938A214561j46052K56745r40060j055979Q96639J682895o20016k398385m2558
41929a152210L491371K949206o40953j765931K73144O22703k087690k949970O32858
41920f27472L890364K117666j915732k756757o29784K94110o16146l68912J377885
41911G65222J521313o54745j697163M93318L120023K552271o27520k752449j698387
41902A021883J332984L651175L395082P80031j970663k570018j210102l36063
41894D094309j253463k177277r24924J484700J931936k69422k157737j298649
41886e70527P72726J036048m43494r04612N98095J890911J414812M61550L36484
41877D591993l1319j488238k070215j7204K415212J761262j058039j876754K30251
$$ plain form
41868 2456949 4172609 4573778 3099132 1664421 1316444 1412135 1741730 2806938 3978147
41859 3978147 3783656 2289501 1173235 1278044 1926992 2558511 3052644 2619011 592254
41850 592254 -1737719 -2413321 -1859848 -2152156 -3349870 -3529720 -2629495 -2824442 -4298690
41841 -4298690 -4245314 -1525534 1190314 1907117 2485488 4723583 6480363 5130328 2380492
41832 2380492 1779999 3104349 3187494 1409452 424382 1588043 3232478 3877699 4104874
41823 4104874 4609660 5007956 5279055 6127059 7245843 7298883 6241154 5661133 6170489
41814 6170489 6441849 5656650 5048186 6023986 8364545 11264010 14614050 18102642 20378660
41805 20378660 20491798 19388831 18881317 19612281 20694374 20752425 18867162 15284461 11649376
$$ packed form
41868B456949J715660M01169j474646j434711l47977R5691L29595J065208J171209
41859C978147j94491j494155j116266J04809O48948O31519M94133m33633k026757
41850E92254k329973o75602N53473k92308j197714j79850R00225j94947j474248
41841d298690N3376K719780K715848P16803N78371K238095J756780j350035k749836
41832B380492o00493J324350Q3145j778042r85070J163661J644435O45221K27175
41823D104874N04786L98296K71099Q48004J118784N3040j057729n80021N09356
41814F170489K71360p85199o08464R75800K340559K899465L350040L488592K276018
41805B0378660J13138j102967n07514P30964J082093N8051j885263l582701l635085
$$ plain form
41796 11649376 9649292 8974864 7666818 5018680 2870236 3088630 4915049 6065358
41788 6065358 5643124 4643922 4172387 4529949 5673181 7152863 7764781 6686444 4972121
41779 4972121 4451250 4998387 4649868 3028030 2604057 4964719 7526851 6532707 2575962
41770 2575962 116174 1142867 2489639 1042556 -1244171 -446598 2995142 4686965
41762 4686965 2694038 16357 -115390 1630030 2768272 2783200 2831163 3314322 3815159
41753 3815159 4478601 5655872 6782482 7096909 6986209 7369980 8220983 8777720 8743794
41744 8743794 8384019 8020383 8145280 9165547 10333596 10116974 8458902 7177075 7060523
41735 7060523 6487265 4609193 3842976 6608744 11159344 13720774 13809459 14174975 15958178
$$ packed form
41796A1649376k000084o74428j308046k648138k148444K18394J826419J150309
41788F065358m22234r99202m71535L57562J143232J479682O11918j078337j714323
41779D972121n20871N47137l48519j621838m23973K360662K562132r94144l956745
41770B575962k459788J026693J346772j447083k286727P97573L441740J691823
41762D686965j992927k677681j31747J745420J138242J4928M7963M83159N00837
41753C815159O63442J177271J126610L14427j10700L83771Q51003N56737l3926
41744H743794l59775l63636J24897J020267J168049k16622j658072j281827j16552
41735G060523n73258j878072p66217K765768M550600K561430Q8685L65516J783203
$$ plain form
41726 15958178 17323896 17000147 15889029 14739985 13458960 13331645 16356469 21047859
41718 21047859 22498786 18861784 14678833 14892891 18063183 19038197 16727333 15188940
41710 15188940 17224115 20679375 22241287 22072296 22747231 25165763 27632254 28626267
41702 28626267 28743034 29390585 30735750 32044719 33599933 36791466 41823124 46623671
41694 46623671 49120534 49605100 49421803 48213603 44593748 39345826 35561480 34882809
41686 34882809 35515553 34966799 33200617 31986521 32424097 34270397 36699495 38678004
41678 38678004 39454424 39577581 40639003 43352439 46842443 50324780 54118941 58290458
41670 58290458 61983582 65319867 70312592 78248038 87599549 96511455 106128197 119087634
$$ packed form
41726A5958178J365718l23749j111118j149044j281025j27315L024824M691390
41718B1047859J450927l637002m182951K14058L170292R75014k310864j538393
41710A5188940K035175L455260J561912j68991O74935K418532K466491R94013
41702B8626267J16767O47551J345165J308969J555214L191533N031658M800547
41694D6623671K496863M84566j83297j208200l619855n247922l784346o78671
41686C4882809O32744n48754j766182j214096M37576J846300K429098J978509
41678C8678004P76420J23157J061422K713436L490004L482337L794161M171517
41670E8290458L693124L336285M992725P935446R351511Q911906R616742J2959437
$$ plain form
41662 119087634 135526314 153363401 172543564 196201449 226658461 262422059 300535919
41655 300535919 340261154 382488558 426007020 465982087 496365321 512883945 513616309
41648 513616309 498161134 467906104 427141626 382297661 338742259 298621727 262413700
41641 262413700 231401569 206802876 187116743 169018695 151534139 137020913 126994836
41634 126994836 119424255 111970419 105657048 102615635 101706429 99649116 96069513 94259175
41626 94259175 96502769 101330632 106217110 110700595 115771072 122189835 130768628 142725243
41618 142725243 158344879 176533787 197049552 222007057 253568057 290832498 330411482
41611 330411482 369341057 405700755 436651471 457836171 465525189 458585037 438204242
$$ packed form
41662A19087634J6438680J7837087J9180163K3657885L0457012L5763598L8113860
41655C00535919L9725235M2227404M3518462L9975067L0383234J6518624P32364
41648E13616309j5455175l0255030m0764478m4843965m3555402m0120532l6208027
41641B62413700l1012131k4598693j9686133j8098048j7484556j4513226j0026077
41634A26994836p570581p453836o313371l041413r09206k057313l579603j810338
41626I4259175K243594M827863M886478M483485N070477O418763Q578793J1956615
41618A42725243J5619636J8188908K0515765K4957505L1561000L7264441L9578984
41611C30411482L8929575L6359698L0950716K1184700P689018o940152k0380795
$$ plain form
41604 438204242 406820982 367879203 325705736 284541369 247423404 215805306 189638955
41597 189638955 167699147 148596489 131951509 118103468 106509520 95504363 84454941
41590 84454941 75120918 69360547 65929082 61349476 54194011 46808295 42089732 40081210
41582 40081210 38817735 37160642 35226752 32927624 29954530 27040890 25662168 26234496
41574 26234496 27589102 28247693 27458453 25391962 23371751 23360305 25725531 27854933 26741102
41565 26741102 22935709 20092295 20270703 21553787 21012395 18335545 15470563 13915633
41557 13915633 13463967 12903679 11303733 9201167 8578080 10620692 13602665 14542869 13013512
41548 13013512 11379048 10974540 10391948 8419881 6277576 5487766 5657235 6051378 7375319
$$ packed form
41604D38204242l1383260l8941779m2173467m1164367l7117965l1618098k6166351
41597A89638955k1939808j9102658j6644980j3848041j1593948j1005157j1049422
41590H4454941r334023n760371l431465m579606p155465p385716m718563k008522
41582D0081210j263475j657093j933890k299128k973094k913640j378722N72328
41574B6234496J354606O58591p89240k066491k020211j1446K365226K129402j113831
41565B6741102l805393k843414J78408J283084n41392k676850k864982j554930
41557A3915633m51666n60288j599946k102566o23087K042612K981973R40204j529357
41548A3013512j634464m04508n82592j972067k142305p89810J69469L94143J323941
$$ plain form
41539 7375319 9985533 12055795 11757552 9976564 8800798 8560897 8404123 8413320 8816653
41530 8816653 8392948 6321740 4568742 5522509 7981228 8599933 7007323 6192474 7539630
41521 7539630 8780751 7920992 6320333 6206789 7208695 7254119 5773175 4388577 4798299
41512 4798299 6913543 9077527 9926278 9958643 10634310 11737488 11155249 8346427 6178041
41503 6178041 7205964 9765079 10646974 10354092 11908295 14923188 15312362 11824668 8691933
41494 8691933 9730376 13160316 14779506 13619481 11749380 10578416 10269845 11390287
41486 11390287 14205280 17008384 17704972 16842451 16956167 18897117 20610245 19884116 17052273
41477 17052273 14553775 14476119 16725303 19349633 20688104 21015019 21551188 22324290 22336999
$$ packed form
41539G375319K610214K070262k98243j780988j175766k39901j56774R197M03333
41530H816653m23705k071208j752998R53767K458719O18705j592610q14849J347156
41521G539630J241121q59759j600659j13544J001906M5424j480944j384598M09722
41512D798299K115244K163984Q48751L2365O75667J103178n82239k808822k168386
41503F178041J027923K559115Q81895k92882J554203L014893L89174l487694l132735
41494H691933J038443L429940J619190j160025j870101j170964l08571J120442
41486A1390287K814993K803104O96588q62521J13716J940950J713128p26129k831843
41477A7052273k498498p7656K249184K624330J338471L26915N36169P73102J2709
$$ plain form
41468 22336999 21746710 22153995 24328211 27270027 29983885 32437243 34275095 34668109
41460 34668109 34270861 35132628 37541101 39244018 39177717 39439671 41656993 43998856 44389721
41451 44389721 44311133 46162688 48773642 49355413 48661230 49971859 53287203 54813840 52830066
41442 52830066 50059708 48833743 47464197 43614388 38589864 35693884 35849206 37053084
41434 37053084 37247901 35965458 33728751 31220521 28777000 26060142 22832376 20272717
41426 20272717 20145934 22017532 22915212 20947246 17805065 16198040 16176717 15919708 15055350
41417 15055350 14711926 14655867 13132017 10148291 8428522 9642164 11545154 10858951 7850264
41408 7850264 5727360 5866713 6221172 5120931 4175661 5524746 7837281 7693662 4583230
$$ packed form
41468B2336999n90289M07285K174216K941816K713858K453358J837852L93014
41460C4668109l97248Q61767K408473J702917o6301K61954K217322K341863L90865
41451D4389721p8588J851555K610954N81771o94183J310629L315344J526637j983774
41442E2830066k770358j225965j369546l849809n024524k895980J55322J203878
41434C7053084J94817j282443k236707k508230k443521k716858l227766k559659
41426B0272717j26783J871598Q97680j967966l142181j607025k1323k57009q64358
41417A5055350l43424n6059j523850k983726j719769J213642J902990o86203l008687
41408G850264k122904J39353L54459j100241r45270J349085K312535j43619l110432
$$ plain form
41399 4583230 1904929 2349092 4513598 5462286 4932812 5060375 6763818 8431291 8236580
41390 8236580 6256441 3926876 2418375 1948472 2035458 2072480 1911347 1860233 1931501 1554661
41380 1554661 517305 -379359 -369232 91273 127762 -56025 284955 728808 61361 -1509853
41370 -1509853 -2129310 -946849 402123 83883 -1157311 -961539 1254349 3343201 3216460
41361 3216460 1460126 357305 968292 2278209 3051331 3164619 2634213 816742 -1996007
41352 -1996007 -3279512 -844852 3435226 4983592 2365058 -630914 -211250 2405810
41344 2405810 3503662 2569942 2344542 3959808 5405065 5112440 4020976 3140415 1788759
41335 1788759 -221123 -912714 1253628 4546060 5845440 4610309 3065531 2807946
$$ packed form
41399D583230k678301M44163K164506R48688n29474J27563J703443J667473j94711
41390H236580j980139k329565j508501m69903Q6986L7022j61133n1114P1268l76840
41380A554661j037356q96664J0127M60505L6489j83787L40980M43853o67447j571214
41370a509853o19457J182461J348972l18240j241194J95772K215888K088852j26741
41361C216460j756334j102821O10987J309917P73122J13288n30406j817471k812749
41352a996007j283505K434660M280078J548366k618534k995972M19664K617060
41344B405810J097852r33720k25400J615266J445257k92625j091464q80561j351656
41335A788759k009882o91591K166342L292432J299380j235131j544778k57585
$$ plain form
41327 2807946 3059431 2527513 1569361 1773523 3960959 7105358 9172337 9007008 7436391
41318 7436391 6305486 6423334 6958586 7005630 6955677 7632134 8584728 8262372 6023558
41309 6023558 3238680 1873590 2227060 2658436 1737783 127316 -298547 1129163 3380932
41300 3380932 5678056 8474283 11750373 13833740 13476778 12120766 12202947 13732256 14511083
41291 14511083 13476312 11670801 9917515 7970727 6448824 6978447 9197291 10006505
41283 10006505 7620259 4448097 3824182 5342330 5825938 3998562 1682595 654854
41275 654854 691848 1057370 1946408 3622997 5318808 5762479 4330920 1557053 -1012952
41266 -1012952 -1724535 -343220 1526952 2271316 2140818 2457118 3423314 3885323 3078441
$$ packed form
41327B807946K51485n31918r58152K04162K187436L144399K066979j65329j570617
41318G436391j130905J17848N35252M7044m9953O76457R52594l22356k238814
41309F023558k784878j365090L53470M31376r20653j610467m25863J427710K251769
41300C380932K297124K796227L276090K083367l56962j356012Q2181J529309P78827
41291A4511083j034771j805511j753286j946788j521903N29623K218844Q09214
41283A0006505k386246l172162o23915J518148M83608j827376k315967j027741
41275F54854L6994L65522Q89038J676589J695811M43671j431559k773867k570005
41266a012952p11583J381315J870172P44364j30498L16300R66196M62009q06882
$$ plain form
41257 3078441 1536028 363876 491920 2281307 4786297 5827444 4193433 1573918
41249 1573918 827292 2372449 3881187 3710428 2926479 3313543 4846527 6031809 5769748
41240 5769748 4204390 2573074 2611129 5028604 8098017 8930288 6774942 3876454 2397104
41231 2397104 1910814 1040389 188292 911872 3276066 5520833 6196595 5360736 3904900
41222 3904900 3007901 4043740 7447553 11407378 13176369 12379088 11802944 13927955 17597442
41213 17597442 19428363 18042422 15346131 13458074 12031397 9734020 7193553 6561216
41205 6561216 8259951 10025385 9788940 7960602 5990894 4313946 3112489 3456914
41197 3456914 5446728 6398268 3742245 -684153 -2296037 96592 2981830 3643668
$$ packed form
41257C078441j542413j172152J28044J789387K504990J041147j634011k619515
41249A573918p46626J545157J508738j70759p83949L87064J532984J185282k62061
41240E769748j565358j631316L8055K417475L069413Q32271k155346k898488j479350
41231B397104m86290q70425q52097P23580K364194K244767O75762q35859j455836
41222C904900q96999J035839L403813L959825J768991p97281n76144K125011L669487
41213A7597442J830921j385941k696291j888057j426677k297377k540467o32337
41205F561216J698735J765434k36445j828338j969708j676948j201457L44425
41197C456914J989814R51540k656023m426398j611884K392629K885238O61838
$$ plain form
41189 3643668 3396526 3743261 3043131 -26441 -2746638 -2026262 217539 -301552 -3271255
41180 -3271255 -4051568 -917628 2492572 2996975 2023036 2097652 2671538 1921653 157641
41171 157641 -1105661 -1629333 -1773135 -987450 847620 2064135 1389429 204257 447775
41162 447775 1483950 1375950 239733 -188012 366498 605638 283773 484879 1326119
41153 1326119 1622136 934042 -49539 -1158600 -2703908 -3804618 -3017045 -937433 -5220
41144 -5220 -1205526 -2917607 -3446161 -2683118 -911218 1700686 3735514 3108608 126081
41135 126081 -2220561 -2188107 -1347263 -1481437 -1809669 -1013928 244101 955706 1910730
41126 1910730 3851885 5249759 4493970 2799857 2240256 2299719 1403662 602593 2099094
$$ packed form
41189C643668k47142L46735p00130l069572k720197P20376K243801n19091k969703
41180c271255p80313L133940L410200N04403r73939P4616N73886p49885j764012
41171A57641j263302n23672j43802P85685J835070J216515o74706j185172K43518
41162D47775J036175j08000j136217m27745N54510K39140l21865K01106Q41240
41153A326119K96017o88094r83581j109061j545308j100710P87573K079612R32213
41144e220j200306j712081n28554P63043J771900K611904K034828o26906k982527
41135A26081k346642L2454Q40844j34174l28232P95741J258029P11605R55024
41126A910730J941155J397874p55789j694113n59601N9463q96057q01069J496501
$$ plain form
41117 2099094 4708355 4743882 1733134 -547574 281437 2103658 2478596 2624679 4720105
41108 4720105 7572854 7891557 4766613 487678 -2539145 -3775791 -3814704 -3328078 -2808200
41099 -2808200 -2345987 -1694867 -1014230 -998659 -1766661 -2434467 -2438585 -2345057 -2546533 -2206013
41089 -2206013 -647221 1032317 1065530 -689022 -2651333 -3383807 -2650945 -1070847 307561
41080 307561 440130 -703817 -1754089 -1397308 -86732 400718 -959016 -3243976 -4317875
41071 -4317875 -2633411 1162006 4314417 4504178 2505668 1231829 1873062 2505390 1203857
41062 1203857 -1212615 -2809355 -3350695 -3871687 -4672953 -5417717 -6162425 -6678795 -5919925
41053 -5919925 -3867817 -2501059 -2819825 -2463856 896889 5085766 5817276 2970402 698540
$$ packed form
41117B099094K609261L5527l010748k280708Q29011J822221L74938J46083K095426
41108D720105K852749L18703l124944m278935l026823j236646l8913M86626N19878
41099b808200M62213O51120O80637J5571p68002o67806m118R3528k01476L40520
41089b206013J558792J679538L3213j754552j962311p32474P32862J580098J378408
41080C07561J32569j143947j050272L56781J310576M87450j359734k284960j073899
41071d317875J684464L795417L152411J89761j998510j273839O41233O32328j301533
41062A203857k416472j596740n41340n20992q01266p44764p44708n16370P58870
41053e919925K052108J366758l18766L55969L360745M188877P31510k846874k271862
$$ plain form
41044 698540 1188166 2181860 1504852 211331 -344319 -1090200 -2744326 -3662571 -2616443
41035 -2616443 -1352942 -1889281 -3212964 -3118980 -1603749 -9162 1561333 3355889 3936043
41026 3936043 1896810 -1249356 -2599435 -1712336 -557333 -248516 -288110 -554682 -1462575
41017 -1462575 -2287993 -1736541 -220991 547084 185233 -198998 -299738 -849113 -1633627
41008 -1633627 -1550425 -694541 -140480 362774 2023353 4208843 4696975 3149871 1604180
40999 1604180 880346 -514602 -2822029 -3518514 -1283407 1203042 863072 -1358226 -2188470
40990 -2188470 -708739 1096018 1457327 228009 -2113036 -4732392 -6101314 -5180744
40982 -5180744 -2736269 -190499 2213566 4719948 6354879 5740711 3276205 889813
$$ packed form
41044F98540M89626R93694o77008j293521n55650p45881j654126r18245J046128
41035b616443J263501n36339j323683R3984J515231J594587J570495J794556N80154
41026C936043k039233l146166j350079Q87099J155003L08817l9594k66572r07893
41017a462575q25418N51452J515550P68075l61851l84231j00740n49375p84514
41008a633627Q3202Q55884N54061N03254J660579K185490M88132j547104j545691
40999A604180p23834j394948k307427o96485K235107K486449l39970k221298q30244
40990b188470J479731J804757L61309j229318k341045k619356j368922R20570
40982e180744K444475K545770K404065K506382J634931o14168k464506k386392
$$ plain form
40974 889813 -191616 -81318 947342 2692744 4209131 4263606 2774898 775097 -926263
40965 -926263 -2036966 -2120286 -960086 517613 945587 257887 -204605 628166 2468389
40956 2468389 4073292 4155484 2399044 220451 -252780 1250609 2647876 2579055 2518762
40947 2518762 4115827 5895848 5143127 2171089 -186000 -993315 -1973748 -3595955 -3781065
40938 -3781065 -1730717 -8369 -804000 -2430372 -1859591 854517 3037820 3236644 2360414
40929 2360414 1601081 1317878 1776104 3110099 4471539 4787131 4457173 4751138 5330723
40920 5330723 4193358 928767 -1627247 -657050 2591641 4085625 2440916 978690
40912 978690 3123348 7348145 8938392 6315925 3054808 2884231 4958769 5751788 4050890
$$ packed form
40974H89813j081429J10298J028660J745402J516387N4475j488708j999801j701360
40965i26263j110703q3320J160200J477699M27974o87700m62492Q32771J840223
40956B468389J604903Q2192j756440k178593m73231J503389J397267o8821o0293
40947B518762J597065J780021p52721k972038k357089q07315r80433j622207j85110
40938c781065K050348J722348p95631j626372N70781K714108K183303J98824q76230
40929B360414p59333k83203M58226J333995J361440L15592l29958K93965N79585
40920E330723j137365l264591k556014R70197L248691J493984j644709j462226
40912I78690K144658M224797J590247k622467l261117j70577K074538P93019j700898
$$ plain form
40903 4050890 1877623 1152042 1626387 2178009 2426272 2664395 3243142 4157659 4557113
40894 4557113 3172434 215339 -1998402 -1805413 -660196 -823697 -1414998 448838 4705856
40885 4705856 7655457 6964876 4512817 3000680 2434143 1803044 1900823 3954145 6794851
40876 6794851 7805198 6151121 3351006 1094663 -111637 -590957 -955643 -1518767 -1542829
40867 -1542829 98382 2864290 4439941 3668438 2184304 1840724 2010758 1205837 46063
40858 46063 351333 2009740 3097567 2950123 2953560 4030056 5204705 5257695 4372267 3440817
40848 3440817 2749766 2056397 1345142 872086 651934 286396 -534180 -1346281 -1105716
40839 -1105716 431683 1908250 1910384 1058608 1173844 2387811 2872814 1860169 918779
$$ packed form
40903D050890k173267p25581M74345N51622K48263K38123N78747R14517L99454
40894D557113j384679k957095k213741J92989J145217j63501n91301J863836M257018
40885D705856K949601o90581k452059j512137n66537o31099R7779K053322K840706
40876F794851J010347j654077k800115k256343j206300m79320l64686n63124k4062
40867a542829J641211K765908J575651p71503j484134l43580J70034q04921j159774
40858D6063L05270J658407J087827j47444L437J076496J174649N2990q85428r31450
40848C440817o91051o93369p11255m73056k20152l65538q20576q12101K40565
40839a105716J537399J476567K134q51776J15236J213967M85003j012645r41390
$$ plain form
40830 918779 1287354 1920323 1594623 1139928 1761673 2629757 2190183 849917 356655
40821 356655 1190461 2326807 3009115 3223467 3045448 2899078 3685357 5319878 6118854
40812 6118854 5059306 3538582 3340753 4071954 4322699 4064773 3948439 3525277 2331867
40803 2331867 1510225 2069618 2762090 2097970 1169479 1786210 3129696 3327084 3142213
40794 3142213 4622756 6980476 7597161 6614376 6585467 7731653 7635450 5897628 4950492
40785 4950492 5552755 5512750 3853555 2282377 1391562 -483340 -3105490 -3274812 -77564
40776 -77564 2785588 2559378 1665513 3313381 6156590 6897377 5699166 5276336 6238313
40767 6238313 6740391 5777989 4138457 2949001 3255228 5685816 8705597 9058163 6073240
$$ packed form
40830I18779L68575O32969l25700m54695O21745Q68084m39574j340266m93262
40821C56655Q33806J136346O82308K14352j78019j46370P86279J634521P98976
40812F118854j059548j520724j97829P31201K50745k57926j16334m23162j193410
40803B331867q21642N59393O92472o64120r28491O16731J343486J97388j84871
40794C142213J480543K357720O16685r82785k8909J146186r6203j737822r47136
40785D950492O02263m0005j659195j571178q90815j874902k622150j69322L197248
40776g7564K863152k26210q93865J647868K843209P40787j198211m22830R61977
40767F238313N02078r62402j639532j189456L06227K430588L019781L52566k984923
$$ plain form
40758 6073240 3509222 4671205 7784653 9034360 8110893 7328663 6944951 5324626 2952354
40749 2952354 2388813 4222575 6324538 7300455 7788053 8100988 7339195 5364238 3412659
40740 3412659 2300080 1844531 2143944 3584879 5624967 7309653 8701607 10024316
40732 10024316 10099113 7967394 5472974 5433793 7385802 8080046 6497718 5366027 6810375
40723 6810375 9265648 10158288 9537996 9426095 10942511 13387109 15210888 15093823 13045663
40714 13045663 11024331 11468700 14743584 18828368 21476826 21617993 19141764 15240048
40706 15240048 12839220 14286333 18005527 19684390 17678357 15065151 15144484 17115471
40698 17115471 18014886 17038006 15535106 13924620 11379589 8443399 7452145 9549714
$$ packed form
40758F073240k564018J161983L113448J249707r23467p82230l83712j620325k372272
40749B952354n63541J833762K101963R75917M87598L12935p61793j974957j951579
40740C412659j112579m55549K99413J440935K040088J684686J391954J322709
40732A0024316P4797k131719k494420l9181J952009O94244j582328j131691J444348
40723F810375K455273Q92640o20292j11901J516416K444598J823779j17065k048160
40714A3045663k021332M44369L274884M084784K648458J41167k476229l901716
40706A5240048k400828J447113L719194J678863k006033k613206P9333J970987
40698A7115471Q99415r76880j502900j610486k545031k936190r91254K097569
$$ plain form
40690 9549714 12914571 14953332 15227612 15209599 15852833 16638049 16900761 16860575 16781829 15997092
40680 15997092 13745473 10625415 8209815 7290915 7452201 8280304 9724756 11042821
40672 11042821 10871047 9087606 7366592 7011887 7378501 7340861 7044238 7001421 6709365
40663 6709365 5709395 5014421 5776474 7271801 7906080 7630978 7698418 8568689 9750619
40654 9750619 11107626 12392400 11999407 8493152 3412232 322470 615130 2128518
40646 2128518 2437508 1633020 1050242 991894 1005404 1333195 2715544 5014044 6877475
40637 6877475 6950738 5322987 3689485 3678897 4919364 5521943 4765964 4106622 4782466
40628 4782466 5865484 6023332 5855328 6619487 7666036 7287391 5540324 4104070 3639455
$$ packed form
40690I549714L364857K038761K74280j8013O43234P85216K62712m0186p8746p84737
40680A5997092k251619l120058k415600r18900J61286Q28103J444452J318065
40672A1042821j71774j783441j721014l54705L66614l7640k96623m2817k92056
40663F709365r99970o94974P62053J495327O34279k75102O7440Q70271J181930
40654I750619J357007J284774l92993l506255n080920l089762K92660J513388
40646B128518L08990q04488n82778n8348J3510L27791J382349K298500J863431
40637F877475P3263j627751j633502j0588J240467O02579p55979o59342O75844
40628D782466J083018J57848j68004P64159J046549l78645j747067j436254m64615
$$ plain form
40619 3639455 3287419 2613139 2160790 2178881 2491876 3390055 4969149 6014230 5369331
40610 5369331 3952450 3513436 4007344 4309510 4747823 6289529 7759358 6879701 4052105
40601 4052105 2186631 2587211 3839721 4967514 6611050 8529171 8982263 7521404
40593 7521404 5743181 4528988 3178194 1876359 2088169 3675028 4571331 4228463 4361887
40584 4361887 5357519 5255586 3539809 2491472 3221731 3877313 3641834 4762234 8029532
40575 8029532 9850007 7194336 2633338 854298 2284804 3634915 3082869 1590437
40567 1590437 348779 -47321 1052038 3154803 3902053 2025891 -196666 142537 2587435
40558 2587435 4688432 5810856 6805103 7331121 6580819 5582273 5754587 6086847 4788324
$$ packed form
40619C639455l52036o74280m52349J8091L12995Q98179J579094J045081o44899
40610E369331j416881m39014M93908L02166M38313J541706J469829q79657k827596
40601D052105j865474M00580J252510J127793J643536J918121M53092j460859
40593G521404j778223j214193j350794j301835K11810J586859Q96303l42868J33424
40584D361887R95632j01933j715777j048337P30259O55582k35479J120400L267298
40575H029532J820475k655671m560998j779040J430506J350111n52046j492432
40567A590437j241658l96100J099359K102765P47250j876162k222557L39203K444898
40558B587435K100997J122424R94247N26018p50302r98546J72314L32260j298523
$$ plain form
40549 4788324 2923189 3173340 5410839 6701609 5737807 4352076 4286481 4974521 5115577
40540 5115577 4586631 4321497 5424819 8139681 10712026 10333397 6637313 2965312 2452605
40531 2452605 4323605 5960830 6773421 7484572 7454471 5908509 4444469 5015109 6546727
40522 6546727 6815367 6405849 7214603 8347329 7724293 6777793 8775016 12783576 14308524
40513 14308524 12277867 10351531 10407420 9957759 7777144 6941608 9415642 11980175 11034442
40504 11034442 8098541 6982115 8080170 8978113 8762667 8394116 8166552 7774831 7890517
40495 7890517 9076886 10023439 9244292 7765321 7806990 9269420 9703125 7782010 5155642
40486 5155642 4557693 6896852 10245964 11487866 9495604 6693817 6434273 8871828
$$ packed form
40549D788324j865135K50151K237499J290770r63802j385731o5595O88040J41056
40540E115577n28946k65134J103322K714862K572345l78629l696084l672001n12707
40531B452605J871000J637225Q12591P11151l0101j545962j464040N70640J531618
40522F546727K68640m09518Q08754J132726o23036r46500J997223M008560J524948
40513A4308524k030657j926336N5889m49661k180615q35536K474034K564533r45733
40504A1034442k935901j116426J098055Q97943k15446l68551k27564l91721J15686
40495G890517J186369R46553p79147j478971M1669J462430M33705j921115k626368
40486E155642n97949K339159L349112J241902j992262k801787k59544K437555
$$ plain form
40478 8871828 10975266 10673723 8961017 7525306 6699213 6629241 7960331 9980582 10444508
40469 10444508 8872810 7761607 8729492 9900234 9411727 9098071 11561636 15358409
40461 15358409 16675157 14957692 13413164 14083634 15607991 16210575 16030850 15696944 15031703
40452 15031703 14290670 14753722 16776033 18579310 18249633 16151099 14318292 13894890 14051410
40443 14051410 13438580 12171743 11917142 13796812 16638872 18244406 18391425 19166973 21622795
40434 21622795 23626263 22555986 19081392 16313147 15665444 15694229 15194886 15239669 17055651
40425 17055651 19539728 20614723 20331571 20776995 22759538 24309587 23504917 21546756
40417 21546756 21226588 22747122 23352118 21795655 20854619 23484518 28133248 30537169
$$ packed form
40478H871828K103438l01543j712706j435711q26093o9972J331090K020251M63926
40469A0444508j571698j111203R67885J170742m88507l13656K463565L796773
40461A5358409J316748j717465j544528O70470J524357O02584j79725l33906o65241
40452A5031703p41033M63052K022311J803277l29677k098534j832807m23402J56520
40443A4051410o12830j266837k54601J879670K842060J605534J47019P75548K455822
40434B1622795K003468j070277l474594k768245o47703K8785m99343M4783J815982
40425A7055651K484077J074995k83152M45424J982543J550049q04670j958161
40417B1546756l20168J520534O04996j556463r41036K629899M648730K403921
$$ plain form
40409 30537169 29450372 27776202 28065930 29742481 31301935 32435205 32847338 31590473
40401 31590473 29206623 28332454 30284128 32841823 33348536 32359324 32109464 32830143 33032077
40392 33032077 32524856 32711369 34243514 36415348 38649473 40863849 42664946 43761516
40384 43761516 44777642 46128229 46724432 45634847 44474900 45937705 49998664 53694314
40376 53694314 54977503 54922145 55633803 57665052 60167466 62227729 63343794 63614131 64007226
40367 64007226 65616485 68365525 71272262 73978657 76833090 79351436 80118280 78954216
40359 78954216 78028961 79785837 84260107 89171011 92359644 93638058 94454747 96147408
40351 96147408 98597747 100654283 101858522 103228044 105842840 109114768 111283012 111515340
$$ packed form
40409C0537169j086797j674170K89728J676551J559454J133270M12133j256865
40401C1590473k383850q74169J951674K557695N06713r89212k49860P20679K01934
40392C3032077n07221J86513J532145K171834K234125K214376J801097J096570
40384D3761516J016126J350587N96203j089585j159947J462805M060959L695650
40376E3694314J283189n5358P11658K031249K502414K060263J116065K70337L93095
40367F4007226J609259K749040K906737K706395K854433K518346P66844j164064
40359G8954216r25255J756876M474270M910904L188633J278414Q16689J692661
40351I6147408K450339K056536J204239J369522K614796L271928K168244K32328
$$ plain form
40343 111515340 110785130 110655790 111814448 113844654 115909543 117550920 119096304 121190628
40335 121190628 123748419 125752435 126419374 126071784 125387016 124347497 122626411 120582407
40327 120582407 119085581 118519968 118498116 118393469 117856210 117138629 116991850 117531231 117190542
40318 117190542 114107033 108977189 104938123 103660257 103218081 101271110 98661846 97698997
40310 97698997 98139276 97570911 95288971 93046124 91792216 90205013 87129112 83326266
40302 83326266 79894602 76782445 73954714 72467392 73005839 74310581 74315045 72411831 69789348
40293 69789348 67913597 67306445 67536624 67873042 67874778 67388084 66130081 63899317 61406691
40284 61406691 59859612 58977461 56662487 52059067 47804970 47151971 49482384 51093659
$$ packed form
40343A11515340p30210j29340J158658K030206K064889J641377J545384K094324
40335A21190628K557791K004016O66939l47590o84768j039519j721086k044004
40327A20582407j496826n65613k1852j04647n37259p17581j46779N39381l40689
40318A17190542l083509n129844m039066j277866m42176j946971k609264r62849
40310I7698997M40279n68365k281940k242847j253908j587203l075901l802846
40302H3326266l431664l112157k827731j487322N38447J304742M464j903214k622483
40293F9789348j875751o07152K30179L36418J736m86694j258003k230764k492626
40284F1406691j547079q82151k314974m603420m254097o52999K330413J611275
$$ plain form
40276 51093659 50277609 48967567 48911095 48999336 47723321 45982764 45583549 46436789 47005497
40267 47005497 46454424 44823095 42113235 38891200 37016051 37954532 40631619 42452072
40259 42452072 42325460 41338323 40525250 39482269 37651484 35837628 35582833 37364433 39907584
40250 39907584 41229757 40256436 37606716 35000957 33897085 34527139 35950303 36848560
40242 36848560 36493841 35255111 34032101 33007868 31415881 29033563 27323265 28044863
40234 28044863 30854970 33338026 33613820 32108296 30635368 30570162 32031987 33927314
40226 33927314 34586994 33300803 31450071 31096852 32191554 32466074 30733946 28974093
40218 28974093 29923490 33406970 36417050 36601173 34561250 32669219 32524654 33927739
$$ packed form
40276E1093659q16050j310042n6472Q8241j276015j740557l99215Q53240N68708
40267D7005497n51073j631329k709860l222035j875149R38481K677087J820453
40259D2452072j26612r87137q13073j042981j830785j813856k54795J781600K543151
40250C9907584J322173r73321k649720k605759j103872O30054J423164Q98257
40242C6848560l54719j238730j223010j024233j591987k382318j710298P21598
40234B8044863K810107K483056K75794j505524j472928o5206J461825J895327
40226C3927314O59680j286191j850732l53219J094702K74520j732128j759853
40218B8974093R49397L483480L010080J84123k039923j892031j44565J403085
$$ plain form
40210 33927739 35850163 37889387 40553441 44132579 47696514 49761154 49899909 49151146
40202 49151146 48834808 49565086 51391057 54024549 56625045 58172175 58590995 58972030 60224666
40193 60224666 62002826 63412580 64337743 65558233 67804254 71031938 74379483 76565374
40185 76565374 76611576 74555316 71500516 68927252 67811133 67954087 67976299 66635464 64674815
40176 64674815 64525040 67219603 70523724 71704933 71482128 73007571 76978841 80398941
40168 80398941 81135066 81195252 83503895 87158614 88424913 85807997 81761070 79185312
40160 79185312 78171294 76942605 74705050 72482627 71541820 71734071 71532762 69593340
40152 69593340 66173387 62771795 60311192 58119917 55028151 51061353 47524052 45565807
$$ packed form
40210C3927739J922424K039224K664054L579138L563935K064640J38755p48763
40202D9151146l16338P30278J825971K633492K600496J547130M18820L81035J252636
40193F0224666J778160J409754R25163J220490K246021L227684L347545K185891
40185G6565374M6202k056260l054800k573264j116119J42954K2212j340835j960649
40176F4674815j49775K694563L304121J181209k22805J525443L971270L420100
40168H0398941P36125O0186K308643L654719J266299k616916m046927k575758
40160G9185312j014018j228689k237555k222423r40807J92251k01309j939422
40152F9593340l419953l401592k460603k191275l091766l966798l537301j958245
$$ plain form
40144 45565807 45123335 45303197 45542356 46239962 48071390 50532676 51585010 49514103 45156944
40135 45156944 41448776 40433855 41385994 42197083 41822269 40720872 39520480 38184765
40127 38184765 36451497 34479176 32881065 32233998 32461156 32697506 32095512 30854110 30043135
40118 30043135 30234172 30743673 30550823 29639853 29005266 29341884 29999090 29505025 27312451
40109 27312451 24772885 23722589 24079311 23872227 22150627 20600686 21061561 22511486
40101 22511486 22400959 20506762 19267891 19995469 20825688 19447859 16354390 14055477
40093 14055477 13885947 14838568 15350460 15325345 16014798 18003439 19801441 19362372 17139101
40084 17139101 16106456 17687056 19307864 18018070 15156252 14544257 16731852 18425516
$$ packed form
40144D5565807m42472J79862K39159O97606J831428K461286J052334k070907m357159
40135D5156944l708168j014921R52139Q11089l74814j101397j200392j335715
40127C8184765j733268j972321j598111o47067K27158K36350o01994j241402q10975
40118C0043135J91037N09501j92850r10970o34587L36618O57206m94065k192574
40109B7312451k539566j050296L56722k07084j721600j549941M60875J449925
40101B2511486j10527j894197j238871P27578Q30219j377829l093469k298913
40093A4055477j69530R52621N11892k5115O89453J988641J798002m39069k223271
40084A7139101j032645J580600J620808j289794k861818o11995K187595J693664
$$ plain form
40076 18425516 17789571 16762159 17118173 17667819 17102349 16551799 17032551 16965060 14914368
40067 14914368 12737715 13082975 15165588 15879346 14202299 11916480 10613345 10360769
40059 10360769 10809289 11391065 10888092 8948173 7579622 8959291 12110509 13996439
40051 13996439 13697679 13144113 13624775 14063477 13471810 12931295 13806908 15329414 15371841
40042 15371841 13225312 10675655 10114636 11723672 12925654 11342234 8145141 7037158
40034 7037158 9422367 12372099 12634892 10922720 10264921 11484867 12772592 12984278 12744920
40025 12744920 12421291 11513005 10448365 10790734 12834519 14597880 14112990 11734936 9565723
40016 9565723 9243504 10592587 11998207 12100800 11292672 10994826 11374029 11142202 10155574
$$ packed form
40076A8425516o35945j027412L56014N49646n65470n50550M80752o7491k050692
40067A4914368k176653L45260K082613P13758j677047k285819j303135k52576
40059A0360769M48520N81776n02973j939919j368551J379669L151218J885930
40051A3996439k98760n53566M80662M38702n91667n40515Q75613J522506M2427
40042A5371841k146529k549657n61019J609036J201982j583420l197093j107983
40034G037158K385209K949732K62793j712172o57799J219946J287725K11686k39358
40025A2744920l23629r08286j064640L42369K043785J763361m84890k378054k169213
40016I565723l22219J349083J405620J02593q08128k97846L79203k31827r86628
$$ plain form
40007 10155574 10255980 12182842 13706034 12892288 11298253 11265648 11825399 10683564 8992906
39998 8992906 10082855 13715820 15655441 13510479 9458200 6436615 5084045 5370292
39990 5370292 7664415 10663117 11555670 10114209 9674722 12094376 14651200 14313084 12349804
39981 12349804 11771183 12347608 11516655 8983583 7150586 7312809 8089452 7789110 6483081
39972 6483081 5603753 6648675 9900291 13403832 14078200 11207259 7964792 7896529 10635575
39963 10635575 12820303 12618646 11315290 10565170 10199880 9441660 8750620 9233503 10690395
39954 10690395 11316789 9843485 7642453 7698593 10865661 14162785 14290971 12150602 11622802
39945 11622802 13941844 16088643 15649792 14335529 14736145 16114474 16191831 15340712 15742341
$$ packed form
40007A0155574J00406J926862J523192q13746j594035l2605N59751j141835j690658
39998H992906J089949L632965J939621k144962m052279l021585j352570K86247
39990E370292K294123K998702Q92553j441461m39487K419654K556824l38116j963280
39981A2349804n78621N76425q30953k533072j832997J62223P76643l00342j306029
39972F483081q79328J044922L251616L503541O74368k870941l242467o8263K739046
39963A0635575K184728k01657j303356p50120l65290p58220o91040M82883J456892
39954A0690395O26394j473304k201032N6140L167068L297124J28186k140369n27800
39945A1622802K319042K146799m38851j314263M00616J378329P7357q51119M01629
$$ plain form
39936 15742341 17210959 17199697 15068411 13326358 13803553 15076639 15006333 13932556 13675557
39927 13675557 14486932 14741601 13379710 11244966 9698964 8870717 8014633 7206500 7654494
39918 7654494 9914424 12590355 13726926 13113093 12184127 11891671 11913028 11894029 11981784
39909 11981784 11875424 10926789 9738731 10104281 12533052 15232615 16403080 16159732 15351514
39900 15351514 14136479 12911135 12927214 14331508 15034524 13390345 10855294 10097278 11468576
39891 11468576 13293728 14702006 15987955 16839041 16556221 15847877 16292376 17977409 19458362
39882 19458362 20007639 20190427 20342592 20293454 20578820 22121727 24593175 26716824 28183019
39873 28183019 29616509 30876043 31419183 32298406 35437115 40495188 44750252 46857847
$$ packed form
39936A5742341J468618j1262k131286j742053M77195J273086p0306j073777k56999
39927A3675557Q11375K54669j361891k134744j546002q28247q56084q08133M47994
39918G654494K259930K675931J136571o13833r28966k92456K1357j8999Q7755
39909A1981784j06360r48635j188058L65550K428771K699563J170465k43348q08218
39900A5351514j215035j225344J6079J404294P03016j644179k535051p58016J371298
39891A1468576J825152J408278J285949Q51086k82820p08344M44499J685033J480953
39882A9458362N49277J82788J52165m9138K85366J542907K471448K123649J466195
39873B8183019J433490J259534N43140Q79223L138709N058073M255064K107595
$$ plain form
39865 46857847 48596483 51924064 56346361 60389224 63739363 66433666 67603463 66749641
39857 66749641 64996259 63398701 61095400 56880019 51708880 47747142 45419057 43226607
39849 43226607 40291957 37338320 35055851 33110862 31192547 29688745 28687803 27364134
39841 27364134 25139582 22765366 21480286 21493229 21960728 22185514 22128856 21798951 20907780
39832 20907780 19524312 18584426 19095954 20836546 22346127 22405901 21175875 19669319 18512398
39823 18512398 17642338 16955987 16653032 16823838 17062890 16741641 15675964 14514107 14323658
39814 14323658 15465015 16841239 16750804 14812493 12726120 12757092 15589459 19760974 22868940
39805 22868940 23285638 21346635 19215923 19044846 20941321 23335854 25457517 28224953
$$ packed form
39865D6857847J738636L327581M422297M042863L350139K694303J169797q53822
39857F6749641j753382j597558k303301m215381n171139l961738k328085k192450
39849D3226607k934650k953637k282469j944989j918315j503802j000942j323669
39841B7364134k224552k374216j285080J2943M67499K24786n6658l29905q91171
39832B0907780j383468r39886N11528J740592J509581N9774j230026j506556j156921
39823A8512398q70060o86351l02955J70806K39052l21249j065677j161857j90449
39814A4323658J141357J376224r0435j938311k086373L0972K832367M171515L107966
39805B2868940M16698j939003k130712j71077J896475K394533K121663K767436
$$ plain form
39797 28224953 32037555 35189413 36066203 35964179 37743579 41999388 46551495 49804094
39789 49804094 52556329 55904888 59315410 61888060 63905189 65647945 65945883 63729123
39781 63729123 60324940 58282777 58025163 57425352 54907776 51191372 47345753 43005696
39773 43005696 37981375 34165145 33540339 34732297 33991422 30112000 26133271 24950614
39765 24950614 25250916 23816648 20473368 18155150 18471071 19744984 19760694 18267980 16165949
39756 16165949 14172608 13113298 13724964 15199470 15504867 14036934 12284195 11033898
39748 11033898 9097863 6252424 5100394 7591270 11366073 12378089 10212156 8033595
39740 8033595 7771248 8188240 7806643 7088690 7038368 7651656 8464254 9118580 9021899 7964290
$$ packed form
39797B8224953L812602L151858Q76790j02024J779400M255809M552107L252599
39789D9804094K752235L348559L410522K572650K017129J742756K97938k216760
39781F3729123l404183k042163k57614n99811k517576l716404l845619m340057
39773D3005696n024321l816230o24806J191958p40875l879422l978729j182657
39765B4950614L00302j434268l343280k318218L15921J273913J5710j492714k102031
39756A6165949j993341j059310O11666J474506L05397j467933j752739j250297
39748A1033898j936035k845439j152030K490876L774803J012016k165933k178561
39740H033595k62347M16992l81597p17953n0322O13288Q12598O54326r6681j057609
$$ plain form
39730 7964290 7262022 8516325 10868570 11370643 8812716 5488252 4221093 5119786 6367117
39721 6367117 6944072 7203606 7506672 7671644 7670086 7925404 8655603 9272142 8791577 7108070
39711 7108070 5659922 6017373 7604376 8004803 6247033 4382353 4441189 5222223 4247349
39702 4247349 1985336 1454894 3723302 6434435 7353262 7039057 7041492 7379361 7068827
39693 7068827 5873328 4439217 3469828 3344440 3879715 4355529 4536490 5274937 6946522
39684 6946522 8044818 7185448 5818091 6465915 8640067 9481116 8548390 8552725 10511525
39675 10511525 11759913 10476782 8880872 9535411 11252206 11449080 10325660 9680832
39667 9680832 9340861 7986068 6395243 6632582 8419106 9151586 7551979 5017014 3292186
$$ packed form
39730G964290p02268J254303K352245N02073k557927l324464j267159Q98693J247331
39721F367117N76955K59534L03066J64972j558K55318P30199O16539m80565j683507
39711G108070j448148L57451J587003M00427j757770j864680N8836P81034r74874
39702D247349k262013n30442K268408K711133R18827l14205K435L37869l10534
39693G068827j195499j434111r69389j25388N35275M75814J80961P38447J671585
39684F946522J098296q59370j367357O47824K174152Q41049r32726M335J958800
39675A0511525J248388j283131j595910O54539J716795J96874j123420o44828
39667I680832l39971j354793j590825K37339J786524P32480j599607k534965j724828
$$ plain form
39658 3292186 2740390 2903738 3068174 2396405 1084623 1055298 3765986 7617475 9386080
39649 9386080 8129740 5883951 4531577 3887610 3138762 2329722 1742209 1197484 737185
39640 737185 1046569 2579568 4855660 6909738 7948356 7605810 6219889 4828037 4260773
39631 4260773 4281928 4112811 3582270 3280193 3913784 5903601 8975051 11619932 11861849
39622 11861849 9490956 6823391 6231448 7501733 8553341 8082388 6497350 4956277
39614 4956277 4581701 5963354 8307736 9673656 9060218 7580422 6732225 6638706 7073330
39605 7073330 8678494 11377487 12942286 11435828 8208261 6181869 5936670 5952416 5956664
39596 5956664 6983006 8301907 7645742 5146585 3944457 5618321 7711966 7445887
$$ packed form
39658C292186n51796J63348J64436o71769j311782k9325K710688L851489J768605
39649I386080j256340k245789j352374o43967p48848q09040n87513n44725m60299
39640G37185L09384J532999K276092K054078J038618l42546j385921j391852n67264
39631D260773K1155j69117n30541l02077O33591J989817L071450K644881K41917
39622A1861849k370893k667565n91943J270285J051608m70953j585038j541073
39614D956277l74576J381653K344382J365920o13438j479796q48197r3519M34624
39605G073330J605164K698993J564799j506458l227567k026392k45199J5746M248
39596E956664J026342J318901o56165k499157j202128J673864K093645k66079
$$ plain form
39588 7445887 5580915 4607029 4924368 5101537 4748546 4774080 5224627 4983017 3774505
39579 3774505 2783533 2743564 2714419 1649894 334446 483314 2056326 2927918 1938002
39570 1938002 873815 1750925 3106633 1657315 -2344017 -4585982 -2731265 217121
39562 217121 841455 592539 2710641 6188832 7232931 5629432 4905462 6096780 6022979
39553 6022979 2860971 -721066 -1722642 -588993 1040804 3105955 5463222 6365900
39545 6365900 5049300 3449450 3108579 2821088 1737202 2111568 5749366 9876566 10322828
39536 10322828 7605446 6125014 7799365 10010204 10022186 8299033 6710147 5917437
39528 5917437 5512968 5087152 4433930 3765028 3832493 4847560 5712861 5601016 5562736 6857771
$$ packed form
39588G445887j864972r73886L17339J77169l52991K5534M50547k41610j208512
39579C774505r90972l9969k9145j064525j315448J48868J573012Q71592r89916
39570A938002j064187Q77110J355708j449318m001332k241965J854717K948386
39562B17121O24334k48916K118102L478191J044099j603499p23970J191318p3801
39553F022979l162008l582037j001576J133649J629797K065151K357267R02678
39545F365900j316600j599850l40871k87491j083886L74366L637798M127200M46262
39536A0322828k717382j480432J674351K210839J1982j723153j588886p92710
39528E917437m04469m25816o53222o68902O7465J015067Q65301j11845l8280J295035
$$ plain form
39518 6857771 8459728 8398018 7029504 6448613 6867442 6413568 4806985 4242099 5663293
39509 5663293 7006416 6647298 5996551 6613946 7015581 5114836 2381628 2371270 5367099
39500 5367099 7451600 5698690 2041604 559343 2296713 4481611 4448335 2708688
39492 2708688 1624388 2102142 2720595 1940681 82593 -1321560 -1341624 -173485 1462874
39483 1462874 2587336 2234680 643055 -218635 1285238 3987044 5075321 3845088
39475 3845088 2479296 2559351 2862157 1919902 830945 1387338 2702215 2352643 466261
39466 466261 -69552 2092501 4737060 5430964 4773819 4724943 5368535 5435283 5045102 5551945
39456 5551945 6796413 6787740 4773860 2790948 2963181 4512859 4950367 3622104 2473692
$$ packed form
39518F857771J601957o1710j368514n80891M18829m53874j606583n64886J421194
39509E663293J343123l59118o50747O17395M01635j900745k733208j0358K995829
39500E367099K084501j752910l657086j482261J737370K184898l3276j739647
39492B708688j084300M77754O18453p79914j858088j404153k0064J168139J636359
39483A462874J124462l52656j591625q61690J503873K701806J088277j230233
39475C845088j365792Q0055L02806r42255j088957N56393J314877l49572j886382
39466D66261n35813K162053K644559O93904o57145m8876O43592O6748l90181N06843
39456E551945J244468q673k013880j982912J72233J549678M37508j328263j148412
$$ plain form
39447 2473692 3176650 4863268 5421164 4185360 2385816 1333388 1321718 2417059 4958032
39438 4958032 8273231 9924325 8045302 4374894 3002066 5319234 8016566 7508822
39430 7508822 4729817 3306776 4079517 4470874 3323273 3063418 5607909 8707610 8671613
39421 8671613 5276145 1712438 454004 1238527 2716332 4083231 4957997 5203864 5223995
39412 5223995 5499021 5830003 5790911 5529456 5230104 4465245 3275780 3040823 4544851
39403 4544851 5869155 4447451 1047362 -737983 656213 2868307 3457933 3262836
39395 3262836 4293567 6159355 6767975 5650180 4496861 4542670 5042122 4648446 3266403
39386 3266403 2030000 1794944 2018277 1403964 -205785 -1172239 -70470 2175711 3477649
$$ packed form
39447B473692P02958J686618N57896j235804j799544j052428j1670J095341K540973
39438D958032L315199J651094j879023l670408j372828K317168K697332n07744
39430G508822k779005j423041P72741L91357j147601k59855K544491L099701l5997
39421H671613l395468l563707j258434P84523J477805J366899Q74766K45867K0131
39412E223995K75026L30982l9092k61455k99352p64859j189465k34957J504028
39403D544851J324304j421704l400089j785345J394196K212094N89626j95097
39395C262836J030731J865788O08620j117795j153319M5809M99452l93676j382043
39386C266403j236403k35056K23333o14313j609749r66454J101769K246181J301938
$$ plain form
39377 3477649 3578613 4055803 5202070 5122790 2899239 608123 611668 2415495 4023842
39368 4023842 5099324 6601904 8096389 7837949 5577863 3311651 2825638 3931523
39360 3931523 5426975 6455836 6542940 5577164 4388263 4345845 5686346 6935956 6644562
39351 6644562 5189744 4213860 4523508 5143158 4541207 2492518 491112 282270 2127219
39342 2127219 4646890 6182758 6030483 4626278 3139040 2761823 3662180 4642218 4619792
39333 4619792 4299741 5169670 6802309 6851799 4438738 1862146 1646053 3230711 4212364
39324 4212364 3829181 3301450 3268652 2915763 1731717 512714 312674 1545454 4133891
39315 4133891 7303663 9272383 8650421 6471248 5453712 6748638 8655359 9147778
$$ packed form
39377C477649J00964M77190J146267p9280k223551k291116L545J803827J608347
39368D023842J075482J502580J494485k58440k260086k266212m86013J105885
39360C931523J495452J028861Q7104r65776j188901m2418J340501J249610k91394
39351F644562j454818r75884L09648O19650o01951k048689k001406k08842J844949
39342B127219K519671J535868j52275j404205j487238l77217R00357R80038k2426
39333D619792l20051Q69929J632639M9490k413061k576592k16093J584658R81653
39324D212364l83183n27731l2798l52889j184046j219003k00040J232780K588437
39315D133891L169772J968720o21962k179173j017536J294926J906721M92419
$$ plain form
39307 9147778 8405981 7891562 7916063 7445632 5989653 4480429 3994208 4283053 4086843
39298 4086843 2772114 1223505 804926 1619338 2360420 2044596 1286423 1430047 2917791
39289 2917791 5033377 6774597 7391066 6619136 5211671 4772485 6070907 7825474 8217315
39280 8217315 7353371 6936127 7504058 7539104 5900914 3811274 3319173 4563944 5779059
39271 5779059 5758925 5164804 5159091 5718033 6035366 6091435 6746329 8102531 8854177 8126740
39261 8126740 7215402 8117053 10524002 11858634 10655535 8332979 6800828 5871374 4441942
39252 4441942 3019269 3185568 5080209 7187671 8454630 8970243 8588702 6726137 4081891
39243 4081891 2961661 4765877 7973047 9633465 8580340 6489885 5812493 7043810
$$ packed form
39307I147778p41797n14419K4501m70431j455979j509224m86221K88845j96210
39298D086843j314729j548609m18579Q14412P41082l15824p58173J43624J487744
39289B917791K115586J741220O16469p71930j407465m39186J298422J754567L91841
39280H217315q63944m17244N67931L5046j638190k089640m92101J244771J215115
39271E779059k0134n94121n713N58942L17333N6069O54894J356202P51646p27437
39261H126740r11338R01651K406949J334632j203099k322556j532151r29454j429432
39252D441942j422673J66299J894641K107462J266959N15613l81541j862565k644246
39243D081891j120230J804216L207170J660418j053125k090455o77392J231317
$$ plain form
39235 7043810 8229031 7272325 4603202 2944641 4124826 6816321 8105671 6700080
39227 6700080 3727130 963884 -501043 -140751 1997457 4757352 6336508 5878261
39219 5878261 4273723 3218048 3658520 4973679 5469211 4203414 2641664 3583552 7697610
39210 7697610 12133025 13709843 12485689 10675620 9129238 7150140 5268278 5352125
39202 5352125 7368962 8494980 6722928 3576663 1870439 2197778 3157735 3960810 5001159
39193 5001159 6207417 6476379 5138256 3103165 2072642 2855191 4600266 5599035 4884896
39184 4884896 3155785 2110958 2847328 4836334 6352329 6061361 4543169 4006154 5768447
39175 5768447 8238319 8635358 6798331 5580008 6795665 8679045 8716529 7249083 6329422
$$ packed form
39235G043810J185221r56706k669123j658561J180185K691495J289350j405591
39227F700080k972950k763246j464927L60292K138208K759895J579156m58247
39219E878261j604538j055675M40472J315159M95532j265797j561750R41888M114058
39210G697610M435415J576818j224154j810069j546382j979098j881862Q3847
39202E352125K016837J126018j772052l146265j706224L27339R59957Q03075J040349
39193E001159J206258K68962j338123k035091j030523P82549J745075R98769p14139
39184D884896j729111j044827P36370J989006J515995k90968j518192n37015J762293
39175E768447K469872L97039j837027j218323J215657J883380L7484j467446r19661
$$ plain form
39166 6329422 6373411 6191559 5434784 4766585 4256739 3746690 4188338 6445914 9347996
39157 9347996 11059026 11630821 11971813 11464410 9485866 8055453 9217922 10585713 7939213
39148 7939213 2245162 -767444 1107272 3667708 3431741 2635701 4214553 6272436
39140 6272436 5537201 3100066 2552418 4546083 6937922 8632225 9799545 9713111 7746653
39131 7746653 5535896 5224888 6449581 7475042 8018587 8484053 7995280 5993419 4271930
39122 4271930 4518145 5411680 5269965 5788012 9324341 13846099 14902325 12027211 8946008
39113 8946008 7652290 6639395 5291632 5508397 7692314 9053290 7764775 5782728
39105 5782728 5719060 7344782 8810676 9274282 8879581 7848072 6734908 6157732 5673146
$$ packed form
39166F329422M3989j81852p56775o68199n09846n10049M41648K257576K902082
39157I347996J711030N71795L40992n07403j978544j430413J162469J367791k646500
39148G939213n694051l012606J874716K560436k35967p96040J578852K057883
39140F272436p35235k437135n47648J993665K391839J694303J167320q6434j966458
39131G746653k210757l11008J224693J025461N43545M65466m88773k001861j721489
39122D271930K46215Q93535j41715N18047L536329M521758J056226k875114l081203
39113H946008j293718j012895j347763K16765K183917J360976j288515j982047
39105E782728o3668J625722J465894M63606l94701j031509j113164n77176m84586
$$ plain form
39096 5673146 4477453 3401703 4205314 6670938 8643165 9254331 9713623 10538509 10655491
39087 10655491 9875224 9559427 9982518 9671719 8265389 7296423 7141254 6133280 4019900
39078 4019900 3231027 4880667 6364793 5114562 2201803 -88454 -1853349 -4121097
39070 -4121097 -5884310 -5456378 -3348803 -1209160 852259 3459160 5732126 6340957
39062 6340957 5834840 5657063 5801064 5625139 5874002 7416009 8876253 8161547 5827993
$$ packed form
39096E673146j195693j075750Q03611K465624J972227O11166M59292Q24886J16982
39087A0655491p80267l15797M23091l10799j406330r68966j55169j007974k113380
39078D019900p88873J649640J484126j250231k912759k290257j764895k267748
39070d121097j763213M27932K107575K139643K061419K606901K272966O08831
39062F340957n06117j77777J44001j75925K48863J542007J460244p14706k333554
$$ [...]
##END NTUPLES=NMR SPECTRUM
##END=
