##TITLE=31Pdec_SR91_rm3
 , 50 sc
 30.09.2021
##JCAMPDX= 6.0         $$ Bruker NMR JCAMP-DX V2.0
##DATA TYPE= NMR SPECTRUM
##DATA CLASS= NTUPLES
##ORIGIN= UXNMR, Bruker Analytische Messtechnik GmbH
##OWNER= root
$$ XWIN-NMR		Version 3.5
$$ Thu Sep 30 12:13:11 2021 Russian Standard Time (UT+4h)  she@DPX200
##.OBSERVE FREQUENCY= 81.013821
##.OBSERVE NUCLEUS= ^31P
##.ACQUISITION MODE= SIMULTANEOUS
##.ACQUISITION SCHEME= undefined
##.AVERAGES= 51
##.DIGITISER RES= 16
##SPECTROMETER/DATA SYSTEM= spect
##.PULSE SEQUENCE= zgpg30
##.SOLVENT NAME= CDCl3
##.SHIFT REFERENCE= (INTERNAL, CDCl3, 0, 248.564)
##AUDIT TRAIL= $$ (NUMBER, WHEN, WHO, WHERE, WHAT)
$$ ##TITLE= Audit trail, XWIN-NMR		Version 3.5
$$ ##JCAMPDX= 5.01
$$ ##ORIGIN= Bruker BioSpin GmbH
$$ ##OWNER= she
$$ F:/spectra/data/she/nmr/P31/1/pdata/1/auditp.txt
$$ ##AUDIT TRAIL=  $$ (NUMBER, WHEN, WHO, WHERE, WHAT)
(   1,<2021-09-30 12:11:51.89 +0400>,<she>,<DPX200>,
      <created by zg, POWCHK disabled, PULCHK disabled
       terminated by command 'halt'
       configuration hash MD5:
       00 E9 B6 7A A2 85 ED C7 34 08 36 98 17 FE 4E 26
       data hash MD5: 32K
       83 17 F9 28 91 9E 18 CD 91 64 7E 0E 31 45 0A CB>)
(   2,<2021-09-30 12:11:55.26 +0400>,<she>,<DPX200>,
      <Start of raw data processing
       efp BC_mod = 2 LB = 1 FT_mod = 6 PKNL = 1 PHC0 = -8828.372 PHC1 = 81.66933 SI = 64K 
       data hash MD5: 64K
       AF 01 FB DC 81 C6 31 E2 96 B8 30 F9 5F C6 04 7D>)
(   3,<2021-09-30 12:12:36.92 +0400>,<she>,<DPX200>,
      <pk PHC0 = -2.580511 PHC1 = 17 
       data hash MD5: 64K
       61 DE F5 FE A2 BC 18 17 B3 3A 8E 39 A2 48 1B 4E>)
(   4,<2021-09-30 12:12:42.64 +0400>,<she>,<DPX200>,
      <abs ABSG = 5 
       data hash MD5: 64K
       F7 16 DA 0C CA 72 F7 CB DF 41 7C AD 06 71 12 98>)
$$ ##END=
$$ 
$$ hash MD5
$$ 3B 50 3A B8 E0 C1 8C EA BF 7C 67 F4 53 E7 30 26
##$RELAX= 
##$RELAX= 
##$RELAX= 
##$RELAX= 
##$RELAX= 
##$RELAX= 
##$RELAX= 
##$RELAX= 
$$ Bruker specific parameters
$$ --------------------------
##$DU= <F:/spectra>
##$EXPNO= 1
##$NAME= <P31>
##$PROCNO= 1
##$TYPE= <nmr>
##$USER= <she>
##$AMP= (0..31)
100 100 100 100 100 100 100 100 100 100 100 100 100 100 100 100 100 100 
100 100 100 100 100 100 100 100 100 100 100 100 100 100 
##$AQSEQ= 0
##$AQ_mod= 1
##$AUNM= <au_zg>
##$AUTOPOS= <>
##$BF1= 81.014009
##$BF2= 200.13
##$BF3= 200.13
##$BF4= 200.13
##$BF5= 200.13
##$BF6= 200.13
##$BF7= 200.13
##$BF8= 200.13
##$BYTORDA= 1
##$CFDGTYP= 0
##$CFRGTYP= 5
##$CHEMSTR= <none>
##$CNST= (0..31)
1 1 145 1 1 1 1 1 1 1 1 1 1 1 1 1 1 1 1 1 1 1 1 1 1 1 1 1 1 1 1 1 
##$CPDPRG= <waltz16>
##$CPDPRG1= <>
##$CPDPRG2= <waltz16>
##$CPDPRG3= <>
##$CPDPRG4= <mlev>
##$CPDPRG5= <mlev>
##$CPDPRG6= <mlev>
##$CPDPRG7= <mlev>
##$CPDPRG8= <mlev>
##$CPDPRGB= <>
##$CPDPRGT= <>
##$D= (0..31)
0 1 0 0 0 0 0 0 0 0 0 0.03 2e-05 3e-06 0 0 0 0 0 0 0 0 0 0 0 0 0 0 0 0 
0 0 
##$DATE= 1632989473
##$DBL= (0..7)
120 120 120 11 120 120 24 19 
##$DBP= (0..7)
150 150 150 150 150 150 150 150 
##$DBP07= 0
##$DBPNAM0= <>
$$ [...]
##$SUBNAM3= <"">
##$SUBNAM4= <"">
##$SUBNAM5= <"">
##$SUBNAM6= <"">
##$SUBNAM7= <"">
##$SUBNAM8= <"">
##$SUBNAM9= <"">
##$SW= 501.771253377433
##$SWIBOX= (0..15)
0 1 3 0 0 0 0 0 0 0 0 0 0 0 0 0 
##$SW_h= 40650.406504065
##$TD= 32768
##$TD0= 1
##$TE= 0
##$TE2= 300
##$TE3= 300
##$TEG= 300
##$TL= (0..7)
0 120 53 12 22 120 120 120 
##$TP= (0..7)
150 150 150 150 150 150 150 150 
##$TP07= 0
##$TPNAME0= <>
##$TPNAME1= <>
##$TPNAME2= <>
##$TPNAME3= <>
##$TPNAME4= <>
##$TPNAME5= <>
##$TPNAME6= <>
##$TPNAME7= <>
##$TPOAL= (0..7)
0.5 0.5 0.5 0.5 0.5 0.5 0.5 0.5 
##$TPOFFS= (0..7)
0 0 0 0 0 0 0 0 
##$TUNHIN= 0
##$TUNHOUT= 0
##$TUNXOUT= 0
##$USERA1= <user>
##$USERA2= <user>
##$USERA3= <user>
##$USERA4= <user>
##$USERA5= <user>
##$V9= 5
##$VALIST= <valist>
##$VCLIST= <CCCCCCCCCCCCCCC>
##$VD= 0
##$VDLIST= <DDDDDDDDDDDDDDD>
##$VPLIST= <PPPPPPPPPPPPPPP>
##$VTLIST= <TTTTTTTTTTTTTTT>
##$WBST= 1024
##$WBSW= 4
##$XGAIN= (0..3)
0 0 0 0 
##$XL= 0
##$YL= 0
##$YMAX_a= 9920
##$YMIN_a= -9466
##$ZGOPTNS= <>
##$ZL1= 120
##$ZL2= 120
##$ZL3= 120
##$ZL4= 120
##$ABSF1= 248.5645
##$ABSF2= -253.2056
##$ABSG= 5
##$ABSL= 3
##$ALPHA= 0
##$AQORDER= 0
##$ASSFAC= 0
##$ASSFACI= 0
##$ASSFACX= 0
##$ASSWID= 0
##$AUNMP= <proc_1d>
##$AZFE= 0.1
##$AZFW= 0.5
##$BCFW= 0
##$BC_mod= 2
##$BYTORDP= 0
##$COROFFS= 0
##$CY= -3
##$DATMOD= 1
##$DC= 0
##$DFILT= <>
##$DTYPP= 0
##$F1P= 0
##$F2P= 0
##$FCOR= 1
##$FTSIZE= 65536
##$FT_mod= 6
##$GAMMA= 0
##$GB= 0
##$INTBC= 1
##$INTSCL= 5.30512e-09
##$ISEN= 30
##$LB= 1
##$LEV0= 0
##$LPBIN= 0
##$MAXI= 10000
##$MC2= 0
##$MEAN= 0
##$ME_mod= 0
##$MI= 50
##$NCOEF= 0
##$NC_proc= -5
##$NLEV= 6
##$NOISF1= 182.463
##$NOISF2= 159.3651
##$NSP= 0
##$NTH_PI= 0
##$NZP= 0
##$OFFSET= 248.5645
##$PC= 4
##$PHC0= -8830.952
##$PHC1= 98.66933
##$PH_mod= 1
##$PKNL= yes
##$PPARMOD= 0
##$PSCAL= 0
##$PSIGN= 0
##$REVERSE= no
##$SF= 81.014009
##$SI= 65536
##$SIGF1= 159.3651
##$SIGF2= -187.1042
##$SINO= 113.3802
##$SIOLD= 16384
##$SREGLST= <1H.CDCl3>
##$SSB= 0
##$STSI= 65536
##$STSR= 0
##$SW_p= 40650.406504065
##$SYMM= 0
##$S_DEV= 0
##$TDeff= 32768
##$TDoff= 0
##$TI= <>
##$TILT= no
##$TM1= 0
##$TM2= 0
##$TOPLEV= 0
##$USERP1= <user>
##$USERP2= <user>
##$USERP3= <user>
##$USERP4= <user>
##$USERP5= <user>
##$WDW= 1
##$XDIM= 65536
##$YMAX_p= 295828803
##$YMIN_p= -59017966
$$ End of Bruker specific parameters
$$ ---------------------------------
##NTUPLES= NMR SPECTRUM
##VAR_NAME=  FREQUENCY,     SPECTRUM/REAL,   SPECTRUM/IMAG
##SYMBOL=    X,             R,               I
##VAR_TYPE=  INDEPENDENT,   DEPENDENT,       DEPENDENT
##VAR_FORM=  AFFN,          ASDF,            ASDF
##VAR_DIM=   65536,         65536,           65536
##UNITS=     HZ,            ARBITRARY UNITS, ARBITRARY UNITS
##FACTOR=    0.620285442955139, 1,           1
##FIRST=     20137.2065510759, 0,            0
##LAST=      -20513.1999529892, 0,           0
##MIN=       -20513.1999529892, -59017966,   0
##MAX=       20137.2065510759, 295828803,    0
$$ Real data points
##PAGE= N=1
##DATA TABLE= (X++(R..R)), XYDATA
$$ [...]
60363h72796O2571j3938l08417l91728k7180M66394N98928L08552l0384r1827
$$ -872796 -810225 -824163 -1132580 -1524308 -1551488 -1085094 -486166 -177614 -207998 -299825
60353b99825J34791M78441P19655O15490P8823o10480r98522r10253n26455n7972
$$ -299825 -165034 313407 1033062 1648552 1727375 1116895 118373 -791880 -1318335 -1376307
60343a376307L66317N42274L47176Q0496J42728K88698j41787j006092j193487
$$ -1376307 -1009990 -467716 -120540 -40044 102684 391382 249595 -756497 -1949984
60334a949984k50772O51057L18890n65411m37540O38646J026767J64942n18764
$$ -1949984 -2200756 -1549699 -1230809 -1796220 -2233760 -1595114 -568347 -403405 -922169
60325i22169N4084Q99947O53588k83619o08239k19438J7900N000L28216P49639
$$ -922169 -868085 31862 685450 401831 -206408 -425846 -407946 -402946 -74730 674909
60315F74909L99458m97082o46634K50451R02692M13499m33563n78410k34514j70848
$$ 674909 1074367 577285 -69349 181102 1083794 1497293 1063730 485320 250806 79958
60305G9958l63097l12883m9481Q9517J79987M04584M58791L5877m57431m05495
$$ 79958 -283139 -596022 -645503 -555986 -375999 28585 487376 523253 65822 -339673
60295c39673P6477L55471J79897j94718n06052o13353m31586j58797j70162l22799
$$ -339673 -263196 92275 272172 77454 -428598 -1041951 -1473537 -1632334 -1802496 -2125295
60285b125295L7365R25573J343514P14320j17523j78898J40351m9208n17952m36742
$$ -2125295 -2087930 -1162357 181157 895477 777954 599056 739407 690199 172247 -264495
60275b64495M8748J48482n7811J38215N80982M61051j15585k26980K38360M87627
$$ -264495 -215747 -67265 -125076 13139 594121 1055172 939587 712607 950967 1438594
60265A438594L15731K05654P592q00204j514688q02760Q30893J248701m7583r87794
$$ 1438594 1754325 1959979 1967571 1167367 -347321 -1150081 -319188 929513 881930 -105864
60255a05864k27949P65233L19061p03288n69386M43698Q05901K76382k04367l41770
$$ -105864 -333813 431420 750481 47193 -522193 -78495 727406 1003788 799421 457651
60245D57651m54295l30785K16470L60450n09014j273583n92863P20047P80599
$$ 457651 3356 -327429 -110959 249491 -259523 -1533106 -2125969 -1405922 -625323
60236f25323l62742q64157l5640Q67949Q65946L40522k40217q51481r76665L390
$$ -625323 -988065 -1852222 -1887862 -1019913 -153967 186555 -53662 -905143 -1881808 -1878418
60226a878418J219142J012405l89273q83649K47632J177231N44399m37200k37796
$$ -1878418 -659276 353129 -36144 -919793 -672161 505070 1049469 612269 374473
60217C74473M44243J37074p64369p32005L16295R70773N12578l49223p89746p25776
$$ 374473 818716 955790 191421 -540584 -224289 746484 1259062 909839 120093 -605683
60207f05683m06241o8270K9218j23975j44575J49854L73859K48067J00643J96801
$$ -605683 -1011924 -1080194 -1050976 -1174951 -1319526 -1169672 -795813 -547746 -447103 -250302
60197b50302K19441r267k9502L69569N81274K68580J10918N23854O27556k74152
$$ -250302 -30861 -40128 -69630 299939 881213 1149793 1260711 1784565 2412121 2137969
60187B137969j146457p18668K61055J30969q31001p98198M33017R58252n3884
$$ 2137969 991512 272844 533899 664868 -166133 -964331 -531314 426938 373054
60178C73054r22172k52708P67074M10114p44035q63037J49941O80845R8142m24463
$$ 373054 -549118 -801826 -34752 375362 -368673 -1231710 -1081769 -400924 -302782 -727245
60168g27245K1275P35870P07687J03213k62627j76907j9169J8840L1942k4019
$$ -727245 -705970 29900 737587 840800 578173 401266 382097 400937 432879 408860
60158D08860k87848o15104o67637l68136K541J31960n6923l52232l58370J05143
$$ 408860 121012 -494092 -1161729 -1529865 -1527324 -1395364 -1452287 -1804519 -2162889 -2057746
60148b057746N72940L11721n53349q09436K93796J680787J608700O9997j097167
$$ -2057746 -1484806 -1173085 -1726434 -2535870 -2242074 -561287 1047413 1117410 20243
60139B0243p15343L07492O16873K83316O4053j68623q69441j348164m94630J178760
$$ 20243 -695100 -387608 229265 512581 576634 408011 -461430 -1809594 -2304224 -1125464
60129a125464J819262P75718n76848r40561o30617m10709j59682L63297N60394
$$ -1125464 693798 1469516 892668 -47893 -678510 -1089219 -1248901 -885604 -325210
60120c25210l3003o33536k83891N24158N37906k71739o49307M7767R70720J002085
$$ -325210 -358213 -991749 -1275640 -751482 -213576 -485315 -1134622 -1086855 -116135 885950
60110H85950O4551j018981j402646q07666K99453J016989Q38957J69885k46356
$$ 885950 950501 -68480 -1471126 -2278792 -1979339 -962350 -123393 46492 -199864
60101a99864k04338Q65J76158K89437J85098j93783m82733l24127P0514K72125
$$ -199864 -404202 -403337 -227179 62258 247356 53573 -429160 -753287 -682773 -410648
60091d10648K65539K03113p3259n73499o50640J40305R96086P46213l69657r53083
$$ -410648 -145109 58004 -15255 -588754 -1239394 -1099089 -103003 643210 273553 -679530
60081f79530m84652J11860J50932J46306N69985Q32503L24416m12245m78085J5757
$$ -679530 -1164182 -1052322 -901390 -755084 -185099 647404 971820 559575 81490 97247
60071I7247K54415p052k83069k22841N4582L31172M41496K23536j98213k98375
$$ 97247 351662 344610 61541 -161300 -106718 224454 665950 889486 691273 392898
60061C92898J73538O17726K57042p33286j353410j045985l05995R5399M8595K0857
$$ 392898 566436 1184162 1441204 707918 -645492 -1691477 -1997472 -1902073 -1853478 -1832621
60051a832621L03898O51858O60833L24826N9033J56882M09788M36179K15908j1764
$$ -1832621 -1528723 -876865 -216032 108794 167827 324709 734497 1170676 1386584 1374820
60041A374820k52997o95077j115153r01878O5645R85518R82076J87658l85675
$$ 1374820 1121823 426746 -688407 -1590285 -1524640 -539122 442954 630612 244937
60032B44937m1131P51262Q25843k80683j512033j319359L02967J473513P73217
$$ 244937 203806 955068 1780911 1500228 -11805 -1331164 -1028197 445316 1218533
60023A218533p07308q22771N12242J252684L89032o22369l69913K86544j06022
$$ 1218533 511225 -311546 200696 1453380 1842412 1220043 850130 1136674 1030652
60014A030652j023799r03176J31886M69484k82173p15310p486Q33004P24916J13966
$$ 1030652 6853 -896323 -764437 -294953 -577126 -1292436 -1299922 -466918 257998 371964
60004C71964j4630L28518M78476K66724J2477j55236l05596l83897l57177l57130
$$ 371964 357334 685852 1164328 1431052 1443529 1288293 982697 598800 241623 -115507
59994a15507l73875k21429k0399j46650m64116l20885L38648O59212J93421k86137
$$ -115507 -489382 -710811 -731210 -877860 -1341976 -1662861 -1324213 -665001 -471580 -757717
59984g57717j3792M96891L36326k59299l41941J45181L44668m7854l75574j71548
$$ -757717 -771509 -274618 61708 -197591 -539532 -394351 -49683 -97537 -473111 -644659
59974f44659K20217L70964L24967K14023k066k07505j56211K1679n9588l18020
$$ -644659 -424442 -53478 271489 485512 483446 275941 119730 141409 81821 -236199
59964b36199k73892N3571R8881k00849j72825M01096P31884K47012m07520l52225
$$ -236199 -510091 -456520 -357639 -558488 -731313 -330217 401667 648679 241159 -111066
59954a11066J41659J34373m92412r28541o70625n4588M37969O95082P09717M15071
$$ -111066 30593 164966 -327446 -1255987 -1926612 -1981200 -1543231 -848149 -138432 276639
59944B76639l6766k89224k39387j31286r4933M4491L53140N03168J39981n80978
$$ 276639 239873 -49351 -288738 -420024 -514957 -470466 -117326 385842 525823 -55155
59934e5155r98359n68609M50044J050670N30449n16175p71796N1085P02018J48011
$$ -55155 -1053514 -1622123 -1172079 -121409 409040 -107135 -878931 -827846 -125828 22183
59924B2183q34909p33840M37294J096133L44349q47294j090218l21248M76998
$$ 22183 -812726 -1546566 -1109272 -13139 331210 -516084 -1606302 -1927550 -1450552
59915a450552O55019L53069l3812k57729k54526j72071k27399l17988m5968O19925
$$ -1450552 -795533 -442464 -476276 -734005 -988531 -1160602 -1388001 -1705989 -1751957 -1132032
59905a132032J034506O05577l62438r17590m95771N08491J158754Q77640K0085
$$ -1132032 -97526 508051 145613 -771977 -1267748 -759257 399497 1277137 1297222
59896A297222m89396k61069K3032l94455j050680p73965M71545J267274P11916
$$ 1297222 807826 546757 569789 175334 -875346 -1649311 -1177766 89508 801424
59887H01424k63268l46187K03326J65005n78789r15617l92490P5139k17130n72360
$$ 801424 538156 191969 395295 560300 -18489 -934106 -1326596 -1251457 -1468587 -2040947
59877b040947m1790R58982J145895K37258n91549l08762O25575J000451N22281
$$ -2040947 -2082737 -1123755 22140 259398 -332151 -640913 -15338 985113 1507394
59868A507394K9433P6710J18587m48386j087033q12905J96809O84841R5315o75209
$$ 1507394 1536827 1613537 1732124 1283738 196705 -616200 -419391 265450 360765 -314444
59858c14444o43141R730N54260P96869Q70637O01325j13612p45312p38465l51948
$$ -314444 -957585 -947855 -393595 403274 1273911 1875236 1761624 1016312 277847 -74101
59848g4101k00391k95570k39946j5312J59719L86007P00628N50332l95866j259234
$$ -74101 -274492 -570062 -810008 -825320 -665601 -279594 421034 971366 575500 -683734
59838f83734q97644L32570R24347L07671n66638q00931n21016p7111N21612J010055
$$ -683734 -1581378 -1248808 -324461 -16790 -583428 -1384359 -1905375 -1982486 -1460874 -450819
59828d50819Q29874J46820j24088K44059L87724j20099m86986j15923L25868J06038
$$ -450819 379055 525875 401787 645846 1033570 913471 426485 310562 636430 742468
59818G42468l34752l10448j13137k47813l21129J21495M44890o2040p02408l82450
$$ 742468 407716 97268 -15869 -263682 -584811 -463316 -18426 -80466 -782874 -1165324
59808a165324M21573L62403m15857m49509M61957P81124j39647q17822m7117J036421
$$ -1165324 -743751 -381348 -797205 -1246714 -784757 -3633 -143280 -961102 -1008219 28202
59798B8202P35139m88607p70196K46785J002701N04931l80827n56592k62992k32320
$$ 28202 763341 274734 -495462 -248677 754024 1258955 878128 321536 58544 -173776
59788a73776k99075O4556M47654j8458j036164j236469j59201R58990R37754K42974
$$ -173776 -472851 -408295 39359 20901 -1015263 -2251732 -2410933 -1451943 -514189 -271215
59778b71215o590J65010p7464p20052q71863l10602K04306L03864M71275Q37407
$$ -271215 -277805 -112795 -190259 -910311 -1782174 -2092776 -1888470 -1584606 -1113331 -275924
59768b75924P70155J72150o7296L60707M15340n11691j249269o05683N34912M95244
$$ -275924 494231 666381 599085 959792 1375132 863441 -385828 -991511 -456599 38645
59758C8645n07819p74423Q4255O52270J37716m88439k75158L24786N47833N06881
$$ 38645 -469174 -1243597 -1159342 -507072 -369356 -857795 -1132953 -808167 -260334 246547
59748B46547N05372K66443l11621n63430r3198L81964J09726m47545l63052K83980
$$ 246547 751919 1018362 706741 143311 50113 432077 541803 94258 -268794 15186
59738A5186O45322M72297L11271M50134M94026Q7330n15898p75331m76598N4325
$$ 15186 660508 1132805 1444076 1894210 2388236 2475566 1959668 1184337 707739 762064
59728G62064K57697o8630n11003n92360m47559m98367o06891k71698L51323N25663
$$ 762064 1019761 951131 440128 -152232 -599791 -1098158 -1705049 -1976747 -1625424 -1099761
59718a099761J95179J66416O90270R42146M62950l270J17766J43570n44265j130823
$$ -1099761 -904582 -738166 -47896 894250 1357200 1353930 1471696 1615266 1071001 -59822
59708e9822o24317L44429M43452k30284m68634N685L81608L97350N25183O12654
$$ -59822 -684139 -339710 103742 -126542 -595176 -589491 -207883 189467 714650 1327304
59698A327304P414q68835p77909K08835N64636k06065o87923K7224P44612J90918
$$ 1327304 1334718 465883 -312026 -103191 461445 255380 -432543 -405319 339293 530211
59688E30211q03358o50075M69872J007418M18597l04683k61629L48553P78746
$$ 530211 -273147 -923222 -453350 554068 972665 667982 406353 754906 1533652
59679A533652M93156m69982j330519j156280j35446M02261j29889n70446J62376
$$ 1533652 2026808 1556826 226307 -929973 -1065419 -663158 -793047 -1363493 -1201117
59670a201117J208451J089310J02780k70718J30513Q8184o79276j033827m98889
$$ -1201117 7334 1096644 1199424 928706 1059219 1147403 468127 -565700 -1064589
59661a064589k3458j44068n9084P03966J213177O77923k18336n34615m60139m46619
$$ -1064589 -1088047 -1232115 -1291199 -587233 625944 1303867 1085531 550916 90777 -355842
59651c55842j08081P78404J212460L55376q30599q65874n3172J55983l48135l26482
$$ -355842 -463923 314481 1526941 1882317 1051718 185844 132672 288655 -59480 -385962
59641c85962M08724N37175m26969j153454o54843J43032P3274l37458M4442Q92037
$$ -385962 22762 559937 132968 -1020486 -1675329 -1532297 -1459023 -1796481 -1752039 -860002
59631h60002R61000J79799l23208j26690j1489m00274o24771j94039L13527K51032
$$ -860002 100998 280797 -42411 -169101 -180590 -580864 -1205635 -1399674 -1086147 -835115
59621h35115q4159j37316o3786k25936l18812J21786P63775R46444P87527Q41788
$$ -835115 -919274 -1056590 -1120376 -1346312 -1665124 -1543338 -779563 166881 954408 1796196
59611A796196Q87900K19995q47368j057020j45060N46831M4367q12487q01569
$$ 1796196 2684096 2904091 2056723 999703 854643 1401474 1445841 633354 -168215
59602a68215j93436j7306k22526K5500O33299O36996q2327n05228r0410M90852
$$ -168215 -361651 -378957 -601483 -575983 57316 694312 611985 106757 16347 507199
59592E07199N24967J41029k52121m69836k79873L90917Q10853J30896j061630
$$ 507199 1032166 1173195 921074 451238 171365 562282 1373135 1504031 442401
59583D42401j176652J4295Q91003M58606k63413k37420j46565p79057j196433
$$ 442401 -734251 -719956 171047 629653 366240 128820 -17745 -796802 -1993235
59574a993235l19179Q44002O25134m60171n23732N06016Q57997L4480m26371K79583
$$ -1993235 -2312414 -1468412 -843278 -1303449 -1827181 -1321165 -463168 -428688 -855059 -575476
59564e75476R19498M85614k07574k15142l8184l37548n64419j55737J94205j87206
$$ -575476 344022 829636 622062 406920 368736 31188 -533231 -688968 -494763 -681969
59554f81969n33551M0964P68544L79485o62878p64708K94983J070414O33812l44967
$$ -681969 -1215520 -1174556 -406012 -26527 -689405 -1454113 -1159130 -88716 545096 200129
59544B00129q44894o34272K3599P51138R19510R8909j067989j301975l15695P54461
$$ 200129 -644765 -1279037 -1255438 -504300 415210 514119 -553870 -1855845 -2171540 -1417079
59534a417079Q63456K73826j34033r4132L7147M3928N5807J77666L10574K87184
$$ -1417079 -553623 -279797 -413830 -507962 -470815 -426887 -371080 -193414 117160 404344
59524D04344K0929l69858n40971k42901K88503N28099L20910M6969L41p6471n65493
$$ 404344 425273 55415 -485556 -728457 -439954 88145 409055 456024 456365 379894 -185599
59513a85599j266161j463805p70759L18373R14341P29230L24860K63149L51678
$$ -185599 -1451760 -2915565 -3686324 -3367951 -2453610 -1724380 -1399520 -1136371 -784693
59504g84693J11674k83032j87671M28477Q27014O16300K62578J45241q8400o57676
$$ -784693 -673019 -956051 -1143722 -715245 111769 728069 990647 1135888 1047488 389812
59494C89812r29218l85695L33972L51353n685J69169O33274K81038q22883j158697
$$ 389812 -539406 -925101 -591129 -239776 -245461 -76292 556982 838020 15137 -1143560
59484a143560j406J291656J093859k62374j063955n43649L58655M69443j91159
$$ -1143560 -1144966 146690 1240549 978175 -85780 -629429 -270774 198669 7510
59475G510o80203l83700L21126N99642J78524l65841l99938r344L36988N92441
$$ 7510 -672693 -1056393 -735267 -135625 42899 -322942 -722880 -732224 -395236 197205
59465A97205J006588J338134R76537r434p02060n56109j40138k20412o84408r16798
$$ 197205 1203793 2541927 3518464 3509030 2806970 2250861 2110723 1890311 1205903 289105
59455B89105p66367n15229k33053J79335N09354M34847J18489K3863J72173J35321
$$ 289105 -477262 -992491 -1225544 -1046209 -536855 -102008 16481 40344 212517 347838
59445C47838k02023m18334k20290J50284L65019M38415M63985L10934p0378l34415
$$ 347838 145815 -272519 -492809 -342525 22494 460909 924894 1235828 1165450 831035
59435H31035j59132J78265J09707l52587n43171j15790L64820J92515m26278o38248
$$ 831035 671903 850168 959875 607288 64117 -51673 313147 505662 79384 -558864
59425e58864j83947K37155J9382m79896n19803m2533L49781L01564P3795K4896
$$ -558864 -742811 -505656 -486274 -966170 -1485973 -1528506 -1178725 -877161 -803366 -778470
59415g78470J62933L03223L40534K46359K8398k06417l00354k01756K0485K62925
$$ -778470 -615537 -312314 28220 274579 302977 96560 -203794 -405550 -385065 -122140
59405a22140L81998K46196m0190j48422L2578K03390J64353J85250M46278M78209
$$ -122140 259858 506054 465864 317442 350020 553410 717763 903013 1349291 1827500
59395A827500j76374r76328q93772P6973P82294M99814j56385l24524j29360j93764
$$ 1827500 1651126 674798 -218974 -142001 640293 1140107 983722 659198 529838 336074
59385C36074m67567l32363L28626Q67364P30010J01436m39610o07442n74723n61335
$$ 336074 -131493 -463856 -135230 732134 1462144 1563580 1123970 516528 -58195 -619530
59375f19530m46981K7788O62725P57607K3512p63419o36307J62194M48927j31789
$$ -619530 -1066511 -1038723 -375998 381609 405121 -358298 -994605 -832411 -383484 -515273
59365e15273n30005P8212R46014Q32458j64108q08264n14773J7715J7871l28581
$$ -515273 -1045278 -967066 -21052 811406 647298 -160966 -675739 -658024 -640153 -968734
59355i68734l63172P2944N23926N26892Q9863l33859k87087J63701M07980R538
$$ -968734 -1331906 -1258962 -735036 -208144 -118281 -452140 -739227 -575526 -167546 -158008
59345a58008o44169p35375m9950P53851J008657P82276N07418K17712l55887j024770
$$ -158008 -802177 -1537552 -1587502 -833651 175006 957282 1464700 1682412 1326525 301755
59335C01755j083309k84947N85936O35085Q0629j29037J65600J00451o44672j025405
$$ 301755 -781554 -1066501 -480565 154520 235149 106112 271712 372163 -272509 -1297914
59325a297914j54246J111932J212541J18380o97668m50697N4449l9174l88798
$$ -1297914 -1452160 -340228 872313 990693 293025 -157672 -103223 -142397 -531195
59316e31195l04758Q2147K24092R5089N9092K12623L61023L29982J4486n01276
$$ -531195 -835953 -753806 -529714 -434625 -375533 -162910 198113 528095 542581 41305
59306D1305p64854m54216o0058k46585n30775K00447J610397J849070K78139j264311
$$ 41305 -723549 -1177765 -1237823 -1484408 -2015183 -1814736 -204339 1644731 1922870 658559
59296F58559j058172M7790K73292k47313j47888N17634M73243k90459m02856M26535
$$ 658559 -399613 -351823 -78531 -325844 -473732 43902 517145 226686 -176170 250365
59286B50365Q64362K59666l65285k46387r8271n61389r12405l60681N28515P65080
$$ 250365 1114727 1374393 1009108 762721 664450 103061 -809344 -1170025 -641510 123570
59276A23570M03927J18082L0586j38410l55364m79074o46273q06651m72478M16821
$$ 123570 527497 645579 676165 537755 182391 -296683 -942956 -1749607 -2222085 -1805264
59266a805264J006405O27985j56946l51400J09403N03323M32822R8068k26016
$$ -1805264 -798859 -170874 -327820 -679220 -569817 -66494 366328 464396 238380
59257B38380l75439k23781J00324K25351J19684K10223N70214N95269m1614p49467
$$ 238380 -137059 -360840 -260516 -35165 84519 294742 864956 1460225 1418611 669144
59247F69144q76927n59397j44147M58635J119077J008993k17165j427020j314141
$$ 669144 -207783 -767180 -911327 -452692 666385 1675378 1458213 31193 -1282948
59238a282948j98715N89520O42928N42511M00565j97922r12594q08937K0509L90406
$$ -1282948 -1481663 -892143 -249215 293296 693861 495939 -416655 -1225592 -1205083 -814677
59228h14677q2630l60190K13686P66820L66058m15294m07292L64377Q20487M22644
$$ -814677 -897307 -1257497 -1043811 -276991 89067 -326227 -733519 -369142 451345 873989
59218H73989k64691n23353l19175j06230j83373l73420k71149J76418M81951K69710
$$ 873989 609298 85945 -233230 -339460 -522833 -896253 -1167402 -990984 -509033 -239323
59208b39323r1483j3480L14153J83146l84510n29766P4780O53703N61664K28092
$$ -239323 -330806 -344286 -30133 153013 -231497 -761263 -686483 -32780 528884 756976
59198G56976K53198L36138q6114p09565p71455k47546J95051K38446J49989J10738
$$ 756976 1010174 1346312 1260198 550633 -220822 -468368 -273317 -34871 115118 225856
59188B25856J7620r5002o1918M59j73486m81068n45192k71291J12633M34362N62635
$$ 225856 243476 148474 86556 87015 -86471 -567539 -1112731 -1384022 -1271389 -837027 -274392
59177b74392K52569m47003q77838n22271J31806K10236k32386l68987J3792K74239
$$ -274392 -21823 -468826 -1346664 -1868935 -1737129 -1526893 -1759279 -2128266 -2114474 -1840235
59167a840235J62583K54582P83512J029913M59456l34381m96963r6399K22194
$$ -1840235 -1677652 -1423070 -639558 390355 849811 515430 18467 -77932 144262
59158A44262K38762J50582j271k55436m31247m47253n42144o90579l60744N18846
$$ 144262 383024 533606 532335 276899 -154348 -601601 -1143745 -1834324 -2195068 -1676222
59148a676222J005908M30766l73336k44160L89283J55289q86312j124530O0753
$$ -1676222 -670314 -239548 -612884 -857044 -467761 -312472 -1198784 -2323314 -2262561
59139b262561J183021Q06061m47682j022481o01977m8085J70337L16539M80822
$$ -2262561 -1079540 -273479 -721161 -1743642 -2345619 -2393704 -2223367 -1906828 -1426006
59130a426006M21090K42995L44550O33838N44781o2870o42186p36329n07837l39322
$$ -1426006 -1004916 -761921 -417371 216467 761248 698378 56192 -680137 -1187974 -1527296
59120a527296l07124k09176J28880O23444Q57023L89830o05413j262092r42039
$$ -1527296 -1834420 -2043596 -1914716 -1291272 -434249 -44419 -649832 -1911924 -2853963
59111b853963j5496O76392Q48214P54305M88884L2869k19930J33190N97840K22896
$$ -2853963 -2869459 -2193067 -1344853 -590548 -101664 -68795 -288725 -155535 442305 665201
59101F65201q73841j367409n23709P09347R96366L15368l25296l46680j0351L08520
$$ 665201 -208640 -1576049 -2099758 -1390411 -394045 -78677 -403973 -750653 -761004 -452484
59091d52484M94294M45914J04139k72450l50098k24557k48259l96672k78033J97846
$$ -452484 41810 487724 591863 319413 -30685 -255242 -503501 -900173 -1178206 -980360
59081i80360O18946O53573M44958K65398J10624j40920m01045m53184k54104K9539
$$ -980360 -361414 292159 737117 1002515 1113139 972219 571174 117990 -136114 -106575
59071a06575K21852K30523O696l94175o94499n52026P480M61127L49429r2385
$$ -106575 115277 345800 352496 -41679 -736178 -1288204 -1280724 -819597 -470168 -562553
59061e62553k04145J60040M12110J66532j19058Q4324M26545K35194k69645k56590
$$ -562553 -766698 -606658 -194548 -28016 -147074 -62750 363795 598989 329344 72754
59051G2754K62255L27682l31642o50949J21040J055038Q08866l52872r64786n38813
$$ 72754 335009 662691 331049 -319900 -198860 856178 1665044 1312172 347386 -191427
59041a91427j28147n37597j045001n14065Q59617J668622J024684l93207j183725
$$ -191427 -319574 -857171 -1902172 -2416237 -1556620 112002 1136686 743479 -440246
59032d40246q20482q5659Q4834k10760j86934L41408P01497M83721J62145J88506
$$ -440246 -1260728 -1346387 -1261553 -1472313 -1659247 -1317839 -616342 -132621 29524 218030
59022B18030J72877l42984q42157m82051M67895Q22801J68576n39460l40613M82131
$$ 218030 390907 47923 -794234 -1276285 -808390 14411 182987 -356473 -697086 -214955
59012b14955R22914N35251k19794o27002m05150J12856L39695P9916k36669j87121
$$ -214955 707959 1243210 1023416 396414 -8736 104120 443815 523731 287062 99941
59002I9941l4280l07279q11784p25082J73021J017922R76000L29090m6591O5504
$$ 99941 65661 -241618 -1053402 -1778484 -1605463 -587541 388459 717549 670958 736462
58992G36462P7382l85687q78846p53774o9798M44832L26484l4242L1073M91942
$$ 736462 813844 428157 -450689 -1204463 -1274261 -829429 -502945 -537187 -506114 -14172
58982a4172O62715K58771j29904P3797N46818N58393J8265n26557p24096o71221
$$ -14172 648543 907314 777410 851207 1398025 1956418 1974683 1448126 724030 52809
58972E2809m74475j31653K04242L40181L50054L39350J17179l74920o04418j26818
$$ 52809 -421666 -553319 -349077 -8896 341158 680508 797687 422767 -181651 -308469
58962c08469N16169M10490l58316q35533o22879k25120O131K41112M15925K07098
$$ -308469 207700 618190 259874 -575659 -1198538 -1423658 -1417527 -1176415 -760490 -553392
58952e53392p4109K82766J008282R57155k1559o50039k36016K55710m8160m86952
$$ -553392 -627501 -344735 663547 1620702 1599143 949104 713088 968798 920638 433686
58942D33686k51023P1761l21929p98662l42343N62152O98079J68604N1194M10357
$$ 433686 182663 254424 -67505 -866167 -1208510 -646358 51721 220325 271519 681876
58932F81876L16074l29623n98871k06689J01764k7738j02951P0853O6054j49845
$$ 681876 997950 668327 69456 -137233 -35469 -63207 -166158 -95305 -29251 -179096
58922a79096r2233J58312k4081n21804m84179J36628M01048N1746m6731M14834
$$ -179096 -271329 -113017 -137098 -658902 -1143081 -1006453 -605405 -553659 -600390 -185556
58912a85556N66266O9368o5808O80815J112849J71484j163971j261989k66211
$$ -185556 380710 450078 384270 1065085 2177934 2349418 1185447 -76542 -342753
58903c42753L43000M6227l15275j61995J35098J65656J6149j47871k37288n9992
$$ -342753 247 46474 -268801 -430796 -295698 -130042 -113893 -261764 -499052 -559044
58893e59044L20846L06473l93533r82230n64908L91676O69106J73992k0538M58535
$$ -559044 -238198 68275 -325258 -1307488 -1872396 -1480720 -811614 -637622 -658160 -199625
58883a99625O85138P6171n64350l21182M30761P13523L92705Q2389o512k54840
$$ -199625 485513 561684 -2666 -323848 106913 820436 1213141 1295530 1289018 1034178
58873A034178p52996r71311n06206K87319O63373L12452l30485n54040j07073
$$ 1034178 281182 -690129 -1196335 -909016 -245643 66809 -263676 -817716 -924789
58864i24789N06616N13920k69893j114142j052177M5172J195502J280481K77378
$$ -924789 -418173 95747 -174146 -1288288 -2340465 -2295293 -1099791 180690 458068
58855D58068p13670p48662n0485M82657M39149R8115k88793p34194j014175o57876
$$ 458068 -255602 -1004264 -1054749 -572092 -132943 -34828 -323621 -1057815 -2071990 -2729866
58845b729866K78958J008751R42185L77437m7651j33790l9556R1130Q0404k07144
$$ -2729866 -2450908 -1442157 -499972 -122535 -170186 -303976 -343532 -252402 -171998 -379142
58835c79142m19483L7819R27487J124754K36946n55632j62111O93446N89635l37849
$$ -379142 -798625 -760806 166681 1291435 1528381 972749 810638 1504084 2093719 1755870
58825A755870o96437j33519K19623k65111p65335n16862P717R5136p5877l7481
$$ 1755870 1059433 925914 1145537 880426 115091 -401771 -394054 -298918 -374795 -412276
58815d12276Q4418M0412Q0493L51174L32866l06092q72342n69877J82085L39088
$$ -412276 -327858 -287446 -206953 144221 477087 170995 -701347 -1271224 -1089139 -750051
58805g50051j19653j90434M86619R88918N04628m35358p10796j27430M82209N11126
$$ -750051 -869704 -1060138 -573519 415399 920027 484669 -226127 -353557 128652 639778
58795F39778K70269K58254K88795j34082q02032q59344m3222P67828O99772P8735
$$ 639778 910047 1168301 1457096 1323014 520982 -338362 -381584 386244 1086016 1164751
58785A164751j58201J19868K27944r7633l86096m30054o42671j107930j169817
$$ 1164751 1006550 1126418 1354362 1256729 870633 440579 -202092 -1310022 -2479839
58776b479839m86056K76106M42534L77751P49770J248085R64414j29533r62790
$$ -2479839 -2965895 -2689789 -2247255 -1869504 -1119734 128351 1092765 963232 442
58767D42p22100K19036R05493Q61430L43892j28409k62769j38215j5948l9364
$$ 442 -721658 -502622 402871 1264301 1608193 1479784 1217015 1078800 1062852 1023488
58757A023488j52794k51909k44624k4701L29842L94101j24586p37850o10508J85367
$$ 1023488 870694 618785 374161 349460 679302 1073403 948817 210967 -399541 -214174
58747b14174N51531r9605q76699o22413M36873J040316N78605l54329r38505r17386
$$ -214174 337357 237752 -638947 -1261360 -824487 215829 794434 440105 -498400 -1415786
58737a415786m52804J40375M62894L54804J55625K11151K78012l0082m07897k22464
$$ -1415786 -1868590 -1728215 -1265321 -910517 -754892 -543741 -265729 -295811 -703708 -926172
58727i26172L59050M66954j11096n31840j92134L71397L91838J3945j40316o4519
$$ -926172 -567122 -100168 -211264 -743104 -935238 -563841 -172003 -158058 -298374 -362893
58717c62893k38136o19827n79029O3388N83870K89261m83499p23417P716J040226
$$ -362893 -601029 -1220856 -1799885 -1736497 -1152627 -863366 -1346865 -2070282 -2062566 -1022340
58707a022340J376763P61905j81401p11346o23854k21439Q4415P4617j48220k36614
$$ -1022340 354423 1116328 934927 223581 -400273 -621712 -537297 -462680 -610900 -847514
58697h47514K6571L95348M24625Q1908k22093k71196k96477m22829l30484J86245
$$ -847514 -820943 -425595 -970 80938 -141155 -412351 -708828 -1131657 -1462141 -1275896
58687a275896P01904O35056J0960o07125p39187k72544N50619J108214P59824
$$ -1275896 -573992 61064 72024 -535101 -1274288 -1546832 -996213 112001 871825
58678H71825l19250j036258o36870K68138N11613q2986o09394l58283M18474R33078
$$ 871825 552575 -483683 -1120553 -852415 -340802 -423788 -1033182 -1391465 -972991 -39913
58668c9913O06732m08377j103359m83068R62493J387940J4379j399972q04337
$$ -39913 566819 158442 -944917 -1427985 -465492 922448 936827 -463145 -1267482
58659a267482J073216J621293J03000j406367j154701Q1905O92605M81094J34213
$$ -1267482 -194266 1427027 1530027 123660 -1031041 -949136 -256531 224563 358776
58650C58776k21244o60240o45172J44161Q59200N34311m51923j013638r22170
$$ 358776 137532 -522708 -1167880 -1023719 -164519 369792 -82131 -1095769 -2017939
58641b017939o84689l66251L13907J021029J055399M44470j32195l71383m73502
$$ -2017939 -2702628 -3068879 -2754972 -1733943 -678544 -234074 -366269 -737652 -1211154
58632a211154m43146j20487K40520K44060P2393J85258M85491N28390L25088J70068
$$ -1211154 -1654300 -1774787 -1534267 -1290207 -1217814 -1032556 -547065 -18675 306413 476481
58622D76481k4472l76032l91143K99955R07342L89502p94459j159614l93589L14848
$$ 476481 452009 75977 -315166 -15211 892131 1281633 487174 -672440 -1066029 -751181
58612g51181K88494K16612N76226O74088K3723n86092l56926J90983J76077j72456
$$ -751181 -462687 -246075 330151 1004239 1027962 441870 84944 275927 452004 279548
58602B79548q4961L06402K22380l84560p38720m41819P3106L06252K46696J00024
$$ 279548 194587 500989 723369 338809 -399911 -841730 -768624 -462372 -215676 -115652
58592a15652k0398k0728K09778O39633J010826R31090J61363r40532j431467p67450
$$ -115652 -136050 -156778 53000 692633 1703459 2634549 2795912 1855380 423913 -343537
58582c43537K98602N16255j43867m79802M9220N39898K66245j01261J98149N47418
$$ -343537 -44935 471320 327453 -152349 -103129 436769 703014 601753 799902 1347320
58572A347320K6682q28016p72175J06667N80019L02874J32210L65978J98564o44986
$$ 1347320 1374002 545986 -226189 -119522 460497 763371 895581 1261559 1460123 815137
58562H15137j110375l92869P19245R26438J42127o50989p81902m21466l7713R3308
$$ 815137 -295238 -688107 31138 957576 1099703 448714 -333188 -754654 -792367 -699059
58552f99059j8729j15493L6268K67400J97866j22522k20515L9750K53101K03697
$$ -699059 -717788 -833281 -797013 -529613 -331747 -454269 -674784 -635034 -381933 -178236
58542a78236J73425K66594J19727l29049m83035j9124M77194M15822J19576J39069
$$ -178236 -4811 261783 381510 52461 -430574 -449698 27496 443318 562894 701963
58532G01963K53412K324l01965q9610L06383J00975n13708n46417J53242N82667
$$ 701963 955375 957699 655734 566124 872507 973482 459774 -86643 66599 649266
58522F49266J56772m84386o31984m64691l18720L5387O58704Q27594P6278p58299
$$ 649266 806038 321652 -310332 -775023 -1093743 -1058356 -399652 427942 504220 -254079
58512b54079n52828M27476R17162N20368J06397K79725N12096J55094n38970r19883
$$ -254079 -806907 -379431 537731 1058099 1164496 1444221 1956317 2111411 1572441 652558
58502F52558q39564n28897p5168M25665N86519K01185k37956q3109N08718O96353
$$ 652558 -187006 -715903 -791071 -365406 221113 422298 184342 101233 609951 1306304
58492A306304M9979r06295j305167p77103L04488J109066R45492n4919q89100
$$ 1306304 1356283 449988 -855179 -1632282 -1327794 -218728 726764 671845 -217255
58483b17255o97796K20363Q25534O54137J44142k67778n61571n32095K38940J338891
$$ -217255 -915051 -694688 130846 784983 929125 661347 99776 -432319 -193379 1145512
58473A145512J425774L080j488262j405732j57042N08571Q1796k80202J17587
$$ 1145512 2571286 2574366 1086104 -319628 -476670 31901 113697 -166505 -48918
58464d8918N06769K15964j80522m1600J86388n8779l01629P0098N36202K78062
$$ -48918 457851 673815 493293 451693 638081 579302 277673 347771 883973 1162035
58454A162035l06616k24147L57321L57618l29359o23052j03163L02653n7414m78160
$$ 1162035 855419 631272 988593 1346211 1016852 393800 290637 593290 535876 57716
58444E7716j62181M31311L99317j48894m01482j85985q1699l58079n96913m01188
$$ 57716 -104465 326846 726163 577269 175787 -10198 -91897 -449976 -1046889 -1448077
58434a448077J07451N72823P57691N72976J16191k77974l23200j44930j04912
$$ -1448077 -1340626 -767803 -10112 562864 679055 401081 77881 -67049 -171961
58425a71961k70419l43977j63268L2020K869m1095K99523R23069J133429M83669
$$ -171961 -442380 -786357 -949625 -917605 -914736 -955831 -656308 266761 1400190 1883859
58415A883859m99975q58118m18357N0278J8260j14831J25511M25801L22436J10976
$$ 1883859 1383884 525766 107409 157687 175947 61116 186627 612428 934864 1045840
58405A045840K58469L87193j05813p62286o33388K7633M4783o41641p50407J56800
$$ 1045840 1304309 1691502 1585689 823403 190015 217648 262431 -379210 -1129617 -972817
58395i72817Q44889M52868j41673K2311L65245J5774n26203l56232K04699L63568
$$ -972817 -127928 324940 183267 205578 570823 586597 60394 -295838 -91139 272429
58385B72429L29157N61427M65439m86330j166058k71084J222741J223110k08239
$$ 272429 601586 1163013 1628452 1142122 -23936 -295020 927721 2150831 1942592
58376A942592j006832m51010L1230l30319m87541Q5961K57877m88187q10013J09569
$$ 1942592 935760 484750 515980 185661 -301880 -215919 41958 -446229 -1256242 -1146673
58366a146673R01523L23219n25573j32492P76504N78232l87417m98497L06778
$$ -1146673 -245150 78069 -447504 -579996 196508 774740 387323 -111174 195604
58357A95604N56572j58902o36238j70423N03246O12792K87033j40389n70205p18723
$$ 195604 752176 593274 -42964 -213387 289859 902651 1189684 1049295 479090 -239633
58347b39633l25852J43853O698m71605m34969J52888N60057N93322O27066M76891
$$ -239633 -565485 -421632 -414934 -886539 -1321508 -1168620 -608563 -15241 611825 1088716
58337A088716l30087j164703p64092O42153J276788M02111n99703m87839J0359
$$ 1088716 758629 -406074 -1170166 -528013 748775 1150886 551183 63344 73703
58328G3703k65915q33495m52369P02604J232948N94451k62435l68873Q6122L00121
$$ 73703 -192212 -1025707 -1478076 -775472 457476 1051927 789492 420619 506741 806862
58318H06862M987k69457J7306N41576L56492p22681j449344o49950R13166J338679
$$ 806862 811849 542392 559698 1101274 1457766 735085 -714259 -1364209 -451043 887636
58308H87636K33409q02066o39424o0075j5017J0938O82090J159980L70569r37414
$$ 887636 1121045 318979 -320445 -380520 -395537 -384599 297491 1457471 1828040 890626
58298H90626j118356j41967N02165K04571j21438J28953L59148P6624k61561k22393
$$ 890626 -227730 -369697 132468 337039 215601 344554 703702 780326 518765 296372
58288B96372j09445j89832j69929P8239J57459m3614o5528J65452N7414m49675
$$ 296372 186927 -2905 -172834 -94595 62864 19250 -46278 119174 176588 -273087
58278b73087m48987M28284J081644N15762m88715m75337M94903J042064N55386
$$ -273087 -722074 -293790 787854 1303616 814901 339564 834467 1876531 2431917
58269B431917k10500n56820n91718m16715K00242R32040P90220m29153j475563
$$ 2431917 2221417 1664597 1072879 656164 856406 1788446 2578666 2149513 673950
58260F73950j189794o5563N34026K16452k45156k34320Q8167L87886N56130M48973
$$ 673950 -515844 -581407 -47381 169071 -76085 -310405 -222238 165648 721778 1170751
58250A170751m8098n56995m63924J59916M94253P4014o06321q78665p24420m45678
$$ 1170751 1122653 565658 101734 261650 755903 829917 223596 -655069 -1379489 -1825167
58240a825167q0773L53230N26099K91805J15609L68160N71669J12142n94304n70202
$$ -1825167 -1905940 -1552710 -1026611 -734806 -619197 -251037 320632 432774 -161530 -731732
58230g31732J85722O24526K41257k46793j65524J10026o71k22106J9183N05767
$$ -731732 -546010 78516 319773 72980 -92544 17482 16811 -205295 -186112 319655
58220C19655N18838o0836o52508q10921n66518r1512M12898O40017N07820L93669
$$ 319655 838493 777657 125149 -685772 -1252290 -1343802 -930904 -290887 216933 610602
58210F10602N40717N17022q9756p44936n97813J25656L74671m7511j78443M16578
$$ 610602 1151319 1668341 1578585 833649 235836 361492 736163 688652 510209 926787
58200I26787P93479J30473q78914j035976l45404K66931M32655M66155L27543
$$ 926787 1720266 1850739 971825 -64151 -409555 -142624 290031 756186 1083729
58191A083729l57978j240129j333005m53807L76191L89376R8921L10920Q19220
$$ 1083729 725751 -514378 -1847383 -2301190 -1924999 -1535623 -1436702 -1125782 -306562
58182c06562Q29634K46187k50187k44926l4747j6876j63353k23030j01683Q1959
$$ -306562 523072 769259 519072 274146 239399 222523 59170 -163860 -265543 -183584
58172a83584J47736M8985J910K67280O77628O69741N1844n81652n96514j77697
$$ -183584 -35848 13137 15047 282327 959955 1629696 1681540 1099888 503374 325677
58162C25677O2741M5847J18519J82602k09547q52682q98259j50477N05771M24981
$$ 325677 388418 434265 552784 735386 525839 -326843 -1225102 -1375579 -869808 -444827
58152d44827J35452L20182O15435L06754l22448l90143Q9068J93273l86772q29522
$$ -444827 -309375 10807 626242 932996 610548 220405 309473 502746 115974 -713548
58142g13548m65656K67249N85025M21768K43685K63418L19361K39970l9850m70926
$$ -713548 -1179204 -911955 -326930 94838 338523 601941 921302 1161272 1121422 650496
58132F50496p32584m11247L68812Q48066N30663j45264m48419l47462l40260n26564
$$ 650496 -82088 -493335 -124523 723543 1254206 1108942 660523 313061 -27199 -553763
58122e53763m98811j34587J42801P9317L3534L69237P75426O33371p3146o28761
$$ -553763 -1052574 -1187161 -1044360 -965043 -931509 -562272 213154 846525 773379 144618
58112A44618m44275K24231N88240K49990l76015n96346k48135J72977J62038k01832
$$ 144618 -299657 -75426 512814 762804 386789 -209557 -457692 -284715 -122677 -324509
58102c24509m05505j15399N15920J082283J251232Q56803n2085j060842j490940
$$ -324509 -730014 -845413 -329493 752790 2004022 2860825 2808740 1747898 256958
58093B56958j005238j04443L31865R8771j18857J99590O04080M17487r9556j23865
$$ 256958 -748280 -852723 -520858 -422087 -540944 -341354 262726 680213 580657 456792
58083D56792L10332K47033n89779j131138n29674M55387N60594r8708l61158R0049
$$ 456792 767124 1014157 424378 -706760 -1236434 -781047 -220453 -319161 -680319 -590270
58073e90270M08134J72888O1998N46918R71485N81269k72844o71410l98719m5521
$$ -590270 -182136 -9248 52750 599668 1571153 2152422 1879578 1208168 809449 763928
58063G63928j28151o00925j042204r84695k88197N77551R12487O18534K68522
$$ 763928 635777 34852 -1007352 -1992047 -2280244 -1702693 -790206 -171672 96850
58054I6850K25426K53587J92456K84973M63401J19948q04294j287874o16031L74448
$$ 96850 322276 575863 768319 1053292 1516693 1636641 832347 -455527 -1071558 -697110
58044f97110M38620k19100l85151K03694O19614L98640J45452K63933K65737k12474
$$ -697110 -258490 -477590 -862741 -659047 -39433 359207 504659 768592 1034329 821855
58034H21855o86327o47819l14463o1446J54553L24799J08816m10186m52414K80904
$$ 821855 135528 -512291 -826754 -888200 -733647 -408848 -300032 -710218 -1162632 -881728
58024h81728Q67295M43724l83042m14319K82670N43304j7418m80191j52232M37334
$$ -881728 -14433 429291 46249 -368070 -85400 457904 440486 -39705 -191937 245397
58014B45397N10387J74330J0574J14711J43745m2393k98249n08507n92901m35061
$$ 245397 755784 930114 940688 1055399 1199144 1156751 858502 349995 -242906 -677967
58004f77967j42010r0837l66318m83368j00874L35026K23719k06212k42346J58708
$$ -677967 -819977 -910814 -1277132 -1760500 -1861374 -1526348 -1302629 -1508841 -1751187 -1592479
57994a592479L69217K22670K54315O12750O60024J27879j83003L96598J150615
$$ -1592479 -1223262 -1000592 -746277 -133527 526497 654376 471373 867971 2018586
57985B018586Q52540m42542j410308j182772k54909L76122K82011k85219p49029
$$ 2018586 2871126 2428584 1018276 -164496 -419405 -43283 238728 -46491 -795520
57976g95520n60924K81191J003853Q55642J23613k45640j6585J05308k71330n91596
$$ -795520 -1356444 -1075253 -71400 784242 907855 662215 645630 750938 479608 -111988
57966a11988l25330J98671M17896L55269K77209R3206l06055n58957l07316J43255
$$ -111988 -437318 -238647 179249 534518 811727 904933 598878 39921 -267395 -124140
57956a24140K00563j88661n46652n00983n9350N02502P32775L23492l61042m90044
$$ -124140 76423 -112238 -658890 -1159873 -1219223 -716721 16054 339546 -21496 -511540
57946e11540J66781Q52398Q67048M29871L9968l51933q63123j008742l96375L60002
$$ -511540 -344759 507639 1374687 1804558 1844526 1492593 629470 -379272 -775647 -415645
57936d15645L59465k44910n32750k19962J36552J88462J40563J07013k0203q2773
$$ -415645 -56180 -301090 -833840 -1053802 -917250 -728788 -588225 -481212 -501415 -584188
57926e84188J65691M38875K62796j42972j59622J59068K19187K574L7657K75720
$$ -584188 -418497 20378 283174 140202 -19420 139648 358835 361409 399066 674786
57916F74786J10083l78515l74918K06120L98217k27206p76811m46267K79301N22205
$$ 674786 784869 406354 31436 237556 635773 408567 -368244 -814511 -535210 -13005
57906a3005K57328k8335j60648r7519L49065R39369Q66177r5936r64922q18107
$$ -13005 244323 215988 55340 -42179 306886 1246255 2112432 2016496 1051574 233467
57896B33467o6500L06995J88244J47170K88381K13212j11850k48823L1142M88177
$$ 233467 166967 473962 662206 809376 1097757 1310969 1199119 950296 981438 1469615
57886A469615P00703L19764o02996j320075j036560j33491J08744n58971p87619
$$ 1469615 2170318 2490082 1887086 567011 -469549 -603040 -494296 -1053267 -1840886
57877a840886K49692J347042J052557n7062l78881J95049M30510k5527l03273
$$ -1840886 -1591194 -244152 808405 751343 372462 567511 998021 972494 669221
57868F69221l8741J95727J94490L15397L54771k08292q09075l53090O76702N73562
$$ 669221 630480 826207 1020697 1336094 1690865 1482573 673498 320408 997110 1570672
57858A570672p39090j273780j68643Q04796J54300r01423n89369N20320P72732
$$ 1570672 831582 -442198 -610841 193955 348255 -553168 -1142537 -622217 150515
57849A50515K65396K30219N22640M7459q57698p98743J25492M29321q0068k6550
$$ 150515 415911 646130 1168770 1216229 358531 -440212 -314720 114601 34533 7983
57839G983Q41517J029986L2538o17735q0233J98339r08324j956973j182484N28245
$$ 7983 849500 1879486 1912024 1294289 1214056 1412395 504071 -1452902 -2635386 -2107141
57829b107141J033966K52824j23649M07578O94421K24742j65303j0220J37892
$$ -2107141 -1073175 -820351 -944000 -536422 157999 382741 217438 207218 345110
57820C45110K8909R3023K43163j70264r15291r15301q7088M01099J33754P7487
$$ 345110 374019 467042 710205 539941 -375350 -1290651 -1377739 -976640 -842886 -765399
57810g65399O24541P41709m7442n35606J27498Q26650L42248n48658m59387K54405
$$ -765399 -140858 600851 553409 17803 145301 971951 1314199 765541 306154 560559
57800E60559K93712l06744n02298j79992K222J64138P69310J111906J99115j131436
$$ 560559 854271 547527 45229 -134763 -132541 31597 800907 1912813 2111928 980492
57790I80492j045434L62741J077754K99785n59354m82666k89729o37749o31034
$$ 980492 -64942 297799 1375553 1675338 1115984 633318 343589 -294160 -925194
57781i25194L47145J142815O07744m91117p79097l56211j24412j8060N33520J076906
$$ -925194 -578049 564766 1172510 681393 -97704 -453915 -578327 -596387 -62867 1014039
57771A014039O54400m84170j084548o85650o1816R2891n7520p8093J28386L77583
$$ 1014039 1668439 1184269 99721 -585929 -647745 -554854 -612374 -690467 -562081 -184498
57761a84498L98658M7461l80283l47981J43445M52546K62625K7784J10141K20049
$$ -184498 214160 261621 -118662 -466643 -323198 129348 391973 419757 529898 749947
57751G49947J47837K05708M08753J50855o40086j008531m29354K37760J50660
$$ 749947 897784 1103492 1512245 1663100 1023014 14483 -414871 -177111 -26451
57742b6451j93051n7017J95400N2697L2446N24419N99010l72616j026197M2557
$$ -26451 -219502 -276519 -81119 -28422 4024 528443 1127453 754837 -271360 -228803
57732b28803J566980J241500n17768j111646M4615O85266m23690j489063p43960
$$ -228803 1338177 2579677 2061909 950263 994878 1680144 1256454 -232609 -976569
57723i76569P75044J054958M5218q00778p31217m5465Q31952J402373R98670k74641
$$ -976569 -201525 853433 898651 97873 -633344 -678809 153143 1555516 2554186 2279545
57713B279545j170135p81212K41661P20281M62344p377m38080p37175n83838m174
$$ 2279545 1109410 328198 569859 1290140 1752484 1745107 1307027 569852 -13986 -18160
57703a8160L04201j1094k82267Q3478N59617L99528j05166j96492R1838J85789
$$ -18160 286041 274947 -7320 76158 635775 1035303 930137 733645 825483 1011272
57693A011272J3229j02634j97803m69050o54569l84839J42157M89875O34084O94537
$$ 1011272 1024501 921867 724064 255014 -399555 -784394 -642237 -152362 481722 1176259
57683A176259M81007m6969l64052j28426J35621j55296o20517m90926J77951O37962
$$ 1176259 1657266 1610297 1246245 1117819 1253440 1098144 477627 -13299 164652 802614
57673H02614M87289o6002o23689p34538j16144P09996O76014k96088q52770j57878
$$ 802614 1289903 1223901 600212 -134326 -250470 459526 1135540 839452 -13318 -171196
57663a71196O60771K15932q36772p51170N65135J435047R14061j59252p22375
$$ -171196 489575 705507 -131265 -882435 -317300 1117747 2031808 1872556 1150181
57654A150181o94723l94046J2992K01173j04141m30546j03262M73941K83256m89747
$$ 1150181 455458 61412 74404 275577 171436 -259110 -362372 111569 394825 -94922
57644i4922n16406M83608J094357L77231o81595p77621j62133J52469J18984L74704
$$ -94922 -611328 -127720 966637 1343868 662273 -115348 -277481 -125012 -6028 368676
57634C68676Q24854P18371n7919p29474o84786j12277M18715N33388K23459k14953
$$ 368676 1193530 1911901 1853982 1124508 439722 327445 746160 1279548 1503007 1288054
57624A288054m39671m13236l50941k86625l9541L09017L71925O3626k15618k01839
$$ 1288054 848383 435147 84206 -202419 -241960 67057 438982 502608 286990 85151
57614H5151r5824p1999J1459J69310J06543k30357m49837l43160j62738j8839
$$ 85151 -10673 -82672 -71213 98097 204640 -25717 -475554 -818714 -981452 -1000291
57604a000291L37378P97364P14913o3008p04253n27470L9382K84466L07546N02848
$$ -1000291 -662913 134451 849364 786356 82103 -445367 -405985 -121519 186027 688875
57594F88875N88846J16834n08125n16185O773L27589K51128J64937J28278q4490
$$ 688875 1277721 1394555 886430 370245 377018 704607 955735 1120672 1248950 1164460
57584A164460j92913K63391Q60315O78086j71077n71616j68551J31396j67005
$$ 1164460 971547 1234938 2095253 2773339 2602262 2030646 1862095 1993491 1826486
57575A826486k61052M21705R85736M27961o46653r02403k85091J34477j794k0925
$$ 1826486 1565434 1987139 2972875 3400836 2754183 1851780 1566689 1701166 1699372 1678447
57565A678447K79961J84274n23608q84707j94750P77044Q19283m8179p56839o91414
$$ 1678447 1958408 2142682 1619074 734367 539617 1316661 2135944 2087765 1330926 639512
57555F39512k09168J71517L36849L09677O4912k34921k91079r0960R6530K00451
$$ 639512 430344 601861 938710 1248387 1313299 1078378 787299 696339 792869 993320
57545I93320L98835O27117N28584O9128k65417j36885J89070L24012K94367K79262
$$ 993320 1392155 2019272 2547856 2616984 2351567 2214682 2403752 2727764 3022131 3301393
57535C301393J96216m6910j81878J08772O90787J124910J136915P00682m6447
$$ 3301393 3497609 3450699 3268821 3377593 4068380 5193290 6330205 7030887 6984440
57526F984440o85152o88562r1065M00741L63564K44683M89235O71666K62960k72210
$$ 6984440 6299288 5610726 5519661 5920402 6283966 6528649 7017884 7689550 7952510 7680300
57516G680300j43180L81415M01921p645J07565Q75238J305791R57862O03703Q02169
$$ 7680300 7537120 7918535 8320456 8312811 8420376 9295614 10601405 11559267 12162970 12965139
57506A2965139J049253R43740J025095J702005K397584K590016K772845L556417
$$ 12965139 14014392 14958132 15983227 17685232 20082816 22672832 25445677 29002094
57498B9002094M712640N918405P470775R385152J0881741J1865499J3820930J7969431
$$ 29002094 33714734 39633139 47103914 56489066 67370807 79236306 93057236 111026667
57490A11026667K3624048K9618927L5618527L9665270L6110411K0164953m723750
$$ 111026667 134650715 164269642 199888169 239553439 275663850 295828803 291105053
57483B91105053k7322849l8290203l7710437l2127528k6656669k2098211j7780244
$$ 291105053 263782204 225492001 187781564 155654036 128997367 106899156 89118912
57476H9118912j3909429j0942999q745616p064919n887034n081416m386880l779621
$$ 89118912 75209483 64266484 55520868 48455949 42568915 37487499 33100619 29320998
57468B9320998l320568k816771k160150j705017j741107j921560j791336j514658
$$ 29320998 26000430 23183659 21023509 19318492 17577385 15655825 13864489 12349831
57460A2349831j465665j478309j163794o38843k98866j83598j42134k34685l97177
$$ 12349831 10884166 9405857 8242063 7603220 7304354 7120756 6978622 6743937 6346760
57451F346760k05429L76397N90204J399n97983l47231K23270K9965p54888j029954
$$ 6346760 6141331 6517728 7107932 7109331 6511348 6164117 6387387 6417352 5662464 4632510
57441D632510n92052k62552l18648k05717J41953R7819l39461l89746L5855O1950
$$ 4632510 4040458 3777906 3459258 3253541 3395494 3493313 3153852 2764106 2799961 2861911
57431B861911n15554o92910M326N62009J15873o07864n21485R7245K44207j35524
$$ 2861911 2346357 1653447 1657773 2219782 2335655 1727791 1206306 1303551 1547758 1412234
57421A412234k77127J6769K10332Q4871L4975L06667O04791N30925M1454m93676
$$ 1412234 1135107 1151876 1362208 1447079 1482054 1788721 2393512 2924437 2965891 2472215
57411B472215n31691Q4940P14480N26813l40390q62144n59899p2695L6803J33879
$$ 2472215 1940524 2025464 2739944 3266757 2926367 2064223 1504324 1431629 1468432 1602311
57401A602311N85219Q51912L10960o70407j253771j171024o09919K59664R63703
$$ 1602311 2187530 3039442 3350402 2679995 1426224 255200 -354719 -95055 868648
57392H68648P29388l43528r19104j93402P92379P10278l0925j77687K00621N7387
$$ 868648 1598036 1254508 335404 142002 934381 1644659 1613734 1436047 1636668 1694055
57382A694055n90952o93157n1967M69654N86528Q02583R42361J90355j132283
$$ 1694055 1103103 409946 357979 827633 1414161 2216744 3159105 3349460 2217177
57373B217177j525611n46447M61287M56081L0542l2926o8220m83949p12503k45277
$$ 2217177 691566 145119 606406 1062487 1093029 1060103 991883 507934 -204569 -449846
57363d49846L12543K26438j84622k42225J3852K40592M65087N90148J24114p88081
$$ -449846 -137303 89135 -95487 -337712 -323860 -83268 381819 971967 1096081 308000
57353C08000j009232j0916J072708R86548Q3111n30435o74578p34930m85127L21678
$$ 308000 -701232 -712148 360560 1347108 1430219 899784 225206 -509724 -994851 -673173
57343f73173Q73816L41588m91498k30133Q05459R41703j82296j025234n69011
$$ -673173 200643 542231 50733 -179400 626059 1567762 1385466 360232 -208779
57334b08779K37165J57396m67941m87328K40138P65757M57462k82421o77790m81550
$$ -208779 28386 185782 -282159 -769487 -529349 236408 693870 411449 -266341 -747891
57324g47891q3477R3346P4445Q6686N4493k09250m06844n1250N53229N17604j41723
$$ -747891 -831368 -738022 -663577 -576891 -522398 -731648 -1138492 -1189742 -636513 -118909 -260632
57313b60632k78653N29280J061147L23876p80310r14843m24149m43674p45264
$$ -260632 -539285 -10005 1051142 1375018 594708 -320135 -744284 -1187958 -1933222
57304a933222l01172N74188O61989J42664L34804J119277Q75567n98155j360121
$$ -1933222 -2234394 -1660206 -998217 -855553 -520749 598528 1474095 875940 -484181
57295d84181l78513P70903M85782l95458k40567O79701Q53033k1127q44368q81848
$$ -484181 -862694 -91791 393991 -1467 -242034 437667 1290700 1269573 425205 -456643
57285d56643m07391P6368K62087K0029l04946o9907O07104P32881L2241l62006
$$ -456643 -864034 -787666 -525579 -505550 -810496 -880403 -273299 459582 491823 129817
57275A29817K82973R07552L04558q51023j105282n38721l06837m71239j21109
$$ 129817 412790 1320342 1624900 773877 -331405 -870126 -1176963 -1648202 -1769311
57266a769311O34677O87432j0855k07280N13221R97499M49110l84442n92760l80193
$$ -1769311 -1134634 -447202 -458057 -665337 -152116 845383 1294493 910051 317291 -62902
57256f2902k47917m1978M01041O26921L54707O5368J15185R4821k49887l59273
$$ -62902 -310819 -352797 48244 675165 1029872 1095240 1210425 1305246 1055359 696086
57246F96086P1727K69260l67997r87797m67084O93849J004153K27327l89818j49957
$$ 696086 767813 1037073 669076 -318721 -785805 -91956 912197 1139524 749706 599749
57236E99749J91686q7430m95184k98694K13515K69460j30773l16835m7595K15622
$$ 599749 791435 704005 208821 -89873 123642 393102 262329 -54506 -102101 113521
57226A13521R1880k33438l90173k98540j43206j02455j78296j88982K1656K89243
$$ 113521 205401 -28037 -418210 -716750 -859956 -962411 -1140707 -1329689 -1308033 -1018790
57216a018790K43770j08351k16281K51374P69701O23201N455k49152K0318J05266
$$ -1018790 -775020 -883371 -1099652 -848278 -78577 544624 550079 300927 321245 426511
57206D26511k73377m04934J71758P31942M44795k93346n45428l31955l57989n84391
$$ 426511 153134 -251800 -80042 651900 1096695 803349 257921 -74034 -432023 -1016414
57196a016414l02073M39416P37036L42610O1095L02223M18851J5736k28813K02655
$$ -1016414 -1318487 -879071 -142035 200575 261670 563893 982744 998480 769667 972322
57186I72322O24672K56299m53623n89406j88879Q8385J26924J64829l0543o77191
$$ 972322 1596994 1853293 1399670 810264 621385 709770 836694 1001523 970980 293789
57176B93789j094633n16848M77529N98096k05525o92761k77619K55299K23749
$$ 293789 -800844 -1317692 -840163 -242067 -447592 -1140353 -1417972 -1162673 -938924
57167i38924R806J00024K35549Q8167r3767o7881m7524o7573K89958R67947J062122
$$ -938924 -929118 -829094 -593545 -505378 -599145 -667026 -714550 -782123 -492165 475782 1537904
57156A537904J23726q75480p60587J73963O25371J01934o12779o91440j56264
$$ 1537904 1661630 786150 25563 199526 824897 926831 314052 -377388 -533652
57147e33652M80269Q03584O27580N4475m79262n84191l78694k56555k70681j47694
$$ -533652 -53383 750201 1377781 1432256 952994 368803 -9891 -266446 -537127 -684821
57137f84821J39230K85516J94660J37965K23417J41352k75655n87119k75184L90021
$$ -684821 -545591 -260075 -65415 72550 295967 437319 161664 -425455 -700639 -310618
57127c10618N10133k53420j035563p27430N42900J409312R28234k23672o46038
$$ -310618 199515 -53905 -1089468 -1816898 -1273998 135314 1063548 839876 193838
57118A93838m030O97046N78245m5256l22998o8079J72058j615l59519m56564k07638
$$ 193838 189808 886854 1465099 1419843 1096845 1028766 1200824 1199209 839690 383126 175488
57107A75488Q2752J34892j2269j46563j99579k53670k85763j80280l0662n9116
$$ 175488 258240 393132 380863 234300 34721 -218949 -504712 -684992 -715654 -774770
57097g74770j21384K05201P69990P24735j98292r38802n09736L93919L50527n49482
$$ -774770 -896154 -690953 79037 803772 605480 -333322 -843058 -449139 -98612 -648094
57087f48094q44553j00728M10029r7505n89354Q51R35218Q68201j6436m21586
$$ -648094 -1492647 -1593375 -1183346 -1280851 -1870205 -1869354 -934136 -65935 -82371 -503957
57077e03957L5139N13954M26975M2617l18586o53789p75167l15000N95815J281564
$$ -503957 -468818 45136 472111 514728 196142 -457647 -1232814 -1547814 -951999 329565
57067C29565J260529O11950k68563q50884p01323o0034J82416l15552o66340n3374
$$ 329565 1590094 2202044 1933481 1082597 381274 321240 503656 188104 -478236 -531610
57057e31610Q49964Q24591J5677l85478j04289J1020k87736k59390K41969L33780
$$ -531610 318354 1142945 1158622 773144 668855 679875 392139 132749 374718 708498
57047G08498k18219l64872L99969R30493J92856r78911j111315k54208L58738
$$ 708498 490279 125407 525376 1455869 1648725 669814 -441501 -695709 -336971
57038c36971K64886J16769L22496M95811K87244j02851l43795l33989j41252J9646
$$ -336971 -72085 44684 367180 862991 1150235 1047384 703589 369600 228348 247994
57028B47994r1240l33034k54156J26836J89560k08624k92147L10652O64337l1117
$$ 247994 156754 -176280 -430436 -303600 -114040 -322664 -614811 -304159 360178 329061
57018C29061q74626m93273P03126J070547L01200k50961P8688L28856j77789o28031
$$ 329061 -545565 -1038838 -335712 734835 1036035 785074 863762 1192618 1014829 386798
57008C86798k74486K04150j6319m09867j21657M06067J83423n52334p00070j14208
$$ 386798 112312 316462 300143 -109724 -231381 174686 358109 -194225 -894295 -1008503
56998a008503K86750J39680O7413L60976M55778Q9961r0665L56995Q32911O32800
$$ -1008503 -721753 -582073 -514660 -153684 302094 392055 301390 658385 1491296 2124096
56988B124096M6022k17287j73648l24285n94551m13210J88856M17555j01441o68510
$$ 2124096 2170118 1952831 1779183 1454898 860347 447137 635993 1053548 952107 283597
56978B83597m71599K82042P24880N19461R4155j88237m26671o16225l51360M61495
$$ 283597 -188002 94040 818920 1338381 1432536 1244299 817628 201403 -149957 311538
56968C11538J067080O84332l18565p51663j57136O10096O11692N9713j61262J77258
$$ 311538 1378618 2062950 1744385 992722 835586 1445682 2057374 2117087 1955825 2133083
56958B133083M39163J76484k26542k05203R8176L5880n36241q98328l86109N65458
$$ 2133083 2572246 2748730 2522188 2316985 2415161 2451041 1914800 1016472 630363 1195821
56948A195821P91945q6939j039167r20447N111N19159K09475j24833N8629J72437
$$ 1195821 1987766 1900827 861660 -58787 -53676 465483 674958 550125 608754 781191
56938G81191l54504q89017m38743P65638J452290R23226k71197j178619j274234
$$ 781191 426687 -462330 -901073 -135435 1316855 2240081 1968884 790265 -483969
56929d83969n53226M64402Q67678K46779n70543m66090L36997N78005m5953m19894
$$ -483969 -1037195 -572793 294885 541664 -28879 -494969 -157972 420033 374080 -45814
56919d5814O8123M80755J9361m88596k1759P13795L83963n61724m24293Q77652
$$ -45814 22309 503064 522425 33829 12070 725865 1109828 548104 123811 1001463
56909A001463J389445R0133j433604j301469N558O43815J72701k09871J61888
$$ 1001463 2390908 2481041 1047437 -254032 -248474 395341 568042 358171 520059
56900E20059N36204K02337m04913n49273k64246j1167J03849J80718N5602l87998
$$ 520059 1056263 1258600 853687 304414 40168 29001 132850 313568 369170 -18828
56890a8828p20061m16549K89552O08838K84017q6190R749K52142N9900m65377
$$ -18828 -738889 -1155438 -865886 -257048 26969 -59221 -49472 202670 262570 -202807
56880b02807o68530k82801K34713L51808P3323j98908j31638L10498Q39900R71151
$$ -202807 -871337 -1154138 -919425 -567617 -494294 -693202 -824840 -514342 325558 1296709
56870A296709M59648k94707o08996l83718j90633l28217l44182J14502N48431
$$ 1296709 1756357 1461650 852654 468936 278303 -49914 -394096 -279594 268837
56861B68837L43683j90021l35023j99221m34125q41380m54322P34760J325951
$$ 268837 612520 422499 87476 -111745 -545870 -1387250 -1841572 -1106812 219139
56852B19139M40084q90706j147833l91996J43593K7240M302N07221R14302N62046
$$ 219139 659223 -231483 -1379316 -1771312 -1627719 -1600479 -1596177 -1088956 -174654 387392
56842C87392k96425q84069p38591M7970R66454J307511O91264m25837j112674
$$ 387392 90967 -793102 -1531693 -1483723 -517269 790242 1481506 1055669 -57005
56833e7005r47447l48983O2146O1016j84991k92528J07121Q52877J111608L74904
$$ -57005 -1004452 -1353435 -1291289 -1230273 -1415264 -1707792 -1600671 -747794 363814 738718
56823G38718n49914m13037N93526Q80196k76330j577641j472060j84743Q64240
$$ 738718 188804 -224233 369293 1249489 973159 -604482 -2076542 -2261285 -1397045
56814a397045R61637M66127j76574p02723o28330K94978J258693J065626k26654
$$ -1397045 -435408 30719 -145855 -848578 -1476908 -1181930 76763 1142389 915735
56805I15735j222065r84615j06048L61485K74160J62163J99146R7206j86768k62697
$$ 915735 -306330 -1290945 -1396993 -1035508 -761348 -599185 -400039 -302833 -489601 -752298
56795g52298Q2440M65057L41186k34691n59896j71711M18541L28654l70091n97365
$$ -752298 -669858 -204801 136385 -98306 -658202 -829913 -411372 -82718 -452809 -1050174
56785a050174J52738R01559N59086l82878n47700K35626P32087K50202m19471
$$ -1050174 -897436 4123 563209 180331 -367369 -131743 600344 850546 431075
56776D31075m29565j48241k85244n89776l48645L09362N55862J37334l14945k83369
$$ 431075 1510 -146731 -431975 -1021751 -1370396 -1061034 -505172 -367838 -682783 -966152
56766i66152n95J00523P7151K94111P71449J032922O76910l2618l57358L7600
$$ -966152 -966747 -866224 -789073 -494962 276487 1309409 1986319 1953701 1596343 1633943
56756A633943N99827N27907k55043j081310j363277j053393l97146K92604O57147
$$ 1633943 2233770 2761677 2506634 1425324 62047 -991346 -1388492 -1095888 -438741
56747d38741N81489M35972N47570N74058N2653o12761o26413j93749k89201q81742
$$ -438741 142748 578720 1126290 1700348 1753001 1140240 513827 320078 30877 -850865
56737h50865p49331M25252J198520N40241m33633j94578P82914R04573L8508n08985
$$ -850865 -1600196 -1174944 23576 563817 130184 -64394 718520 1623093 1661601 1152616
56727A152616k70930j36695n41586p39594k36148L85296N23003L44282J01256
$$ 1152616 881686 744991 203405 -536189 -772337 -387041 135962 480244 581500
56718E81500l20984p61498o65337n2611L03406R3948m4620K87757N60583L56800
$$ 581500 260516 -500982 -1166319 -1218930 -915524 -821576 -866196 -578439 -17856 338944
56708C38944J48690L39756M37709j414m29524k41959O9024k31125o85562k93936
$$ 338944 487634 827390 1265099 1263685 834161 592202 661226 430101 -255461 -549397
56698e49397P07575R99400J53987p16284o03186Q8916L93003J72329j8239J1465
$$ -549397 158178 1157578 1311565 595281 -7905 81011 474014 646343 628104 639569
56688F39569o2062k95972k64466J91801N43281L00310j84826k01664J88817K16478
$$ 639569 577507 281535 17069 208870 752151 1052461 867635 665971 854788 1071266
56678A071266l08998n87953j38484K90915j13123q12542p12538O4809M24694J16131
$$ 1071266 762268 174315 35831 326746 213623 -598919 -1311457 -1246648 -821954 -705823
56668g05823l9871K21311J87974k96463l39224L42966O60039o4143p93587l86452
$$ -705823 -745694 -524383 -336409 -632872 -972096 -629130 30909 -33234 -826821 -1213273
56658a213273N65561P81862L07880P9756J29019k54293r12240q84306m7706O25364
$$ -1213273 -647712 134150 442030 521786 650805 396512 -515728 -1400034 -1447740 -822376
56648h22376N54065J65707p9918k33253k90116o9651J89420K7702l19269j36668
$$ -822376 -268311 -102604 -182522 -415775 -705891 -775542 -586122 -558420 -877689 -1014357
56638a014357N06246O92345R2053m95659l71067J68136N14755N27346K59783k87462
$$ -1014357 -508111 184234 276287 -219372 -590439 -422303 92452 619798 879581 592119
56628E92119p55797n41144K51759O96665L26875j93665j56914J60744J38924j65942
$$ 592119 -163678 -704822 -453063 243602 570477 376812 219898 380642 519566 353624
56618C53624k99481k10021j41354j16185o6094j11460k53362j92233J23640K53596
$$ 353624 54143 -155878 -297232 -413417 -479511 -590971 -844333 -1036566 -912926 -659330
56608f59330K0160o1347L28802O09154K20914l01892j15842M78953M38764l33352
$$ -659330 -639170 -700517 -371715 237439 458353 156461 40619 519572 958336 624984
56598F24984q13238m72131L965l8581k13828P1659N30011N04757J02061k6753
$$ 624984 -188254 -660385 -656420 -695001 -908829 -837170 -307159 197598 299659 272906
56588B72906J69341O8733m66221o75854o4227O46572M09343n95127j089097m21594
$$ 272906 442247 510980 44759 -631095 -695322 -48750 360593 -234534 -1323631 -1745225
56578a745225N99443R09544N46432K50894K31461J00090k05775k70945n940J23139
$$ -1745225 -1145782 -236238 310194 561088 792549 892639 686864 415919 409979 533118
56568E33118j52205n04402n64243l70588r9460J56608J99345j24582m23273o2677
$$ 533118 380913 -123489 -687732 -1058320 -1157780 -1001172 -801827 -926409 -1349682 -1412359
56558a412359P73973J054003L36285m91521n04504n8283j2321k47587k2011N28808
$$ -1412359 -638386 415617 751902 260381 -244123 -302406 -314727 -562314 -584325 -55517
56548e5517M61067l51638q24018k92187M41451L63523j94167j51768N56500Q42618
$$ -55517 405550 53912 -770106 -1062293 -620842 -257319 -451486 -603254 -46754 795864
56538G95864J64622n58935k49359P23695J020434K36515n28614k67402N07623
$$ 795864 960486 401551 152192 875887 1896321 2132836 1604222 1336820 1844443
56529A844443N60919k74109r23226o33623Q7227L34699k1271m27604m82004k37098
$$ 1844443 2405362 2131253 1208027 574404 661631 996330 975059 547455 65451 -171647
56519a71647P9861K69324K15281J3660n7814J26813L68520M10202J95170j93155
$$ -171647 -91786 177538 392819 406479 348665 475478 843998 1254200 1449370 1256215
56509A256215n74682o15046j23079M83316M92393j03703m59154o9234M41316K57597
$$ 1256215 681533 66487 -56592 426724 919117 815414 356260 287026 728342 985939
56499I85939l78040n71550j46146J85234k4396l70744l46773r0923o1366l05435
$$ 985939 607899 36349 -109797 75437 51041 -319703 -666476 -757399 -818765 -1124200
56489a124200l97908k7369N56986P68157L77091j25076j02978L31637M38286l6499
$$ -1124200 -1522108 -1549477 -992491 -224334 152757 27681 -75297 256340 694626 658127
56479F58127m32126k10048J65974j2821n21915n61759l5044L70681K95963P9562
$$ 658127 226001 15953 181927 169106 -352809 -914568 -949612 -578931 -282968 -203406
56469b03406k0117j46178k32763R3768P01275Q31097K27874l35771k13432J16147
$$ -203406 -223523 -369701 -602464 -508696 192579 1023676 1251550 915779 702347 818494
56459H18494q6739n44461m52922J15171L14595o2672l05618n3578J39504j20475
$$ 818494 731755 187294 -265628 -150457 164138 101466 -204152 -257730 -118226 -238701
56449b38701l39078o7777K19233l1608l58990k550O99085P31046O8186k61100
$$ -238701 -577779 -645556 -426323 -457931 -816921 -819471 -120386 610660 678846 417746
56439D17746J06933K95935k47272p57033m39570J96990K30278j82239k19014K00978
$$ 417746 524679 820614 573342 -183691 -623261 -426271 -195993 -378232 -597246 -396268
56429c96268M56978L25266O9145k61538o45877n35137M14190J309561R73349j88349
$$ -396268 60710 385976 455121 193583 -452294 -987431 -573241 736320 1709669 1521320
56419A521320o16401N1164N10081l8253p31022o53437k37428k22874l71415j58271
$$ 1521320 904919 956083 1466164 1427911 696889 43452 -193976 -416850 -788265 -946536
56409i46536J68924J45868l8180l9770l8128j98608j83653J46176L43065K91382
$$ -946536 -777612 -631744 -669924 -709694 -747822 -946430 -1130083 -983907 -640842 -349460
56399c49460N32723R87659N69894r27225j824459q06598Q98601J183270N7249
$$ -349460 183263 1170922 1740816 813591 -1010868 -1817466 -918865 264405 321654
56390C21654p20976l79932K69288N68404N97346K65228n13895r29849k17481P18786
$$ 321654 -399322 -779254 -509966 58438 655784 921012 407117 -522732 -740213 -21427
56380b1427L92309p25769p52602M83020J061748J34507p69273m23896K11621J353
$$ -21427 370882 -354887 -1107489 -624469 437279 571786 -197487 -621383 -409762 -408409
56370d08409l48037J92705R26675O13021l45918n85829K7350M36771K06947r3625
$$ -408409 -756446 -563741 362934 975955 630037 44208 71558 508329 715276 621651
56360F21651r9151l8322j8801R5020J67252k5084k17690k2241K92793J43561l55375
$$ 621651 522500 484178 465377 560397 727649 702565 484875 462634 755427 898988 543613
56349E43613m74486K3117N30823M78533L8803k35455j27577J06852J70149Q4825
$$ 543613 69127 92244 623067 1101600 1140403 904948 777371 884223 1054372 1139197
56339A139197L8506k8689l51943p50091o15442J01967M81448p4954p00838k78172
$$ 1139197 1177703 1149014 797071 46980 -568462 -466495 14953 -60001 -760839 -1039011
56329a039011O46353N61696n27601r44031N5293J113452Q52455k85827j056410
$$ -1039011 -392658 169038 -358563 -1302594 -1247301 -133849 718606 432779 -623631
56320f23631j033034m21243N59300J282273Q88767k90409p09768J11209O79630
$$ -623631 -1656665 -2077908 -1518608 -236335 652432 362023 -347745 -236536 443094
56311D43094j7819p21526p3480R14095N38765o24615p13089K33080M87840k88980
$$ 443094 425275 -296251 -369731 544364 1083129 458514 -254575 -21495 466345 177365
56301A77365o36408k1799L70087J0469k8816P23078J000731l4088j173019j009298
$$ 177365 -459043 -480842 -110755 -100286 -129102 593976 1594707 1560619 387600 -621698
56291f21698j05665P3211n38456p74682j66593N64658P42959M63809J12638j00101
$$ -621698 -727363 -654152 -1192608 -1967290 -2133883 -1569225 -826266 -362457 -249819 -349920
56281c49920o7546K36156O11054P24779L85455l16964r89955j088349m19371M51046
$$ -349920 -417466 -181310 429744 1154523 1539978 1223014 233059 -855290 -1274661 -823615
56271h23615O64158M1771p31946r45697n09623K44995R41064J213788Q59783J60110
$$ -823615 -159457 -117686 -849632 -1795329 -2304952 -2059957 -1118893 94895 954678 1114788
56261A114788k68300j43783J83285K15740j17096m49860l98467K4111L48819J54553
$$ 1114788 846488 702705 885990 1101730 984634 534774 136307 160418 509237 663790
56251F63790l22807m25634m0270J93031p7157l00437K2422M10137J71502m09809
$$ 663790 340983 -84651 -124921 68110 -9047 -309484 -287062 123075 294577 -115232
56241a15232n23445r7860K44166K06118k1095l13765n36289k93068M01513P01521
$$ -115232 -638677 -736537 -492371 -286253 -307348 -621113 -1157402 -1450470 -1048957 -347436
56231c47436J40115l52545J57660Q71583M75449m62285k61568R20811J107075
$$ -347436 -207321 -559866 -402206 469377 944826 482541 220973 1141784 2248859
56222B248859k82196j418498r44697J70320N77583M51756L29611j59367j044802
$$ 2248859 1966663 548165 -396532 -226212 351371 803127 1132738 973371 -71431
56213g1431j127133J04886J088784M13955q08563o46198O21492J182140O61799
$$ -71431 -1198564 -1093678 -4894 409061 -399502 -1045700 -424208 757932 1419731
56204A419731K91877M78636L28027l76124o71648k18323Q4876k66636o00529m21708
$$ 1419731 1711608 2190244 2518271 2142147 1470499 1252176 1337052 1070416 469887 48179
56194D8179k16907l36366k82697K40005O46707N27966M07127O98940Q09844J40842
$$ 48179 -168728 -505094 -787791 -547786 98921 626887 1034014 1732954 2542798 2683640
56184B683640p44428q88043l39602J26233K71541M19193N05968J44874m32911
$$ 2683640 1939212 1051169 711567 837800 1109341 1528534 2034502 2179376 1746465
56175A746465n25038j73444k09217p55459p57556L09338J249186P50533n15824
$$ 1746465 1221427 1047983 838766 83307 -674249 -364911 884275 1634808 1118984
56166A118984p95315Q6370N67700l8115n24379j5841M92254k2297p04661l21997
$$ 1118984 323669 410039 977739 939624 415245 399404 891658 869361 164700 -157297
56156a57297N13818M62201j13890O3149N75650j07900j599677j707052M0992J475487
$$ -157297 356521 818722 704832 767981 1343631 1235731 -363946 -2070998 -2030006 -554519
56146e54519J163453L10255K18870K11800m35838p03057J70273Q10231m7846j110935
$$ -554519 608934 919189 1138059 1349859 914021 210964 381237 1191468 1143622 32687
56136C2687o24912N40641M49424m61511l15647O56320N43570o03991o94672O18519
$$ 32687 -592225 -51584 397840 -63671 -379318 277002 820572 216581 -478091 140428
56126A40428J119339k30047j506498r90385K72589N37356J762k15878j29118k61770
$$ 140428 1259767 1029720 -476778 -1467163 -1194574 -657218 -655456 -871334 -1000452 -1262222
56116a262222k34298M08028R12930M00164m96799m91216L81939R55897P29934
$$ -1262222 -1496520 -1088492 -175562 224602 -272197 -763413 -381474 574423 1304357
56107A304357K85429J02024l755k74087o00229p44691n45583m0336L63777K14719
$$ 1304357 1589786 1691810 1688055 1413968 813739 69048 -476535 -516871 -153094 61625
56097F1625k54463k72192L01309O30254J52316n35301n79023j8610N19709O72704
$$ 61625 -192838 -465030 -163721 466533 618849 83548 -495475 -514085 5624 678328
56087F78328L63398l67698j010749p75581K57688R03804M46864l25896m09659
$$ 678328 1041726 674028 -336721 -1112302 -854614 49190 496054 170158 -239501
56078b39501m7868M1828P4116N91969J065077N02372p95032j449655r62116k23828
$$ -239501 -287369 -245541 -171425 420544 1485621 1987993 1192961 -256694 -1218810 -1442638
56068a442638L6353J42184M88889P10110L71692k09673m02676j12649K28951L00446
$$ -1442638 -1406285 -1264101 -775212 -65102 306590 96917 -305759 -418408 -189457 110989
56058A10989K21329L02023N48420M91114k28857j083791j032539J5796P77842
$$ 110989 332318 634341 1182761 1673875 1445018 361227 -671312 -655516 122326
56049A22326K76232o55129m77731Q13556J660647J099117j33656q71112r48788
$$ 122326 398558 -256571 -734302 79254 1739901 2839018 2705362 1834250 885462
56040H85462r04368r35786p41591j13804O97258J142941Q47834N9125m93648m20363
$$ 885462 -18906 -954692 -1696283 -1810087 -1112829 30112 877946 937071 443423 23060
56030B3060j20744q5936j23817J52574M33275J35349m64842m71749K16974O83613
$$ 23060 -97684 -183620 -307437 -154863 278412 413761 -51081 -522830 -305856 377757
56020C77757L85699j30307k61324k26565l96328n05006k12485J17419m6704m38862
$$ 377757 763456 633149 371825 145260 -251068 -756074 -968559 -851140 -897844 -1336706
56010a336706l11163M22023J008714Q60136K26787k42308k58922m6669O1998o673
$$ -1336706 -1647869 -1225846 -217132 643004 869791 627483 368561 321892 383890 377217
56000C77217q3008l6286N4118L6281j19049l49356n85027o65316l69516K22296
$$ 377217 294209 257923 312041 348322 229273 -120083 -705110 -1370426 -1739942 -1517646
55990a517646O03316M27475N9180J02165M91247N75924J09778l95720m40543j63943
$$ -1517646 -914330 -486855 -427675 -325510 165737 741661 851439 455719 15176 -148767
55980a48767J8188P698Q535J94073N65254R08200Q20385Q1731r08520j367571
$$ -148767 -130579 -122881 -114346 79727 644981 1553181 2373566 2455297 1546777 179206
55970A79206r16462P2287Q86662R91450L06859o09342q41460j37782N20718Q8653
$$ 179206 -737256 -664969 221693 1213143 1520002 910660 69200 -68582 452136 540789
55960E40789r55266j141151j55124O94686M84580p1268m5703J84888j14700n07269
$$ 540789 -414477 -1555628 -1710752 -1016066 -531486 -602754 -648457 -463569 -578269 -1085538
55950a085538j09001P06777P17375k15561q90732n15571L63762Q33579N91177
$$ -1085538 -1194539 -487762 229613 14052 -876680 -1392251 -1028489 -194910 396267
55941C96267j75043r90640j069618l5425J170881J136401j0506n92727J38296
$$ 396267 221224 -769416 -1839034 -1874459 -703578 432823 422317 -170410 -32114
55932c2114Q05397Q5355j097468r33018M74336J273886N95954m66456p68805n43030
$$ -32114 773283 858638 -238830 -1171848 -697512 576374 1172328 705872 -62933 -605963
55922f05963l95488j59425M01486P01186J73065n89177n64074J52417N22324J52645
$$ -605963 -1001451 -1160876 -759390 -58204 114861 -474316 -1038390 -885973 -363649 -211004
55912b11004k57425j41737J46843R0313j45877p0308L47183O63755N44087J05699
$$ -211004 -468429 -610166 -463323 -373010 -518887 -589195 -242012 421743 965830 1071529
55902A071529k06309m7705L64703L60278k91057q28987m37849M48842O18989j39223
$$ 1071529 865220 817515 1182218 1542496 1251439 422452 -15397 433445 1052434 913211
55892I13211p40095n27280j70775k81302k86544L59689Q43340J50935j093743
$$ 913211 173116 -354164 -524939 -806241 -1092785 -733096 110244 261179 -832564
55883h32564j364466m65397L61782M21242K55925L02990K46794P74O3022M73695
$$ -832564 -2197030 -2662427 -2300645 -1879403 -1623478 -1320488 -1073694 -1072920 -1009898 -536203
55873e36203N57941J43292q1845J21492O2355m70346n65338K36291R17030N46503
$$ -536203 21738 165030 83185 204677 267032 -203314 -768652 -532361 384669 931172
55863I31172k10325l09901n8145k62128n22810J4378P99565N52272m45745n69617
$$ 931172 720847 410946 352801 90673 -432137 -417759 381806 934078 488333 -81284
55853h1284N03361J164593M10695o20675n24829K88428N01171o9025n30917m63728
$$ -81284 422077 1586670 1997365 1376690 851861 1140289 1641460 1572435 1041518 577790
55843E77790k57846j60159K1466K80438K91889M1482o3744J14604J66987j94917
$$ 577790 319944 159785 181251 461689 753578 795060 731316 845920 1012907 817990
55833H17990n82955m20373J82142M48110n1618p12228n87288K94558Q02572J56933
$$ 817990 235035 -185338 -3196 444914 393296 -318932 -906220 -611662 190910 347843
55823C47843r26541j080253n2349J017978J094701L64578l15587m75385j79933
$$ 347843 -578698 -1658951 -1711300 -693322 401379 765957 450370 -25015 -204948
55814b04948L64398Q49542Q35658K24354l84571l12935K53941M27018j93873r33270
$$ -204948 159450 1008992 1844650 2069004 1684433 1371498 1625439 2052457 1858584 925314
55804I25314r04636j48034M72421L83711r3963l24614j52947J23991L01007M07043
$$ 925314 20678 -127356 345065 728776 634813 310199 157252 281243 582250 989293
55794I89293M35842L31541K00761J49033m6837o16227j155304r59448j46275L05970
$$ 989293 1425135 1756676 1957437 2106470 2059633 1443406 288102 -671346 -817621 -511651
55784e11651P85k19360L00954P72236J72872q58730p17552O82559J539472O64985
$$ -511651 -510866 -730226 -429272 342964 515836 -342894 -1060446 -377887 1161585 1826570
55774A826570q68526j309373n31434J77617P0678l38790l75345j19107P678j1339
$$ 1826570 958044 -351329 -882763 -705146 -634468 -973258 -1348603 -1467710 -1460032 -1471371
55764a471371J43137N14816O95327L50492k63702n46118k94698Q8016K32511K62441
$$ -1471371 -1328234 -813418 -118091 232401 -31301 -577419 -872117 -784101 -551590 -289149
55754b89149L40240J82288m33119r76494p05526J77550O38054J94558m59758m44223
$$ -289149 51091 233379 -199740 -1176234 -1881760 -1704210 -1066156 -871598 -1331356 -1775579
55744a775579K49523R49282J108333O66754l3845m92169m77700k80933k44974
$$ -1775579 -1526056 -576774 531559 1198313 1164468 672299 194599 -86334 -331308
55735c31308j69297L22215R42392R65212L09368l35272n52613n91494n82817k68461
$$ -331308 -500605 -178390 764002 1729214 2038582 1703310 1150697 559203 -23614 -292075
55725b92075K00728J50615m45337n90166K75208J222198J042427q7494r49668
$$ -292075 -91347 59268 -386069 -976235 -701027 521171 1563598 1476104 526436
55716E26436q61924j84937M04822N09741J55060j79133R667M67848L81056l37789
$$ 526436 -335488 -520425 -115603 394138 549198 370065 379732 847580 1228636 890847
55706H90847p38332k85133L06115L54788K97086N45793L80808o86575j428719
$$ 890847 152515 -132618 173497 528285 825371 1371164 1751972 1065397 -363322
55697c63322n00390J148395J409813K47892l25913M12647Q35007j20622j099243
$$ -363322 -863712 284683 1694496 1942388 1616475 2029122 2864129 2743507 1644264
55688A644264o44014L63875K25262p88057r79026K1906Q12330M78894k25942l31853
$$ 1644264 1000250 1364125 1589387 801330 -177696 -155790 656540 1135434 909492 577639
55678E77639p7262k11986o30605n36786K54405Q97459N84616l92437j006499p38914
$$ 577639 500377 288391 -342214 -879000 -624595 272864 857480 465043 -541456 -1280370
55668a280370l7992M33260M92358K47303j83296m17337P5112J032159J229375
$$ -1280370 -1318362 -885102 -392744 -145441 -328737 -746074 -670962 361197 1590572
55659A590572Q6321j135360q61231M61008R22087m5835r43893n89260K66503M00942
$$ 1590572 1676893 541533 -319698 141310 1063397 1017562 73669 -515591 -249088 151854
55649A51854n8763k26272O4555L48936M29450L19555j28350p52443q23511m8209
$$ 151854 93091 -133181 -68626 280310 709760 1029315 900965 148522 -674989 -723198
55639g23198P40514O97801J81578p181L7737k02914m28840m039O48902N01943
$$ -723198 17316 715117 896695 889514 927251 724337 295497 291458 940360 1442303
55629A442303k95140m62011L64326R48719L55343n99153n93244K72035P10854
$$ 1442303 1147163 685152 1049478 1998197 2353540 1754387 1161143 1433178 2144032
55620B144032P3340q72005r90247j30769P36509O25525l01785q46631k18805R00717
$$ 2144032 2217372 1345367 355120 224351 960860 1586385 1284600 437969 219164 1119881
55610A119881J198082M35070l60274m25032j84967l31825p05178o80265j96454
$$ 1119881 2317963 2753033 2392759 1967727 1782760 1450935 745757 65492 -130962
55601a30962K59594M49466N35478N36964K39434k65319m44701K9076P77122J079385
$$ -130962 128632 578098 1113576 1650540 1889974 1624655 1179954 1209030 1986152 3065537
55591C065537O12287k95617j016435j125665o63607k5124M15232N76695N49201
$$ 3065537 3677824 3382207 2365772 1240107 576500 551376 966608 1543303 2092504
55582B092504L33578n6512l02757k2406N40387N42227l19926j110639p70704L20673
$$ 2092504 2426082 2369570 2066813 2044407 2584794 3127021 2807095 1696456 925752 1246425
55572A246425P86775K43085k25258R9731M35397j0055n02317J0449R36400Q56628
$$ 1246425 2033200 2276285 2051027 2150758 2586155 2576100 2073783 2084232 3020632 3877260
55562C877260q7837l75071L10913N21067m29575j159751m39889P85120R01395
$$ 3877260 3789423 3414352 3725265 4246332 3816757 2657006 2217117 3002237 3903632
55553C903632L6518m59606j53431K71625M03764L43122k6030p08147r18563n8102
$$ 3903632 3940150 3480544 3327113 3598738 4002502 4345624 4319594 3611447 2692884 2634782
55543B634782R65062Q02349j98407m76397K24538N48942o4399m77913M7944N54725
$$ 2634782 3599844 4402193 4203786 3727389 3951927 4500869 4436470 3958557 4006501 4561226
55533D561226J40276m35758j11393O29374O00424j52722n70560k79755R6977R2803
$$ 4561226 4701502 4265744 4154351 4783725 5384149 5231427 4660867 4381112 4478089 4570892
55523D570892j16558k37629j13703L51072Q93982Q59136J24322l72874J58106
$$ 4570892 4454334 4216705 4103002 4454074 5348056 6207192 6331514 5958640 6116746
55514F116746J038563R59744j29331r94101q65608k11327K65527M14526K69063
$$ 6116746 7155309 8115053 7985722 6991621 6126013 5914686 6180213 6594739 6863802
55505F863802j95220o49505n39071O1170L89447R2322k59687p5004M26202O41528
$$ 6863802 6668582 6019077 5480006 5541176 5930623 6022945 5763258 5688254 6114456 6755984
55495F755984L65292j79676o67158p83230m35931j4447J7732j49913K3456L55176
$$ 6755984 7121276 6941600 6274442 5491212 5055281 5040834 5058566 4908653 4932109 5287285
55485E287285N7735q05753j032718n2348J010966R26623J42901j18284J69332
$$ 5287285 5345020 4539267 3506549 3454201 4465167 5391790 5534691 5416407 5585739
55476E585739J18664k83270k05215L12552K46451n57873r27202k91647L27601
$$ 5585739 5704403 5421133 5215918 5528470 5774921 5217048 4289846 3998199 4325800
55467D325800M9919m32009k00398K38982r619m30395P4162J055061R74712k47020
$$ 4325800 4375719 3943710 3743312 3982294 3972675 3542280 3616442 4671503 5646215 5399195
55457E399195q98660j17590P33465J88908j100598j442426n63265K78452K58193
$$ 5399195 4500535 4382945 5116410 5305318 4204720 2762294 2199029 2477481 2735674
55448B735674j27331j25900K74200O17675N98351J90201l93953p44816o01216
$$ 2735674 2608343 2482443 2756643 3374318 3972669 4162870 3768917 3024101 2422885
55439B422885j96346L7003M0284N9809J29314Q1149q212R0133K35795M8384l96921
$$ 2422885 2226539 2263542 2303826 2363635 2492949 2574098 2565886 2656019 2891814 2940198 2543277
55428B543277n97035m51011m09502n80250m03837L53573R60548P10626L0317j70290
$$ 2543277 1946242 1495231 1085729 505479 101642 455215 1415763 2126389 2156706 1986416
55418A986416J02548N5837m99265q27550m82814K8733J63136J64934M22618N95104
$$ 1986416 2088964 2144801 1645536 817986 335172 363905 527041 691975 1114593 1709697
55408A709697J32259o49911q21507j43201N90517O61627K66758k8831j22683k14880
$$ 1709697 1841956 1192045 370538 227337 817854 1479481 1746239 1717408 1594725 1379845
55398A379845k25491M3956L51867K24783k60424m57445p4255L74544L21559o3236
$$ 1379845 1154354 1198310 1550177 1774960 1514536 1057091 982836 1357380 1678939 1615703
55388A615703k39863j50844j88397m26059m32666L2573N63508N79015J2399o57903
$$ 1615703 1375840 1224996 1036599 610540 177874 210447 773955 1352970 1365369 707466
55378G07466r00655n36892J52955N96739M04780j71509m46196j13958L78942M86705
$$ 707466 -193189 -730081 -577126 19613 424393 252884 -193312 -307270 71672 558377
55368E58377L02604K87129M78781M70113J13847k65099m40569n64492o89422n05876
$$ 558377 860981 1148110 1626891 2097004 2210851 1945752 1505183 940691 251269 -254607
55358b54607J09540O80823O81353K20124k05159l63916k90964L9695M80044M48452
$$ -254607 -145067 535756 1217109 1437233 1232074 868158 577194 616889 1096933 1545385
55348A545385l51316j124378p98193L33626P93396K4109p58037m15665M28641
$$ 1545385 1194069 69691 -728502 -394876 398520 422629 -335408 -751073 -322432
55339c22432N23801r015o9451M75610O37803O6918l80462j42464J54277j51525
$$ -322432 201369 192354 122903 598513 1236316 1303234 922772 780308 934585 783060
55329G83060o71246p22383m27374l10188l35423j05941L27645N48805M58510K92064
$$ 783060 111814 -610569 -1037943 -1348131 -1683554 -1789495 -1461850 -913045 -454535 -162471
55319a62471J12714j81871m50465l83389K7131M25014M82813J78484j93135j86552
$$ -162471 -49757 -231628 -682093 -1065482 -1038351 -613337 -130524 47960 -145175 -331727
55309c31727L40637Q47012O16196j98339o29363k89061K5326l43292p60921l53327
$$ -331727 8910 855922 1472118 1273779 644416 355355 380681 37389 -723532 -1076859
55299a076859M16109L72805m60811q15214p2904R15412J178930Q08932L94676
$$ -1076859 -660750 -287945 -748756 -1563970 -1636874 -721462 457468 1266400 1661076
55290A661076J15409r5564j19190R0347K46948J42196k9014k6083J07951K57292
$$ 1661076 1776485 1680921 1561731 1652078 1899026 2041222 2012208 1986125 2094076 2351368
55280B351368L62008K00867m49712j273301j579969j209280o87291l07956K17438
$$ 2351368 2713376 2914243 2464531 1191230 -388739 -1598019 -2285310 -2593266 -2375828
55271b375828R04438J121301N84129m5038j86079k19327n76302p15069m1865P39094
$$ -2375828 -1471390 -350089 234040 189002 2923 -216404 -792706 -1507775 -1549640 -810546
55261h10546M76697m95408o38735M85981J478337J072271k19617j027788q56829
$$ -810546 -333849 -829257 -1467992 -982011 496326 1568597 1348980 321192 -535637
55252e35637k25323K93057M60292K18466k13502l47281l2092K16236l9002m05097
$$ -535637 -760960 -467903 -7611 210855 -2647 -349928 -382020 -165784 -204786 -609883
55242f09883k38342K74010L11605l28037q55870n66372K24632O30450K87239l10895
$$ -609883 -848225 -574215 -262610 -590647 -1446517 -2012889 -1788257 -1157807 -870568 -1181463
55232a181463m71172q6879K88918J46109k84947k74130L87300R66286P18802o8898
$$ -1181463 -1652635 -1739514 -1450596 -1304487 -1589434 -1863564 -1476264 -509978 208824 139926
55222A39926m82816k38628R0183O8730n9237K6441K23346L60753M65932M06418
$$ 139926 -342890 -581518 -491335 -422605 -481842 -455401 -232055 128698 594630 1001048
55212A001048r8713p60155p26603J48634P62644K44448o43657n61989L91072Q58324
$$ 1001048 902335 142180 -584423 -435789 326855 571303 -72354 -634343 -243271 615053
55202F15053K51621n63758p04670l15704Q0243L20325L37605m916m41900m18156
$$ 615053 866674 302916 -401754 -717458 -637215 -316890 20715 15799 -426101 -844257
55192h44257j355R1587l00592m25822J03881N94475M18272K609m2043M0123j86218
$$ -844257 -845612 -754025 -1054617 -1480439 -1376558 -782083 -363811 -361202 -403245 -363122 -549340
55181e49340l88618j08400K59375J13012k48672j78113J20980K4602k50200J6875
$$ -549340 -937958 -1046358 -786983 -673971 -922643 -1100756 -979776 -955174 -1205374 -1188499
55171a188499O54964P43371J40822k67420j3833K94288P2494l46643l28308J48278
$$ -1188499 -533535 209836 350658 83238 69405 363693 436187 89544 -238764 -90486
55161i0486N45981M10661j72139n52673j32952P22605Q61862p2756q73901m02804
$$ -90486 455495 866156 694017 141344 8392 730997 1592859 1520103 646202 243398
55151B43398O38219P01388l07546j061223q85959l76276Q17M30671P47587L91103
$$ 243398 881617 1583005 1275459 214236 -671723 -1047999 -1047182 -616511 131076 522179
55141E22179l20012k92428N45383R42583L20169l48036k87595j34207n41532r02343
$$ 522179 202167 -90261 455122 1397705 1717874 1369838 1082243 948036 406504 -495839
55131d95839n01447J67389L17202J42871J30852J0520n00911p50551j28425P10839
$$ -495839 -997286 -829897 -512695 -369824 -238972 -228452 -729363 -1479914 -1608339 -897500
55121h97500P80666K99346J22501K16591m3960m97775m27904N7204J23361l62265
$$ -897500 -116834 182512 305013 521604 477644 -20131 -448035 -390831 -267470 -629735
55111f29735o26270k77441J66942J82353j12079l34077k80827L3805L23352J65704
$$ -629735 -1256005 -1533446 -1366504 -1184151 -1296230 -1630307 -1911134 -1877329 -1553977 -1388273
55101a388273l48836m44630K72301R79065O52501l84124q26631j85134O58568
$$ -1388273 -1737109 -2181739 -1909438 -930373 -277872 -661996 -1488627 -1673761 -1015193
55092a015193P55444K20367j34909J70919P91998R02755J27885q18592q47839
$$ -1015193 -259749 -39382 -174291 -3372 788626 1691381 1819266 1000674 152835
55083A52835L396M74518j43708r52086q09748L4604N51676M96055L45872K00964
$$ 152835 156231 630749 487041 -465045 -1274793 -1240189 -688513 -192458 153414 354378
55073C54378j73120n38769m49172p6565J20837K50196O04424Q16065L94875k41995
$$ 354378 181258 -357511 -806683 -883248 -762411 -512215 92209 908274 1303149 1061154
55063A061154l47363j36411l64791q72157p66936M4426O94104O93129L46959r9672
$$ 1061154 713791 577380 212589 -659568 -1426504 -1382078 -687974 5155 352114 252442
55053B52442o24461q12713k47477N12515N15021n7280j68111K92905L81982j48811
$$ 252442 -372019 -1184732 -1432209 -919694 -404673 -461953 -630064 -337159 44823 -103988
55043a03988m29634r1370J40652p2930k7179N61775P57169q2732j080203j055654
$$ -103988 -533622 -624992 -484340 -557270 -584449 -22674 734495 651763 -428440 -1484094
55033a484094j44138O46661Q09922N12775K09m45307m13564J30481N88349M26282
$$ -1484094 -1628232 -981571 -171649 341126 341335 -103972 -517536 -387055 201294 627576
55023F27576j61894n58372l74265K82927P99584M24994p58616j456874o17180
$$ 627576 465682 -92690 -466955 -184028 615556 1040550 281934 -1174940 -1792120
55014a792120R26566J363778L92237n03545l76627L5875q0880l13486p0346K82929
$$ -1792120 -865554 498224 890461 386916 10289 46164 -34716 -348202 -418548 -135619
55004a35619K19263J9523J19108K96646K28090Q6472m741k96757o61757m49212
$$ -135619 83644 103167 222275 518921 747011 833483 828742 531985 -129772 -578984
54994e78984L22826O33795j2277p27275o30223r4313J64343K20773L25285J73230
$$ -578984 -256158 377637 365360 -361915 -992138 -1086451 -922108 -701335 -376050 -202820
54984b02820l06321m27619O5888L25867j32393m23794J35560O59921K42840l17670
$$ -202820 -509141 -936760 -870872 -545005 -677398 -1101192 -965632 -305711 -62871 -380541
54974c80541L6352N41547r0872j130605p78379P48088J357130L49788o53751m74069
$$ -380541 -344189 197358 106486 -1024119 -1802498 -1054410 302720 652508 -1243 -475312
54964d75312k585k59155o11939j28695O16987M68569l57366n74208J81405P86940
$$ -475312 -477897 -737052 -1348991 -1477686 -860699 -392130 -749496 -1323704 -1142299 -355359
54954c55359K35266r49242j345481m26118P87728J052151M76298J82004N57937
$$ -355359 -120093 -1069335 -2414816 -2840934 -2053206 -1001055 -524757 -342753 215184
54945B15184P71469K63820k81909j28127K45191l843o09680o59289j01397K80874
$$ 215184 986653 1250473 968564 840437 1085628 1081785 472105 -187184 -288581 -7707
54935g707J74434J3919O7069J15554j7705l17758p67875j086015o91376L47856
$$ -7707 166727 180646 247715 363269 345564 27806 -740069 -1826084 -2517460 -2169604
54925b169604R17829L54086l05559K12272J271320J189262o6387p96158k66788
$$ -2169604 -1251775 -897689 -1203248 -990976 280344 1469606 1403219 607061 340273
54916C40273K66010k72914j138488j086957j48962P56600J096824Q78407K57991
$$ 340273 606283 333369 -805119 -1892076 -2041038 -1284438 -187614 690793 948784
54907I48784l54483m12408K6018K33530j25693m97944l53760Q7821M27505O56013
$$ 948784 594301 181893 207911 441441 315748 -182196 -535956 -448135 -20630 635383
54897F35383P18368K54277o49845j103101m93954N15352P41730l6690r03091r54451
$$ 635383 1353751 1608028 958183 -144918 -638872 -123520 618210 581520 -321571 -1276022
54887a276022k05909N91632P61753L19928j65172l14675k99856k85798J4479O96142
$$ -1276022 -1481931 -890299 -128546 191382 26210 -288465 -588321 -874119 -859640 -163498
54877a63498J030490L33676p90842j075388l75127K30019J71920O6933L80049
$$ -163498 866992 1200668 409826 -665562 -1040689 -810670 -638750 -571817 -191768
54868a91768O03307L08043l0383N4593J79901o2308k39541J05508M40329J2271
$$ -191768 411539 719582 689199 743792 923693 861385 621844 727352 1167681 1179952
54858A179952q01554q99527l6569Q69179J004792N04712p3570m66388o21753l81392
$$ 1179952 378398 -521129 -557698 311481 1316273 1820985 1747415 1281027 659274 277882
54848B77882K84271Q60059O02333m87972j343551r84883J31211O17386R8668k76046
$$ 277882 562153 1422212 2024545 1536573 193022 -791861 -660650 -43264 55404 -220642
54838b20642K83278Q63705L42278o75676p73131j239L31565r8695k84484J40343
$$ -220642 62636 926341 1268619 592943 -180188 -181427 150138 51443 -233041 -92698
54828i2698K81871k59627o16688k68525L1346k73482m76391P1401P57155Q12922
$$ -92698 189173 -70454 -687142 -955667 -924321 -1197803 -1674194 -1602793 -845638 -32716
54818c2716N75023O06065N15024k22438j039087j001933k07732N03016P05469
$$ -32716 542307 1148372 1663396 1440958 401871 -600062 -807794 -304778 400691
54809D00691M60237j41539o90271m19361O64052J315966O48215n26663r05977
$$ 400691 860928 719389 29118 -390243 273809 1589775 2237990 1711327 805350
54800H05350m95376j24144O9013M11613O01509J81888l67750l25390o1249l43694
$$ 805350 309974 185830 254843 666456 1267965 1449853 1082103 756713 695464 351770
54790C51770p75451m15687L86011M06187l47076o15295k9783M01069J95582J35108
$$ 351770 -423681 -839368 -453357 -47170 -394246 -1009541 -1039324 -638255 -442673 -307565
54780c07565O07608P65429N7934p18241p13342k59900j8908J03098L58321L85589
$$ -307565 300043 1065472 1123406 405165 -308177 -568077 -586985 -483887 -125566 260023
54770B60023q1272m79850k69286J03824o0774n30051n23287Q5505P12835R49281
$$ 260023 178751 -301099 -570385 -466561 -527335 -1057386 -1580673 -1495168 -782333 166948
54760A66948Q46885N43113J60572r5592j76535l12715n65644n96931k50289M7793
$$ 166948 1013833 1556946 1717518 1621926 1445391 1132676 567032 -29899 -280188 -232395
54750b32395p3488k88547j06581K97806L74589P7345j41065p2872N7302R3266
$$ -232395 -305883 -594430 -701011 -403205 -28616 48729 -92336 -165208 -107906 -14640
54740a4640J46200K71404L21988J77091j09698l73996m32898k53521j08324k74729
$$ -14640 131560 402964 724952 902043 792345 418349 -14549 -268070 -376394 -651123
54730f51123m77409q9950Q57493J419671R36706k0603m96016m49647m50390m90459
$$ -651123 -1128532 -1218482 -360989 1058682 1995388 1974785 1478769 1029122 578732 88273
54720H8273j16641M30354L47560l11677m66163L07599R28423L60655p82108j084527
$$ 88273 -28368 401986 749546 437869 -28294 279305 1207728 1568383 786275 -298252
54710b98252k78187O00448P39111L10794k21105o47116p27819k11312N33961O13954
$$ -298252 -576439 24009 763120 1073914 852809 205693 -522126 -733438 -199477 414477
54700D14477j99132r34433o34111L35171Q24664M82436N3999J33353L62209J72788
$$ 414477 215345 -719088 -1353199 -1018028 -193364 289072 343071 476424 838633 1011421
54690A011421k32629j88454L57780O50149J51123o49156q39167l38795k1282m42495
$$ 1011421 778792 590338 948118 1598267 1749390 1100234 261067 -77728 -99010 -541505
54680e41505r96496q16512r7401K45684N5273R4462N95290P32693Q6300m16044
$$ -541505 -1538001 -2354513 -2451914 -2206230 -2150957 -2056495 -1461205 -728512 -642212 -1058256
54670a058256N4865O94394K36659q82011j025783J05939J000756O66286l8602
$$ -1058256 -1003391 -308997 -72338 -954349 -1980132 -1874193 -873437 -207151 -245753
54661b45753m0890K91026R4812l78328k56354M41732Q70857O17551r679o75317
$$ -245753 -286643 4383 99195 -279133 -535487 -93755 777102 1394653 1384974 709657
54651G09657j156812j040622j66996P56071Q53840L42683K04943N88599N33862
$$ 709657 -447155 -1487777 -1654773 -898702 -44862 297821 502764 1091363 1625225
54642A625225l92338j151488o20804O84195J144506J40781j150221j251723j26845
$$ 1625225 1232887 81399 -539405 144790 1289296 1430077 279856 -971867 -1098712
54633a098712R76102J100471M54394k48671o82330q31063n74731N0136M98274
$$ -1098712 -122610 977861 1432255 1183584 501254 -329809 -904540 -854404 -356130
54624c56130L16870q5913j4169L24926J20030n70078p34765m2253N92741N31412
$$ -356130 -39260 -125173 -139342 185584 305614 -264464 -999229 -1041482 -448741 82671
54614H2671L33321M83863L98742l35027q48891l66465K82628j6980o44691k47355
$$ 82671 415992 899855 1298597 963570 114679 -251786 30842 13862 -630829 -878184
54604h78184Q05704R07138m6290m35264L36490Q77843K15288o63030o09294r2196
$$ -878184 -72480 834658 788368 353104 689594 1567437 1782725 1119695 510401 418205
54594D18205k6064j34868K22400O15914K85740m16037o05541l26028k18335k25504
$$ 418205 392141 257273 479673 1095587 1381327 965290 359749 33721 -184614 -410118
$$ [...]
##END NTUPLES=NMR SPECTRUM
##END=
