##TITLE=31Pdec_SR91_rm2
 , 124 sc
 30.09.2021
##JCAMPDX= 6.0         $$ Bruker NMR JCAMP-DX V2.0
##DATA TYPE= NMR SPECTRUM
##DATA CLASS= NTUPLES
##ORIGIN= UXNMR, Bruker Analytische Messtechnik GmbH
##OWNER= root
$$ XWIN-NMR		Version 3.5
$$ Thu Sep 30 10:59:08 2021 Russian Standard Time (UT+4h)  she@DPX200
##.OBSERVE FREQUENCY= 81.013821
##.OBSERVE NUCLEUS= ^31P
##.ACQUISITION MODE= SIMULTANEOUS
##.ACQUISITION SCHEME= undefined
##.AVERAGES= 124
##.DIGITISER RES= 16
##SPECTROMETER/DATA SYSTEM= spect
##.PULSE SEQUENCE= zgpg30
##.SOLVENT NAME= CDCl3
##.SHIFT REFERENCE= (INTERNAL, CDCl3, 0, 248.564)
##AUDIT TRAIL= $$ (NUMBER, WHEN, WHO, WHERE, WHAT)
$$ ##TITLE= Audit trail, XWIN-NMR		Version 3.5
$$ ##JCAMPDX= 5.01
$$ ##ORIGIN= Bruker BioSpin GmbH
$$ ##OWNER= she
$$ F:/spectra/data/she/nmr/P31/1/pdata/1/auditp.txt
$$ ##AUDIT TRAIL=  $$ (NUMBER, WHEN, WHO, WHERE, WHAT)
(   1,<2021-09-30 10:58:10.59 +0400>,<she>,<DPX200>,
      <created by zg, POWCHK disabled, PULCHK disabled
       configuration hash MD5:
       00 E9 B6 7A A2 85 ED C7 34 08 36 98 17 FE 4E 26
       data hash MD5: 32K
       49 CF 45 37 0D 81 32 32 61 41 D3 B8 DC E4 91 24>)
(   2,<2021-09-30 10:58:13.70 +0400>,<she>,<DPX200>,
      <Start of raw data processing
       efp BC_mod = 2 LB = 1 FT_mod = 6 PKNL = 1 PHC0 = -8833.106 PHC1 = 98.26933 SI = 64K 
       data hash MD5: 64K
       BB D3 63 D3 BE FE 09 44 91 0D A7 BE 40 E7 5F 1F>)
(   3,<2021-09-30 10:58:37.75 +0400>,<she>,<DPX200>,
      <pk PHC0 = 2.448923 PHC1 = -12.6 
       data hash MD5: 64K
       B7 66 40 AC 0B B0 E5 49 1F 3E 2B 58 62 79 D7 85>)
$$ ##END=
$$ 
$$ hash MD5
$$ 56 73 C1 8A E6 E7 0B E0 0E 96 EB B2 65 5F C9 31
##$RELAX= 
##$RELAX= 
##$RELAX= 
##$RELAX= 
##$RELAX= 
##$RELAX= 
##$RELAX= 
##$RELAX= 
$$ Bruker specific parameters
$$ --------------------------
##$DU= <F:/spectra>
##$EXPNO= 1
##$NAME= <P31>
##$PROCNO= 1
##$TYPE= <nmr>
##$USER= <she>
##$AMP= (0..31)
100 100 100 100 100 100 100 100 100 100 100 100 100 100 100 100 100 100 
100 100 100 100 100 100 100 100 100 100 100 100 100 100 
##$AQSEQ= 0
##$AQ_mod= 1
##$AUNM= <au_zg>
##$AUTOPOS= <>
##$BF1= 81.014009
##$BF2= 200.13
##$BF3= 200.13
##$BF4= 200.13
##$BF5= 200.13
##$BF6= 200.13
##$BF7= 200.13
##$BF8= 200.13
##$BYTORDA= 1
##$CFDGTYP= 0
##$CFRGTYP= 5
##$CHEMSTR= <none>
##$CNST= (0..31)
1 1 145 1 1 1 1 1 1 1 1 1 1 1 1 1 1 1 1 1 1 1 1 1 1 1 1 1 1 1 1 1 
##$CPDPRG= <waltz16>
##$CPDPRG1= <>
##$CPDPRG2= <waltz16>
##$CPDPRG3= <>
##$CPDPRG4= <mlev>
##$CPDPRG5= <mlev>
##$CPDPRG6= <mlev>
##$CPDPRG7= <mlev>
##$CPDPRG8= <mlev>
##$CPDPRGB= <>
##$CPDPRGT= <>
##$D= (0..31)
0 1 0 0 0 0 0 0 0 0 0 0.03 2e-05 3e-06 0 0 0 0 0 0 0 0 0 0 0 0 0 0 0 0 
0 0 
##$DATE= 1632984939
##$DBL= (0..7)
120 120 120 11 120 120 24 19 
##$DBP= (0..7)
150 150 150 150 150 150 150 150 
##$DBP07= 0
##$DBPNAM0= <>
##$DBPNAM1= <>
##$DBPNAM2= <>
##$DBPNAM3= <>
##$DBPNAM4= <>
##$DBPNAM5= <>
##$DBPNAM6= <>
##$DBPNAM7= <>
##$DBPOAL= (0..7)
0.5 0.5 0.5 0.5 0.5 0.5 0.5 0.5 
##$DBPOFFS= (0..7)
0 0 0 0 0 0 0 0 
$$ [...]
##$SUBNAM2= <"">
##$SUBNAM3= <"">
##$SUBNAM4= <"">
##$SUBNAM5= <"">
##$SUBNAM6= <"">
##$SUBNAM7= <"">
##$SUBNAM8= <"">
##$SUBNAM9= <"">
##$SW= 501.771253377433
##$SWIBOX= (0..15)
0 1 3 0 0 0 0 0 0 0 0 0 0 0 0 0 
##$SW_h= 40650.406504065
##$TD= 32768
##$TD0= 1
##$TE= 0
##$TE2= 300
##$TE3= 300
##$TEG= 300
##$TL= (0..7)
0 120 53 12 22 120 120 120 
##$TP= (0..7)
150 150 150 150 150 150 150 150 
##$TP07= 0
##$TPNAME0= <>
##$TPNAME1= <>
##$TPNAME2= <>
##$TPNAME3= <>
##$TPNAME4= <>
##$TPNAME5= <>
##$TPNAME6= <>
##$TPNAME7= <>
##$TPOAL= (0..7)
0.5 0.5 0.5 0.5 0.5 0.5 0.5 0.5 
##$TPOFFS= (0..7)
0 0 0 0 0 0 0 0 
##$TUNHIN= 0
##$TUNHOUT= 0
##$TUNXOUT= 0
##$USERA1= <user>
##$USERA2= <user>
##$USERA3= <user>
##$USERA4= <user>
##$USERA5= <user>
##$V9= 5
##$VALIST= <valist>
##$VCLIST= <CCCCCCCCCCCCCCC>
##$VD= 0
##$VDLIST= <DDDDDDDDDDDDDDD>
##$VPLIST= <PPPPPPPPPPPPPPP>
##$VTLIST= <TTTTTTTTTTTTTTT>
##$WBST= 1024
##$WBSW= 4
##$XGAIN= (0..3)
0 0 0 0 
##$XL= 0
##$YL= 0
##$YMAX_a= 6899
##$YMIN_a= -7884
##$ZGOPTNS= <>
##$ZL1= 120
##$ZL2= 120
##$ZL3= 120
##$ZL4= 120
##$ABSF1= 0
##$ABSF2= 0
##$ABSG= 0
##$ABSL= 0
##$ALPHA= 0
##$AQORDER= 0
##$ASSFAC= 0
##$ASSFACI= 0
##$ASSFACX= 0
##$ASSWID= 0
##$AUNMP= <proc_1d>
##$AZFE= 0.1
##$AZFW= 0.5
##$BCFW= 0
##$BC_mod= 2
##$BYTORDP= 0
##$COROFFS= 0
##$CY= -3
##$DATMOD= 1
##$DC= 0
##$DFILT= <>
##$DTYPP= 0
##$F1P= 0
##$F2P= 0
##$FCOR= 1
##$FTSIZE= 65536
##$FT_mod= 6
##$GAMMA= 0
##$GB= 0
##$INTBC= 1
##$INTSCL= 5.30512e-09
##$ISEN= 30
##$LB= 1
##$LEV0= 0
##$LPBIN= 0
##$MAXI= 10000
##$MC2= 0
##$MEAN= 0
##$ME_mod= 0
##$MI= 50
##$NCOEF= 0
##$NC_proc= -7
##$NLEV= 6
##$NOISF1= 182.463
##$NOISF2= 159.3651
##$NSP= 0
##$NTH_PI= 0
##$NZP= 0
##$OFFSET= 248.5645
##$PC= 4
##$PHC0= -8830.657
##$PHC1= 85.66933
##$PH_mod= 1
##$PKNL= yes
##$PPARMOD= 0
##$PSCAL= 0
##$PSIGN= 0
##$REVERSE= no
##$SF= 81.014009
##$SI= 65536
##$SIGF1= 159.3651
##$SIGF2= -187.1042
##$SINO= 113.3802
##$SIOLD= 16384
##$SREGLST= <1H.CDCl3>
##$SSB= 0
##$STSI= 65536
##$STSR= 0
##$SW_p= 40650.406504065
##$SYMM= 0
##$S_DEV= 0
##$TDeff= 32768
##$TDoff= 0
##$TI= <>
##$TILT= no
##$TM1= 0
##$TM2= 0
##$TOPLEV= 0
##$USERP1= <user>
##$USERP2= <user>
##$USERP3= <user>
##$USERP4= <user>
##$USERP5= <user>
##$WDW= 1
##$XDIM= 65536
##$YMAX_p= 396620541
##$YMIN_p= -203388685
$$ End of Bruker specific parameters
$$ ---------------------------------
##NTUPLES= NMR SPECTRUM
##VAR_NAME=  FREQUENCY,     SPECTRUM/REAL,   SPECTRUM/IMAG
##SYMBOL=    X,             R,               I
##VAR_TYPE=  INDEPENDENT,   DEPENDENT,       DEPENDENT
##VAR_FORM=  AFFN,          ASDF,            ASDF
##VAR_DIM=   65536,         65536,           65536
##UNITS=     HZ,            ARBITRARY UNITS, ARBITRARY UNITS
##FACTOR=    0.620285442955139, 1,           1
##FIRST=     20137.2065510759, 0,            0
##LAST=      -20513.1999529892, 0,           0
##MIN=       -20513.1999529892, -203388685,  0
##MAX=       20137.2065510759, 396620541,    0
$$ Real data points
##PAGE= N=1
##DATA TABLE= (X++(R..R)), XYDATA
$$ [...]
$$ plain form
60014 3392867 3743575 2214746 -320556 -528717 2930426 5277061 808816 -8122625
60006 -8122625 -12858240 -9686331 -3729427 -625467 -381348 -1253346 -3351389 -5399419
59998 -5399419 -3859451 956641 3226331 78902 -3372319 -1884647 1942717 2632330
59990 2632330 326043 -1309845 -1886689 -3001582 -3218242 -531310 2462012 1897414 -771816
59981 -771816 -1540283 -1394413 -4456785 -9568073 -10796307 -6856152 -3461539 -4631688 -7221140
59972 -7221140 -6420500 -2297787 1608844 2919603 1447230 -1883250 -5208394 -6315611
59964 -6315611 -4233773 316909 5561405 8944215 8639400 6549131 7238346 11247085
59956 11247085 12743839 7879786 1938117 2207400 6367283 5357512 -3075980 -11283199
$$ packed form
60014C392867L50708j528829k535302k08161L459143K346635m468245q931441
60006h122625m735615L171909N956904L103960K44119q71998k098043k048030
59998e399419J539968M816092K269690l147429l451221J487672L827364O89613
59990B632330k306287j635888n76844j114893k16660K686932K993322n64598k669230
59981g71816p68467J45870l062372n111288j228234L940155L394613j170149k589452
59972g221140Q00640M122713L906631J310759j472373l330480l325144j107217
59964f315611K081838M550682N244496L382810l04815k090269O89215M008739
59956A1247085J496754m864053n941669K69283M159883j009771q433492q207219
$$ plain form
59948 -11283199 -12622367 -8368318 -2719981 2037828 3749624 720413 -3809422 -3843767
59940 -3843767 525948 2885470 1064917 446180 3819017 6125834 3807235 1347923
59932 1347923 2623348 3270577 -1116843 -5882887 -4710915 -671217 -906788 -4490820
59924 -4490820 -4960189 -2041611 -1298370 -3633515 -4487801 -3204298 -4319390 -8564059 -10401351
59915 -10401351 -6338022 410485 4810808 4486058 -642974 -7678125 -10216380 -4569695
59907 -4569695 3971295 7308602 5916765 6728865 10615110 10937055 5325389 -250594
59899 -250594 -1290714 -63693 1398535 4876666 9149814 8226314 877323 -5728313
59891 -5728313 -6358431 -4170118 -2616516 497631 5317121 5298817 -2047985 -7698208 -3357016
$$ packed form
59948a1283199j339168M254049N648337M757809J711796l029211m529835l4345
59940c843767M369715K359522j820553o18737L372837K306817k318599k459312
59932A347923J275425O47229m387420m766044J171972M039698k35571l584032
59924d490820m69369K918578P43241k335145q54286J283503j115092m244669j837292
59915a0401351M063329O748507M400323l24750n129032p035151k538255N646685
59907d569695Q540990L337307j391837Q12100L886245L21945n611666n575983
59899b50594j040120J227021J462228L478131M273148r23500p348991o605636
59891e728313o30118K188313J553602L114147M819490j8304p346802n650223M341192
$$ plain form
59882 -3357016 5359744 7531525 3145013 375134 1090158 411544 -1648563 286175
59874 286175 5745479 7274308 2340146 -2389110 -1238239 3040870 4566981 1479462
59866 1479462 -4124546 -8738661 -8887282 -4234325 674671 1870560 1813035 4690274 8205733
59857 8205733 7249483 3981615 5260643 10224945 10450509 4284300 707657 4839028
59849 4839028 9293032 6227916 -204747 -1337643 2059665 1963290 -4019198 -9940528
59841 -9940528 -10556393 -6697400 -1939192 976814 395038 -3340243 -6757052 -6075410 -1635860
59832 -1635860 2273584 1901852 -2622602 -7474339 -7992122 -3019388 3039420 4641916
59824 4641916 1830763 -497182 -153403 24210 -1532263 -2087597 -660316 -1556064 -7409917
$$ packed form
59882c357016Q716760K171781m386512k769879P15024o78614k060107J934738
59874B86175N459304J528829m934162m729256J150871M279109J526111l087519
59866A479462n604008m614115j48621M652957M908996J195889n7525K877239L515459
59857H205733r56250l267868J279028M964302K25564o166209l576643M131371
59849D839028M454004l065116o432663j132896L397308r6375n982488n921330
59841i940528o15865L858993M758208K916006n81776l735281l416809O81642M439550
59832a635860L909444l71732m524454m851737n17783M972734O058808J602496
59824D641916k811153k327945L43779J77613j556473n55334J427281q95748n853853
$$ plain form
59815 -7409917 -13316330 -13226979 -8702208 -5789912 -6066193 -6566149 -6339216 -6790941 -6682667
59806 -6682667 -3091242 2519386 4612057 715854 -5939358 -11149404 -13161692 -11597572
59798 -11597572 -7250329 -3075029 -1429762 -585404 1940591 3568645 -228596 -7129290
59790 -7129290 -8835136 -2352065 5697766 8520942 7116077 5567168 4165500 1992640
59782 1992640 1630758 5403572 9882289 9959587 6546205 4564978 4481035 1923965 -3951810
59773 -3951810 -7600327 -4631555 2165991 6984026 8034951 7687854 7754551 7493288 5444010
59764 5444010 1317558 -3376762 -5492554 -2302176 4955425 10573780 9512702 2959277
59756 2959277 -2826725 -3342076 -99148 2322483 2062859 1514172 3374355 6578640 7298094
$$ packed form
59815g409917n906413Q9351M524771K912296k76281m99956K26933m51725J08274
59806f682667L591425N610628K092671l896203o655212n210046k012288J564120
59798a1597572M347243M175300J645267Q44358K525995J628054l797241o900694
59790g129290j705846O483071Q049831K823176j404865j548909j401668k172860
59782A992640l61882L772814M478717P7298l413382j981227q3943k557070n875775
59773c951810l648517K968772O797546M818035J050925l47097O6697k61263k049278
59764E444010m126452m694320k115792L190378P257601N618355j061078o553425
59756B959277n786002n15351L242928K421631k59624n48687J860183L204285P19454
$$ plain form
59747 7298094 3778187 -1295967 -4203328 -4671366 -4986841 -5395458 -3598513 312184 1871725
59738 1871725 -2052593 -7930580 -9618475 -6614067 -4307445 -6123559 -9531258 -10784339
59730 -10784339 -9588051 -7071811 -2839616 2755068 6028363 3535947 -2812217 -7453670
59722 -7453670 -7560590 -5077261 -2820833 -1310801 301205 2342536 4165456 4394096
59714 4394096 2002017 -1655320 -3071889 -851028 1532244 -6668 -4106622 -5673170
59706 -5673170 -3438036 -1817601 -4153297 -7748974 -7848510 -4005657 30079 1275113
59698 1275113 -13284 -2200680 -4605513 -7511298 -10540622 -11677418 -8868239 -3156056
59690 -3156056 1149996 1083646 -1349525 -2365468 -2006967 -3296701 -6419346 -7913106 -6331655
$$ packed form
59747G298094l519907n074154k907361m68038l15475m08617J796945L910697J559541
59738A871725l924318n877987j687895L004408K306622j816114l407699j253081
59730a0784339J196288K516240M232195N594684L273295k492416o348164m641453
59722g453670j06920K483329K256428J510032J612006K041331J822920K28640
59714D394096k392079l657337j416569K220861K383272j538912m099954j566548
59706e673170K235134J620435k335696l595677r9536L842853M035736J245034
59698A275113j288397k187396k404833k905785l029324j136796K809179N712183
59690c156056M306052o6350k433171j015943L58501j289734l122645j493760J581451
$$ plain form
59681 -6331655 -4570414 -4901305 -5509840 -4353154 -3036815 -3754544 -5061037 -4122537 -1222163
59672 -1222163 1415474 3746073 7146048 10384669 10227620 6335044 2315554 1048739
59664 1048739 1508308 1272549 -3479 -1121691 -1824575 -2881248 -4125158 -4066975 -2021533
59655 -2021533 411461 1198778 904198 2142865 5348808 7132208 4893387 1469077
59647 1469077 1956196 6403231 9343896 7195637 2467698 -753178 -1839350 -1917967 -640518
59638 -640518 2028328 3502323 1985779 338912 2202921 5256581 3176308 -5112188
59630 -5112188 -12587899 -12501907 -6356837 -1090491 -645824 -3216663 -5468837 -6119052 -5139835
59621 -5139835 -2431007 1041538 2536645 181071 -4175687 -6715395 -6292715 -5422415
$$ packed form
59681f331655J761241l30891o08535J156686J316339p17729j306493R38500K900374
59672a222163K637637K330599L399975L238621j57049l892576m019490j266815
59664A048739M59569k35759j276028j118212p02884j056673j243910N8183K045442
59655b021533K432994P87317k94580J238667L205943J783400k238821l424310
59647A469077M87119M447035K940665k148259m727939l220876j086172p8617J277449
59638f40518K668846J473995j516544j646867J864009L053660k080273q288496
59630e112188p475711Q5992O145070N266346M44667k570839k252174o50215R79217
59621e139835K708828L472545J495107k355574m356758k539708M22680Q70300
$$ plain form
59613 -5422415 -6238577 -7577644 -7241912 -5387306 -4108353 -4908213 -7766252 -11178415 -12097944
59604 -12097944 -8250702 -2205387 -160137 -3971970 -7556439 -4973593 1109761 4040257
59596 4040257 3312068 3571934 5432949 4964037 1962444 714203 1673988 517394 -2855158
59587 -2855158 -3007257 483937 210875 -6787382 -12699212 -10833045 -5506933 -2985424
59579 -2985424 -832332 4728331 8416938 3993713 -2933867 -2478240 3021891 3217192
59571 3217192 -1676885 -952482 7218809 11273596 5279483 -1187933 729430 4742556
59563 4742556 666651 -8674372 -12530051 -8779357 -4907006 -5173082 -6384997 -5810520
59555 -5810520 -4998250 -4726933 -2704203 1839793 5858448 6441495 3857279 -152722 -4105011
$$ packed form
59613e422415q16162j339067L35732J854606J278953p99860k858039l412163r19529
59604a2097944L847242O045315K045250l811833l584469K582846O083354K930496
59596D040257p28189K59866J861015m68912l001593j248241R59785j156594l372552
59587b855158j52099L491194k73062o998257n911830J866167N326112K521509
59579b985424K153092N560663L688607m423225o927580M55627N500131J95301
59571C217192m894077P24403Q171291M054787n994113o467416J917363M013126
59563D742556m075905r341023l855679L750694L872351k66076j211915N74477
59555e810520Q12270K71317K022730M543996M018655N83047k584216m010001l952289
$$ plain form
59546 -4105011 -6157316 -4679924 -549406 3058169 3846413 2053738 -854259 -3483072
59538 -3483072 -4892138 -5499695 -7066361 -9856587 -10906321 -8071068 -4934371 -7351699
59530 -7351699 -14390670 -17448368 -11137588 -1161994 2833639 -399914 -3751670 -2877218
59522 -2877218 -998871 -1437038 -1651880 1397466 4650130 3077825 -2248604 -5760268
59514 -5760268 -5532512 -4134940 -2187157 2363828 7731360 7857354 1363000 -4739789
59506 -4739789 -4137585 545263 2795517 1571603 814024 2472411 4999496 7173505
59498 7173505 9075985 10196342 9884973 8639990 6519601 2261723 -3645091 -7912051
59490 -7912051 -9304699 -10943781 -14190046 -14601347 -9162659 -3336503 -4002075 -8313554
$$ packed form
59546d105011k052305J477392M130518L607575P88244j792675k907997k628813
59538c483072j409066o07557j566666k790226j049734K835253L136697k417328
59530g351699p038971l057698O310780R975594L995633l233553l351756Q74452
59522b877218J878347m38167k14842L049346L252664j572305n326429l511664
59514e760268K27756J397572J947783M550985N367532J25994o494354o102789
59506d739789O02204M682848K250254j223914p57579J658387K527085K174009
59498G173505J902480J120357l11369j244983k120389m257878n906814m266960
59490g912051j392648j639082l246265m11301N438688N826156o65572m311479
$$ plain form
59482 -8313554 -7411060 122206 6393139 5838172 1503610 -1160388 -405378 2919393 6815808
59473 6815808 7660055 3640501 -1060556 -1000541 2071226 1978531 -1218115 -1238171 3297780
59464 3297780 6505518 5731941 5351107 7078326 5775529 -398562 -4434993 -1250789
59456 -1250789 3607280 2967927 -928791 -1894055 -367221 -273466 -234118 3001771 5771123
59447 5771123 1726261 -6543137 -9220684 -2978350 4834738 6917011 4171925 1440068
59439 1440068 989774 2577465 5293523 6933289 5100292 921028 -1325944 202374
59431 202374 2655388 3287687 3318658 4634749 5309206 2019903 -3801888 -5956342 -1164649
59422 -1164649 5625330 6612458 1117724 -3565702 -2259919 1562149 2529273 2271454 5535740
$$ packed form
59482h313554R02494P533266O270933n54967m334562k663998P55010L324771L896415
59473F815808Q44247m019554m701057O0015L071767r2695l196646k0056M535951
59464C297780L207738p73577l80834J727219j302797o174091m036431L184204
59456a250789M858069o39353l896718r65264J526834R3755L9348L235889K769352
59447E771123m044862q269398k677547O242334P813088K082273k745086k731857
59439A440068m50294J587691K716058J639766j832997m179264k246972J528318
59431B02374K453014O32299L0971J316091O74457l289303n821791k154454M791693
59422a164649O789979R87128n494734m683426J305783L822068R67124k57819L264286
$$ plain form
59413 5535740 10091508 8484726 -64374 -7588226 -9174986 -9061304 -11483748 -13074816
59405 -13074816 -9819679 -5236558 -4937726 -7645405 -8415208 -7255123 -7575148 -8521652 -5877733
59396 -5877733 390330 5554203 6784803 5547464 3913801 2815152 3198675 4965144
59388 4965144 5739419 4103057 2190206 1576238 -432938 -5716990 -9779425 -7490985
59380 -7490985 -2123921 -1673230 -7138204 -11351403 -9381188 -3566293 2125801 6251274
59372 6251274 7417312 3899595 -2418325 -6794572 -7776485 -7978523 -8122463 -5931466 -2158820
59363 -2158820 -1516580 -5077875 -7424033 -4649399 -169361 1298715 1060405 3076449
59355 3076449 6661007 7897553 6716777 7242585 10695228 12337860 7780562 -51898
$$ packed form
59413E535740M555768j606782q549100p523852j586760J13682k422444j591068
59405a3074816L255137M583121K98832k707679p69803J160085l20025r46504K643919
59396e877733O268063N163873J230600j237339j633663j098649L83523J766469
59388D965144P74275j636362j912851o13968k009176n284052m062435K288440
59380g490985N367064M50691n464974m213199J970215N814895N692094M125473
59372F251274J166038l517717o317920m376247r81913k02038j43940K190997L772646
59363b158820O42240l561295k346158K774634M480038J468076k38310K016044
59355C076449L584558J236546j180776N25808L452643J642632m557298p832460
$$ plain form
59347 -51898 -3576902 -417054 2562327 -2086733 -11576793 -15649694 -10548797 -4276760
59339 -4276760 -4835020 -9008492 -8486549 -2705837 1748206 2094709 1857200 3091710 3692884
59330 3692884 3028025 3303886 4152941 2357229 -1609102 -3119213 -1156003 -208345 -2455349
59321 -2455349 -4490946 -4102298 -3471107 -2709700 2306797 11108278 14827219 7593705 -3866245
59312 -3866245 -8907552 -6740166 -4235554 -3686924 -1292615 3544668 5883476 3366406
59304 3366406 -45859 -717223 -592542 -2923625 -6184808 -5461395 1212234 9760560 13367341
59295 13367341 8969281 870445 -3130968 -235412 4196336 3597000 -1482234 -4774065
59287 -4774065 -2916616 841699 1938660 459055 194331 3276347 7371085 8126031
$$ packed form
59347e1898l525004L159848K979381m649060r490060m072901N100897O272037
59339d276760n58260m173472N21943N780712M454043L46503k37509J234510O01174
59330C692884o64859K75861Q49055j795712l966331j510111J963210R47658k247004
59321b455349k035597L88648O31191P61407N016497Q801481L718941p233514j1459950
59312c866245n041307K167386K504612N48630K394309M837283K338808k517070
59304C366406l412265o71364J24681k331083l261183P23413O673629Q548326L606781
59295A3367341m398060q098836m001413K895556M431748n99336n079234l291831
59287d774065J857449L758315J096961j479605k64724L082016M094738P54946
$$ plain form
59279 8126031 3906244 -2029916 -4415319 -1313976 3901656 6373410 4971749 2828103
59271 2828103 2837601 3767718 1966459 -2988781 -6061606 -2386746 5405484 9041554 5178419
59262 5178419 348971 2079047 8398421 11281796 8489078 5595985 6321373 7530175
59254 7530175 5811237 3022238 1892899 989949 -1702771 -3886866 -2360263 1056217
59246 1056217 1763221 -591565 -1860916 -297074 266038 -4224185 -11802809 -15917551
59238 -15917551 -12876158 -6085024 -1538987 -106550 2707975 8594075 12069849 7786905
59230 7786905 -801069 -5094192 -2086305 3935178 9352195 14406396 18070048 16622524
59222 16622524 9684608 2164426 -2199833 -4340978 -5214855 -3487722 -261127 104934
$$ packed form
59279H126031m219787n936160k385403L101343N215632K471754j401661k143646
59271B828103R498R30117j801259m955240l072825L674860P792230L636070l863135
59262E178419m829448J730076O319374K883375k792718k893093P25388J208802
59254G530175j718938k788999j129339r02950k692720k184095J526603L416480
59246A056217P07004k354786j269351J563842N63112m490223p578624m114742
59238a5917551L041393O791134M546037J432437K814525N886100L475774m282944
59230G786905q587974m293123L007887O021483N417017N054201L663652j447524
59222A6622524o937916p520182m364259k141145q73877J727133L226595L66061
$$ plain form
59214 104934 -2775344 -3314740 944208 4415119 2397764 -1156081 -525724 2801161 4663389
59205 4663389 6608894 11986562 17476695 16790986 10655807 5451039 3400306 1398561
59197 1398561 -1508904 -2786208 -2269826 -2683531 -4179403 -4350449 -3601643 -4613516 -6519977
59188 -6519977 -5547894 -1650009 1216137 1654287 2054858 3067925 2599815 790681 435892
59179 435892 1984007 3467479 5302163 9062293 11582973 7522356 -1168162 -5813588
59171 -5813588 -3157348 312609 -969803 -3829089 -3171333 -99633 1754217 2727787
59163 2727787 4734560 6436797 5668081 3433666 1399073 -1363444 -5357285 -7906891
59155 -7906891 -7383806 -6718002 -8539323 -10281538 -8704036 -5970265 -5928298 -6925925 -4070395
$$ packed form
59214A04934k880278n39396M258948L470911k017355l553845O30357L326885J862228
59205D663389J945505N377668N490133o85709o135179n204768k050733k001745
59197A398561k907465j277304N16382m13705j495872j71046P48806j011873j906461
59188f519977R72083L897885K866146M38150M00571J013067m68110j809134l54789
59179D35892J548115J483472J834684L760130K520680m060617q690518m645426
59171e813588K656240L469957j282412k859286O57756L071700J853850R73570
59163B727787K006773J702237p68716k234415k034593k762517l993841k549606
59155g906891N23085O65804j821321j742215J577502K733771M1967r97627K855530
$$ plain form
59146 -4070395 2805450 8917332 11607333 12581595 13134221 11835711 7777811 2532134
59138 2532134 -1937193 -4677624 -4970562 -2875979 -646218 -995870 -3768069 -6482646
59130 -6482646 -7939866 -8890768 -9409523 -8323606 -5565165 -2777816 -1100615 -144230 576288
59121 576288 819538 405057 -496058 -1720645 -2618077 -1890945 544980 2372813 1458735
59112 1458735 -1045447 -2231576 -1453026 -556066 -593374 -855044 -993138 -1345122 -907998
59103 -907998 2000679 6041854 6698768 1853188 -4440298 -6176791 -2456998 1971871
59095 1971871 2949543 1321063 351434 711496 123222 -2506489 -4967204 -4783585 -2699983
59086 -2699983 -1387953 -1745200 -2686287 -3978140 -6357262 -8497450 -7129130 -1822135
$$ packed form
59146d070395O875845O111882K690001R74262N52626j298510m057900n245677
59138B532134m469327k740431k92938K094583K229761l49652k772199k714577
59130f482646j457220r50902n18755J085917K758441K787349J677201R56385P20518
59121E76288K43250m14481r01115j224587q97432P27132K435925J827833r14078
59112A458735k504182j186129P78550Q96960l7308k61670j38094l51984M37124
59103i07998K908677M041175O56914m845580o293486j736493L719793M428869
59095A971871R77672j628480r69629L60062n88274k629711k460715J83619K083602
59086b699983J312030l57247r41087j291853k379122k140188J368320N306995
$$ plain form
59078 -1822135 3115630 3961683 2682192 3723017 7109154 8274231 4631722 -919893
59070 -919893 -3900303 -3226269 -1057564 643991 1926464 3833268 6507554 8414482
59062 8414482 7744485 4954516 2994693 3748503 5036547 3138817 -1898467 -5806587
59054 -5806587 -5590660 -3322302 -3042343 -5477357 -7705470 -7229850 -4372588 -684481 3091322
59045 3091322 6584290 8582830 7817408 5065102 3434650 5659131 10965501 15036668
59037 15036668 13684928 7079658 292104 -1163065 2937460 6745113 4522358 -2503375
59029 -2503375 -7222461 -5184448 117030 2342686 683903 -251569 1782848 3348766
59021 3348766 1217217 -2198792 -2400662 560836 2756952 2733554 3265005 6215459 9069969
$$ packed form
59078a822135M937765Q46053j279491J040825L386137J165077l642509n551615
59070i19893k980410O74034K168705J701555J282473J906804K674286J906928
59062H414482o69997k789969j959823P53810J288044j897730n037284l908120
59054e806587K15927K268358K79959k435014k228113M75620K857262L688107L775803
59045C091322L492968J998540p65422k752306j630452K224481N306370M071167
59037A5036668j351740o605270o787554j455169M100525L807653k222755p025733
59029b503375m719086K038013N301478K225656j658783r35472K034417J565918
59021C348766k131549l416009k01870K961498K196116k3398N31451K950454K854510
$$ plain form
59012 9069969 8387369 4492675 633789 -1190019 -1449706 -970948 57793 952802 580530
59003 580530 -802834 -1559127 -1437388 -2505099 -5791550 -8729847 -8355977 -6002525 -5861762
58994 -5861762 -9085019 -12332884 -12492258 -9658809 -4839992 1354106 5994845 4166621
58986 4166621 -4393581 -12282325 -12368132 -6306938 -636092 3049750 7912467 13167514
58978 13167514 12971830 5514124 -3014483 -6243102 -4563073 -1706987 789910 2517033
58970 2517033 2047618 -184233 -459357 2765296 5189036 2701358 -1865122 -2814683 -147321
58961 -147321 1162697 -885530 -3340053 -3928274 -3783748 -4042256 -3856826 -2720183 -1527814
58952 -1527814 -682378 94225 38566 -1422349 -1790371 2350963 9597789 13867088 11654929
$$ packed form
59012I069969o82600l894694l858886j823808k59687M78758J028741Q95009l72272
59003E80530j383364p56293J21739j067711l286451k938297L73870K353452J40763
58994e861762l223257l247865j59374K833449M818817O194098M640739j828224
58986D166621q560202p888744q5807O061194N670846L685842M862717N255047
58978A3167514j95684p457706q528607l228619J680029K856086K496897J727123
58970B517033m69415k231851k75124L224653K423740k487678m566480r49561K667362
58961a47321J310018k048227k454523n88221J44526k58508J85430J136643J192369
58952a527814Q45436P76603n5659j460915l68022M141334P246826M269299k212159
$$ plain form
58943 11654929 5925853 1265372 -1554544 -3956333 -5440983 -4319183 -1120196 1763717
58935 1763717 3485655 5323724 7561928 7922317 4483188 -813907 -3500882 -1959477
58927 -1959477 282001 -534340 -2500408 -469735 5540601 8791532 4889119 -1677717
58919 -1677717 -3903143 -1871300 -959819 -2734880 -3702880 -2353318 -1072022 -476141 1851299
58910 1851299 5366884 5617485 2093531 878459 5149574 8509668 3682472 -6027049
58902 -6027049 -10622521 -6687927 -258584 2683763 2117189 55623 -2936066 -5409454
58894 -5409454 -4567995 -922822 777588 -1849596 -5050777 -4946449 -3625035 -5018480
58886 -5018480 -7674278 -6956819 -2978476 -705181 -2200228 -4224971 -4572821 -5392096 -8005894
$$ packed form
58943A1654929n729076m660481k819916k401789j484650J121800L198987K883913
58935A763717J721938J838069K238204L60389l439129n297095k686975J541405
58927a959477K241478q16341j966068K030673O010336L250931l902413o566836
58919a677717k225426K031843R11481j775061r68000J349562J281296N95881K327440
58910A851299L515585K50601l523954j215072M271115L360094m827196r709521
58902f027049m595472L934594O429343K942347n66574k061566k991689k473388
58894e409454Q41459L645173J700410k627184l201181J04328J321414j393445
58886e018480k655798P17459L978343K273295j495047k024743l47850q19275k613798
$$ plain form
58877 -8005894 -9524987 -7966452 -6196622 -6580627 -5977204 -1464727 2746867 1133676
58869 1133676 -2950950 -1202754 6299588 10778135 8826897 7071668 9466950 9944165
58861 9944165 3987374 -1433913 1655516 8668250 9566954 4698792 2460107 4186508
58853 4186508 3306374 -1226163 -2855910 -264518 -484103 -5723185 -8169222 -3151520
58845 -3151520 2561265 2140609 -645800 264259 2453894 1442446 811592 5609019 10965059
58836 10965059 8644614 1700695 673111 6233645 7829411 1234744 -4222416 -417214
58828 -417214 7351099 9202669 4421960 -682304 -3449541 -5962785 -8459757 -8814762
58820 -8814762 -7680966 -7979219 -8874172 -5607329 2918206 10491749 10407166 3703747 -2386744
$$ packed form
58877h005894j519093J558535J769830l84005O03423M512477M211594j613191
58869A133676m084626J748196P502342M478547j951238j755229K395282M77215
58861I944165n956791n421287L089429P012734Q98704m868162k238685J726401
58853D186508q80134m532537j629747K591392k19585n239082k446037N017702
58845c151520N712785m20656k786409R10059K189635j011448o30854M797427N356040
58836A0965059k320445o943919j027584N560534J595766o594667n457160L805202
58828d17214P768313J851570m780709n104264k767237k513244k496972l55005
58820h814762J133796k98253q94953L266843Q525535P573543q4583o703419o090491
$$ plain form
58811 -2386744 -3428861 -2198479 -3380521 -6646060 -7791589 -5596057 -3629186 -4171090
58803 -4171090 -4084312 185044 6017022 7279120 2838566 -1805195 -1978120 820189 2509858
58794 2509858 2188359 1861479 2398887 2518066 1318883 -242513 -771041 -235819 169223
58785 169223 -400468 -1520858 -2335712 -2791929 -3261506 -3388299 -2809253 -2836191 -5112983
58776 -5112983 -8144210 -8131902 -4673611 -2282943 -3766156 -5690321 -4378465 -2972038
58768 -2972038 -6592648 -12403945 -11761409 -2870767 5507851 5303493 -1655997 -8605616
58760 -8605616 -12592180 -14102655 -12481802 -7229807 -1548495 510262 -447591 -486138 1564754
58751 1564754 3052036 2152546 79317 -1473292 -2047348 -1327101 784345 2415171 843054
$$ packed form
58811b386744j042117J230382j182042l265539j145529K195532J966871n41904
58803d171090Q6778M269356N831978J262098m440554m643761j72925K798309J689669
58794B509858l21499l26880N37408J19179j199183j561396n28528N35222M05042
58785A69223n69691j120390q14854m56217m69577j26793N79046k6938k276792
58776e112983l031227J2308L458291K390668j483213j924165J311856J406427
58768b972038l620610n811297O42536Q890642Q378618k04358o959490o949619
58760h605616l986564j510475J620853N251995N681312K058757r57853l8547K050892
58751A564754J487282q99490k073229j552609n74056P20247K111446J630826j572117
$$ plain form
58742 843054 -3356616 -5461062 -1742937 5582283 10205002 8345865 2461213 -1820180
58734 -1820180 -1623619 1058517 2865920 3174896 3499765 3810562 1920413 -2757929 -6913917
58725 -6913917 -6591236 -1920194 2998960 4739324 3765994 2779855 2869567 2290601 -751907
58716 -751907 -4875248 -6356843 -3584204 597561 2091543 178278 -2368402 -2933810
58708 -2933810 -1237784 1421578 3296647 3058555 1229845 94087 505646 52310 -3236358
58699 -3236358 -6902159 -7269997 -5509097 -6016426 -8931926 -9284420 -4700424 843080 3000673
58690 3000673 2559675 2507519 3401021 4437205 5824936 7225879 6732759 4022165 1561422
58681 1561422 143551 -3307632 -10204095 -15923362 -15126189 -9125702 -3929159 -2610088
$$ packed form
58742H43054m199670k104446L718125P325220M622719j859137n884652m281393
58734a820180J96561K682136J807403L08976L24869L10797j890149m678342m155988
58725f913917L22681M671042M919154J740364r73330r86139Q9712n78966l042508
58716g51907m123341j481595K772639M181765J493982j913265k546680n65408
58708b933810J696026K659362J875069k38092j828710j135758M11559m53336l288668
58699c236358l665801l67838J760900n07329k915500l52494M583996N543504K157593
58690C000673m40998n2156Q93502J036184J387731J400943m93120k710594k460743
58681A561422j417871l451183o896463n719267P97173O000487N196543J319071
$$ plain form
58673 -2610088 -3215360 -2767855 -46602 4340906 7971174 8241972 6065795 5414110 7070501
58664 7070501 6556649 1393579 -3881750 -4396827 -2449563 -2795561 -4304785 -3040730 -575934
58655 -575934 -1526427 -4630900 -4373749 -823344 283031 -2432406 -3942678 -1986811 -390690
58646 -390690 -1174045 -979525 1696731 2919289 648888 -982977 935583 2516414 -58684
58637 -58684 -3326104 -1908319 2836357 5281405 3986354 2423129 3004546 4960411 7082879
58628 7082879 8927692 10046834 10469296 10630151 9198376 3638772 -4843138 -10167209
58620 -10167209 -8500083 -3860312 -3046990 -7151730 -11713470 -13416619 -12729786 -10920227
58612 -10920227 -8095382 -4300030 -425446 1945493 1045463 -3207416 -7565345 -8530453
$$ packed form
58673b610088o05272M47505K721253M387508L630268K70798k176177o51685J656391
58664G070501n13852n163070n275329n15077J947264l45998j509224J264055K464796
58655e75934r50493l104473K57151L550405J106375k715437j510272J955867J596121
58646c90690p83355J94520K676256J222558k270401j631865J918560J580831k575098
58637e8684l267420J417785M744676K445048j295051j563225N81417J955865K122468
58628G082879J844813J119142M22462J60855j431775n559604q481910n324071
58620a0167209J667126M639771Q13322m104740m561740j703149O86833J809559
58612a0920227K824845L795352L874584K370939r00030m252879m357929r65108
$$ plain form
58604 -8530453 -7655689 -9721475 -14356171 -14840184 -8326942 -1636850 -1818947 -5716861 -5395501
58595 -5395501 -475992 2366060 488717 -1701400 -894409 771050 733289 -388092 -1958699
58586 -1958699 -5098975 -9095830 -10263037 -7019782 -2994240 -2438760 -4630157 -5166815
58578 -5166815 -1729305 3204865 5195159 2719001 -1043050 -2002942 -636900 -1556853
58570 -1556853 -6715733 -11886761 -12164313 -8322772 -4702472 -3215368 -3031125 -3902508 -5446740
58561 -5446740 -4922696 -613582 3723137 2952431 -1411851 -2659412 1364854 5338748
58553 5338748 4513023 801583 -1180052 -312586 905751 -285757 -4712694 -9987218
58545 -9987218 -11153270 -5801242 1270293 2398160 -3213877 -8157413 -6406885 -149351
$$ packed form
58604h530453Q74764k065786m634696m84013O513242O690092j82097l897914L21360
58595e395501M919509K842052j877343k190117Q06991J665459l7761j121381j570607
58586a958699l140276l996855j167207L243255M025542N55480k191397n36658
58578e166815L437510M934170J990294k476158l762051r59892J366042r19953
58570a556853n158880n171028k77552L841541L620300J487104J84243q71383j544232
58561e446740N24044M309114M336719p70706m364282j247561M024266L973894
58553E338748q25725l711440j981635Q67466J218337j191508m426937n274524
58545i987218j166052N352028P071535J127867n612037m943536J750528O257534
$$ plain form
58537 -149351 4753528 6184880 5969938 5544042 4383391 1582958 -2530235 -5622463 -4492033
58528 -4492033 1088495 6517266 7408408 5626645 6211851 8929803 8277518 2560579 -2794566
58519 -2794566 -3062486 -227954 1468869 1378651 797721 -465982 -2635985 -4332215 -5054232
58510 -5054232 -6123127 -7140902 -5478783 -1556783 -118841 -3339824 -7224340 -8108625
58502 -8108625 -7855279 -8696380 -8136902 -4071700 -126899 106641 -87658 3830266 8923606
58493 8923606 9197748 5837428 4613888 4816294 142475 -9022332 -13646398 -9130828
58485 -9130828 -2261174 -866204 -3152800 -2746727 435936 681618 -4096993 -8949686
58477 -8949686 -8398573 -3108644 1231525 650115 -2525814 -2662743 1620727 5180302 3534549
$$ packed form
58537a49351M902879J431352k14942m25896j160651k800433m113193l092228J130430
58528d492033N580528N428771Q91142j781763N85206K717952o52285n716939n355145
58519b794566k67920K834532J696823r0218n80930j263703k170003j696230p22017
58510e054232j068895j017775J662119L922000J437942l220983l884516q84285
58502h108625K53346q41101N59478M065202L944801K33540j94299L917924N093340
58493H923606K74142l360320j223540K02406m673819r164807m624066M515570
58485i130828O869654J394970k286596M06073L182663K45682m778611m852693
58477h949686N51113N289929M340169n81410l175929j36929M283470L559575j645753
$$ plain form
58468 3534549 -267921 49204 4428814 6510564 3161582 -1705312 -4229802 -5901481
58460 -5901481 -8919024 -11223891 -10219439 -7699531 -6591185 -5616521 -2068367 1984342
58452 1984342 1619940 -3131001 -6443155 -4806818 -1913749 -3284328 -8751939 -12920423
58444 -12920423 -11928636 -7525364 -4437595 -5050346 -7244446 -7193502 -3878273 -348135 -237707
58435 -237707 -3541474 -6621599 -6291342 -3025748 159306 1274819 1064206 1324871 2405309
58426 2405309 3074089 2686670 2494457 4076284 6936345 8748826 8211771 6682580 6148438
58417 6148438 6095899 3789800 -1704493 -6855787 -6760935 -1103265 4814828 6228188 4428814
58408 4428814 3871074 5094652 4336493 508032 -1928150 323243 3409802 1322872
$$ packed form
58468C534549l802470L17125M379610K081750l348982m866894k524490j671679
58460e901481l017543k304867J004452K519908J108346R74664L548154M052709
58452A984342l64402m750941l312154J636337K893069j370579n467611m168484
58444a2920423R91787M403272L087769o12751k194100N0944L315229L530138J10428
58435b37707l303767l080125L30257L265594L185054J115513k10613K60665J080438
58426B405309O68780l87419j92213J581827K860061J812481n37055j529191n34142
58417F148438n2539k306099n494293n151294R4852N657670N918093J413360j799374
58408D428814n57740J223578p58159l828461k436182K251393L086559k086930
$$ plain form
58400 1322872 -5122660 -9231635 -8015903 -5821542 -7013517 -9431713 -7999359 -2003768
58392 -2003768 4358376 7081850 5345665 853864 -2971021 -2286841 3274277 8254262
58384 8254262 6430702 -1099725 -6309514 -4196598 1020899 2285697 -792972 -2991414
58376 -2991414 -2199435 -1694233 -3418480 -4515289 -2914555 -1622452 -3572308 -5786161
58368 -5786161 -3563647 1702037 4220228 2401708 420091 1078615 2387388 2326305 2081537
58359 2081537 2771146 3455319 4410288 7776945 12397243 12845612 7295575 1892756 2566760
58350 2566760 6226275 5714865 787712 -2219204 -438518 2246619 2278307 948591 322463
58341 322463 -540735 -2897159 -5162948 -4865842 -1960893 1202954 2040388 -329723 -3785298
$$ packed form
58400A322872o445532m108975J215732K194361j191975k418196J432354N995591
58392b003768O362144K723474j736185m491801l824885O84180N561118M979985
58384H254262j823560p530427n209789K112916N217497J264798l078669k198442
58376b991414P91979N05202j724247j096809J600734J292103j949856k213853
58368e786161K222514N265684K518191j818520j981617O58524J308773o1083k44768
58359B081537O89609O84173R54969L366657M620298M48369n550037n402819O74004
58350B566760L659515n11410m927153l006916J780686K685137L1688j329716o26128
58341C22463q63198k356424k265789K97106K904949L163847Q37434k370111l455575
$$ plain form
58332 -3785298 -4346005 -732042 2965446 1895367 -2958243 -6078264 -4955228 -2609308
58324 -2609308 -2325711 -3664743 -4642924 -4504386 -3150856 -716080 1355914 1608524 1523773
58315 1523773 3979399 8185117 9939593 8009265 6071624 6370271 5649128 532489
58307 532489 -6382725 -9544075 -7493168 -3553472 -953975 -343500 -1177904 -2758126 -4184983
58298 -4184983 -5180395 -6500238 -8162486 -8185789 -4689776 1281862 6158434 6667648 2134595
58289 2134595 -4628465 -8475732 -6060089 286580 4652979 4262782 2003154 1650421
58281 1650421 3395925 5376152 6614524 6419086 3606994 -1156776 -4479919 -4258357
58273 -4258357 -2684461 -2877447 -4510046 -5371514 -5307473 -5633551 -6245562 -6417836 -7144107
$$ packed form
58332c785298n60707L613963L697488j070079m853610l120021J123036K345920
58324b609308K83597j339032r78181J38538J353530K434776K071994K52610q4751
58315A523773K455626M205718J754476j930328j937641K98647p21143n116639
58307E32489o915214l161350K050907L939696K599497O10475q34404j580222j426857
58298d184983r95412j319843j662248k3303L496013N971638M876572N09214m533053
58289B134595o763060l847267K415643O346669M366399l90197k259628l52733
58281A650421J745504J980227J238372j95438k812092m763770l323143K21562
58273d258357J573896j92986j632599q61468O4041l26078o12011j72274p26271
$$ plain form
58264 -7144107 -9416136 -11164073 -9450599 -5494232 -4140953 -7683646 -12719662 -14044565
58256 -14044565 -10003600 -3315751 2152970 4663090 5042639 4346144 2002528 -2457452
58248 -2457452 -6627465 -6939492 -3532329 -336391 754877 2339925 6235676 9417785
58240 9417785 8358434 4462419 1626922 821671 790208 1829658 4630354 7078962 6632918
58231 6632918 4745311 4785578 6736472 8242896 9533198 12098670 13350558 8858164
58223 8858164 788173 -1978233 5159822 15909437 20528933 16689345 10043345 6395300
58215 6395300 6290473 6428584 4397216 1776489 2392130 6979113 11130308 10584248 6792136
58206 6792136 4013536 2604244 -259747 -4219937 -5701490 -4431301 -4060236 -4947421
$$ packed form
58264g144107k272029j747937J713474L956367J353279l542693n036016j324903
58256a4044565M040965O687849N468721K510120L79549o96495k343616m459980
58248b457452m170013l12027L407163L195938J091268J585048L895751L182109
58240I417785j059351l896015k835497q05251l1463J039450K800696K448608m46044
58231F632918j887607M0267J950894J506424J290302K565472J251888m492394
58223H858164q069991k766406P138055J0749615M619496l839588o646000l648045
58215F395300j04827J38111k031368k620727O15641M586983M151195n46060l792112
58206F792136k778600j409292k863991l960190j481553J270189L71065q87185
$$ plain form
58198 -4947421 -2330923 5641808 13349661 14505192 9251562 1654785 -5146839 -8122380
58190 -8122380 -4185671 4226317 8036796 1860484 -7924024 -11263377 -7511379 -3961749
58182 -3961749 -3889682 -3818633 -2063622 -1999811 -5075381 -7139838 -4720033 -318360 1368256
58173 1368256 -872212 -4935533 -8161704 -8312589 -4957407 -1473161 -2503838 -7742133
58165 -7742133 -11302488 -8987628 -3117872 1573914 3468152 3253693 977862 -3074068
58157 -3074068 -7003637 -9475895 -10997953 -10940209 -6675571 1150323 6115136 3464449
58149 3464449 -2570855 -4180033 -811659 1306740 -517763 -2329773 -1365089 -278737
58141 -278737 -1273136 -2066968 -1086432 -1253823 -4235984 -5625284 -1268991 5207440 7288475
$$ packed form
58198d947421K616498P972731P707853J155531n253630p596777o801624k975541
58190h122380L936709Q411988L810479o176312r784508l339353L751998L549630
58182c961749P2067P1049J755011O3811l075570k064457K419805M401673J686616
58173A368256k240468m063321l226171j50885L355182L484246j030677n238295
58165g742133l560355K314860N869756M691786J894238k14459k275831m051930
58157c074068l929569k472258j522058N7744M264638P825894M964813k650687
58149C464449o035304j609178L368374K118399j824503j812010R64684J086352
58141b78737r94399p93832R80536j67391k982161j389300M356293O476431K081035
$$ plain form
58132 7288475 5401571 5092042 6766594 4974836 -1277643 -5217634 -2565519 1282912
58124 1282912 -743117 -6792279 -9289672 -6042856 -2099932 -1323968 -1840625 -857330 669641
58115 669641 419806 -1330882 -2626344 -2922009 -3007191 -2761253 -1004277 2402249 5578335
58106 5578335 6227769 3917074 575916 -1333551 -1168684 -403460 -563343 -1561022 -2566830
58097 -2566830 -3740458 -6027506 -9439911 -12389565 -12788805 -9653034 -4312568 -378235
58089 -378235 -1121451 -5614562 -8610145 -6041060 62890 4062722 3606873 1791471 2378212
58080 2378212 5123400 6616191 4165673 -1773146 -7745045 -9602586 -6210619 -1177261
58072 -1177261 619606 -1647569 -4658408 -5964135 -6326255 -6514177 -5202562 -2060726
$$ packed form
58132G288475j886904l09529J674552j791758o252479l939991K652115L848431
58124A282912k026029o049162k497393L246816L942924P75964n16657R83295J526971
58115F69641k49835j750688j295462k95665q5182K45938J756976L406526L176086
58106E578335O49434k310695l341158j909467J64867P65224j59883r97679j005808
58097b566830j173628k287048l412405k949654l99240L135771N340466L934333
58089c78235p43216m493111k995583K569085O103950L999832m55849j815402N86741
58080B378212K745188J492791k450518n938819n971899j857541L391967N033358
58072a177261J796867k267175l010839j305727l62120j87922J311615L141836
$$ plain form
58064 -2060726 -19175 -1477240 -4167146 -4034417 -1105772 838715 41927 -1082415
58056 -1082415 -34533 2362592 3691562 2986247 887295 -1670117 -3694841 -4062948
58048 -4062948 -2311221 745187 3450861 4136698 2151865 -893110 -1710940 990363
58040 990363 3908293 2710092 -1689235 -3419147 606792 6191790 7350927 3975690
58032 3975690 972373 1152311 2494874 2371080 1191921 794329 1530702 2419896 2853104
58023 2853104 2945560 2910807 2706274 1706749 -1188535 -5868170 -9510207 -8792717 -4369890
58014 -4369890 -1190181 -2898639 -7346166 -9264058 -6272453 -528035 4612198 7462477
58006 7462477 7918511 6607414 4563430 2555002 684827 -358645 1667387 8218629
$$ packed form
58064b060726K041551j458065k689906J32729K928645J944487p96788j124342
58056a082415J047882K397125J328970p05315k098952k557412k024724l68107
58048d062948J751727L056408K705674O85837j984833l044975q17830K701303
58040I90363K917930j198201m399327j729912M025939N584998J159137l375237
58032C975690l003317J79938J342563j23794j179159l97592P36373Q89194M33208
58023B853104R2456l4753k04533r99525k895284m679635l642037P17490M422827
58014d369890L179709j708458m447527j917892K991605N744418N140233K850279
58006G462477M56034j311097k043984k008428j870175j043472K026032O551242
$$ plain form
57998 8218629 16539171 20898449 18541137 12968060 9783448 10113832 9854766 5426654
57990 5426654 -1345661 -5142212 -3262522 1559279 4686800 4473515 2527652 542374
57982 542374 -792571 -423440 2233519 4597627 2722665 -2515943 -4759564 -616744
57974 -616744 4711378 4394149 -385618 -3046999 -1765964 -600893 -1224072 -709166 1407811
57965 1407811 1117689 -2231282 -2791701 2800571 8843209 8035218 1137263 -5948595 -10597933
57956 -10597933 -13089368 -11517125 -4375969 3448621 4428664 -1878116 -8682797 -11381592
57948 -11381592 -11274256 -9964523 -6740087 -2935192 -2502105 -5516684 -6489444 -2331954
57940 -2331954 2657459 3226486 334647 -2056073 -3473236 -5321620 -5682293 -1604201
$$ packed form
57998H218629Q320542M359278k357312n573077l184612L30384k59066m428112
57990E426654o772315l796551J879690M821801L127521k13285j945863j985278
57982E42374j334945L69131K656959K364108j874962n238608k243621M142820
57974f16744N328122l17229m779767k661381J281035J165071o23179N14906K116977
57965A407811k90122l348971n60419N592272O042638q07991o897955p085858m649338
57956a0597933k491435J572243P141156P824590R80043o306780o804681k698795
57948a1381592J07336J309733L224436L804895M33087l014579r72760M157490
57940b331954M989413N69027k891839k390720j417163j848384l60673M078092
$$ plain form
57932 -1604201 4300500 5286095 -387143 -6203261 -5439045 687085 5561495 5711796 3476114
57923 3476114 1907319 834123 -655049 -1003557 1351038 3947828 2789528 -1203293
57915 -1203293 -2546090 709168 3630247 1852331 -1823119 -2455061 -1107622 -2392034
57907 -2392034 -5937868 -6665029 -3267632 -280062 -636239 -1631052 -117219 2974546 5433360
57898 5433360 6999799 7646501 6310815 3437242 1429962 870448 -132202 -1393212
57890 -1393212 78882 4171566 5950256 2973614 -517375 -725687 -829201 -5021112
57882 -5021112 -9967996 -8866407 -1978809 3467026 3300543 357996 -1761783 -3260360
57874 -3260360 -5276411 -7212415 -8629244 -10066127 -10457864 -7271184 -1028537 3503609
$$ packed form
57932a604201N904701R85595n673238n816118P64216O126130M874410J50301k235682
57923C476114j568795j073196j489172l48508K354595K596790j158300l992821
57915a203293j342797L255258K921079j777916l675450o31942J347439j284412
57907b392034l545834p27161L397397K987570l56177r94813J513833L091765K458814
57898E433360J566439O46702j335686k873573k007280n59514j002650j261010
57890a393212J472094M092684J778690k976642l490989k08312j03514m191911
57882e021112m946884J101589O887598N445835j66483k942547k119779j498577
57874c260360k016051j936004j416829j436883l91737L186680O242647M532146
$$ plain form
57866 3503609 2946904 -296360 -1625190 -247674 1033948 728901 193146 165789 -1203958
57857 -1203958 -5037258 -8281639 -6677597 -1253674 1483684 -2115167 -7050869 -5795064
57849 -5795064 1359024 6545936 4630285 -1622984 -7404043 -11450736 -13477307 -11354471
57841 -11354471 -5033822 561754 1175940 -923712 -926013 1293588 2438919 1948868 1857834
57832 1857834 2114506 1110648 -190851 388793 1626285 705955 -993380 617255 5022636
57823 5022636 6760167 3161621 -2560302 -6720145 -8555267 -7420735 -2435791 3181656
57815 3181656 3290273 -2589394 -7050290 -4797293 -61823 345501 -3012006 -4686146
57807 -4686146 -3437372 -2354843 -1541763 2307482 8377785 10292171 5156423 -765257
$$ packed form
57866C503609n56705l243264j328830J377516J281622l05047n35755k7357j369747
57857a203958l833300l244381J604042N423923K737358l598851m935702J255805
57849e795064P154088N186912j915651o253269n781059m046693k026571K122836
57841a1354471O320649N595576O14186k099652k301K219601J145331m90051r1034
57832A857834K56672j003858j301499N79644J237492r20330j699335J610635M405381
57823E022636J737531l598546n721923m159843j835122J134532M984944N617447
57815C181656J08617n879667m460896K252997M735470M07324l357507j674140
57807d686146J248774J082529Q13080L849245O070303J914386n135748n921680
$$ plain form
57799 -765257 179639 6295538 8692664 3717342 -2090617 -1628058 2751229 3690344 800051
57790 800051 1290525 7750068 12412646 8004803 -1080287 -4815610 -1447315 1864588
57782 1864588 819591 -1395171 -1782225 -2255377 -4261830 -5142209 -3195070 -1075033 -826929
57773 -826929 -567131 442623 -1212788 -6607354 -10182854 -7535464 -2889564 -2180749 -2634283
57764 -2634283 2560826 11339996 13735885 6383735 -2378019 -4366266 -1164085 1790603
57756 1790603 4092488 7774116 10461254 7876326 1512945 -2224491 -899280 661786
57748 661786 -2506552 -8440420 -10704016 -6417399 337803 3028990 -763080 -7764818
57740 -7764818 -13111101 -14703537 -13219255 -9419458 -3487513 3121997 7351205 7134531
$$ packed form
57799g65257R44896O115899K397126m975322n807959M62559M379287R39115k890293
57790H00051M90474O459543M662578m407843r085090l735323L368295L311903
57782A864588j044997k214762l87054m73152k006453q80379J947139K120037K48104
57773h26929K59798J009754j655411n394566l575500K647390M645900P08815m53534
57764b634283N195109Q779170K395889p352150q761754j988247L202181K954688
57756A790603K301885L681628K687138k584928o363381l737436J325211J561066
57748F61786l168338n933868k263596M286617O755202K691187l792070p001738
57740g764818n346283j592436J484282L799797N931945O609510M229208k16674
$$ plain form
57732 7134531 3257958 -1924777 -6286768 -7938134 -5627340 -887522 1951971 340561
57724 340561 -2997385 -3764408 -2249746 -2227876 -4069804 -3683091 246833 2968253 1169565
57715 1169565 -521065 3933396 11594142 13504053 7582762 1465505 880713 2107358
57707 2107358 -334784 -4508917 -5071804 -2297880 -971121 -2678406 -4981898 -6580318
57699 -6580318 -7581188 -5987039 -194088 5489997 4531160 -1902347 -5336042 -2039424
57691 -2039424 1974925 1028092 -1544756 401326 5833131 8510226 6095764 1973983
57683 1973983 -498726 -1090044 -939042 -1255258 -2995588 -5231564 -5248079 -2561243 -494612
57674 -494612 -980194 -862621 2647063 5902456 3600260 -2399453 -5101642 -2399469 1065272
$$ packed form
57732G134531l876573n182735m361991j651366K310794M739818K839493j611410
57724C40561l337946p67023J514662K1870j841928L86713L929924K721420j798688
57715A169565j690630M454461P660746J909911n921291o117257n84792J226645
57707B107358k442142m174133n62887K773924J326759j707285k303492j598420
57699f580318j000870J594149N792951N684085r58837o433507l433695L296618
57691b039424M014349r46833k572848J946082N431805K677095k414462m121781
57683A973983k472709n91318J51002l16216j740330k235976j6515K686836K066631
57674d94612m85582J17573L509684L255393k302196n999713k702189K702173L464741
$$ plain form
57665 1065272 2041110 2284097 2967286 1881635 -1243860 -2174477 1656395 6727258 8531846
57656 8531846 7334709 5637204 3744819 1564335 1185439 3283671 3957577 -91778
57648 -91778 -5673728 -7411474 -5791808 -5199400 -5417752 -1960494 4710335 7275158 1581528
57639 1581528 -6802881 -9653721 -5886323 -763046 1674107 1659927 1078305 1050855 1224856
57630 1224856 -345227 -4909292 -9270885 -7479280 1082121 8542418 7333408 -429735
57622 -429735 -6685497 -8204428 -8308572 -9356432 -9861193 -9364607 -10013526 -11550388 -10032383
57613 -10032383 -4028063 2229666 4476790 3608664 2995030 4108188 6865224 10572565
57605 10572565 12456351 9523199 4418904 4585173 11925579 18148885 15313975 6810428
$$ packed form
57665A065272R75838K42987O83189j085651l125495r30617L830872N070863J804588
57656H531846j197137j697505j892385k180484l78896K098232O73906m049355
57648i1778n581950j737746J619666N92408k18352L457258O670829K564823n693630
57639A581528q384409k850840L767398N123277K437153j4180n81622k7450J74001
57630A224856j570083m564065m361593J791605Q561401P460297j209010p763143
57622d29735o255762j518931j04144j047860n04761M96586o48919j536862J518005
57613a0032383O004320O257729K247124q68126o13634J113158K757036L707341
57605A0572565J883786k933152n104295J66269P340406O223306k834910q503547
$$ plain form
57597 6810428 2000451 3283394 5135989 3953314 1872268 1234079 1422775 1657173 1963782
57588 1963782 1213109 -1327692 -2862422 -253667 4011970 3989075 -1704226 -8671543 -12993779
57579 -12993779 -13819222 -10835770 -5092254 -1430738 -3315816 -5797030 -1324060 7529254
57571 7529254 10262619 4671830 679761 4323297 8145434 3796291 -4693643 -8264348
57563 -8264348 -6544921 -5528712 -6579489 -6443566 -4776834 -3612733 -1924810 1953255
57555 1953255 4969414 3587285 982402 2699074 7376108 9557581 9781671 13151822
57547 13151822 18578247 18650347 11411623 3853332 1374698 1246816 -455013 -2260760
57539 -2260760 -1680308 -733428 -2512295 -5648760 -6139975 -2793488 1562560 2911367 -623133
$$ packed form
57597F810428m809977J282943J852595j182675k081046o38189J88696K34398L06609
57588A963782p50673k540801j534730K608755M265637k2895n693301o967317m322236
57579a2993779q25443K983452N743516L661516j885078k481214M472970Q853314
57571G529254K733365n590789l992069L643536L822137m349143q489934l570705
57563h264348J719427J016209j050777J35923J666732J164101J687923L878065
57555A953255L016159j382129k604883J716672M677034K181473K24090L370151
57547A3151822N426425P2100p238724p558291k478634j27882j701829j805747
57539b260760N80452R46880j778867l136465m91215L346487M356048J348807l534500
$$ plain form
57530 -623133 -6218203 -7379424 -678705 8870632 12971972 10066565 5535782 2498598
57522 2498598 -1243213 -6217131 -8283970 -5478443 -1657348 299547 3211129 9191644
57514 9191644 13923866 12819429 8658867 7159032 8220856 7875244 6526028 8352128
57506 8352128 13239146 15892547 13752082 10312517 9281007 10198377 11492386 13468836
57498 13468836 15962308 16744415 15133606 14432274 17858466 24105943 29698531 33799904
57490 33799904 37398146 39256112 37034468 32611270 31976904 37948725 46245339 51473797
57482 51473797 54560436 60828427 72242192 85739074 99267960 115348587 137131900
57475 137131900 164232888 194819996 229491218 270102438 315219576 358128822 388624883
$$ packed form
57530f23133n595070j161221O700719R549337M101340k905407m530783l037184
57522B498598l741811m973918k066839K805527L821095J956895K911582N980515
57514I191644M732222j104437m160562j499835J061824l45612j349216J826100
57506H352128M887018K653401k140465l439565j031510R17370J294009J976450
57498A3468836K493472P82107j610809p01332L426192O247477N592588M101373
57490C3799904L598242J857966k221644m423198o34366N971821Q296614N228458
57482E1473797L086639O267991J1413765J3496882J3528886J6080627K1783313
57475A37131900K7100988L0587108L4671222M0611220M5117138M2909246L0496061
$$ plain form
57468 388624883 396620541 377279410 335842754 286287374 242026187 207135291 177347671
57461 177347671 148327587 120962542 99199234 84964856 75961664 68020508 59651409
57454 59651409 53711240 53077310 55190013 53761441 46285450 36459407 28205411 21428038
57446 21428038 15656001 13166219 14776178 16443332 14503151 11191023 10471294 11433073
57438 11433073 10824589 9256822 9190404 9164617 6304807 2837513 3475308 7285691 8826365
57429 8826365 6944621 5807362 7261110 8900230 9900055 11675898 12133469 6956149
57421 6956149 -1664217 -5276469 -1009157 3930038 3080333 -605509 -1140174 1408807
57413 1408807 3108193 2777056 1696661 282491 -1096443 -1199739 -681316 -2111636 -4978546
$$ packed form
57468C88624883P995658j9341131m1436656m9555380m4261187l4890896k9787620
57461A77347671k9020084k7365045k1763308j4234378r003192p941156q369099
57454E9651409n940169o33930K112703j428572p475991r826043q253996o777373
57446B1428038n772037k489782J609959J667154j940181l312128p19729R61779
57438A1433073o08484j567767o6418k5787k859810l467294O37795L810383J540674
57429H826365j881744j137259J453748J639120R99825J775843M57571n177320
57421F956149q620366l612252M267312M939195q49705l685842n34665K548981
57413A408807J699386l31137j080395j414170j378934j03296N18423j430320k866910
$$ plain form
57404 -4978546 -5284885 -2543363 -1619617 -4376866 -5588062 -1708789 2134631 -358912
57396 -358912 -7051203 -11306366 -11386868 -9659581 -6118920 383153 6743128 7993647 4067893
57387 4067893 -754148 -3663641 -4365155 -2740447 -44284 273721 -2274425 -2395524 3244273
57378 3244273 8954124 7343370 768522 -2177467 301160 1915894 -598471 -3500763
57370 -3500763 -3961387 -3952162 -4251593 -1969565 2844453 4577260 112299 -5454999 -5549884
57361 -5549884 -1038310 1884075 521692 -1638045 -446707 3745706 7158425 7493859
57353 7493859 6540627 7172121 8628155 7409414 3386271 1266153 3564887 5931216
57345 5931216 3581566 -728317 -467691 4858077 9335152 9210129 6330308 3368530
$$ packed form
57404d978546l06339K741522R23746k757249j211196L879273L843420k493543
57396c58912o692291m255163q0502J727287L540661O502073O359975J250519l925754
57387D067893m822041k909493p01514J624708K696163L18005k548146j21099N639797
57378C244273N709851j610754o574848k945989K478627J614734k514365k902292
57370c500763m60624R225k99431K282028M814018J732807m464961n567298r4885
57361e549884M511574K922385j362383k159737J191338M192413L412719L35434
57353G493859r53232O31494J456034j218741m023143k120118K298734K366329
57345E931216k349650m309883K60626N325768M477075j25023k879821k961778
$$ plain form
57337 3368530 1092757 573259 2702662 4819702 2990903 -1313699 -1887975 3357118
57329 3357118 8900647 8890972 3936052 -1123366 -2607725 276188 5507276 8670444 6713868
57320 6713868 2305706 934078 3212859 4535569 3045313 2284252 3834862 3301905
57312 3301905 -2350380 -8302728 -7921955 -2239568 1887690 1487237 271894 1832750
57304 1832750 4410603 4011166 222185 -3200283 -3198298 -1424746 -2216128 -6713030 -10945501
57295 -10945501 -11065278 -8524577 -7559575 -8974042 -9620875 -7313755 -2971651 1681241
57287 1681241 5269740 6094498 3852996 1661454 2633828 4942884 4532480 2194789 2657625
57278 2657625 6389724 8278714 5984072 3743674 5265940 8138251 8579174 7097731
$$ packed form
57337C368530k275773n19498K129403K117040j828799m304602n74276N245093
57329C357118N543529r675m954920n059418j484359K883913N231088L163168j956576
57320F713868m408162j371628K278781J322710j490256p61061J550610n32957
57312C301905n652285n952348L80773N682387M127258m00453j215343J560856
57304A832750K577853l99437l788981l422468J985J773552p91382m496902m232471
57295a0945501j19777K540701R65002j414467o46833K307120M342104M652892
57287A681241L588499Q24758k241502k191542R72374K309056m10404k337691M62836
57278B657625L732099J888990k294642k240398J522266K872311M40923j481443
$$ plain form
57270 7097731 5783105 4040647 961677 -1422055 -1167585 -6902 -411023 -1605286
57262 -1605286 -1781576 -1704052 -2714676 -3527934 -2473768 -822444 -469130 -268957 1819869
57253 1819869 4581562 5067272 3164319 1450937 1269323 1669759 1571513 642819 -1259936
57244 -1259936 -3548684 -4589659 -3585549 -1905701 -1384089 -2561841 -5371276 -9424380
57236 -9424380 -12538483 -11647632 -6982652 -2923024 -2721206 -4554925 -4593665 -1745257 2183081
57227 2183081 4480048 2370892 -4748644 -12158805 -12869358 -6376285 -209342 470099
57219 470099 152405 5061443 12150056 12696716 4933025 -3721569 -7013615 -6443226 -6215235
57210 -6215235 -6616971 -5145581 -1451045 1584677 1183396 -2110727 -4811974 -4219221 -1333954
$$ packed form
57270G097731j314626j742458l078970k383732K54470J160683m04121j194263
57262a605286j76290P7524j010624q13258J054166J651324L53314K00173K088826
57253A819869K761693M85710j902953j713382j81614M00436r8246r28694j902755
57244a259936k288748j040975J004110J679848N21612j177752k809435m053104
57236i424380l114103Q90851M664980M059628K01818j833719l8740K848408L928338
57227B183081K296967k109156p119536p410161p10553O493073O166943O79441
57219D70099l17694M909038P088613N46660p763691q654594l292046N70389K27991
57210f215235m01736J471390L694536L035722m01281l294123k701247N92753K885267
$$ plain form
57201 -1333954 861751 1144515 24439 -2703514 -6545731 -7323862 -1293405 7146372
57193 7146372 8576751 1655752 -4084138 -2302425 990822 -1706306 -6842611 -6620921
57185 -6620921 -2543690 -2087162 -5539994 -6842522 -5691408 -7709038 -12334773 -11541191
57177 -11541191 -3197149 3970070 2892244 -2193592 -3267716 530258 4178789 4259088
57169 4259088 1015499 -3426463 -5785727 -3874077 -235635 76988 -3192311 -4894002
57161 -4894002 -2718257 -752703 -2303146 -4433688 -3095846 788709 3927694 5435609
57153 5435609 5713704 4329423 2245092 2485257 5409639 6943858 4490495 666968
57145 666968 -1788089 -4130940 -6912149 -6332256 -561958 4718710 3352283 -1934735
$$ packed form
57201a333954K195705K82764j120076k727953l842217p78131O030457Q439777
57193G146372J430379o920999n739890J781713L293247k697128n136305K21690
57185f620921M077231M56528l452832j302528J151114k017630m625735P93582
57177a1541191Q344042P167219j077826n085836j074124L797974L648531Q0299
57169D259088l243589m441962k359264J911650L638442L12623l269299j701691
57161d894002K175745J965554j550443k130542J337842L884555L138985J507915
57153E435609K78095j384281k084331K40165K924382J534219k453363l823527
57145F66968k455057k342851k781209N79893N770298N280668j366427n287018
$$ plain form
57137 -1934735 -3609455 -298628 3008699 4022492 5257760 7361128 7280732 4345400
57129 4345400 2373361 3762636 5962266 5688259 3061338 142440 -1429804 -386388
57121 -386388 3313877 6777007 6618491 3665796 1604354 618757 -2877628 -8910030 -11766890
57112 -11766890 -8234573 -3283536 -3241898 -6945060 -8702119 -7438927 -7027798 -8469696
57104 -8469696 -7839770 -3201416 1415983 1415730 -2325935 -5328271 -4985186 -1732975 3236144
57095 3236144 8455540 11245072 9188442 3141045 -2695672 -4349113 -1531751 2040757
57087 2040757 1589684 -4303149 -11494214 -13752719 -9347216 -2788086 835319 1047349
57079 1047349 -55170 -2126499 -5546983 -8203247 -7470246 -4291383 -1219035 2258899
$$ packed form
57137a934735j674720L310827L307327J013793J235268K103368q0396k935332
57129D345400j972039J389275K199630k74007k626921k918898j572244J043416
57121c86388L700265L463130j58516k952695k061442r85597l496385o032402k856860
57112a1766890L532317M951037M1638l703162j757059J263192M11129j441898
57104h469696O29926M638354M617399k53l741665l002336L43085L252211M969119
57095C236144N219396K789532k056630o047397n836717j653441K817362L572508
57087B040757m51073n892833p191065k258505M405503O559130L623405K12030
57079A047349j102519k071329l420484k656264P33001L178863L072348L477934
$$ plain form
57071 2258899 7423710 10709977 7342828 854693 793098 8307556 12377637 5400620
57063 5400620 -5221776 -8172945 -4273183 -2448849 -4562654 -4873903 -2295648 -2036658
57055 -2036658 -4643916 -3896858 1979978 6283636 4527374 955274 153243 -296653 -3595507
57046 -3595507 -6750335 -5880799 -3408196 -3807415 -6128078 -6656045 -5786616 -6416738 -8026210
57037 -8026210 -8028506 -7111353 -7775236 -8877331 -6865116 -1898096 1685620 695704 -4483976
57028 -4483976 -11523764 -16581208 -14935917 -5920806 3753269 6415011 2835824 647785
57020 647785 3608255 7517580 7612563 4982996 3370293 3355973 2678188 325879 -2106105
57011 -2106105 -2381559 300480 4628787 7992259 8327634 5246566 -385565 -6562795
$$ packed form
57071B258899N164811L286267l367149o488135o1595P514458M070081o977017
57063E400620j0622396k951169L899762J824334k113805l11249K578255K58990
57055b036658k607258P47058N876836M303658j756262l572100q02031m49896l298854
57046c595507l154828Q69536K472603l99219k320663n27967Q69429o30122j609472
57037h026210k296R17153o63883j102095K012215M967020L583716r89916n179680
57028d483976p039788n057444J645291R015111R674075K661742l579187k188039
57020F47785K960470L909325R4983k629567j612703j4320o77785k352309k431984
57011b106105k75454K682039M328307L363472L35375l081068n632131o177230
$$ plain form
57003 -6562795 -9684858 -6851508 -384077 2795756 -820000 -6332001 -6762172 -1969977
56995 -1969977 2851081 5342630 7373095 9443879 9508472 7547362 5979799 4936567
56987 4936567 2433212 109177 2832864 10346987 15005677 11512081 4438155 1834148
56979 1834148 4697620 7224365 5333385 627540 -3183466 -4293491 -3351252 -2205016
56971 -2205016 -2055083 -2138087 -1354224 -1181353 -4069215 -8164004 -7653267 -768555 6326534
56962 6326534 7063336 2712992 -728910 -904096 262843 1693690 3350357 2809154 -2298829
56953 -2298829 -8711784 -10435744 -7799926 -7414093 -11377142 -12919660 -6444850 3443839
56945 3443839 7986248 5680441 2200221 1162446 746732 -982803 -2703178 -2833387
$$ packed form
57003f562795l122063K833350O467431L179833l615756n512001m30171M792195
56995a969977M821058K491549K030465K070784O4593j961110j567563j043232
56987D936567k503355k324035K723687P514123M658690l493596p073926k604007
56979A834148K863472K526745j890980m705845l811006j110025R42239J146236
56971b205016J49933q3004P83863J72871k887862m094789N10737O884712P095089
56962F326534P36802m350344l441902j75186J166939J430847J656667n41203n107983
56953b298829o412955j723960K635818L85833l963049j542518O474810R888689
56945C443839M542409k305807l480220j037775m15714j729535j720375j30209
$$ plain form
56937 -2833387 -1971909 -896235 962013 3677228 5762624 6154663 5462481 4528210 3649994
56928 3649994 3613103 4973800 5660659 2409786 -3858020 -7270635 -4170618 1613995 3840965
56919 3840965 2022336 695617 2008596 3557838 3489894 3283977 4256315 4897294 3476075
56910 3476075 721456 -1633615 -2853486 -2677685 -1164207 -84151 -1722420 -4886507
56902 -4886507 -5115870 -921758 3148635 2498893 -956619 -1586708 2319497 7149035 9101255
56893 9101255 7465001 3554035 -372436 -1438287 1609272 6392441 9360844 9849391
56885 9849391 9603562 9422236 9125150 9670287 11645973 12383641 8823935 3318195 2082916
56876 2082916 6863260 12305351 13165578 10209286 6920430 4088950 521193 -3605877
$$ packed form
56937b833387Q61478J075674J858248K715215K085396L92039o92182r34271q78216
56928C649994l6891J360697O86859l250873o267806l412615L100017N784613K226970
56919C840965j818629j326719J312979J549242o7944k05917R72338O40979j421219
56910C476075k754619k355071j219871J75801J513478J080056j638269l164087
56902d886507k29363M194112M070393o49742l455512o30089L906205M829538J952220
56893I101255j636254l910966l926471j065851L047559M783169K968403M88547
56885I849391k45829j81326k97086N45137J975686P37668l559706n505740j235279
56876B082916M780344N442091Q60227k956292l288856k831480l567757m127070
$$ plain form
56868 -3605877 -6914794 -8442136 -7143823 -2190112 4180855 6881017 3871326 -444966
56860 -444966 -710757 2578343 5010459 5103776 5268420 6798055 7803316 6362595 2844576
56851 2844576 -1051770 -3197729 -1386095 4307311 9508608 8965291 2747773 -3430620
56843 -3430620 -4892176 -2741683 -1049154 -1569421 -2834715 -2983245 -1719425 63706
56835 63706 1465550 2392498 3558647 5547001 7897614 9365032 8811777 5703101 621912
56826 621912 -4095872 -5435072 -2683003 1488780 4050513 4541844 3625810 669577 -4313641
56817 -4313641 -7536769 -4394417 3685655 8915726 5745157 -2401560 -7140104 -4593609
56809 -4593609 1192924 3774830 1380829 -2075798 -2180076 929217 3358698 2601660
$$ packed form
56868c605877l308917j527342J298313M953711O370967K700162l009691m316292
56860d44966k65791L289100K432116R3317J64644J529635J005261j440721l518019
56851B844576l896346k145959J811634N693406N201297n43317o217518o178393
56843c430620j461556K150493J692529n20267j265294j48530J263820J783131
56835F3706J401844R26948J166149J988354K350613J467418n53255l108676n081189
56826F21912m717784j339200K752069M171783K561733M91331r16034k956233m983218
56817d313641l223128L142352Q080072N230071l170569q146717m738544K546495
56809d593609N786533K581906k394001l456627j04278L109293K429481p57038
$$ plain form
56801 2601660 -67918 -2685624 -5242441 -7213899 -5389490 1687138 8641153 7899692
56793 7899692 -118767 -6492907 -5322360 -1180827 -1925148 -7663240 -11067314 -6958165
56785 -6958165 2173465 9698933 11182745 7354170 2572689 227695 -854479 -4108577
56777 -4108577 -9128598 -10878030 -6604721 -259079 2818580 2668636 2501059 2291240 -634515
56768 -634515 -5835667 -9440982 -9579474 -8017190 -6193377 -3540681 -318125 1399868
56760 1399868 372429 -2797977 -7093961 -10513315 -9137449 -1406308 6902026 7382509
56752 7382509 -306058 -7664160 -8601467 -5873007 -4344123 -4184052 -4314549 -6400218 -10207162
56743 -10207162 -10388880 -4352376 930512 -2603259 -11571960 -14932335 -9120154 -1668488
$$ packed form
56801B601660k669578k617706k556817j971458J824409P076628O954015p41461
56793G899692q018459o374140J170547M141533p44321n738092l404074M109149
56785f958165R131630P525468J483812l828575m781481k344994j082174l254098
56777d108577n020021j749432M273309O345642L077659j49944j67577k09819k925755
56768f34515n201152l605315j38492J562284J823813K652696L222556J717993
56760A399868j027439l170406m295984l419354J375866P731141Q308334M80483
56752G382509p688567p358102r37307K728460J528884J60071j30497k085669l806944
56743a0207162j81718O036504N282888l533771q968701l360375N812181P451666
$$ plain form
56735 -1668488 440698 -1445505 -3006916 -3290411 -2968988 -1620626 225127 255353 -2050680
56726 -2050680 -4266181 -4715823 -3764155 -986696 4139020 8189651 6619687 2120620
56718 2120620 2936789 9847461 12864394 6221622 -1284132 1042068 9255718 11091592
56710 11091592 4760407 -3121 1559595 3397372 1028479 -1083007 1246753 4253684
56702 4253684 3317027 762736 784344 2197796 2048756 1561094 2501598 1937014 -2902380
56693 -2902380 -8042543 -7883216 -4210490 -3036065 -4509174 -3658438 -118356 1217488
56685 1217488 -284170 665902 5258240 7107021 2643778 -2467100 -2585267 -1161322
56677 -1161322 -3765138 -7494939 -5882691 -1109886 -1685210 -8306516 -11580908 -6267382
$$ packed form
56735a668488K109186j886203j561411k83495L21423J348362J845753L0226k306033
56726b050680k215501m49642R51668K777459N125716M050631j569964m499067
56718B120620Q16169O910672L016933o642772p505754K326200Q213650J835874
56710A1091592o331185m763528J562716J837777k368893k111486K329760L006931
56702D253684r36657k554291K1608J413452j49040m87662R40504n64584m839394
56693b902380n140163J59327L672726J174425j473109Q50736L540082J335844
56685A217488j501658R50072M592338J848781m463243n110878j18167J423945
56677a161322k603816l729801J612248M772805n75324o621306l274392N313526
$$ plain form
56669 -6267382 657473 863789 -3139313 -3170194 1625913 4425261 1894212 -1366323 -500514
56660 -500514 3052382 4875910 3467366 404291 -2382079 -3141527 -702031 3087759
56652 3087759 3566086 -1120367 -6454078 -7055472 -4321662 -4258830 -8100110 -10208181 -6886665
56643 -6886665 -2437272 -2901122 -7198883 -9153568 -6642486 -3770130 -3936144 -5385238
56635 -5385238 -5110478 -3443374 -2384203 -1925845 -664794 1444457 3279096 4484758
56627 4484758 5159662 4401316 1292447 -2908936 -5352394 -4483342 -1245444 2303245 4437864
56618 4437864 4307972 2472961 784162 531367 810020 -183690 -2344659 -3190437 -391081
56609 -391081 5490464 10388819 9175811 642777 -9384570 -12699749 -8406559 -4972680
$$ packed form
56669f267382O924855K06316m003102l0881M796107K799348k531049l260535Q65809
56660e00514L552896J823528j408544l063075k786370p59448K439496L789790
56652C087759M78327m686453n333711o01394K733810O2832l841280k108071L321516
56643f886665M449393m63850m297761j954685K511082K872356j66014j449094
56635e385238K74760J667104J059171M58358J261051K109251J834639J205662
56627D484758O74904p58346l108869m201383k443458Q69052L237898L548689K134619
56618D437864j29892j835011j688799k52795K78653r93710k160969q45778K799356
56609c91081N881545M898355j213008q533034j0027347l315179M293190L433879
$$ plain form
56601 -4972680 -9231873 -16164714 -15036467 -4491011 5115036 5704156 1430488 1201105
56593 1201105 6334655 10710388 10343102 7590980 6559483 8258686 10431530 9727561
56585 9727561 4357808 -3551406 -9032403 -9251468 -6058373 -2213791 2317138 7723001
56577 7723001 10835898 8415992 2416157 -2166578 -3670870 -3957359 -3414273 -803049
56569 -803049 2147037 1477859 -2470903 -4183522 -583376 4686273 6862454 6145928 5577678
56560 5577678 6201275 7335917 8979598 10846691 11007510 8289541 4393468 1239477
56552 1239477 -1899508 -5980334 -8797476 -7335080 -2582277 1156481 1534972 56024
56544 56024 -1366563 -3100093 -6057722 -9049747 -9560629 -7051196 -4233937 -3870089 -4605466
$$ packed form
56601d972680m259193o932841J128247J0545456R606047N89120m273668k29383
56593A201105N133550M375733l67286k752122j031497J699203K172844p03969
56585I727561n369753p909214n480997k19065L193095L844582M530929N405863
56577G723001L112897k419906n999835m582735j504292k86489N43086K611224
56569h03049K950086o69178l948762j712619L600146N269649K176181p16526n68250
56560E577678O23597J134642J643681J867093J60819k717969l896073l153991
56552A239477l138985m080826k817142J462396M752803L738758L78491j478948
56544E6024j422587j733530k957629k992025n10882K509433K817259L63848p35377
$$ plain form
56535 -4605466 -2218389 3793699 7595095 4192710 -2746163 -4905873 -415237 4422175
56527 4422175 4841320 3104230 2557842 2312628 1035140 520664 1561119 1374665 -572662
56518 -572662 414669 6182349 10210979 6923250 1494676 2187571 6882260 6666879 361788
56509 361788 -4584731 -4645672 -3388742 -2072538 2223304 7664744 7769665 3268497 3049402
56500 3049402 9400813 13527374 11088365 10213797 16006066 18885631 9917496 -1990759
56492 -1990759 -2266545 6738265 10630221 6416035 4811198 9969407 13366598 10545904
56484 10545904 8564709 11383156 11752004 5274675 407941 4916322 12150058 11323673
56476 11323673 3865157 -1283152 -2586650 -4752013 -6975304 -4231604 1682210 3562956
$$ packed form
56535d605466K387077O012088L801396l402385o938873k159710M490636M837412
56527D422175M19145j737090n46388k45214j277488n14476J040455j86454j947327
56518e72662R87331N767680M028630l287729n428574O92895M694689k15381o305091
56509C61788m946519o0941J256930J316204M295842N441440J04921m501168k19095
56500C049402O351411M126561k439009q74568N792269K879565q968135j1908255
56492a990759k75786R004810L891956m214186j604837N158209L397191k820694
56484A0545904j981195K818447L68848o477329m866734M508381P233736q26385
56476A1323673p458516n148309j303498k165363k223291K743700N913814J880746
$$ plain form
56468 3562956 660425 -1263696 -1521487 -5170865 -10882942 -9663754 423365 8729440
56460 8729440 7085269 1579230 2155836 7693564 9858765 6917123 4897327 7252437
56452 7252437 11045900 12729648 11564445 7617003 1612524 -3247124 -3709190 -778803
56444 -778803 1664918 1755731 111496 -2772270 -5782385 -5724668 -1029314 4589469 6529854
56435 6529854 5514330 4736437 3415003 -532925 -3645538 -728671 5207724 5543073
56427 5543073 -562060 -4281799 -875271 3712375 3757523 2295940 3145700 2682610 -2881097
56418 -2881097 -8606491 -7786718 -3070465 -1917494 -4345769 -4104462 -40586 2556688
56410 2556688 1417861 -44902 139162 172296 134147 2950666 8245315 11484986 10897204
$$ packed form
56468C562956k902531j924121k57791l649378n712077J219188J0087119Q306075
56460H729440j644171n506039N76606N537728K165201k941642k019796K355110
56452G252437L793463J683748j165203l947442o004479m859648m62066K930387
56444g78803K443721R0813j644235k883766l010115N7717M695354N618783J940385
56435F529854j015524p77893j321434l947928l112613K916867N936395L35349
56427E543073o105133l719739L406528M587646M5148j461583Q49760m63090n563707
56418b881097n725394Q19773M716253J152971k428275K41307M063876K597274
56410B556688j138827j462763J84064L3134l8149K816519N294649L239671n87782
$$ plain form
56401 10897204 9503988 8829509 6553109 2321181 -171326 333135 -326208 -4774002
56393 -4774002 -8979211 -8023780 -3287333 -33875 -487505 -2483072 -2933337 -395204 3779345
56384 3779345 5649826 2843359 -866555 739674 7021529 10111548 5975775 76480
56376 76480 -1412677 -116897 -274405 -629437 1831724 4281856 1994785 -2480733 -2139596
56367 -2139596 3138130 5888270 2604226 -1294181 -423185 2871146 3435356 1314180
56359 1314180 573847 2773579 5455041 6083969 4836441 3771580 4507234 6298688 6318475
56350 6318475 3164560 -201241 501207 4612730 6490955 3041990 -1923424 -3294130
56342 -3294130 -1850084 -2268877 -5461065 -7042465 -3704809 2351012 6465769 6239070
$$ packed form
56401A0897204j393216o74479k276400m231928k492507N04461o59343m447794
56393d774002m205209R55431M736447L253458m53630j995567m50265K538133M174549
56384C779345J870481k806467l709914J606229O281855L090019m135773n899295
56376G6480j489157J295780j57508l55032K461161K450132k287071m475518L41137
56367b139596N277726K750140l284044l898407Q70996L294331N64210k121176
56359A314180p40333K199732K681462O28928j247528j064861P35654J791454J9787
56350F318475l153915l365801P02448M111523J878225l448965m965414j370706
56342c294130J444046m18793l192188j581400L337656O055821M114757k26699
$$ plain form
56334 6239070 1811826 -5621015 -12820040 -14218484 -6864218 4403908 10723943 9445695
56326 9445695 7011945 9411552 13380654 11170626 1723613 -8160995 -13337008 -15529633
56318 -15529633 -17726995 -18363128 -14267650 -6264875 1507777 6105918 7040673 4728194
56310 4728194 386347 -3491600 -4822492 -3636417 -977809 2524101 5715869 6466136
56302 6466136 4206323 1553442 1409459 3496785 5372878 5682141 4965902 4566931 5858889
56293 5858889 8839076 10644000 8064116 2605333 -478124 97991 -584692 -5104315
56285 -5104315 -8083286 -4426334 1225862 512796 -5760594 -8858000 -5556814 -1983461
56277 -1983461 -2623972 -3458252 325413 5939448 7085634 2699963 -2602041 -4664615
$$ packed form
56334F239070m427244p432841p199025j398444P354266J1268126O320035j278248
56326I445695k433750K399607L969102k210028r447013r884608n176013k192625
56318a5529633k197362o36133M095478Q002775P772652M598141R34755k312479
56310D728194m341847l877947j330892J186075K658608L501910L191768P50267
56302F466136k259813k652881j43983K087326J876093L09263p16239l98971J291958
56293E858889K980187J804924k579884n458783l083457N76115o82683m519623
56285e104315k978971L656952N652196p13066o273390l097406L301186L573353
56277a983461o40511q34280L783665N614035J146186m385671n302004k062574
$$ plain form
56269 -4664615 -3303376 -1041950 -111857 286511 3536667 10190447 14429574 10600372
56261 10600372 2470765 -612161 2487342 2724174 -4233126 -9677321 -4778400 5270743
56253 5270743 8820197 4948723 3138107 7524227 11671188 10305255 7078024 6878554
56245 6878554 7543917 4492975 -931784 -3223684 -676900 2800370 2989451 -632590
56237 -632590 -5617131 -8821142 -8262047 -4579131 -625556 1339435 1479116 768750 -999582
56228 -999582 -4096957 -6915023 -7253019 -5287624 -3425898 -3031710 -2907691 -1565968 434278
56219 434278 1570748 1979972 3444943 6488927 8726645 7326942 2898324 -366144
56211 -366144 920495 5546058 9140465 8913031 5883644 2666101 584166 -406329 -320468
$$ packed form
56269d664615J361239K261426R30093L98368L250156O653780M239127l829202
56261A0600372q129607l082926L099503K36832o957300n444195M898921J0049143
56253E270743L549454l871474j810616M386120M146961j365933l227231j99470
56245F878554O65363l050942n424759k291900K546784L477270J89081l622041
56237f32590m984541l204011N59095L682916L953575J964991J39681p10366j768332
56228i99582l097375k818066l37996J965395J861726L94188J24019J341723K000246
56219D34278J136470M09224J464971L043984K237718j399703m428618l264468
56211c66144J286639M625563L594407k27434l029387l217543k081935r90495Q5861
$$ plain form
56202 -320468 824672 2027399 1907147 599736 -149042 656252 1912228 2351512 2802519
56193 2802519 4937115 8161247 9651181 8000939 5365294 5123815 8410594 13565030
56185 13565030 17728880 18022423 12626342 2709033 -7055209 -11692461 -10223874 -6112540
56177 -6112540 -3383146 -2848528 -2140967 953613 5397347 7639896 6026276 3350383
56169 3350383 2974128 3277595 -334877 -7428754 -11264680 -8069734 -3032611 -2740939 -5513284
56160 -5513284 -5190655 -1937556 -1952084 -6820714 -10502156 -8421509 -3160884 1214738 4611003
56151 4611003 7632552 8223095 5470950 2551724 2104168 2385828 1492761 1346459 3422156
56142 3422156 4523738 1815133 -1148011 1140755 7835548 13029134 13673454 11385053
$$ packed form
56202c20468J145140J202727j20252j307411p48778Q05294J255976M39284M51007
56193B802519K134596L224132J489934j650242k635645k41479L286779N154436
56185A3565030M163850K93543n396081r917309r764242m637252J468587M111334
56177f112540K729394N34618P07561L094580M443734K242549j613620k675893
56169C350383l76255L03467l612472p093877l835926L194946N037123K91672k772345
56160e513284L22629L253099j4528m868630l681442K080647N260625M375622L396265
56151D611003L021549N90543k752145k919226m47556K81660q93067j46302K075697
56142C422156J101582k708605k963144K288766O694793N193586O44320k288401
$$ plain form
56134 11385053 7974224 4147710 1416602 491948 -1049166 -4904962 -7603260 -5238549
56126 -5238549 -827953 -485203 -3442749 -3340423 610979 2037351 -1328506 -3123153
56118 -3123153 1200001 6784866 7329824 4552883 3784317 4892153 4148257 1882756 1547369
56109 1547369 2716887 1174122 -4250287 -9796326 -11794666 -9726771 -4709359 1180782
56101 1180782 4468013 3250409 675315 1570160 5473641 7238544 5247142 4267714
56093 4267714 7788423 11551778 8663572 -791571 -9187644 -10263195 -5544313 -1111086
56085 -1111086 -325276 -1562621 -2018119 -1326271 -722459 -415058 325527 1023558 4318
56076 4318 -3049392 -6159889 -7321870 -6379337 -4170191 -1474344 406043 -74499 -2455050
$$ packed form
56134A1385053l410829l826514k731108r24654j541114l855796k698298K364711
56126e238549M410596L42750k957546J02326L951402J426372l365857j794647
56118c123153M323154N584865N44958k776941p68566J107836p43896k265501l35387
56109A547369J169518j542765n424409n546039j998340K067895N017412N890141
56101A180782L287231j217604k575094Q94845L903481J764903j991402r79428
56093D267714L520709L763355k888206r455143q396073j075551M718882M433227
56085a111086P85810j237345m55498O91848O03812L07401P40585O98031j019240
56076D318l053710l110497j161981R42533K209146K695847J880387m80542k380551
$$ plain form
56067 -2455050 -3916976 -2762257 -725209 -17548 357624 2863293 6970253 9247037
56059 9247037 7907509 4876837 2713598 1217988 -1859112 -7317771 -12393739 -12719860
56051 -12719860 -7224077 -577441 1275576 -1806344 -4304891 -3002590 -1037679 -1905998
56043 -1905998 -3708609 -3383212 -2808932 -5014242 -7169962 -4448609 540238 300108 -5118724
56034 -5118724 -6894445 -1227606 4251861 2750817 -872513 1276888 6892704 7776554
56026 7776554 3605299 1684214 4211859 5431078 2527116 453685 2936997 6324566
56018 6324566 6556719 5796157 7101606 7994497 5315197 2226927 3543253 6781830 5246397
56009 5246397 -888831 -4037395 -715781 3443934 3079056 1400402 4252306 9860265
$$ packed form
56067b455050j461926J154719K037048P07661L75172K505669M106960K276784
56059I247037j339528l030672k163239j495610l077100n458659n075968l26121
56051a2719860N495783O646636J853017l081920k498547J302301J964911q68319
56043a905998j802611L25397N74280k205310k155720K721353M988847k40130n418832
56034e118724j775721N666839N479467j501044l623330K149401N615816Q83850
56026G776554m171255j921085K527645J219219k903962k073431K483312L387569
56018F324566K32153p60562J305449Q92891k679300l088270J316326L238577j535433
56009E246397o135228l148564L321614M159715l64878j678654K851904N607959
$$ plain form
56001 9860265 10434645 2945593 -6656705 -10637925 -7569261 -2254617 128383 -1242973
55993 -1242973 -2691927 -143992 5856824 9759122 6967850 -619508 -6954035 -8748101
55985 -8748101 -7284499 -4156342 614193 5539602 7315669 5850007 5698961 9196196
55977 9196196 11649825 7795503 383753 -3062147 -754427 1863417 1082379 -623556
55969 -623556 -646014 -1034670 -3969447 -6754791 -5476023 -1123843 1727328 969900 -1241295
55960 -1241295 -1654342 1335933 6777480 11026863 10146704 4421095 -1310432 -3680250
55952 -3680250 -4673697 -7074245 -9100078 -7452795 -3306083 -469010 1118282 4966235
55944 4966235 11233584 15109159 12882688 5993950 -1551328 -6396153 -6277904 -1310131
$$ packed form
56001I860265N74380p489052r602298l981220L068664N314644K383000j371356
55993a242973j448954K547935O000816L902298k791272p587358o334527j794066
55985h748101J463602L128157M770535M925409J776067j465662j51046L497235
55977I196196K453629l854322p411750l445900K307720K617844p81038j705935
55969f23556k2458l88656k934777k785344J278768M352180K851171p57428k211195
55960a241295m13047K990275N441547M249383q80159n725609n731527k369818
55952c680250r93447k400548k025833J647283M146712K837073J587292L847953
55944D966235O267349L875575k226471o888738p545278m844825J18249M967773
$$ plain form
55936 -1310131 4217922 5021447 1056734 -2597222 -2891980 -2163453 -3149378 -4630500 -4205365
55927 -4205365 -2158823 -142092 1523690 3080236 3876502 3357348 1851396 -336325
55919 -336325 -2472075 -2024278 2934168 9616889 12729217 11425374 9779556 9806553 9461162
55910 9461162 8649864 10441162 13714181 12065365 4440597 -608183 2587455 7194059
55902 7194059 4622078 -1593277 -2544969 471949 -1064532 -6894779 -7606284 -685001
55894 -685001 5108027 3910408 286808 -1144368 -3057023 -6999773 -7301717 -649983
55886 -649983 5893567 4414486 -2010784 -4703115 -1965377 1416278 3439354 5576851
55878 5576851 6613495 3756010 -910886 -1994602 1239501 4206716 4073177 2141257
$$ packed form
55936a310131N528053Q03525l964713l653956k94758P28527r85925j481122M25135
55927d205365K046542K016731J665782J556546P96266n19154j505952k187721
55919c36325k135750M47797M958446O682721L112328j303843j645818K6997l45391
55910I461162q11298J791298L273019j648816p624768n048780L195638M606604
55902G194059k571981o215355r51692L016918j536481n830247p11505O921283
55894f85001N793028j197619l623600j431176j912655l942750l01944O651734
55886f49983O543550j479081o425270k692331K737738L381655K023076K137497
55878E576851J036644k857485m666896j083716L234103K967215j33539j931920
$$ plain form
55870 2141257 -458204 -3937524 -6587721 -5643921 -2015739 595075 1776025 4746513
55862 4746513 9816081 12421736 9347083 2860040 -2857294 -5712506 -4986023 -770591
55854 -770591 4060262 5209807 2600920 1422381 5260152 11116554 13550956 11055016
55846 11055016 6036562 1188671 -1505877 -590521 3030944 5677412 4860257 2257478
55838 2257478 619063 -368461 -2432998 -4597465 -3920637 323032 5827055 10057291
55830 10057291 11720553 10528521 8145612 8344711 12951323 17989603 17267611 10140195
55822 10140195 2616704 246411 3048783 8125939 13373764 16613077 14831858 7949077
55814 7949077 1098923 -738593 775371 11556 -4194283 -7215923 -6289307 -4848695
$$ packed form
55870B141257k599461l479320k650197R43800L628182K610814J180950K970488
55862D746513N069568K605655l074653o487043n717334k855212P26483M215432
55854g70591M830853J149545k608887j178539L837771N856402K434402k495940
55846A1055016n018454m847891k694548R15356L621465K646468q17155k602779
55838B257478j638415r87524k064537k164467O76828M243669N504023M230236
55830A0057291J663262j192032k382909J99099M606612N038280p21992p127416
55822A0140195p523491k370293K802372N077156N247825L239313j781219o882781
55814G949077o850154j837516J513964p63815m205839l021640R26616J440612
$$ plain form
55806 -4848695 -6881949 -10688740 -11764279 -9415047 -6498945 -4103228 -1081589 1373518
55798 1373518 -232609 -5433423 -8007208 -3664043 3509042 6073666 2761410 -1146705
55790 -1146705 -1873640 -850508 37214 2089200 6326761 9973852 9742150 6601170 4030568
55781 4030568 2817590 977043 -1679671 -2462571 30181 3510260 4934514 3748070
55773 3748070 1285645 -824694 -527719 3821068 10429482 13999638 11311585 5440197
55765 5440197 1816057 1587631 2100748 2551721 4628786 7624169 8004545 5431955 4461753
55756 4461753 7476249 10318793 9020160 7105805 10539242 17433292 19307820 12889323
55748 12889323 4737738 2207927 4629736 6255792 4108285 -546184 -5664719 -9395335
$$ packed form
55806d848695k033254l806791j075539K349232K916102K395717L021639K455107
55798A373518j606127n200814k573785M343165P173085K564624l312256l908115
55790a146705p26935J023132Q87722K051986M237561L647091k31702l140980k570602
55781D030568j212978j840547k656714p82900K492752L480079J424254j186444
55773C748070k462425k110339K96975M348787O608414L570156k688053n871388
55765E440197l624140k28426N13117M50973K077065K995383L80376k572590r70202
55756D461753L014496K842544j298633j914355L433437O894050J874528o418497
55748A2889323q151585k529811K421809J626056k147507m654469n118535l730616
$$ plain form
55740 -9395335 -9178699 -4027305 2293070 3746657 -1208125 -7416203 -8742570 -4608147
55732 -4608147 392365 2400577 2009559 1886333 2596872 2680213 2060005 2430731 3426938
55723 3426938 1661909 -3735450 -7248606 -2895030 7059684 14016467 13773761 10394668
55715 10394668 8231519 5658588 99273 -5392114 -5822988 -2145088 -94863 -1781209
55707 -1781209 -3252732 -1134023 2358675 2899825 55964 -2298380 -676998 4176174
55699 4176174 7917238 6628403 369291 -7120561 -11904419 -12416087 -9179752 -4022227
55691 -4022227 -122479 -575262 -5141466 -9698230 -10441443 -7618443 -4009083 -1265598
55683 -1265598 691737 2115527 3154968 4184441 4968780 4583787 3295798 2902268 3885762
$$ packed form
55740i395335K16636N151394O320375J453587m954782o208078j326367M134423
55732d608147N000512K008212l91018j23226P10539Q3341o20208L70726R96207
55723C426938j765029n397359l513156M353576R954714O956783k42706l379093
55715A0394668k163149k572931n559315n491387m30874L677900K050225j686346
55707a781209j471523K118709L492698N41150k843861k354344J621382M853172
55699D176174L741064j288835o259112p489852m783858n11668L236335N157525
55691d022227L899748m52783m566204m556764p43213K823000L609360K743485
55683a265598J957335J423790J039441J029473P84339l84993j287989l93530R83494
$$ plain form
55674 3885762 4261802 3059055 2790053 6014500 11092842 13821171 12126720 7413004
55666 7413004 2901066 1981742 5547696 9359486 7741808 2048844 349449 4964760
55658 4964760 6739990 -1307760 -10484855 -6952639 7286513 16116074 12372294 6621634
55650 6621634 9136086 15001828 14497045 8921090 6647438 9429989 12160056 12698279
55642 12698279 13085589 12975000 10085243 6405318 6488872 9548703 9984669 6258545 2941844
55633 2941844 2998796 4014589 3560968 2689549 2120282 191953 -2957926 -4000515 -2012767
55624 -2012767 -971211 -3440359 -6046035 -5069961 -2543001 -2049405 -1972327 1164317 4956279
55615 4956279 3717303 -1511754 -2769846 3109661 9083748 7935410 2495394 688868
$$ packed form
55674C885762L76040j202747k69002L224447N078342K728329j694451m713716
55666G413004m511938r19324L565954L811790j617678n692964j699395M615311
55658D964760J775230q047750r177095L532216J4239152Q829561l743780n750660
55650F621634K514452N865742n04783n575955k273652K782551K730067N38223
55642A2698279L87310j10589k889757l679925Q3554L059831M35966l726124l316701
55633B941844N6952J015793m53621q71419n69267j928329l149879j042589J987748
55624b012767J041556k469148k605676R76074K526960M93596P7078L136644L791962
55615D956279j238976n229057j258092N879507N974087j148338n440016j806526
$$ plain form
55607 688868 3925250 6491586 5083266 2923809 3862414 7310471 10497351 11904760
55599 11904760 10889387 7234629 2739913 339077 251152 56462 -302671 2290076 7928749
55590 7928749 11397620 9674996 7347249 9585152 13348361 11790496 5171983 596361
55582 596361 1675377 5154823 7882174 10170198 11048015 7413327 918093 -833920
55574 -833920 5500624 12682979 12039720 5258404 1416436 4432413 9183244 9712584 6399969
55565 6399969 3863642 4935951 8302095 10789387 10999700 10536663 11152512 11279337 7730426
55556 7730426 1383740 -1811255 2469007 11312134 17828270 18442079 15032458 11496961
55548 11496961 10451767 12205405 14912547 16258049 16013210 15848324 16111461 14939289
$$ packed form
55607F88868L236382K566336j408320k159457R38605L448057L186880J407409
55599A1904760j015373l654758m494716k400836q7925j94690l59133K592747N638673
55590G928749L468871j722624k327747K237903L763209j557865o618513m575622
55582E96361J079016L479446K727351K288024Q77817l634688o495234j752013
55574h33920O334544P182355o43259o781316l841968L015977M750831N29340l312615
55565F399969k536327J072309L366144K487292K10313m63037O15849J26825l548911
55556G730426o346686l194995M280262Q843127O516136O13809l409621l535497
55548A1496961j045194J753638K707142J345502k44839j64886K63137j172172
$$ plain form
55540 14939289 11598367 8274677 7131896 8023545 10370520 14122009 17102353 15343425
55532 15343425 9133724 5020485 7675810 12888398 13476467 9645821 7735938 9951818
55524 9951818 11557754 8824706 4231781 1823857 1521988 589681 -1685396 -3001947
55516 -3001947 -881153 4209714 8086013 6260441 -155359 -3421539 2885015 15476381
55508 15476381 24244641 23693408 18218191 15223478 16223198 16922533 14373837 11333331
55500 11333331 12695654 18590128 23116087 21517260 16892585 16114319 19666918 20949984
55492 20949984 17043403 13739903 15959227 19455393 18451188 16294200 19962806 27166384
55484 27166384 28774207 23474910 20075272 23501355 27806337 26807648 23661952 24583962
$$ packed form
55540A4939289l340922l323690j142781Q91649K346975L751489K980344j758928
55532A5343425o209701m113239K655325N212588N88069l830646j909883K215880
55524I951818J605936k733048m592925k407924l01869r32307k275077j316551
55516c001947K120794N090867L876299j825572o415800l266180O306554J2591366
55508A5476381Q768260n51233n475217k994713R99720O99335k548696l040506
55500A1333331J362323N894474M525959j598827m624675p78266L552599J283066
55492B0949984l906581l303500K219324L496166j004205k156988L668606P203578
55484B7166384J607823n299297l399638L426083M304982r98689l145696R22010
$$ plain form
55476 24583962 29040278 31984645 31924308 31466601 32158599 32902247 32162247 29474158 26505163
55467 26505163 27411499 34658911 43393915 44592443 36075966 26002577 22893151 26728332
55459 26728332 32687363 38503975 43995447 47849081 49656302 51650860 54274135 53890031
55451 53890031 49364434 46673381 51422510 60354041 66249290 68232313 70944889 76133294
55443 76133294 81828352 87993681 96018673 103753289 107978060 111134745 118549215 129095898
55435 129095898 135916680 137201015 139136118 146568465 157430047 168509883 180353520
55428 180353520 193772710 207293748 220836203 236462795 252907320 265274398 273330673
55421 273330673 283969446 301359333 320503071 335280056 346933544 358617564 367165629
$$ packed form
55476B4583962M456316K944367o0337m57707O91998P43648p40000k688089k968995
55467B6505163R06336P247412Q735004J198528q516477j0073389l109426L835181
55459B6728332N959031N816612N491472L853634J807221J994558K623275l84104
55451E3890031m525597k691053M749129Q931531N895249J983023K712576N188405
55443G6133294N695058O165329Q024992P734616M224771L156685P414470J0546683
55435A29095898O820782J284335J935103P432347J0861582J1079836J1843637
55428A80353520J3419190J3521038J3542455J5626592J6444525J2367078Q056275
55421B73330673J0638773J7389887J9143738J4776985J1653488J1684020Q548065
$$ plain form
55414 367165629 368137466 365242483 366082418 370094785 368877476 358340868 343171540 328677075
55406 328677075 315178721 301823597 289433454 277508754 264223769 251578603 244686977
55399 244686977 243015067 238044494 223759919 204857027 190251389 182606782 178921255
55392 178921255 177260100 176662868 173087163 162576744 148176028 137618704 133455376 130667163
55384 130667163 125010223 118476743 114381270 111585270 106796224 99699208 92826037 88079637
55376 88079637 85495173 83899762 81298433 76349764 70655374 67486300 67139879 66166760
55368 66166760 62418541 57511271 52520026 45603872 37393593 34236428 40224855 48845462
55360 48845462 49611931 42147599 36340120 37690684 40127460 36491910 29298595 25743680
$$ packed form
55414C67165629R71837k894983Q39935M012367j217309j0536608j5169328j4494465
55406C28677075j3498354j3355124j2390143j1924700j3284985j2645166o891626
55399B44686977j671910m970573j4284575j8902892j4605638p644607l685527
55392A78921255j661155n97232l575705j0510419j4400716j0557324m163328k788213
55384A30667163n656940o533480m095473k796000m789046p097016o873171m746400
55376H8079637k584464j595411k601329m948669n694390l169074l46421r73119
55368F6166760l748219m907270m991245o916154q210279l157165N988427Q620607
55360D8845462P66469p464332n807479J350564K436776l635550p193315l554915
$$ plain form
55352 25743680 26940316 28557131 29335515 32095132 36757181 38629997 35155170 29850298
55344 29850298 27529717 28826116 31272974 32952412 32903978 30291957 25855521 22781703
55336 22781703 23434227 25757607 25345659 21076873 16492030 15134839 16691513 18919124
55328 18919124 21426121 25226027 29344164 30590727 27388302 21909134 17423931 15115666
55320 15115666 14623872 15929645 18696660 20937135 20711399 18725555 17208073 16730482
55312 16730482 16446545 17013989 20293516 25703459 29619335 29327616 25451281 20035388
55304 20035388 14779236 11545519 11385508 12134075 10478585 7652510 8898492 15175928
55296 15175928 20091360 18521669 13666873 10855459 8973198 4675263 1384351 5284898
$$ packed form
55352B5743680J196636J616815P78384K759617M662049J872816l474827n304872
55344B9850298k320581J296399K446858J679438m8434k612021m436436l073818
55336B2781703O52524K323380m11948m268786m584843j357191J556674K227611
55328A8919124K506997L799906M118137J246563l202425n479168m485203k308265
55320A5115666m91794J305773K767015K240475k25736j985844j517482m77591
55312A6730482k83937N67444L279527N409943L915876k91719l876335n415893
55304B0035388n256152l233717j60011P48567j655490k826075J245982O277436
55296A5175928M915432j569691m854796k811414j882261m297935l290912L900547
$$ plain form
55288 5284898 13566443 16192042 10843841 6982082 11376171 17913914 17546599 11587004
55280 11587004 7792609 7952968 7562401 5416962 5287164 8109741 9713372 7775435
55272 7775435 5322551 5345702 6631626 7158662 7640712 9144991 10334265 9706684 8266553
55263 8266553 7646562 7480825 6796694 6425384 7880640 10793987 13084269 12999210 10112279
55254 10112279 5364217 824490 -1835556 -3050509 -3952608 -3333359 1076766 7587795
55246 7587795 10542356 7526151 3204098 2908669 5492750 6530660 6004975 7663156
55238 7663156 11957204 15029709 14784837 12951252 10492458 6054530 430700 -2458746
55230 -2458746 -1513718 -866502 -3208128 -4825444 -1303804 5190198 8986047 8848827 7881374
$$ packed form
55288E284898Q281545K625599n348201l861759M394089O537743l67315n959595
55280A1587004l794395J60359l90567k145439j29798K822577J603631j937937
55272G775435k452884K3151J285924N27036M82050J504279J189274o27581j440131
55263H266553o19991j65737o84131l71310J455256K913347K290282q5059k886931
55254A0112279m748062m539727k660046j214953r02099O19249M410125O511029
55246G587795K954561l016205m322053k95429K584081J037910n25685J658181
55238G663156M294048L072505k44872j833585k458794m437928n623830k889446
55230b458746R45028O47216k341626j617316L521640O494002L795849j37220r67453
$$ plain form
55221 7881374 7124766 4712724 1107313 -168698 1964682 4424220 5207443 6196869 8659371
55212 8659371 9846003 7275366 3649552 3719150 7455901 9783804 7035650 1034121
55204 1034121 -3647758 -4391225 -1743081 2341571 5944321 7485863 6304375 3722182
55196 3722182 2583650 4267413 6383556 5369906 1816575 557183 3616122 5883954
55188 5883954 1595019 -6657137 -10596561 -7982487 -5762849 -9299197 -14138882 -13161674
55180 -13161674 -7699915 -5140560 -7290598 -8138347 -4014182 377064 -871359 -6301486
55172 -6301486 -9879999 -9519080 -8219392 -7955783 -7221275 -5267390 -4465323 -6034976 -6418824
55163 -6418824 -1533302 6437335 10280297 6504126 -227719 -3177739 -1650697 -320333
$$ packed form
55221G881374p56608k412042l605411j276011K133380K459538P83223R89426K462502
55212H659371J186632k570637l625814O9598L736751K327903k748154o001529
55204A034121m681879p43467K648144M084652L602750J541542j181488k582193
55196C722182j138532J683763K116143j013650l553331j259392L058939K267832
55188E883954m288935q252156l939424K614074K219638l536348m839685R77208
55180a3161674N461759K559355k150038q47749M124165M391246j248423n430127
55172f301486l578513L60919J299688K63609P34508J953885Q02067j569653l83848
55163f418824M885522P970637L842962l776171o731845k950020J527042J330364
$$ plain form
55155 -320333 -1864176 -3778240 -2840454 359069 2924296 3689519 3775227 3999918 3486037
55146 3486037 904078 -3664227 -8160112 -9853268 -7755798 -3639518 120613 3240906
55138 3240906 6603421 9211823 8721817 5461469 2951395 2942618 2728449 -391528 -4569770
55129 -4569770 -6369945 -6141153 -6581736 -7263608 -5244782 -1245972 -285129 -4104504 -7020292
55120 -7020292 -3008161 5212695 8443964 2515777 -5983576 -7425987 -681659 5903590
55112 5903590 5085056 -636750 -3047326 930144 6023795 6429389 3038585 829920
55104 829920 2000024 4750518 7013485 7953072 6775454 3494592 497073 28269 214508
55095 214508 -2935448 -9156772 -13129414 -11174992 -5474008 -45963 4257761 8316258
$$ packed form
55155c20333j543843j914064R37786L199523K565227P65223Q5708K24691n13881
55146C486037k581959m568305m495885j693156K097470M116280L760131L120293
55138C240906L362515K608402m90006l260348k510074q777k14169l119977m178242
55129d569770j800175K28792m40583o81872K018826L998810R60843l819375k915788
55120g020292M012131Q220856L231269n928187q499353j442411O744328O585249
55112E903590q18534n721806k410576L977470N093651M05594l390804k208665
55104H29920J170104K750494K262967R39587j177618l280862k997519m68804J86239
55095B14508l149956o221324l972642J954422N700984N428045M303724M058497
$$ plain form
55087 8316258 10908408 9717281 5397636 1931038 2542280 6510738 10217510 10756720
55079 10756720 8377597 5272847 2169322 -2294992 -7822677 -10660208 -8689027 -6180729
55071 -6180729 -8495691 -12978141 -11577143 -3494137 2034301 -1041339 -6520332 -5704990
55063 -5704990 -367893 1459872 -1486085 -3583105 -3210422 -4560759 -8266850 -8944279
55055 -8944279 -4267988 1068744 3475412 5668546 9990127 12885583 10851559 6563604
55047 6563604 3884008 1584698 -2073884 -2937090 3428019 12276177 13851673 6745555
55039 6745555 -96061 262484 4777544 6872394 5263002 3171466 2738530 3602003 4619388
55030 4619388 4492656 2546800 463919 978923 3480374 3767122 118901 -3380792 -2339406
$$ packed form
55087H316258K592150j191127m319645l466598O11242L968458L706772N39210
55079A0756720k379123l104750l103525m464314n527685k837531J971181K508298
55071f180729k314962m482450J400998Q083006N528438l075640n478993Q15342
55063e704990N337097J827765k945957k097020L72683j350337l706091o77429
55055h944279M676291N336732K406668K193134M321581K895456k034024m287955
55047F563604k679596k299310l658582q63206O365109Q848158J575496p106118
55039F745555o841616L58545M515060K094850j609392k091536m32936Q63473J017385
55030D619388j26732j945856k082881N15004K501451K86748l648221l499693J041386
$$ plain form
55021 -2339406 1706152 3994983 3627436 3855497 5881030 6598979 3666644 -359242 -1105361
55012 -1105361 2012887 5413903 6108309 4920036 4383840 4903314 4740755 3531783 3475260
55003 3475260 5784961 7980047 7045396 3845824 1354316 -400409 -3429830 -6036718
54995 -6036718 -3415698 4062735 8582885 4974608 -1169676 -871888 5561297 9510576
54987 9510576 6516892 1144012 -1298391 -1514521 -2210050 -2672147 -1258953 375709 -102643
54978 -102643 -1039126 1034463 5599243 8516426 8099653 7083189 7578363 7342043 3261656
54969 3261656 -3487571 -8522179 -9709586 -8692967 -6792598 -2731706 3549513 7768092
54961 7768092 6005050 1305684 715529 5313382 8449212 5866158 1946856 1810510
$$ packed form
55021b339406M045558K288831l67547K28061K025533P17949k932335m025886p46119
55012a105361L118248L401016O94406j188273n36196N19474j62559j208972n6523
55003C475260K309701K195086r34651l199572k491508j754725l029421k606888
54995f036718K621020P478433M520150l608277o144284K97788O433185L949279
54987I510576k993684n372880k442403k16130o95529m62097J413194J634662m78352
54978a02643r36483K073589M564780K917183m16773j016464M95174k36320m080387
54969C261656o749227n034608j187407J016619J900369M060892O281219M218579
54961G768092j763042m699366n90155M597853L135830k583054l919302j36346
$$ plain form
54953 1810510 2427291 -2021591 -9562120 -12961463 -11047843 -9062526 -7963262 -2817721
54945 -2817721 5911307 9080469 2077452 -6709072 -7591636 -3381953 -3272140 -7612486
$$ packed form
54953A810510O16781m448882p540529l399343J913620J985317J099264N145541
54945b817721Q729028L169162p003017q786524q82564M209683J09813m340346
$$ [...]
##END NTUPLES=NMR SPECTRUM
##END=
