##TITLE=31Pdec_SR91_rm1
 , 124 sc
 30.09.2021
##JCAMPDX= 6.0         $$ Bruker NMR JCAMP-DX V2.0
##DATA TYPE= NMR SPECTRUM
##DATA CLASS= NTUPLES
##ORIGIN= UXNMR, Bruker Analytische Messtechnik GmbH
##OWNER= root
$$ XWIN-NMR		Version 3.5
$$ Thu Sep 30 09:42:02 2021 Russian Standard Time (UT+4h)  she@DPX200
##.OBSERVE FREQUENCY= 81.013821
##.OBSERVE NUCLEUS= ^31P
##.ACQUISITION MODE= SIMULTANEOUS
##.ACQUISITION SCHEME= undefined
##.AVERAGES= 124
##.DIGITISER RES= 16
##SPECTROMETER/DATA SYSTEM= spect
##.PULSE SEQUENCE= zgpg30
##.SOLVENT NAME= CDCl3
##.SHIFT REFERENCE= (INTERNAL, CDCl3, 0, 248.564)
##AUDIT TRAIL= $$ (NUMBER, WHEN, WHO, WHERE, WHAT)
$$ ##TITLE= Audit trail, XWIN-NMR		Version 3.5
$$ ##JCAMPDX= 5.01
$$ ##ORIGIN= Bruker BioSpin GmbH
$$ ##OWNER= she
$$ F:/spectra/data/she/nmr/P31/1/pdata/1/auditp.txt
$$ ##AUDIT TRAIL=  $$ (NUMBER, WHEN, WHO, WHERE, WHAT)
(   1,<2021-09-30 09:39:57.85 +0400>,<she>,<DPX200>,
      <continue with go, POWCHK disabled, PULCHK disabled
       configuration hash MD5:
       00 E9 B6 7A A2 85 ED C7 34 08 36 98 17 FE 4E 26
       data hash MD5: 32K
       57 B7 4E EA 9A C0 7E 01 20 13 E1 31 DD 62 E8 A9>)
(   2,<2021-09-30 09:41:07.04 +0400>,<she>,<DPX200>,
      <Start of raw data processing
       efp BC_mod = 2 LB = 1 FT_mod = 6 PKNL = 1 PHC0 = -8867.238 PHC1 = 137.0694 SI = 64K 
       data hash MD5: 64K
       27 A0 69 93 CD 87 FB B5 30 A1 FB AA 1E 1D 83 A5>)
(   3,<2021-09-30 09:41:33.87 +0400>,<she>,<DPX200>,
      <pk PHC0 = 26.86756 PHC1 = -12.2 
       data hash MD5: 64K
       E4 C5 94 A9 D2 95 47 78 A1 44 1B 09 6D 98 3D 2B>)
(   4,<2021-09-30 09:41:38.00 +0400>,<she>,<DPX200>,
      <abs ABSG = 5 
       data hash MD5: 64K
       F4 E3 BD BD 65 C8 5C 35 42 B0 26 D0 1C C2 8F BE>)
$$ ##END=
$$ 
$$ hash MD5
$$ 05 8D 9E 13 F5 8E 6F F6 AD 10 9F 32 BC C7 27 B1
##$RELAX= 
##$RELAX= 
##$RELAX= 
##$RELAX= 
##$RELAX= 
##$RELAX= 
##$RELAX= 
##$RELAX= 
$$ Bruker specific parameters
$$ --------------------------
##$DU= <F:/spectra>
##$EXPNO= 1
##$NAME= <P31>
##$PROCNO= 1
##$TYPE= <nmr>
##$USER= <she>
##$AMP= (0..31)
100 100 100 100 100 100 100 100 100 100 100 100 100 100 100 100 100 100 
100 100 100 100 100 100 100 100 100 100 100 100 100 100 
##$AQSEQ= 0
##$AQ_mod= 1
##$AUNM= <au_zg>
##$AUTOPOS= <>
##$BF1= 81.014009
##$BF2= 200.13
##$BF3= 200.13
##$BF4= 200.13
##$BF5= 200.13
##$BF6= 200.13
##$BF7= 200.13
##$BF8= 200.13
##$BYTORDA= 1
##$CFDGTYP= 0
##$CFRGTYP= 5
##$CHEMSTR= <none>
##$CNST= (0..31)
1 1 145 1 1 1 1 1 1 1 1 1 1 1 1 1 1 1 1 1 1 1 1 1 1 1 1 1 1 1 1 1 
##$CPDPRG= <waltz16>
##$CPDPRG1= <>
##$CPDPRG2= <waltz16>
##$CPDPRG3= <>
##$CPDPRG4= <mlev>
##$CPDPRG5= <mlev>
##$CPDPRG6= <mlev>
##$CPDPRG7= <mlev>
##$CPDPRG8= <mlev>
##$CPDPRGB= <>
##$CPDPRGT= <>
##$D= (0..31)
0 1 0 0 0 0 0 0 0 0 0 0.03 2e-05 3e-06 0 0 0 0 0 0 0 0 0 0 0 0 0 0 0 0 
0 0 
##$DATE= 1632980227
##$DBL= (0..7)
120 120 120 11 120 120 24 19 
##$DBP= (0..7)
150 150 150 150 150 150 150 150 
##$DBP07= 0
##$DBPNAM0= <>
##$DBPNAM1= <>
##$DBPNAM2= <>
$$ [...]
##$SUBNAM3= <"">
##$SUBNAM4= <"">
##$SUBNAM5= <"">
##$SUBNAM6= <"">
##$SUBNAM7= <"">
##$SUBNAM8= <"">
##$SUBNAM9= <"">
##$SW= 501.771253377433
##$SWIBOX= (0..15)
0 1 3 0 0 0 0 0 0 0 0 0 0 0 0 0 
##$SW_h= 40650.406504065
##$TD= 32768
##$TD0= 1
##$TE= 0
##$TE2= 300
##$TE3= 300
##$TEG= 300
##$TL= (0..7)
0 120 53 12 22 120 120 120 
##$TP= (0..7)
150 150 150 150 150 150 150 150 
##$TP07= 0
##$TPNAME0= <>
##$TPNAME1= <>
##$TPNAME2= <>
##$TPNAME3= <>
##$TPNAME4= <>
##$TPNAME5= <>
##$TPNAME6= <>
##$TPNAME7= <>
##$TPOAL= (0..7)
0.5 0.5 0.5 0.5 0.5 0.5 0.5 0.5 
##$TPOFFS= (0..7)
0 0 0 0 0 0 0 0 
##$TUNHIN= 0
##$TUNHOUT= 0
##$TUNXOUT= 0
##$USERA1= <user>
##$USERA2= <user>
##$USERA3= <user>
##$USERA4= <user>
##$USERA5= <user>
##$V9= 5
##$VALIST= <valist>
##$VCLIST= <CCCCCCCCCCCCCCC>
##$VD= 0
##$VDLIST= <DDDDDDDDDDDDDDD>
##$VPLIST= <PPPPPPPPPPPPPPP>
##$VTLIST= <TTTTTTTTTTTTTTT>
##$WBST= 1024
##$WBSW= 4
##$XGAIN= (0..3)
0 0 0 0 
##$XL= 0
##$YL= 0
##$YMAX_a= 10885
##$YMIN_a= -2751
##$ZGOPTNS= <>
##$ZL1= 120
##$ZL2= 120
##$ZL3= 120
##$ZL4= 120
##$ABSF1= 248.5645
##$ABSF2= -253.2056
##$ABSG= 5
##$ABSL= 3
##$ALPHA= 0
##$AQORDER= 0
##$ASSFAC= 0
##$ASSFACI= 0
##$ASSFACX= 0
##$ASSWID= 0
##$AUNMP= <proc_1d>
##$AZFE= 0.1
##$AZFW= 0.5
##$BCFW= 0
##$BC_mod= 2
##$BYTORDP= 0
##$COROFFS= 0
##$CY= -3
##$DATMOD= 1
##$DC= 0
##$DFILT= <>
##$DTYPP= 0
##$F1P= 0
##$F2P= 0
##$FCOR= 1
##$FTSIZE= 65536
##$FT_mod= 6
##$GAMMA= 0
##$GB= 0
##$INTBC= 1
##$INTSCL= 5.30512e-09
##$ISEN= 30
##$LB= 1
##$LEV0= 0
##$LPBIN= 0
##$MAXI= 10000
##$MC2= 0
##$MEAN= 0
##$ME_mod= 0
##$MI= 50
##$NCOEF= 0
##$NC_proc= -7
##$NLEV= 6
##$NOISF1= 182.463
##$NOISF2= 159.3651
##$NSP= 0
##$NTH_PI= 0
##$NZP= 0
##$OFFSET= 248.5645
##$PC= 4
##$PHC0= -8840.371
##$PHC1= 124.8694
##$PH_mod= 1
##$PKNL= yes
##$PPARMOD= 0
##$PSCAL= 0
##$PSIGN= 0
##$REVERSE= no
##$SF= 81.014009
##$SI= 65536
##$SIGF1= 159.3651
##$SIGF2= -187.1042
##$SINO= 113.3802
##$SIOLD= 16384
##$SREGLST= <1H.CDCl3>
##$SSB= 0
##$STSI= 65536
##$STSR= 0
##$SW_p= 40650.406504065
##$SYMM= 0
##$S_DEV= 0
##$TDeff= 32768
##$TDoff= 0
##$TI= <>
##$TILT= no
##$TM1= 0
##$TM2= 0
##$TOPLEV= 0
##$USERP1= <user>
##$USERP2= <user>
##$USERP3= <user>
##$USERP4= <user>
##$USERP5= <user>
##$WDW= 1
##$XDIM= 65536
##$YMAX_p= 553167957
##$YMIN_p= -124686245
$$ End of Bruker specific parameters
$$ ---------------------------------
##NTUPLES= NMR SPECTRUM
##VAR_NAME=  FREQUENCY,     SPECTRUM/REAL,   SPECTRUM/IMAG
##SYMBOL=    X,             R,               I
##VAR_TYPE=  INDEPENDENT,   DEPENDENT,       DEPENDENT
##VAR_FORM=  AFFN,          ASDF,            ASDF
##VAR_DIM=   65536,         65536,           65536
##UNITS=     HZ,            ARBITRARY UNITS, ARBITRARY UNITS
##FACTOR=    0.620285442955139, 1,           1
##FIRST=     20137.2065510759, 0,            0
##LAST=      -20513.1999529892, 0,           0
##MIN=       -20513.1999529892, -124686245,  0
##MAX=       20137.2065510759, 553167957,    0
$$ Real data points
##PAGE= N=1
##DATA TABLE= (X++(R..R)), XYDATA
$$ [...]
13024d94492k739433l367945j90175L716247M296443J772600p41984k186810l225080
13015c160629k666202P24121L772660K066683k423627l170403N67903K149849
13007b139645j382537l943502m79648M335727L817858K70792L76099L146793J587564
12998E589501m582314p150534k164009L707650L355698q34885k344211p82749
12990e205853n59736k169889j416242L054341O957263O216891J822313k264417
12982F434671l272436j138315J566160J190685k673095n030607j650440L292618
12974a280759J768476n165699o733007J606048R601169O529662k698660n331176
12966a703946p4423K911720m47973l145115j051817M40102j998300k678116K063581
$$ plain form
13024 -494492 -3233925 -6601870 -6792045 -3075798 1220645 2993245 2251261 64451 -3160629
13015 -3160629 -5826831 -5102710 -1330050 736633 -1686994 -4857397 -4289494 -2139645
13007 -2139645 -3522182 -7465684 -7945332 -3609605 208253 479045 855144 4001937 5589501
12998 5589501 1007187 -6143347 -8307356 -4599706 -1244008 -2078893 -4423104 -5205853
12990 -5205853 -5765589 -7935478 -9351720 -6297379 659884 6876775 8699088 6434671
12982 6434671 3162235 2023920 3590080 4780765 2107670 -2922937 -4573377 -1280759
12974 -1280759 487717 -4677982 -11410989 -9804941 -203772 6325890 3627230 -1703946
12966 -1703946 -1778369 1133351 685378 -2459737 -3511554 -3071452 -5069752 -7747868 -5684287
12957e684287N695623K290161k845194k206466J372018J016727j350485O17011
12949a094892M852301M067936o49483j263086K795535L279695k509991o875783
12941B602232m154230J383025L682044K937281J746948K96609r55248J2822K196730
12932I748213J516312k080682l581006j302483L67389q08528j271185M94826K16197
12923C299053l658501n313304j022543L686846K736269q07472q12732J375509
12915e16875J87987m080117n957852l387122O64485L431713M116024K507068J72581
12906b862108L70325L027237L573857N31193j016089J636596K798484j817110
12898F242385n734970j343025O326344O238476j482193o359779l922285J63633
$$ plain form
12957 -5684287 11336 2301497 -543697 -2750163 -1378145 -361418 -1711903 -1094892
12949 -1094892 3757409 7825345 7175862 5912776 8708311 11988006 9478015 2602232
12941 2602232 -1551998 -168973 3513071 6450352 8197300 8493909 7538661 7551483 9748213
12932 9748213 11264525 9183843 5602837 4300354 4667743 3859215 2588030 3082856 3299053
12923 3299053 -359448 -5672752 -6695295 -3008449 -272180 -1079652 -1892384 -516875
12915 -516875 -328888 -4409005 -10366857 -13753979 -13089494 -9657781 -5541757 -3034689 -2862108
12906 -2862108 -2491783 535454 4109311 4640504 3624415 5261011 8059495 6242385
12898 6242385 507415 -835610 5490734 11729210 10247017 3887238 -35047 128586
12890A28586J932682L405089L940732q48436q555340r576314j801311M542643
12882f831669K294994k040278l4284N108084N439272J856644R14374K420893M53663
12873I581693m855786o153684n65042N084424L528583l481447q012719n463994
12865a0337972J173109N393507M073349K61538r19166J345667L010396J232038
12857E232466j740570k328634p68301O4j075358k297232k105110o88389Q00916
12848d970148J179644J7273j440956j109892J149319K732138J444711j487696
12840b485607k608100J01970N017459P716145M707331k246144o681598m706897
12832a185441l48040r0105l392923l746449J077585N870733O229325L791248J138468
$$ plain form
12890 128586 2061268 5466357 9407089 8558653 3313 -9573001 -11374312 -6831669
12882 -6831669 -4536675 -6576953 -6611237 -1503153 3936119 5792763 6707137 9128030 9581693
12873 9581693 4725907 -1427777 -1992819 3091605 6620188 3138741 -4873978 -10337972
12865 -10337972 -9164863 -3771356 301993 563531 -355635 990032 4000428 5232466
12857 5232466 3491896 1163262 394961 395025 -680333 -2977565 -5082675 -5771064 -4970148
12848 -4970148 -3790504 -3773231 -5214187 -6324079 -5174760 -2442622 -997911 -2485607
12840 -2485607 -5093707 -4991737 25722 7741867 12449198 10203054 3521456 -1185441
12832 -1185441 -1533481 -1623586 -5016509 -8762958 -7685373 -1814640 4414685 8205933 9344401
12823I344401k176103n360840m543399N04416L775133K028363L15856K809452
12815F697279M653372N73945m477720k944040J805197Q20964m423695l944165
12807a238863L247021O659726J738244k940628p55832K391757k67272m334814
12799D499339k902609P87479m68079m679625m279760O08269K871158O47269r58798
12790c875357L3209Q9576j405596m20321L035563L154092j439477l821722J05095
12781d544938L974932R63993m445843l008003M262695O798021K97768o637352
12773b338727m797391L179318P682617N468449K016228J791626K412064K70067
12765A5684251l024908l744387k637682l487059n979402n334389j50717M376522
$$ plain form
12823 9344401 7168298 1807458 -2735941 -2231525 1543608 3571971 3887827 6697279
12815 6697279 11350651 11924596 7446876 4502836 6308033 7128997 2705302 -1238863
12807 -1238863 2008158 8667884 10406128 7465500 6709668 9101425 8834153 4499339
12799 4499339 1596730 2384209 1916130 -2763495 -7043255 -6434986 -3563828 -2916559 -3875357
12790 -3875357 -3842148 -3752572 -5158168 -5578489 -2542926 611166 -828311 -4650033 -4544938
12781 -4544938 -570006 393987 -4051856 -7059859 -2797164 4000857 4298625 -2338727
12773 -2338727 -7136118 -3956800 3725817 9194266 11210494 13002120 15414184 15684251
12765 15684251 12659343 8914956 6277274 2790215 -3189187 -8523576 -8674293 -4297771
12757d297771L882113J223885J303689K861212J038760l520618m540506K80344
12749a768892N273905M595963n05126m854254n981283m588271j670001J338558
12741h159401J996766l3157j218500J115457M151749L461490r3223j819243p16834
12732a314896m78580k541965l352568n72673K556503K365418P47448J709378M125369
12723C243434L074195j781182m351825p63590M242437L431874k613984o154801
12715a673442l196578J321521J457950j098241p52310K550938L589292Q89791
12707C088921r77492M26738J244402j329541l223907j35300M478542M378026M26937
12698H377326j561537r63201k386495n825254n317327N04632M571762K084727
$$ plain form
12757 -4297771 -415658 808227 2111916 4973128 6011888 2491270 -2049236 -1768892
12749 -1768892 3505013 8100976 7595850 2741596 -3239687 -7827958 -9497959 -8159401
12741 -8159401 -6162635 -6195792 -7414292 -6298835 -2147086 1314404 1221181 -598062 -1314896
12732 -1314896 -1793476 -4335441 -7688009 -8260682 -5704179 -3338761 -2591313 -881935 3243434
12723 3243434 6317629 4536447 184622 -578968 3663469 7095343 4481359 -1673442
12715 -1673442 -4870020 -3548499 -2090549 -3188790 -3941100 -1390162 2199130 3088921
12707 3088921 2111429 2538167 3782569 2453028 -770879 -906179 3572363 7950389 8377326
12698 8377326 6815789 5852588 3466093 -2359161 -7676488 -7171856 -2600094 -515367
12690e15367j800409l08921M372011N052730M29102m158623m725978k067403J323446
12681b399412L287515K470176M62199J139444M302330L841703k737405p693311
12673B673239l503769M086760L434661m735961q122990k337832L038557J370965
12665d096370p68815K930241O353230K129136m219493l069890K859117L507451
12657E624607j253604k572761J011305J647454k762054m707778j133341R94316
12649c151856k133730l882960M81646M513069J749239k660502q98303M031429
12641a951968M063289J13493m52954K864517L694027N42839j773412k075662m110732
12632I13437p138451n197762J966501O528521M499547J492775K401496L473063
$$ plain form
12690 -515367 -2315776 -2624697 1747314 6800044 7229146 3070523 -1655455 -3722858 -2399412
12681 -2399412 888103 3358279 3820478 4959922 9262252 13103955 10366550 2673239
12673 2673239 -830530 3256230 6690891 1954930 -6168060 -8505892 -5467335 -4096370
12665 -4096370 -4865185 -1934944 4418286 6547422 2327929 -741961 2117156 5624607
12657 5624607 4371003 1798242 2809547 4457001 1694947 -3012831 -4146172 -3151856
12649 -3151856 -5285586 -9168546 -8686900 -4173831 -2424592 -5085094 -5983397 -1951968
12641 -1951968 2111321 2224814 1771860 4636377 8330404 8873243 7099831 5024169 913437
12632 913437 -6225014 -11422776 -9456275 -2927754 1571793 3064568 5466064 8939127
12624H939127K84427l452960j984741K659881L961989O89732k942707m337965
12616C816783l908463j563208K439087M642350J959159k777790l929513j107250
12608d28845Q29816m54767k017186j154904R15488K135714K568004K718878J864099
12599F976297k72154k186770k353030j116160q2831l94286j762298k730769k290046
12590f212047j310020j053181m31729K482874N815631M878130m11651l791738
12582c3731j531625J802063R90085j310070R7898L315699K825192l43392n97767
12573E214352J695052R59155k666354k940267Q24993J751066k250435m100635
12565a513073m55L253383k63886n072360l030400L688794O616416L526125q93375
$$ plain form
12624 8939127 9223554 5770594 3785853 6445734 10407723 11097455 8154748 3816783
12616 3816783 -91680 -1654888 784199 5426549 7385708 4607918 678405 -428845
12608 -428845 400971 -53796 -2070982 -3225886 -2310398 -174684 2393320 5112198 6976297
12599 6976297 6704143 4517373 2164343 1048183 965352 571066 -1191232 -3922001 -6212047
12590 -6212047 -7522067 -8575248 -9006977 -6524103 -708472 4169658 3758007 -33731
12582 -33731 -1565356 236707 1226792 -83278 14620 3330319 6155511 5812119 5214352
12573 5214352 6909404 7868559 5202205 2261938 3086931 4837997 2587562 -1513073
12565 -1513073 -1513528 1739855 1475969 -3596391 -6626791 -2937997 3678419 7204544 6311169
12556F311169l537101m597507l342354O74983L874917K529088r72756j430568
12548d90129J169043K582826J636725Q34773Q29644j04446j821957k490699k179695
12539c3915k020894j461414m41371j431544m480823m143241K289722P726581M681775
12530F84876k056579k276351K925153L375741j947612k686448M334507Q169261
12522A0522548J516982o740727n438297K038270M681655N99801l268082l404547
12514E07603k069555l67353K422505M352869K930295K39304k19176K61030j373804
12505F683718l181437j251816K540473K911067j1513j280208K35660Q55424m08515
12496G092853k88025K069176L114392P78246k885137n687777p134835o202522
$$ plain form
12556 6311169 2774068 -1823439 -5165793 -4490810 -615893 1913195 940439 -490129
12548 -490129 678914 3261740 4898465 5733238 6562882 6458436 4636479 2145780 -33915
12539 -33915 -2054809 -3516223 -3957594 -5389138 -9869961 -14013202 -11723480 -3996899 684876
12530 684876 -1371703 -3648054 -722901 2652840 705228 -1981220 2353287 10522548
12522 10522548 12039530 5298803 -139494 1898776 6580431 7180232 3912150 507603
12514 507603 -1561952 -1929305 493200 4846069 7776364 8015668 7796492 8057522 6683718
12505 6683718 3502281 2250465 4790938 7702005 7690492 6410284 6645944 7501368 7092853
12496 7092853 6804828 8874004 11988396 12766642 9881505 4193728 -2941107 -9143629
12488i143629k435656R10056L55858j552254K99755M332078L949586j074165l340240
12479g698611Q1818L010107J112614j066324Q17489K806229M13037k294797M52363
12470b366075N205842M140376k133812n466109k794178M40257N5909j113673O41814
12461c389649L774959M482246K194331o45519k245198k901920l563940l989750
12453f284440k767025J15615J601872o52888l118775J38949P569856R953650L568607
12444A0125421l158012j957182K799830K133609k462180k523273K014886K812601
12436I785700k072431n241921l218187j164721j645419j20127M231063M665557
12428E219514m64149k612369K024979L932451l509544j0094128m107140P066187
$$ plain form
12488 -9143629 -11579285 -10669229 -10313371 -11865625 -11565870 -7233792 -3284206 -4358371 -7698611
12479 -7698611 -7616793 -4606686 -3494072 -4560396 -3742907 -936678 -523641 -2818438 -2366075
12470 -2366075 2839767 6980143 4846331 -619778 -3413956 -2973699 -2917790 -4031463 -3389649
12461 -3389649 385310 4867556 7061887 6416368 4171170 1269250 -2294690 -6284440
12453 -6284440 -9051465 -8935850 -7333978 -7986866 -11105641 -10966692 -3396836 6556814 10125421
12444 10125421 6967409 5010227 7810057 9943666 7481486 4958213 6973099 9785700
12436 9785700 7713269 2471348 -746839 -1911560 -3556979 -3677106 553957 5219514
12428 5219514 4755365 2142996 4167975 8100426 4590882 -5503246 -9610386 -2544199
12420b544199P226310l044877p928190j828915L842789J411627j889628Q33196
12412c921887L956279Q44434l651919j942842L184144L926319J48459k414459
12404A28528k293567k059288j343590J617039L954924J765844j966867r94942
12396a191919L618905M639553M41479k569445q54599R11129j307738l759366j614945
12387a686946K488748K662462p35670k177135k60367L69559k768441n426200l091813
12378a0625803J975247M176600K695121J475746J879968P78502k681031l848099
12370d173749J95853M622530L540597m60590m07133L066447K406690l307230n058454
12361D24961J500072P040060J958430p811013q573623Q23778P575824M024418
$$ plain form
12420 -2544199 4682111 1637234 -6290956 -8119871 -4277082 -2865455 -4755083 -3921887
12412 -3921887 34392 878826 -2773093 -4715935 -1531791 2394528 2542987 128528
12404 128528 -2165039 -4224327 -5567917 -3950878 4046 1769890 -196977 -1191919
12396 -1191919 2426986 7066539 7508018 4938573 4083974 4995103 3687365 -72001 -1686946
12387 -1686946 801802 3464264 2728594 551459 291092 660651 -2107790 -7533990 -10625803
12378 -10625803 -8650556 -4473956 -1778835 -303089 1576879 2355381 -325650 -4173749
12370 -4173749 -3977896 644634 4185231 3724641 3317508 6383955 8790645 5483415 424961
12361 424961 1925033 8965093 10923523 3112510 -5461113 -4637335 2938489 6962907
12353F962907k521148k571403J979445L179308l37085l273586k996969j996954
12345a575485j955553j280545P91992K197824J563094M12161L07105M08394l17930
12336E51057n70339J305624L992362M341977J671485j290423k213765j891193
12328E896785k029719k163402q33931J171383J327454q05784k580686j828065
12320a845965M05487J651609J065974l59848j449983j706538j332564r83599q09252
12311e364679R5248K005653K908925P60227k948970m739693m044763k927488j076374
12302a5331914L645674Q526822O529060k743527q894661l647293O873461J0075861
12294E033483L816461k749583l463787j513409j129657j399382p38371n81647
$$ plain form
12353 6962907 4441759 1870356 3849801 7029109 6692024 3418438 421469 -1575485
12345 -1575485 -3531038 -4811583 -4019591 -1821767 -258673 153488 460593 868987 551057
12336 551057 -19282 1286342 5278704 9620681 11292166 10001743 7787978 5896785
12328 5896785 3867066 1703664 869733 2041116 3368570 2562786 -17900 -1845965
12320 -1845965 -1440478 211131 1277105 917257 -532726 -2239264 -3571828 -4555427 -5364679
12311 -5364679 -5269431 -3263778 -354853 405374 -2543596 -7283289 -11328052 -14255540 -15331914
12302 -15331914 -11686240 -3159418 3369642 626115 -8268546 -11915839 -5042378 5033483
12294 5033483 8849944 6100361 2636574 1123165 -6492 -1405874 -2144245 -2725892
12286b725892j478003j027070J343551K385770M73088j585354j644150j377814
12278e635874j739913l32886L384808N144827K116921k103673k846606q27230
12270b839626Q26146J997134L370495K617073j735112n612026m342701p8327J478777
12261d318167p1469l54611J519961J757543q16625k380779n07696K111084K249361
12252h11398M51372j083339j553362p93386J565707M428374N136988K674758p67940
12243I247774k474652j939069m48596M33349k37218j772493j915123K91573K299887
12234C485432J053400k399272l996735k013751J394243L535660L240258L24519
12226D623754l678244n048949j930695K016973K322311P84278K080973M318531
$$ plain form
12286 -2725892 -4203895 -5230965 -3887414 -1501644 -1028556 -2613910 -4258060 -5635874
12278 -5635874 -7375787 -7708673 -4323865 820962 2937883 834210 -2012396 -2839626
12270 -2839626 -2013480 -16346 3354149 5971222 4236110 -1375916 -5718617 -5796944 -4318167
12261 -4318167 -4389636 -4744247 -3224286 -1466743 -2283368 -4664147 -5171843 -3060759 -811398
12252 -811398 -360026 -1443365 -2996727 -3790113 -2224406 2203968 7340956 10015714 9247774
12243 9247774 6773122 4834053 4385457 4818806 4581588 2809095 893972 1185545 3485432
12234 3485432 4538832 2139560 -1857175 -3870926 -2476683 1058977 4299235 4623754
12226 4623754 945510 -4103439 -6034134 -4017161 -1694850 -910572 1170401 5488932
12218E488932R17481p066582r650966k801765M182720K403820l323784l234132
12210a3084276J612323K597161j271039k683797O13985K901160J911580K530510
12202d872393O137539O265315j67290n924753m066245J518866L115314Q92358
12194B898711J9216P36450l28880j972241j62579L406247K863452j804477m133913
12185A521986j539428J124588K12628j437307o89238N86200p7512j149041o24020
12176b071144J04204o44686j668948j862190k375377k915927n10264M589405O861086
12167d93841L782860Q16965K482017L893471j130603q060103p468254n27979K064638
12158d640829l028308o766158k496200M165914N334246K403339R85389Q55710
$$ plain form
12218 5488932 6406413 -660169 -10311135 -13112900 -8930180 -6526360 -9850144 -13084276
12210 -13084276 -11471953 -8874792 -10145831 -12829628 -12215643 -9314483 -7402903 -4872393
12202 -4872393 1265146 7530461 7363171 1438418 -2627827 -1108961 2006353 2898711
12194 2898711 2917927 3654377 3325497 1353256 1190677 4596924 7460376 5655899 1521986
12185 1521986 -17442 1107146 1319774 -117533 -806771 -220571 -298083 -1447124 -2071144
12176 -2071144 -1966940 -2611626 -4280574 -6142764 -8518141 -11434068 -11944332 -7354927 -493841
12167 -493841 3289019 4105984 6588001 10481472 9350869 1290766 -6177488 -6705467 -4640829
12158 -4640829 -7669137 -14435295 -16931495 -12765581 -7431335 -5027996 -4042607 -3186897
12150c186897j321679l647026j527563L507235N056688J536781j834978j270975
12142b688414J025799J814513J347334P98309p63697l839419n652859l256244
12134a1214678J593626L786216J373515j762392j162850K050109K922615J97438
12126b216401j464379J482078N572605N146069P45073k211246k034287k161644
12118B857868l655609k915093R69856L158456J153554k61965K533518M487987
12110H328572Q4127n624253l498174M453551O730561j24282o051100l194876K305458
12101C409584R01703n019317n255889K056796P598328M594403k192349m127178
12093A966081j31819L699251L132800Q0015j648098j227061l42811k13616r28929
$$ plain form
12150 -3186897 -4508576 -8155602 -9683165 -6175930 -1119242 417539 -1417439 -2688414
12142 -2688414 -1662615 151898 1499232 2297541 1533844 -2305575 -7958434 -11214678
12134 -11214678 -9621052 -5834836 -4461321 -6223713 -7386563 -5336454 -2413839 -2216401
12126 -2216401 -3680780 -2198702 3373903 8519972 9265045 7053799 5019512 2857868
12118 2857868 -797741 -3712834 -2742978 415478 1569032 1307067 3840585 8328572
12110 8328572 8412699 2788446 -709728 3743823 10474384 10350102 4299002 1104126 3409584
12101 3409584 4311287 -708030 -5963919 -3907123 3691205 8285608 6093259 1966081
12093 1966081 1834262 5533513 8666313 8746328 7098230 5871169 5528358 5314742 4385813
12084D385813k473217m330882m615508j891259J966791L134734Q91791j148151
12076d079888l26575J190640M21218r32061J029992N458544O889737K968631k078658
12067A0541580l398081j472046K23737N76452O90489M46037j047099k408224j291717
12058B861128R23722l94377o140786j0151089o232649L024874Q427994N436256
12050b244927m98906j610864K365631N307863L704963K88789j333775j589668
12042D389106k725227m458612m289898j112549L059976M658368J739826l342373
12034b081383n060598p86457M790975M803283k25141k714971O87235L881762J024029
12025D318734l970789l676214Q29540J767323k694286n259564l91592P764770
$$ plain form
12084 4385813 1912596 -2418286 -7033794 -8925053 -6958262 -3823528 -2931737 -4079888
12076 -4079888 -4406463 -3215823 -2794605 -3726666 -2696674 2761870 9651607 12620238 10541580
12067 10541580 7143499 5671453 5895190 6471642 7162131 7608168 6561069 4152845 2861128
12058 2861128 3784850 3390473 -2750313 -12901402 -19134051 -16109177 -7681183 -2244927
12050 -2244927 -2743833 -4354697 -1989066 3318797 7023760 7312549 5978774 4389106
12042 4389106 1663879 -2794733 -7084631 -8197180 -5137204 -478836 1260990 -2081383
12034 -2081383 -7141981 -7928438 -3137463 1665820 1440679 -1274292 -587057 3294705 4318734
12025 4318734 347945 -3328269 -2498729 -731406 -3425692 -8685256 -9076848 -1312078
12017a312078J1044663O704007j216110o854568o900219k507590J639930K004145
12009B602180J29680m07582L0631j449082l369761n96941O280345Q788448K055650
12000A4063568o766982p434710n78979L912240J111191l342409k996611K81455
11992a751237O61302k076010k518866J497601M862373K265259l799833o101758
11984f961169k849336Q7207j336266k726930J407055P493118O974976m45768n292514
11975c649627j852734L845840L660535r05560k465222N06122K481083J80896l209405
11966a408072l751388j708339O63205K443998L363327K694594Q13109k19385N27736
11957C418785J084102m58376k470790j653640J891513L940523J573642k506176
$$ plain form
12017 -1312078 9732585 16436592 15220482 8365914 1465695 -1041895 598035 2602180
12009 2602180 2731860 2324278 2354909 905827 -2463934 -3060875 3219470 12007918 14063568
12000 14063568 7296586 -138124 -717103 3195137 4306328 963919 -2032692 -1751237
11992 -1751237 -1089935 -3165945 -5684811 -4187210 675163 2940422 -859411 -6961169
11984 -6961169 -9810505 -9723298 -11059564 -13786494 -12379439 -4886321 2088655 1642887 -3649627
11975 -3649627 -5502361 -1656521 2004014 1098454 -1366768 -860646 1620437 1801333 -1408072
11966 -1408072 -5159460 -6867799 -6204594 -3760596 -397269 2297325 3110434 2891049 3418785
11957 3418785 4502887 4044511 1573721 -79919 1811594 5752117 7325759 4819583
11949D819583l217239M6049K503101N50493l450907m783248k589616J37855J248114
11940d735815J058458K65359n54718Q085K357464L773890J840352q41184n4172
11931C117719K477031J048038l903695m959356K99298M086580L03513n240271
11923b771143l803537K348770L988101k2105j625467K501238N515847J787136
11915G918840m091011m459694L80098L531960J250137l182142m550021j635472
11907d837305K192687L032983P67231j061831j42052J379757M39855j904931k210605
11898b344211k66969R93134P26542R06597J666490O96832j791641k452585p93921
11889b659732o57838l140696l293359K022547P529160O233205k59732m080370
$$ plain form
11949 4819583 1602344 1648393 4151494 4701987 1251080 -3532168 -6121784 -5983929 -4735815
11940 -4735815 -3677357 -3411998 -3966716 -3958631 -1601167 2172723 4013075 3171891 3117719
11931 3117719 5594750 6642788 2739093 -2220263 -1920965 2165615 2469128 -2771143
11923 -2771143 -6574680 -4225910 -237809 -259914 -1885381 615857 6131704 7918840
11915 7918840 3827829 -631865 -251767 3280193 4530330 1348188 -3201833 -4837305
11907 -4837305 -2644618 388365 1155596 93765 -48287 1331470 1771325 -133606 -2344211
11898 -2344211 -2611180 -1618046 -891504 15093 1681583 2378415 586774 -1865811 -2659732
11889 -2659732 -3317570 -6458266 -9751625 -7729078 -199918 6033287 5773555 1693185
11881A693185k311360R2107j250776m180895m142697m05696L892775N436112L051693
11872A874448j439541l587013O756O753501R150150L188630n843397q882154l933184
11863b711804J766527J330561l108011m175793J8640L449097J486807j850489
11855c794465N8584N767336O882367J54568p138078o589853P27699O817494P001270
11846I886922L304680n85875k998886l275613j466161L35122j63984j739914j233246
11837B063045P72733K12430l132642l543925K038021P671016N829607j497842
11829A0412443n197841j742410K775378K380978j061845k823891k824043l540480
11821a621711m021896j622924K028828K581300J52444p22683R27444N98272l272673
$$ plain form
11881 1693185 -618175 -526068 -1776844 -5957739 -10100436 -10506132 -6613357 -1177245 1874448
11872 1874448 434907 -3152106 -3145350 3608151 12758301 15946931 10103534 1221380 -2711804
11863 -2711804 -945277 385284 -2722727 -6898520 -6879880 -3430783 -1943976 -3794465
11855 -3794465 -3735881 2031455 8913822 9068390 1930312 -4659541 -3931842 2885652 9886922
11846 9886922 13191602 12605727 9606841 6331228 4865067 5200189 5036205 3296291 2063045
11837 2063045 2835778 3048208 -84434 -3628359 -1590338 6080678 11910285 10412443
11829 10412443 5214602 3472192 6247570 8628548 7566703 4742812 1918769 -1621711
11821 -1621711 -5643607 -7266531 -5237703 -2656403 -2503959 -3226642 -2299198 -1700926 -4973599
11812d973599n002255l60287N329568M265558j596007l013740K388277O452301
11804C489816L089606k691149k809275K268374N624385M153078P52057j862583
11796A2014309l669229m294673k895489j277959k208328m179383k806888J848719
11788g468921M687774L576948K098705K112400J56935m727633o311339o68039
11780f543170N320782L292702k804869k229095N080161P750202R27426o207542
11772D586597n117078j28213N22727k360272k950126j114657m36739p6640K532024
11763d542377M267068P30753m349165l639607J369026K534738p80161p50920M317020
11754h43625O053640O32270l813711p20039L789830J503548m284332n274795k053723
$$ plain form
11812 -4973599 -9975854 -10336141 -5006573 -741015 -2337022 -5350762 -2962485 3489816
11804 3489816 6579422 3888273 1078998 3347372 8971757 13124835 13876892 12014309
11796 12014309 8345080 4050407 1154918 -123041 -2331369 -6510752 -9317640 -7468921
11788 -7468921 -2781147 795801 2894506 5006906 5163841 436208 -5875131 -6543170
11780 -6543170 -1222388 2070314 -734555 -2963650 2116511 9866713 10794139 4586597
11772 4586597 -530481 -658694 -135967 -2496239 -5446365 -6561022 -6997761 -7074401 -4542377
11763 -4542377 -275309 455444 -3893721 -7533328 -6164302 -3629564 -4409725 -5160645 -843625
11754 -843625 5210015 5842285 2028574 1308535 5098365 6601913 2317581 -2957214 -5010937
11745e010937j190780k707270j120302L175549M000772N09849j398527L77882
11737c363764J091663j543116l199188r62563J629320J089259m17254L37285K282165
11728c056193K752639J614445j54545k387526l993414l019468l24346P89021J38343
11719g641044J126363L938457L990325k0818k553009R6393L143960P30099m619925
11710a809199n939888j863290L057300N292686M123880o29028o703938p810260
11702a2281737n89623Q492485R879969L456711k334624k958105j840571j858210
11694c3705r54913J637180K264907n71352k632950p72124J911782J711529K83347
11685B843701O13539J324486j20018k042613j489068K41503J61583n73475J171663
$$ plain form
11745 -5010937 -6201717 -8908987 -10029289 -6853740 -2852968 -2343119 -3741646 -3363764
11737 -3363764 -2272101 -3815217 -7014405 -7976968 -6347648 -5258389 -5675643 -5338358 -3056193
11728 -3056193 -303554 1310891 1156346 -1231180 -5224594 -8244062 -8568408 -7779387 -7641044
11719 -7641044 -6514681 -2576224 1414101 1393283 -1159726 -1063333 2080627 2810726 -1809199
11710 -1809199 -7749087 -9612377 -6555077 -1262391 2861489 2232461 -4471477 -12281737
11702 -12281737 -12871360 -4378875 5501094 8957805 6623181 3665076 1824505 -33705
11694 -33705 -988618 648562 2913469 2342117 -290833 -1062957 848825 2560354 2843701
11685 2843701 3457240 4781726 4661708 2619095 1130027 1371530 1533113 959638 2131301
11676B131301M090304L880344N04046j677956j321766k005509n265411o979033
11668f643680l550672K207377M765298K968864L39439p8754J600703L547056L958811
11659I114442J953215j466842l797322l624275k026425m65181J115305K624023
11651C426940K339192l97986k755713j925599K10370k12542k480433k209683R78492
11642c026962K181452o36252k837641q18997J784555N46026j712894J42881L946061
11633d31771L345460j123784k578543N39981K134993m63081k010083M93970J849993
11624A757135j677311m652362j539845L264474K815808n39018j17263K650264
11616A961882J245757l174236l298202R81023K263044o59558p05184L432822L369986
$$ plain form
11676 2131301 6221605 10101949 10605995 8928039 7606273 5600764 335353 -6643680
11668 -6643680 -10194352 -7986975 -3221677 -252813 86626 7872 1608575 5155631 9114442
11659 9114442 11067657 9600815 5803493 2179218 152793 -312388 802917 3426940
11651 3426940 5766132 5368146 2612433 686834 897204 684662 -1795771 -4005454 -3026962
11642 -3026962 -845510 -1481762 -4319403 -5138400 -3353845 -2807819 -4520713 -4377832 -431771
11633 -431771 2913689 1789905 -788638 -248657 1886336 1423255 -586828 -92858 1757135
11624 1757135 79824 -4572538 -6112383 -2847909 -32101 -571119 -688382 1961882
11616 1961882 3207639 33403 -3264799 -2283776 -20732 -680290 -1385474 2047348 5417334
11607E417334l826427q217540k314155O044036N458580k046384n923363l273689
11599h681608L49777K406390N024806P110441M775631o48765l632755l430163
11591C273754m077330n572794l474923J893018M208802J138706j978965r75614
11583e565346J537977K291150K545646L676360L391115K70731k762935l149810
11575B234888k462903k240272o98964K792291M588160K354363l30448M24633K214768
11566H876516M24480l799626n067002j911469J409851J117902j698055l188147
11558c835550j141104K654244L745513P3616m233648l205209K366577N254629
11550A679068K366726o61236J112700L811415J625959l080513l674254K240K397439
$$ plain form
11607 5417334 1590907 -6626633 -8940788 -2896752 2561828 515444 -5407919 -8681608
11599 -8681608 -8331831 -5925441 -900635 6209806 10985437 10336672 6703917 3273754
11591 3273754 -803576 -6376370 -9851293 -7958275 -3749473 -2610767 -4589732 -5565346
11583 -5565346 -4027369 -1736219 809427 4485787 7876902 8147633 5384698 2234888
11575 2234888 -228015 -2468287 -3167251 -374960 4213200 6567563 6237115 6661748 8876516
11566 8876516 9300996 5501370 434368 -1477101 -67250 1050652 -647403 -3835550
11558 -3835550 -4976654 -2322410 1423103 1496719 -2736929 -5942138 -3575561 1679068
11550 1679068 4045794 3384558 4497258 8308673 9934632 6854119 3179865 3182105 5579544
11541E579544J822817J398526J215134k241726p930252r294359l879640K659160
11533a0670796N010069M689622M784196M002415N59773k577693j663717J492660
11525E626529K149399l05149k488241k811676k522298j696414R77275L976796
11517B906221L166360j913348n775006l916671O69987J616558j692816l588701
11509h527416r34639K365516K078835N00810J989249M562765K364261m033308
11501C66073o835104k462823K854832K785110K28231J187135L932731J838678
11493C894863m982772q620734m529589K475524N124618K125494j978209k240203
11485h731008K257034P004276N702743j842600p349576m037497L154774L807750
$$ plain form
11541 5579544 7402361 8800887 10016021 7774295 -155957 -9450316 -13329956 -10670796
11533 -10670796 -5660727 -971105 3813091 7815506 8375279 5797586 4133869 5626529
11525 5626529 7775928 7470779 4982538 2170862 -351436 -2047850 -1070575 2906221
11517 2906221 6072581 4159233 -1615773 -5532444 -4862457 -3245899 -4938715 -8527416
11509 -8527416 -9462055 -7096539 -5017704 -4516894 -2527645 2035120 4399381 366073
11501 366073 -6469031 -8931854 -6077022 -3291912 -3063681 -1876546 2056185 3894863
11493 3894863 -1087909 -9708643 -14238232 -11762708 -6638090 -4512596 -6490805 -8731008
11485 -8731008 -6473974 530302 6233045 4390445 -2959131 -6996628 -3841854 -34104
11477c4104k627815n878538l83347O747463O915232J720814j726386j336382J3553
11468C410490Q56358J648807J692010M85352r2669J014496J264477j216424l589391
11459E473506k719463o03587p80571k171776j526033M35137N85723p85662q37059
11450b929785P28277K101548K974953L139590L21430n120279o805601q38423N487650
11441i40640K584836n871945p183100O09308N511438J098123l490175L32039O031030
11432a319086L460332l886504n108444J55101K657233q0285q80188L213124N775016
11423C986299K574562j459121j035661J624030K240818J132366j35061k599702
11415F328530n524957m086134K739438P222901K718403n555736p126836j067479
$$ plain form
11477 -34104 -2661919 -8540457 -8923804 -2176341 4738891 6459705 4733319 3396937 3410490
11468 3410490 4266848 5915655 7607665 8093017 8000348 9014844 10279321 9062897 5473506
11459 5473506 2754043 2150456 1369885 -801891 -2327924 -1892787 -1307064 -2092726 -2929785
11450 -2929785 -2201508 -99960 2874993 6014583 6336013 1215734 -5589867 -6428290 -940640
11441 -940640 1644196 -4227749 -11410849 -10801541 -5290103 -4191980 -7682155 -7350116 -1319086
11432 -1319086 2141246 -1745258 -6853702 -6698601 -4041368 -4121653 -5001841 -1788717 3986299
11423 3986299 6560861 5101740 4066079 5690109 7930927 9063293 8928232 6328530
11415 6328530 803573 -3282561 -543123 6679778 9398181 3842445 -3284391 -4351870
11407d351870L725415K008954j972192k853803j170598J89919Q44374J469895
11399b109906J632166J337360J539137J770024N28800j302537j251453O3142m43565
11390A763168k390610j929278J109591K025739n91436j764824J434499M395016
11382D051865K313690k348036m579440m019578k493800M82521M147301L719851
11374A274374k225073o588505l349476K448264K711125l65453Q94932N157549
11366d2263M307399j337510k768864J882451L935699l88427l302233N79909M630036
11357G496197J580796m562524n839588k477754M8628L86227K86659r71036l926440
11348g978835m679555j64439N544360O425054L004666m2543j489710k787289k855508
$$ plain form
11407 -4351870 -626455 1382499 -589693 -3443496 -4614094 -4424175 -3579801 -2109906
11399 -2109906 -477740 859620 2398757 4168781 4697581 3395044 2143591 2206733 1763168
11390 1763168 -627442 -2556720 -1447129 578610 -12826 -1777650 -343151 4051865
11382 4051865 6365555 4017519 -561921 -4581499 -7075299 -6592778 -2445477 1274374
11374 1274374 -950699 -7539204 -10888680 -8440416 -5729291 -6094744 -5199812 -42263
11366 -42263 4265136 2927626 158762 2041213 5976912 5588485 2286252 2866161 7496197
11357 7496197 9076993 4514469 -1325119 -3802873 -3754245 -3368018 -3081359 -4052395 -7978835
11348 -7978835 -12658390 -12822829 -7278469 -853415 2151251 2108708 618998 -2168291 -5023799
11339e023799l2121L166246L326919K067073K783151L714639P79868m144405m714039
11330A923532Q3121L870875J889011k803280m027065l62935L430935J977085m086097
11321A895182p663054l535633L670985M658437j005929l511036K139052P591842
11313D239846L728096n078227p609421k036002L513400L855217J398682p28696
11305A282895j933116j022074K603595M750119O28416o502870p855809j157167
11297i206011O137419O940089K330020k131434l165282j325154Q34386J165479
11289A579512K88347N72880J525775k15973l943512l495179K746568O858727K934743
11280H851888k856599k238137J539443O41335k491405j40200M867247K934252
$$ plain form
11339 -5023799 -5055920 -1889674 1437245 3504318 6287469 10002108 10781976 6637571 1923532
11330 1923532 2006653 5877528 7766539 4963259 936194 573259 4004194 5981279 1895182
11321 1895182 -5767872 -9303505 -5632520 -974083 -1980012 -5491048 -3351996 4239846
11313 4239846 7967942 2889715 -4719706 -6755708 -3242308 612909 2011591 1282895
11305 1282895 -650221 -1672295 931300 5681419 6309835 -193035 -8048844 -9206011
11297 -9206011 -3068592 3871497 6201517 4070083 904801 -420353 414033 1579512
11289 1579512 1867859 2440739 3966514 3750541 -192971 -3688150 -941582 5917145 8851888
11280 8851888 5995289 3757152 5296595 5937930 3446525 3306325 8173572 11107824
11272A1107824m458223o028373k10254K229272k480204m816548L33713M659402
11264C36609J807976j809676M17465L958061K886102K85288L83461J57717k825508
11255E597495l775916k96602J044683l390556n734721K14867O945238N354857
11247E959345j88556r13856Q05110j748718m903156j354816M261875K092877m691263
11238f81158m311280L085213N419092o88965m914046j190200L583313K737826
11230C039795o44541j970501k238329k490665o82595K010553Q87595k797515j559225
11221f445428N241469P976226J601040n527638m224891K267447M810540J584349
11213G283114k400591l816181k511191J089123M375056K739201l355563o283375
$$ plain form
11272 11107824 6649601 621228 410974 2640246 160042 -4656506 -4322793 336609
11264 336609 2144585 334909 752374 4710435 7596537 7881825 8265286 8423003 5597495
11255 5597495 1821579 1524977 2569660 -820896 -6555617 -6340750 604488 5959345
11247 5959345 5770789 4856933 5662043 3913325 -989831 -2344647 1917228 4010105 -681158
11238 -681158 -4992438 -1907225 3511867 2822902 -2091144 -3281344 301969 3039795
11230 3039795 2395254 424753 -1813576 -4304241 -4986836 -2976283 -2088688 -4886203 -6445428
11221 -6445428 -1203959 6772267 8373307 2845669 -1379222 888225 5698765 7283114
11213 7283114 4882523 1066342 -1444849 -355726 4019330 6758531 3402968 -2880407
11205b880407j747657L776936K553122k439952k909523J128064K151996j926916
11197b294337m596698j430902L566388M654031J811097j153536j929314p16599
11189b089870J221745K088508P02787j647381k299551q05214N58011M09802K23558
11180a637605J660129L664209L459908k60253n546041q151302n024845J853079
11172i982721O103375L662742j725549k683318K025730N485719J973979n034500
11164a74543p367240k698145L234058M655908K375323J097848K680579M299816
11156H103604K665592j573694m175395k028903K690617M278777L81532m405454
11148E936676m168143K61663K577053K46792k169438n36215K831641L856062L078891
$$ plain form
11205 -2880407 -4628064 -851128 1701994 -737958 -3647481 -2519417 -367421 -2294337
11197 -2294337 -6891035 -8321937 -4755549 -101518 1709579 556043 -1373271 -2089870
11189 -2089870 -868125 1220383 1923170 275789 -2023762 -2828976 -2270965 -1861163 -1637605
11180 -1637605 22524 3686733 7146641 6886388 1340347 -6810955 -11835800 -9982721
11172 -9982721 -3879346 -216604 -1942153 -4625471 -2599741 2885978 4859957 -174543
11164 -174543 -7541783 -10239928 -7005870 -2349962 25361 1123209 3803788 8103604
11156 8103604 10769196 9195502 5020107 2991204 5681821 9960598 10342130 5936676
11148 5936676 1768533 2030196 4607249 4854041 2684603 2148388 4980029 8836091 11914982
11139A1914982K901722K098836j353072m649403l673753m94397o40958l749172
11131B354785m175996j021067L48941j775094k134849J824197M745355K349910
11123B516182j248527p07663J942529J886402k64031j114235j044930j710267
11115B55460r41389K944280N230561Q81763n894789o292285o1568M005893J086451
11106A214377l593952l238012K066629P293305Q093486L098944m965731r380976
11098E88070n075407M412288R493833N456173k483312o120956l131566K153279
11090E292402M268831J779937j828636k537202j422804l215364p756282p706145
11082a3125263Q26985J0040062R649880J183180m851020m112941j898977j892345
$$ plain form
11139 11914982 14816704 16915540 15562468 10913065 7239312 6744915 6103957 2354785
11131 2354785 -1821211 -2842278 -2493337 -4268431 -6403280 -4579083 166272 2516182
11123 2516182 1267655 559992 2502521 4388923 4124892 3010657 1965727 255460
11115 255460 -685929 2258351 7488912 8370675 2475886 -3816399 -3877967 127926 1214377
11106 1214377 -2379575 -5617587 -3550958 3742347 11835833 14934777 9969046 588070
11098 588070 -4487337 -75049 9418784 14874957 12391645 6270689 3139123 5292402
11090 5292402 9561233 11341170 9512534 6975332 5552528 2337164 -5419118 -13125263
11082 -13125263 -12298278 -2258216 7391664 8574844 3723824 -389117 -2288094 -4180439
11074d180439j029770K404957M241758J632283k005356k880900j952734j053340
11066d823541N23242K462623J881681j395854l030175p47874K061762K133472
11058i34664P48267k69312j576649k508769j21187M568424N475173O65631l408809
11049B638105j629450J927628J449828j162151j042991M35614j177079m581186
11041c141682m677824j180633J553468J687046R07557L8750p56184M56193L991616
11032a121693N402739J854943j506959J054762N169669K211226n878532q205637
11024a019482j992321K892207k84393n001109k917776K905502L823748q52136
11016b445760m095451k236005J227412K167286P92342k49508P22512L112978M253420
$$ plain form
11074 -4180439 -5210209 -2805252 1436506 3068789 1063433 -1817467 -3770201 -4823541
11066 -4823541 -4300299 -1837676 44005 -1351849 -4382024 -5129898 -3068136 -934664
11058 -934664 -186397 -455709 -2032358 -4541127 -4662314 -93890 5381283 6046914 2638105
11049 2638105 1008655 2936283 4386111 3223960 2180969 2616583 1439504 -3141682
11041 -3141682 -7819506 -9000139 -7446671 -5759625 -4852068 -4813318 -5569502 -5113309 -1121693
11032 -1121693 4281046 6135989 4629030 5683792 10853461 13064687 7186155 -1019482
11024 -1019482 -3011803 -119596 -403989 -5405098 -8322874 -5417372 -1593624 -2445760
11016 -2445760 -6541211 -8777216 -7549804 -5382518 -4590176 -4839684 -4117172 -1004194 3249226
11007C249226J826754k474403l835501q24087J853363J43985k783255j313888
10999d157806L310705M261378l61228m159928j706338L576697M421837l34202
10991D851115m957085m810372j199123K031021L237305K733453M39368l378493
10983a052811n936296l623578L106093Q514978P096673k26173o789314o978195
10975e888623j383872M620339O287829L275399r62816k863376k010865q41978
10967B32037j174135j917615j145371N51153Q69571j57895K96047K960701L839408
10958D353901n04646o543801o808287J67681O906594O231847L01839l075799j076722
10949d7393J785025J506520l39407j059846j661117l625538m297457m41933N145131
$$ plain form
11007 3249226 5075980 2601577 -1233924 -2058011 -204648 -60663 -2843918 -4157806
10999 -4157806 -847101 3414277 3053049 -1106879 -2813217 763480 5185317 4851115
10991 4851115 -105970 -4916342 -6115465 -4084444 -847139 1886314 2325682 -1052811
10983 -1052811 -6989107 -10612685 -7506592 1008386 8105059 7878886 1089572 -5888623
10975 -5888623 -7272495 -2652156 3635673 6911072 5948256 3084880 1074015 232037
10967 232037 -942098 -2859713 -4005084 -3453931 -2584360 -2742255 -2446208 514493 4353901
10958 4353901 3849255 -2694546 -9502833 -9335152 -2428558 3803289 4105128 1029329 -47393
10949 -47393 1737632 3244152 2904745 1844899 183782 -3441756 -7739213 -8181146 -3036015
10940c036015N992526J227261k652681j126433J896211N10438l756560m059595
10932e004848J261890N587692L026709l327504n388108o75950M660560L986844
10924D127285j473235m678437j911934L157990N152335L718698K153240J352833
10916A1598775q72761m537050n809921k590591J540320J995945l46703r14085
10908F3929J473576L194122J611745j395885k813048k347704j299196j17184Q64942
10899g64703K89096k229803m277666l203665J99057K623140K320074M35905j102430
10890e710995j182816L73271K327445K293528m33335l056346k649089m46483K48688
10881h236132l50525J007284M519395O183763L890014M02193j462839k480816
$$ plain form
10940 -3036015 2956511 4183772 1531091 404658 2300869 2811307 -945253 -5004848
10932 -5004848 -3742958 1844734 4871443 1543939 -3844169 -4520119 140441 4127285
10924 4127285 2654050 -2024387 -3936321 -778331 4374004 8092702 10245942 11598775
10916 11598775 10726014 6188964 379043 -2211548 -671228 1324717 978014 63929
10908 63929 1537505 4731627 6343372 4947487 2134439 -213265 -1512461 -1629645 -764703
10899 -764703 -475607 -2705410 -6983076 -10186741 -9987684 -7364544 -5044470 -4608565 -5710995
10890 -5710995 -6893811 -6520540 -4193095 -1899567 -2332902 -5389248 -8038337 -8484820 -8236132
10881 -8236132 -8586657 -7579373 -3059978 3123785 7013799 7415992 5953153 3472337
10873C472337l678601l588474j698283o43702j728450k196912m32340N29535j068858
10864a1033748j125477L235389O660198L103556l237056l288662K654889N549717
10856B518806K066754j334859j68348J740497O89471p15815N7606L23040k009323
10847C167829l852481k714394j258819j738934j542230J200256L091302J338868
10839b308603j086788j029594o99742k502814l423851l02684L758408M071979
10831c523689J585700P9228L1198L27695J812085M036589L218835j214122l422238
10822B931281m38936J514104k670086o899308l497472K894728K385984l276963
10814g056668l528323L079085O760806K981012j364835r10310L12587j790063
$$ plain form
10873 3472337 -206264 -3794738 -5493021 -6136723 -7865173 -10062085 -10494425 -9964890 -11033748
10864 -11033748 -12159225 -8923836 -2263638 839918 -2397138 -5685800 -3030911 2518806
10856 2518806 4585560 3250701 3082353 4822850 5512321 4796506 4854112 5177152 3167829
10847 3167829 -684652 -3399046 -4657865 -6396799 -7939029 -6738773 -3647471 -2308603
10839 -2308603 -3395391 -4424985 -5124727 -7627541 -11051392 -11354076 -7595668 -3523689
10831 -3523689 -1937989 -1858761 -1827563 -1499868 312217 4348806 7567641 6353519 2931281
10822 2931281 2492345 4006449 1336363 -5562945 -9060417 -6165689 -3779705 -7056668
10814 -7056668 -10584991 -7505906 -745100 2235912 871077 -39233 273354 -1516709
10806a516709l852572k125597O66360Q55323J723O37931J157677l35088j517248
10797f028200K45617K862131K523286n56794k753386j969395L25671J260991j67451
10788d257530j642779j49058L256740L823518J12999l013346j709939P70683J06751
10779b701961j389034M85937L322097K067844j535362j862056N91128Q74676p39283
10770h86014j69774J013292k073355o600799m574745L025195O140438J457357
10762b668405l057094k052969L66619J293481M412331R340558P498558l599899
10754A1533180j2300967q379423J612742M536940k04802k423997J757638N250459
10746A381770K179469l748175n248347r10870M010216M625027K218076J682886
$$ plain form
10806 -1516709 -5369281 -7494878 -6828518 -5973195 -5971472 -5333541 -4175864 -4510952 -6028200
10797 -6028200 -5782583 -2920452 -397166 -953960 -3707346 -5676741 -5351070 -4090079 -4257530
10788 -4257530 -5900309 -6049367 -2792627 1030891 1143890 -1869456 -3579395 -2808712 -2701961
10779 -2701961 -4090995 -3605058 -282961 1784883 249521 -1612535 -1021407 -146731 -886014
10770 -886014 -1055788 -42496 -2115851 -8716650 -13291395 -10266200 -4125762 -2668405
10762 -2668405 -5725499 -7778468 -7411849 -6118368 -1706037 7634521 15133079 11533180
10754 11533180 -767787 -9147210 -7534468 -2997528 -3202330 -5626327 -3868689 1381770
10746 1381770 3561239 -186936 -5435283 -6346153 -2335937 2289090 4507166 6190052
10738F190052L550616K552155l341961p589534m438191J296036J791690r88534
10730i77671k75145J805864j586469o678206l275140N809048O498109k616016
10722a295626o038663K944056J0444643N290124k973151j994707K737716L83365
10714I497757m818707k660113L052598J413776n171542n114187J655399M065721
10706A920702n27041l080365K50453K433335q63989m362236l144497M98180L318138
10697c557320N647969O840325L755017l169838q355364q040904m062387M84198
10689a0458304M526762P001110O240539K817761l75651j743127k244038l110899
10681B654153m346869m915175l176892J213253N048434M188281n02367l531836
$$ plain form
10738 6190052 9740668 12292823 8950862 1361328 -3076863 -1780827 10863 -977671
10730 -977671 -1252816 553048 -1033421 -7711627 -10986767 -5177719 1320390 -1295626
10722 -1295626 -7334289 -4390233 6054410 11344534 8371383 6376676 9114392 9497757
10714 9497757 4679050 2018937 5071535 6485311 1313769 -3800418 -2145019 1920702
10706 1920702 1393661 -1686704 -1436251 997084 133095 -4229141 -7373638 -6875458 -3557320
10697 -3557320 2090649 8930974 12685991 9516153 1160789 -6880115 -10942502 -10458304
10689 -10458304 -5931542 1069568 7310107 10127868 9752217 8009090 5765052 2654153
10681 2654153 -1692716 -6607891 -9784783 -8571530 -3523096 665185 162818 -3369018
10673c369018k143979J112244L842945N946120N372753o02611p655185o638209
10665d134940K571284Q305300L403353m490249n364533j088449O00467j049313
10657a247080j605621m39256J77725M46291R36931j21526k095311n38300M280805
10648b05342M827304j819507p599381n659315n08636J281174J678538M298318
10640c706847N769757K978697M54756J525894R78079m123875o031344O23760P164059
10631E632936M209352k614622l061056N62247K12460k207085l26677K879266J124881
10622F411702k135989p09294J384062j833714m797815l92931M461126j11839p673649
10613e398341n277797L769452N783118J98381k105557N9019j558212n903464l727019
$$ plain form
10673 -3369018 -5512997 -4400753 -557808 5388312 10761065 10158454 2503269 -4134940
10665 -4134940 -1563656 6741644 10144997 5654748 290215 -798234 -197767 -1247080
10657 -1247080 -2852701 -3291957 -3114232 -2667941 -1731010 -1852536 -3947847 -4486147 -205342
10648 -205342 4621962 2802455 -4796926 -10456241 -10964877 -9683703 -8005165 -3706847
10640 -3706847 2062910 5041607 5496363 7022257 8000336 3876461 -2154883 -1531123 5632936
10631 5632936 9842288 7227666 4166610 4728857 4941317 2734232 2407555 5286821 6411702
10622 6411702 4275713 3566419 4950481 3116767 -1681048 -2073979 2387147 2275308 -5398341
10613 -5398341 -10676138 -6906686 -1123568 -925187 -3030744 -2971725 -4529937 -10433401 -14160420
10604a4160420L788553O057356J920955p4339J232096k45599k639436Q29625N781912
10595B490703K422415m886153l468621M393960M969785j715033k431231L838879
10587E614704M224079l128485n953777k006115k505630q157977o210688L810861
10579a4313028O464794j172711k968368O111953R441163m96595o630764K690984
10571h72572J2231516O101795n570033n863108P30239J94399m831195k067534
10563E3507O660724Q658814J905238l638504l253933k100573l999171o177944
10555a891842m950593j66316N051963O093046J349867m213195m715174j732674
10547e174918m35547J92263L987627P238880L397076l760711m467299Q58187K878216
$$ plain form
10604 -14160420 -10371867 -4314511 -2393556 -2467895 -1235799 -1481398 -4120834 -3291209 2490703
10595 2490703 4913118 26965 -3441656 952304 5922089 4207056 1775825 5614704
10587 5614704 9838783 6710298 756521 -1249594 -3755224 -11913201 -18123889 -14313028
10579 -14313028 -7848234 -9020945 -11989313 -5877360 3563803 3067208 -3563556 -872572
10571 -872572 11358944 17460739 11890706 6027598 6757837 6952236 2121041 53507
10563 53507 6714231 15373045 17278283 13639779 10385846 8285273 4286102 -1891842
10555 -1891842 -6842435 -7008751 -1956788 4136258 5486125 1272930 -3442244 -5174918
10547 -5174918 -5610465 -5418202 -1430575 5808305 9205381 5444670 977371 1835558 4713774
10538D713774o42301l453224l487734l268936p27600O069963R497650L099410
10530A1801002m300966k027681L146971M53590k665578M580186J0666327l85052
10522B1268799j5773262j1383137N889441R233524j410983k913255N696727L727034
10514A4334888p587956o354028N376801M174468p298638m050047R601166N205637
10506A3402291j1826658q039486J1500721P777543j5474040j2761485J5472730
10499E1616J7778642r810954j1628136J7690555J4792368k5450442k3060162L2764470
10491A3127957L8000524l0776415k3421166J40898219K71449195J43889643j42593433
10484D10574524k70843850j42251439K0462322K9418052l5531753k9545407K1661310
$$ plain form
10538 4713774 4071473 618249 -2869485 -6138421 -6866021 -796058 8701592 11801002
10530 11801002 7500036 5472355 8619326 9072916 6407338 10987524 21653851 21268799
10522 21268799 5495537 -5887600 1841 9235365 7824382 4911127 10607854 14334888
10514 14334888 6746932 392904 5769705 9944173 2645535 -1404512 8196654 13402291
10506 13402291 1575633 -6463853 5036868 12814411 -2659629 -15421114 51616
10499 51616 17830258 8019304 -3608832 14081723 28874091 3423649 -19636513 13127957
10491 13127957 51128481 20352066 -3069100 137829119 409278314 553167957 410574524
10484 410574524 139730674 -2520765 17941557 47359609 11827856 -17717551 3943759
10477C943759J9478636j8928149j5390948J7715920J4653638j5270310j4213638
10470h011092J1928204J2151878j0202499j0350644R252180Q231074j1377999
10463A621102j1709315P128787J0588376l112386m393664P247179M939670r634494
10455B675255q869388O602576R268797l146174o392735K520921L189958n210802
10447F38408l624566O507380N383874n030741m456259M983466K755702q109879
10439i52615n082648R037055P980961r590904j5489381o94010J1128007O098162
10431B434627r28377J176787K512220k630820l783225K583539N030629K31262
10423F626642j147654K654470Q46272o265690n608981K674884L622250m192201
$$ plain form
10477 3943759 23422395 4494246 -10896702 6819218 21472856 6202546 -8011092
10470 -8011092 3917112 16068990 5866491 -4484153 4768027 12999101 1621102
10463 1621102 -10088213 -2959426 7628950 4516564 122900 7370079 12309749 2675255
10455 2675255 -6194133 408443 9677240 6531066 138331 2659252 5849210 638408
10447 638408 -2986158 3521222 8905096 3874355 -581904 4401562 7157264 -952615
10439 -952615 -6035263 3001792 10982753 1391849 -14097532 -14791542 -3663535 2434627
10431 2434627 1506250 2683037 5195257 2564437 -1218788 1364751 6395380 6626642
10423 6626642 5478988 8133458 8979730 2714040 -2894941 -220057 3402193 -790008
10415g90008n182679L905208P904162J639481k199539P23464q63071q282392p094234
10406a0239608M978945J0507454K043491n718546l122861j91356l658275l822011
10398i222767L706945O402177j956035q087610k615636L827049J515875j146247
10390g576249M098424Q370839K540510n073867l385450K977395M134216J287857
10382G373675k20380j944692m726334k520601N058725P019510j050189o934334
10374B055380j637063M724301N47144o986510m905108L251928M705344r24890
10366H30526l307646L80356L277832J879519n58040j618173j716695p63641O45734
10357i50228K05990j277152L31812L897540K230967n197849q321205j762513N809955
$$ plain form
10415 -790008 -5972687 -2067479 5836683 7476164 5276625 6000089 5137018 -3145374 -10239608
10406 -10239608 -5260663 5246791 7290282 1571736 -1551125 -1742481 -5400756 -9222767
10398 -9222767 -5515822 886355 -1069680 -9157290 -11772926 -7945877 -6430002 -7576249
10390 -7576249 -3477825 4893014 7433524 2359657 -1025793 1951602 6085818 7373675
10382 7373675 7153295 5208603 482269 -2038332 3020393 10039903 8989714 2055380
10374 2055380 418317 5142618 5689762 -1296748 -6201856 -2949928 1755416 830526
10366 830526 -2477120 -2096764 1181068 3060587 2502547 884374 -832321 -1595962 -950228
10357 -950228 -744238 -2021390 -1689578 2207962 4438929 -758920 -9080125 -10842638 -5032683
10348e032683N419489J031689O8400L34447k896566n146600m2197P728970Q405511
10339I870460J883109l801199n020610m207259k432852O80009K463773N82669
10331A8100j859263j378795n32599k514990l931164o22940L753724L381612N91719
10322c094596J497591M381018K148055m876019q036303k991672M480072O967747
10314D75893L766832r58979l692942l413451j034861J423051K400659J841350
10306H07552M08447j116705j562392o85688n70818k519272l208585J073178O591323
10297g82960N377757k372373o853833k842804K531139J388837k813418j991393
10289h359048L302176N664838K834163k21019k35854M00795p72359k338219k232115
$$ plain form
10348 -5032683 386806 1418495 1486895 1821342 -1075224 -6221824 -6264021 1464949 9870460
10339 9870460 11753569 7952370 2931760 -1275499 -3708351 -3028342 -564569 18100
10331 18100 -1841163 -3219958 -3752557 -6267547 -10198711 -10821651 -7067927 -3686315 -3094596
10322 -3094596 -1597005 2784013 4932068 56049 -7980254 -10971926 -6491854 475893
10314 475893 4242725 3283746 -409196 -3822647 -4857508 -3434457 -1033798 807552
10306 807552 1215999 99294 -1463098 -2148786 -2719604 -5238876 -8447461 -7374283 -782960
10297 -782960 4594797 2222424 -4631409 -7474213 -4943074 -3554237 -6367655 -8359048
10289 -8359048 -5056872 607966 3442129 3221110 2985256 3386051 2613692 275473 -1956642
10280a956642j140506p45982o72214Q95419L907244N312184K668958j616151k548984
10271D103326J77292J294337j352406k670033M33054J788847m159887j0521044
10263a0906514o718142M112027Q882403M673990J575845M146149M391414k321079
10255G836093p968548n521561k33610P40105j34916J911053M201412K982398J443846
10246E256272K630917K103958l236139o562589j396414O194975O286937L67611
10238A1645528k944919k574373l814281n994085l358840L033637N427642J618617
10230C038926k423136k747377j759447j586773p97672J088834K210364K307467
10222f68814K785816L034838J644436P7036o7432j291521n627601q460847m405572
$$ plain form
10280 -1956642 -3097148 -3843130 -4515344 -3619925 287319 5599503 8268461 6652310 4103326
10271 4103326 4280618 5574955 4222549 1552516 1985570 3774417 -385470 -10906514
10263 -10906514 -17624656 -13512629 -4630226 43764 1619609 5765758 10157172 7836093
10255 7836093 -132455 -5654016 -5887626 -5147521 -5282437 -3371384 830028 3812426 5256272
10246 5256272 7887189 9991147 6755008 192419 -1203995 4990980 11277917 11645528
10238 11645528 8700609 6126236 2311955 -3682130 -7040970 -4007333 1420309 3038926
10230 3038926 615790 -2131587 -3891034 -5477807 -6275479 -5186645 -2976281 -668814
10222 -668814 2117002 5151840 6796276 6873312 6805880 5514359 -113242 -8574089 -12979661
10213a2979661K732062M340483K02581j748021J285908L541043J853975N28584
10205b43046K070029K223159j278756l253854j3646L385724J541914j595654O59032
10196C494902N581497M472204l186356p847256l565365L864463N681514J394394
10188I889997l058917m195010k864829M2340L874330N244765J102761m619924
10180E415513l991691K943344N904806j260304j0028461q111020L116303J0461820
10172D450310O598641k360052p126236n460439p78443K884892K707745q42162
10164G4256k850059J66645L883455K047366k641168k248670K403379K419674l141740
10155A13138m362529K284919O561466J357971n076377l274826J785995O78698
$$ plain form
10213 -12979661 -10247599 -5907116 -5704535 -7452556 -6166648 -2625605 -771630 -243046
10205 -243046 1826983 4050142 2771386 -482468 -496114 2889610 4431524 2835870 3494902
10196 3494902 9076399 13548603 10362247 2514991 -1050374 2814089 8495603 9889997
10188 9889997 6831080 2636070 -228759 -186419 3687911 8932676 10035437 5415513
10180 5415513 1423822 4367166 10271972 9011668 -1016793 -9127813 -6011510 4450310
10172 4450310 11048951 8688899 1562663 -3897776 -4676219 -1791327 916418 74256
10164 74256 -2775803 -2609158 1274297 3321663 680495 -1568175 835204 3254878 113138
10155 113138 -4249391 -1964472 4596994 5954965 878588 -2396238 -610243 68455
10147F8455l711938k540552K415866K439925j927826k266470K042588K903416
10139e76536j694897m355883j250707K571060L016784K313792K198785P77743
10131C000141j352025l49493K996556K891434j386026l391421n36108J439557
10123C312615q58187j925710K662187P248542M472064k745508n427949j516622
10115E221432K750095K731480r4927l059541n548011o413783l515268J873175
10107f055348M233579O70777l929867k571111M016649P785976M556578j42853
10099H564380J64345K767187N86331n510352p449563l093250L15810j502648k987465
10090h145225Q09964N122192L757001n21669j967668k041355m454021n483424
$$ plain form
10147 68455 -3643483 -6184035 -3768169 -1328244 -3256070 -5522540 -3479952 -576536
10139 -576536 -2271433 -6627316 -7878023 -5306963 -2290179 23613 2222398 3000141
10131 3000141 1648116 1298623 4295179 7186613 5800587 2409166 1873058 3312615
10123 3312615 2454428 528718 3190905 10439447 14911511 12166003 6738054 5221432
10115 5221432 7971527 10703007 10608080 7548539 2000528 -4413255 -7928523 -6055348
10107 -6055348 -1821769 -1150992 -5080859 -7651970 -3635321 4150655 8707233 8564380
10099 8564380 8728725 11495912 12082243 6571891 -877672 -3970922 -3655112 -5157760 -8145225
10090 -8145225 -7335261 -2213069 1543932 1022263 -945405 -2986760 -7440781 -12924205
10082a2924205K1095O916158N869471j000763k937423J638915L117429k085305
10074a384628n502824j719924K868830K298945R18291L547555N443046J073120
10066G542411m681137l875171J235886K011188k677643n497026k360648K713007
10058e589133M522096K488556q07958k550301j228739J566195J999635o36684
10050b36333j785963J761157O081036N434185P41539k504459k835355l486762
10042C169045n375367n353983k031899J670244K953934K280184J208255N13685
10034i65902J040731L035632M106902J440847l126298m043064L23840M468900
10026F281588K693641l250575o481708l642340J795847M797712M524901L375304
$$ plain form
10082 -12924205 -12903110 -5986952 -117481 -1118244 -4055667 -2416752 700677 -1384628
10074 -1384628 -6887452 -8607376 -5738546 -3439601 -2521310 1026245 6469291 7542411
10066 7542411 2861274 -1013897 221989 2233177 -444466 -5941492 -8302140 -5589133
10058 -5589133 -1067037 1421519 613561 -1936740 -3165479 -1599284 400351 -236333
10050 -236333 -2022296 -261139 5819897 11254082 11995621 9491162 6655807 3169045
10042 3169045 -2206322 -7560305 -9592204 -7921960 -4968026 -2687842 -1479587 -965902
10034 -965902 74829 3110461 7217363 8658210 5531912 1488848 1812688 6281588
10026 6281588 8975229 5724654 -757054 -4399394 -2603547 2194165 6719066 10094370
10018A0094370K111810r67164n423854o544935j216811N598425N241143k822577
10010F070407q617527m322245M862293P531013J282967m951980l641394K123081
10002C36615M245831L54758m319013m127979M29868L494914P87496m554785m949006
9993h301301J523923P021084L835317m132156o117605j50676L963496j80607n518434
9984h056959k686001M925713O036101j301779o735045k753635N347740Q022684
9976B798819L960163n96272j284524M27498J196153j08074k053994k234903M58460
9967B563326M012094M820913K017513j403877k890417l407820m372701m187890
9959b848859j035241K717756K821031p14077l452224k647396r7804J694350K800164
$$ plain form
10018 10094370 12206180 11239016 5815162 -729773 -1946584 3651841 8892984 6070407
10010 6070407 -2547120 -6869365 -2007072 5523941 6806908 1854928 -1786466 336615
10002 336615 4582446 4937204 618191 -3509788 -3079920 414994 1202490 -3352295 -8301301
9993 -8301301 -6777378 243706 4079023 -53133 -6170738 -6321414 -2357918 -2538525 -8056959
9984 -8056959 -10742960 -5817247 218854 -1082925 -7817970 -10571605 -5223865 2798819
9976 2798819 6758982 6162710 4878186 5305684 6501837 6393763 4339769 2104866 2563326
9967 2563326 6575420 11396333 13413846 12009969 9119552 5711732 1339031 -2848859
9959 -2848859 -3884100 -1166344 1654687 940610 -2511614 -5159010 -5256814 -3562464 -762300
9950g62300L876908L827696J581801j647368l755343l935339k037628K217011
9942f34562P155642Q294760L122246l959889n475547m23359L808520J058140n486520
9933G459431q031213m448531N43994L053358L641266L097360R8595m787690p350288
9924f723718n024520n14906K476235L504494K871275l84556m346492l487167K676622
9915h952733N777164M33729n687232k950650L968942K910433n367413p644480
9907a7512240L29054P288377M938489o08270j511960J68260M37299J475364M149770
9898h45857L145658k505671m574911O21178M688557J941351m85258K681924L366562
9889H033533m191462r778093m232069K903560m5254n350267n80748P280142M728982
$$ plain form
9950 -762300 3114608 6942304 8524105 6876737 3121394 -813945 -2851573 -634562
9942 -634562 6521080 14815840 17938086 13978197 8502650 8079291 11887811 12945951 7459431
9933 7459431 -571782 -5020313 -4476319 -1422961 2218305 5315665 5414260 626570 -6723718
9924 -6723718 -11748238 -12263144 -9786909 -6282415 -3411140 -3795696 -8142188 -11629355 -8952733
9915 -8952733 -3175569 -2741840 -8429072 -11379722 -7410780 -4500347 -9867760 -17512240
9907 -17512240 -17183186 -9894809 -4956320 -5564590 -7076550 -6908290 -6470991 -4995627 -845857
9898 -845857 2299801 -205870 -4780781 -4159603 528954 2470305 1985047 4666971 8033533
9889 8033533 3842071 -5936022 -10168091 -7264531 -7309785 -12660052 -13240800 -5960658 -1231676
9880a231676k491218j316025J939562m869960j0631652j06756P252865j8137039
9872b9591899n3978991m1115355K5636879P4091178N0868261m699991k2154449
9865i44367K034283J6940430K787759j0854842m711716L668412j048512p613343
9857B58104m630406J32959q49526j069976L477095M948855K02330j949217K125577
9848B645795M052206M99796n01299L167332K086242n639179p756025O87078O724238
9839E966184J068579n925873k417189N217552M894392q26824j901474O32182j476742
9830E230787o908523o440599R32138O106896M139318L11755L68920K353050J205712
9821G299454k931209m613529o73531M653747M869291R57188O00878N281847N634497
$$ plain form
9880 -1231676 -3722894 -5038919 -3099357 -7969317 -18600969 -18707725 -11454860 -29591899
9872 -29591899 -83570890 -124686245 -99049366 -24958188 25910073 21210082 -944367
9865 -944367 1089916 18030346 20818105 9963263 5251547 8919959 7871447 258104
9857 258104 -4372302 -4239343 -5088869 -6158845 -2681750 2267105 2469435 520218 2645795
9848 2645795 6698001 7197797 6696498 9863830 11950072 6310893 -1445132 -758054 5966184
9839 5966184 7034763 1108890 -1308299 3909253 8803645 7976821 6075347 6707529 5230787
9830 5230787 -1677736 -8118335 -7186197 -1079301 3060017 3371772 3740692 6093742 7299454
9821 7299454 4368245 -245284 -918815 3734932 8604223 9561411 10162289 15444136 21078633
9812B1078633l761219j2631002q835142K035889M724473j683433l960625J715361
9804a317065M097790k069611o712286k660033K532542J466610o02136K034897
9796c229292L688591j222360n916153k487430L796453L598354p51994q37294K730654
9787f30471K954907k60905r80639J569650K828898J660543N55934n19014k617493
9778D561410k946118R59925N194761M863400K108746J463293J144195k740716
9770A4608896o874729m864108J457708L949909M64392l120233k877467j087951
9762A656417j24584R01217K227754J922397k31092j471877J39511L251468M750593
9753A3021804K427711k548906n182843j868700L345215K954898k259472l127494
$$ plain form
9812 21078633 17317414 4686412 -4148730 -2112841 2611632 928199 -3032426 -1317065
9804 -1317065 2780725 711114 -6001172 -8661205 -6128663 -4662053 -5264189 -3229292
9796 -3229292 459299 -763061 -6679214 -9166644 -5370191 -1771837 -2523831 -3361125 -630471
9787 -630471 2324436 2063531 1082892 2652542 5481440 7141983 7697917 7178903 4561410
9778 4561410 1615292 2575217 7769978 12633378 14742124 16205417 17349612 14608896
9770 14608896 7734167 2870059 4327767 8277676 8742068 5621835 2744368 1656417
9762 1656417 1531833 2433050 4660804 6583201 6352109 4880232 5019743 8271211 13021804
9753 13021804 15449515 12900609 7717766 5849066 9194281 12149179 9889707 6762213
9745F762213L034743O384181k14601q539955o960917J678707N177894N92610l987855
9736C927020m136885l718249m530397k456844L316540O413374K766760k624614
9728a043295k784869J816744M812635K415119k595106m656880j968979J240282
9720b764349Q9137l851708m253091N82924M916225M340469J958777K116987L198111
9711F333482J519591j970269l939054l877566k679112j65523J958810p8855m944850
9702g843346n181067J223344N500558J401962l795105p62989O333587O836380
9694C713324Q01275k799514j460405n42871j516530p82770Q78357q18541l871162
9685f398837k113314L183740M667429J506591l69401j19080k194346m826230j396839
$$ plain form
9745 6762213 9796956 16181137 15966536 7426581 465664 2144371 7322265 7914875 3927020
9736 3927020 -209865 -3928114 -8458511 -10915355 -7598815 -1185441 1581319 -1043295
9728 -1043295 -3828164 -2011420 2801215 5216334 2621228 -2035652 -4004631 -2764349
9720 -2764349 -2675212 -6526920 -10780011 -10197087 -5280862 -940393 1018384 3135371 6333482
9711 6333482 7853073 5882804 1943750 -1933816 -4612928 -4778451 -2819641 -2898496 -7843346
9702 -7843346 -13024413 -11801069 -6300511 -4898549 -8693654 -9456643 -3123056 3713324
9694 3713324 4514599 1715085 254680 -288191 -1804721 -2587491 -1709134 -2527675 -6398837
9685 -6398837 -8512151 -5328411 -660982 845609 476208 357128 -1837218 -6663448 -8060287
9676h060287N482822N101090l166276o739954K39236P455766N677750P58909J563130
9667H312186M813341K445504l976056o740528m510369k059740j292286l88552
9659c396500R40179J665143K358213L254803K577835L18477o44646k89481k507948
9650D276075o853475o385934J105831P179014M813674n70389l53558L246750K181132
9641H639120k824138l532278J607991M860098J506709l799094m887054j698343
9633a26989J970325L375203J889818j032360k258714n90591N10397k396064o321215
9624d980190n045603J518124O512578N535986J744482j89056m42959j409063k403240
9615H41059j031439J893596K697137J32351k641792k395913l1612J305068R14256
$$ plain form
9676 -8060287 -2577465 2523625 -642651 -7382605 -7143369 312397 5990147 6749056 8312186
9667 8312186 13125527 15571031 11594975 4854447 344078 -1715662 -3007948 -3396500
9659 -3396500 -2456321 -791178 1567035 4821838 7399673 7718150 7073504 6784023 4276075
9650 4276075 -2577400 -8963334 -7857503 -678489 4135185 3564796 3211238 6457988 8639120
9641 8639120 5814982 2282704 3890695 8750793 10257502 6458408 1571354 -126989
9633 -126989 1843336 5218539 7108357 6075997 3817283 3226692 3737089 1341025 -4980190
9624 -4980190 -10025793 -8507669 -1995091 3540895 5285377 5096321 4653362 3244299 841059
9615 841059 -190380 1703216 4400353 4532704 1890912 -505001 -536613 768455 1682711
9606A682711O90265Q97206p10265m122794m966643m12380N342406N701803L68306
9597D470615m889844o103210m048421k38304M357203O538356L066599l072151
9589H0843m652384m29196K692211K90291l148744k235308J043588K131037J728161
9580b499501K920280M581987L741054J392777J73805q78169l454210m851305k198890
9571a072172Q69324p80241l985522j104528O583152Q679058J270600o130326m192261
9562A37084K916490M677174k02403l461672o66757L148619K353008j416944l359765
9553D124834k670535j517192j09729K456382M185037K133776j938613l039077
9545C624883p96905m09807l742148n352351j417098K888892J083801l719878l341472
$$ plain form
9606 1682711 2372976 3270182 2559917 -1562877 -6529520 -6941900 -1599494 4102309 4470615
9597 4470615 -419229 -6522439 -10570860 -10809164 -6451961 86395 3152994 80843
9589 80843 -4571541 -5000737 -2308526 -2018235 -5166979 -7402287 -6358699 -4227662 -2499501
9580 -2499501 420779 5002766 8743820 10136597 10310402 9432233 5978023 1126718 -1072172
9571 -1072172 -202848 -983089 -4968611 -6073139 510013 9189071 10459671 4329345 137084
9562 137084 3053574 7730748 7528345 4066673 3399916 6548535 8901543 7484599 4124834
9553 4124834 1454299 -62893 -172622 2283760 6468797 8602573 6663960 3624883
9545 3624883 2827978 2418171 -1323977 -6676328 -8093426 -5204534 -4120733 -7840611 -11182083
9536a1182083K315776N224659K123987j283927p24377M60515r60128j691921J632046
9527d085453N403119M285851m07736l015940j504437J404211K837779J749218
9519F666612j442955m017587k464561K180536L861237k88370n050847m558523
9511e114458p63661N97801q79939j150522O26293J561338J044310J382670K711395
9502A5227K520777M78113p94896p5281J148018J696504J523474m1816l184790
9493C285330n236017l266815J199713L723389K891256J204401N57440N70508R43274
9484E872479J596194Q74980k401247n486844m549827p87553P71939j252175k973528
9475h335582j777993K16937O59402O15625J665606K757124K096740k31747k934414
$$ plain form
9536 -11182083 -8866307 -3641648 -1517661 -2801588 -3525965 -3065450 -4025578 -5717499 -4085453
9527 -4085453 1317666 5603517 5195781 2179841 675404 2079615 4917394 6666612
9519 6666612 5223657 1206070 -1258491 922045 4783282 4494912 -555935 -5114458
9511 -5114458 -5878119 -5280318 -6160257 -7310779 -6684486 -5123148 -4078838 -2696168 15227
9502 15227 2536004 3014117 2219221 2143940 3291958 4988462 6511936 6470120 3285330
9493 3285330 -1950687 -5217502 -4017789 -294400 2596856 3801257 4358697 4929205 5872479
9484 5872479 7468673 8343653 5942406 455562 -4094265 -4881818 -4109879 -5362054 -8335582
9475 -8335582 -10113575 -9896638 -9237236 -8621611 -6956005 -4198881 -2102141 -2333888 -5268302
9466e268302m605776l525981R13822N815097O607964K329724l167640n729511
9458f630603m341872l59232L567472L985646j25672m309818k873063L117858O348290
9449a620994L018131k203360k875308J456158O324063P658786M045403k785896
9441A3016983p690270o037374j14280K351613j466998n183172k682813K885893
9433d920418M725305K898791K490532L604941R81571o004134j0153723o125251
9425a2502386J825276N544616L160454l82809j098769j1981N91013J062593K469292
9416F57299L258659J274538j580308q30512L182749L877730k005532p437188l867015
9407c469580N332464Q317441J929848l775097j442873K453580p91894p209879
$$ plain form
9466 -5268302 -9874078 -13400059 -12486237 -6671140 -63176 2266548 -901092 -6630603
9458 -6630603 -10972475 -11331707 -7764235 -3778589 -3904261 -8214079 -11087142 -7969284 -1620994
9449 -1620994 1397137 -806223 -3681531 -2225373 4098690 11757476 15802879 13016983
9441 13016983 5326713 -710661 -824941 1526672 59674 -5123498 -7806311 -4920418
9433 -4920418 -195113 2703678 5194210 8799151 9780722 3776588 -6377135 -12502386
9425 -12502386 -10677110 -5132494 -1972040 -2354849 -3453618 -3465599 -2874586 -1811993 657299
9416 657299 3915958 5190496 3610188 2779676 5962425 9840155 7834623 397435 -3469580
9407 -3469580 1862884 10180325 12110173 8335076 6892203 9345783 8553889 1344010
9399A344010o683920L24978L689894k30578m238920l064801l70333j78119l63930
9390i771719J178362J807354L36578P28791M312899N391090R04635k489376J054001
9381C452615N317206J376760o443120o030684K794804O933208K20992p229564
9373C92217m959051K874852N774144K442810m02656J07046P04281p81151k916281
9364C236211m277403m184460j249868L918597O482455L141710j737644j644821
9356C684777K021339K182635k341914n080226k656697L81320J79907j09872K943060
9347A204329N836421L354144k767614o134599m520251j285813P14326J877504
9339a721553K893374L124327K265122Q06811j003393k411323j503548J794096
$$ plain form
9399 1344010 -5339910 -5014932 -1325038 -1555616 -5794536 -8859337 -9229670 -9407789 -9771719
9390 -9771719 -8593357 -6786003 -6449425 -5720634 -1407735 3983355 4887990 2398614 3452615
9381 3452615 8769821 10146581 3703461 -2327223 467581 7400789 7621781 392217
9373 392217 -4566834 -1691982 4082162 6524972 6122316 6229362 6933643 6152492 3236211
9364 3236211 -1041192 -5225652 -6475520 -2556923 3925532 7067242 5329598 3684777
9356 3684777 5706116 7888751 5546837 466611 -2190086 -1808766 -1628859 -1738731 1204329
9347 1204329 7040750 10394894 7627280 1492681 -3027570 -4313383 -3599057 -1721553
9339 -1721553 1171821 4296148 6561270 7368081 6364688 3953365 2449817 4243913
9331D243913L504824K99046m630320n188972j572897n1525k513451k952034K081975
9322f779441O081553K126483m928005m575589K904768O082993n8720o158359l089832
9313h394149M080615M822207l31639k089825J823251M098403J075039j953973
9305C129929j081535J68028q40205l32718L588850N162839K69476n423480n199501
9296e58317j882288j270191j106034L188551O925037K534577n505117n523922
9288c197704K309189N782024Q66851k462045J220836L219067k655476p431044
9280b348302j934875O430424M947388l953301p347443k351284J916096J027666
9272c613631L27255K418891K049757k975417n991789j710530N128353O547937
$$ plain form
9331 4243913 7748737 8047783 3417463 -1771509 -3344406 -3395931 -5909382 -8861416 -6779441
9322 -6779441 -697888 1428595 -3499410 -8074999 -5170231 912762 854042 -5304317 -8394149
9313 -8394149 -4313534 508673 177034 -1912791 -89540 4008863 5083902 3129929
9305 3129929 2048394 2216422 1376217 1043499 4632349 9795188 10064664 4641184 -558317
9296 -558317 -2440605 -3710796 -4816830 -1628279 5296758 7831335 2326218 -3197704
9288 -3197704 -888515 4893509 5760360 3298315 4519151 7738218 5082742 -2348302
9280 -2348302 -4283177 2147247 7094635 3141334 -4206109 -6557393 -4641297 -3613631
9272 -3613631 -3286376 -867485 1182272 -1793145 -7784934 -9495464 -4367111 2180826
9264B180826J757512l500424m386910o01737M414002N801404J669469l669777
9256C664365m092800J69571K917787J211129r45887K3483J519214k46797l681490
9247E38575m251051r00142L392894N632652M754224J419163j797266j880359P62591
9238G671281J790308j532775o145961o914899l020618J672684L419541J732808
9230a327631j141215k094491K95441L507410K953135k043163o015211l717683
9222i583408K765023O458845M297600N758j936669j566947j213086j083557J14045
9213a742396J728426J580789j23281j69318L045047O319645N260085R4417m518310
9204A1475104n291973l406981j365925M29380K361846L256508J887832n38454
$$ plain form
9264 2180826 3938338 437914 -3948996 -4550733 -136731 5664673 7334142 3664365
9256 3664365 -428435 -258864 2658923 3870052 2924165 2947648 4466862 4220065 538575
9247 538575 -3712476 -4612618 -1219724 4412928 9167152 10586315 8789049 6908690 7671281
9238 7671281 9461589 7928814 1782853 -5132046 -8152664 -6479980 -3060439 -1327631
9230 -1327631 -2468846 -4563337 -4267896 -760486 2192649 149486 -5865725 -9583408
9222 -9583408 -6818385 -359540 3938060 3943818 2007149 440202 -772884 -1856441 -1742396
9213 -1742396 -13970 1566819 1443538 1274220 4319267 10638912 15898997 15993414 11475104
9204 11475104 6183131 2776150 1410225 1839605 4201451 7457959 9345791 8807337
9196H807337j953574k600445m066627n694423m822775r14835L025534L964973
9188d254835K014461n41701j891232j786383j151650r33717n99318J558587N227609
9179b358179O477838K260509m031570n373169l68945M214068K377404l164049
9171C3907n397049k659560P25803K150814L561292N752869N238151P0741n143194
9162D333774m767906n67484P21908k224008l205406J604131P163879O619438O75573
9153A0353899m609170o162015m852638q74155N263463Q488458L523852n725045
9145E406649q575071j789377N481650M586242j259722l470038m18525K894543
9137B856351L509459K364771J20400k704682l269461P1415L246805J216640l887343
$$ plain form
9196 8807337 6853763 4253318 186691 -5507732 -10330507 -11245342 -8219808 -4254835
9188 -4254835 -2240374 -2782075 -4673307 -6459690 -7611340 -8545057 -9144375 -7585788 -2358179
9179 -2358179 4119659 6380168 2348598 -3024571 -3393516 820552 3197956 33907
9171 33907 -5363142 -8022702 -7296899 -5146085 -1584793 4168076 9406227 9476968 4333774
9162 4333774 -434132 -1001616 -279708 -2503716 -5709122 -4104991 3058888 9678326 10353899
9153 10353899 5744729 -417286 -5269924 -6144079 -880616 7607842 11131694 5406649
9145 5406649 -3168422 -4957799 523851 5110093 3850371 380333 -38192 2856351
9137 2856351 6365810 8730581 8850981 6146299 2876838 2948253 6195058 7411698 3524355
9128C524355n219559j193783K896400L190608J342459l42111k147867l793395
9120a742893k998892O13870L867256M120209K230618M10190k66172K27339R13038
9111G374563Q20k375556k874181J65694K538292j54046m501929l582373J590231
9102a818485K834488k020454n165159j138965M749928N285518J989657O28744
9094E345272J062480j204884n959786p728398l966252J521244M017035L076642
9086c836647J416867J078331J733774J919062J413923J817349L847531N151494
9078A4541684L174981n84009k471593k308033k966359m413838l352888J88294
9070A808239J569092q72636k478152Q2771K915942J132280l113175l904585k18919
$$ plain form
9128 3524355 -1695204 -2888987 7413 3198021 4540480 4198369 2050502 -1742893
9120 -1742893 -4741785 -4127915 -260659 3859550 6090168 6500358 6234186 6461525 7374563
9111 7374563 7375383 4999827 2125646 2291340 4829632 4675586 173657 -3408716 -1818485
9102 -1818485 1016003 -1004451 -6169610 -7308575 -2558647 2726871 4716528 5345272
9094 5345272 6407752 5202868 -756918 -8485316 -12451568 -10930324 -6913289 -3836647
9086 -3836647 -2419780 -1341449 392325 2311387 3725310 5542659 9390190 14541684
9078 14541684 17716665 17132656 14661063 12353030 9386671 4972833 1619945 1808239
9070 1808239 3377331 2504695 26543 109314 3025256 4157536 1044361 -2860224 -3079143
9061c079143L522634L987855J976482j51949j092357j290389k533072n396930
9053d056869o763554l167966K837918M540837Q27821j749822N82866K940299Q26284
9044c182186j661021P71145M713262L534906j392537l416126j593105l00746Q253
9035b518155K474175N258651K956876k852539m069826P79882L110957k177217
9027B962804q102363o130059J298968N351028L431624M84004Q3432N48875m62688
9018e34375k403769l643831l667995k617286o28248J618136K815762K149668K92709
9009f619229q58545K27010K971849M921664M219269J230783k599125n983368p112812
9000i602504m162524J508885N026555L707681R52974J073950K578308J198928
$$ plain form
9061 -3079143 443491 4431346 6407828 6255879 5163522 3873133 1340061 -4056869
9053 -4056869 -10820423 -13988389 -11150471 -6609634 -5781813 -7531635 -6948769 -4008470 -3182186
9044 -3182186 -4843207 -4072062 641200 4176106 2783569 -632557 -2225662 -2526408 -2518155
9035 -2518155 -43980 5214671 8171547 5319008 1249182 2029064 5140021 2962804
9027 2962804 -5139559 -11269618 -9970650 -4619622 -1187998 -703994 -620562 -71687 -534375
9018 -534375 -2938144 -6581975 -10249970 -12867256 -13495504 -11877368 -9061606 -6911938 -6619229
9009 -6619229 -7477774 -7250764 -4278915 642749 4862018 6092801 3493676 -2489692 -9602504
9000 -9602504 -13765028 -12256143 -7229588 -3521907 -2568933 -1494983 1083325 2282253
8992B282253k220092k720630K81459J707596q72997l407815j984834J679092L906085
8983a349883L823751J933553j649193m565597k398175M530976Q652003M415369
8975A3392804l116654m679355K65607L543777R33005k089723L06596M861194L868431
8966A7285682l512201r754422q668563k411068K631231L683075K579930J059320
8958B892984j014975k913411k515039M0948J477255K73670o68953Q12524J445509
8949a69488k523333p784280p118064J39007O603245P102196M860136M710221N198415
8940A1018055K035450l754607o410175l284793K168328N337753M871070J697720
8932A3678801k943182o905513p155957k950164K013220L034091M2198k297911
$$ plain form
8992 2282253 62161 -2658469 -2377010 -669414 -1542411 -4950226 -6935060 -5255968 -1349883
8983 -1349883 2473868 4407421 2758228 -1807369 -4205544 325432 8977435 13392804
8975 13392804 10276150 5596795 5862402 9406179 10339184 8249461 8556057 13417251 17285682
8966 17285682 13773481 4019059 -4649504 -7060572 -4429341 -746266 1833664 2892984
8958 2892984 1878009 -1035402 -3550441 -3509493 -2032238 -1758568 -2427521 -1614997 -169488
8949 -169488 -2692821 -10477101 -17595165 -17456158 -10852913 -3750717 1109419 5819640 11018055
8940 11018055 13053505 9298898 2888723 -396070 1772258 7110011 11981081 13678801
8932 13678801 10735619 3830106 -3325851 -6276015 -4262795 -1228704 -1186506 -3484417
8924c484417p37834K445085L102512J035351o53398q10442r97446j112689J127091
8915h6187M872176N061189l07685n982566o440782l247937p72831J411361N283294
8906b09968O796854M10986r388354j0663345n88987R097328P664496p72154m856986
8897b510130j750784J944818J667216l07366r18978p37774j053346r99193M67804
8888d197733K157112J860507q23054l463757k718995J906905O354440N934398
8880G009823J162603k914350l640664l322770l597650j976291K674719N635419
8872A030839K516703l011780l693732N86252K909405J86049k511343l63181M003494
8863A652706N082183K222769j129362l243945m876531n519255l330745O67445
$$ plain form
8924 -3484417 -4222251 -1777166 1325346 2360697 1707299 896857 -100589 -1213278 -86187
8915 -86187 4785989 9847178 9539493 3556927 -2883855 -6131792 -6904623 -5493262 -209968
8906 -209968 6586886 6997872 -2390482 -13053827 -13642814 -4545486 3119010 2346856 -2510130
8897 -2510130 -4260914 -2316096 -648880 -956246 -1875224 -2612998 -3666344 -4665537 -4197733
8888 -4197733 -2040621 -180114 -1003168 -4466925 -7185920 -5279015 1075425 7009823
8880 7009823 8172426 5258076 1617412 -1705358 -5303008 -7279299 -4604580 1030839
8872 1030839 3547542 535762 -3157970 -2571718 337687 523736 -1987607 -2350788 1652706
8863 1652706 6734889 8957658 7828296 4584351 -292180 -5811435 -9142180 -8474735
8855h474735K089939j060666m550403k750468L544079P367664M384516j534257
8847i84331l657694j010959J684458J462914K70375K74071L61845o33271q39989
8838c072581J333851L282457J350688l280470n489001k860388J639844M031428
8830c064172L643230K122064M08136j522955k984251k562145q4383K489142L010707
8821A455373J581830j7829j112758k430682l130460n27141M826498O785505Q52991
8812H283327p925208r995895l966771K086162K910277K372911M460290N623550
8804C848643J931083k457778j678398J459507J99706l875181k995696K975477
8796e92637M982639r19822o964952n525212J75739K650117J269558M85482J405044
$$ plain form
8855 -8474735 -6384796 -7445462 -11995865 -14746333 -11202254 -3834590 549926 -984331
8847 -984331 -4642025 -5652984 -3968526 -2505612 -2235237 -1961166 -1599321 -2232592 -3072581
8838 -3072581 -1738730 1543727 2894415 -386055 -5875056 -8735444 -7095600 -3064172
8830 -3064172 579058 2701122 3109258 1586303 -1397948 -3960093 -4044476 -1555334 1455373
8821 1455373 3037203 3019374 1906616 -524066 -3654526 -4181667 644831 7430336 8283327
8812 8283327 358119 -9637776 -13604547 -11518385 -8608108 -6235197 -1774907 3848643
8804 3848643 5779726 3321948 1643550 3103057 3302763 -572418 -3568114 -592637
8796 -592637 4390002 3470180 -3494772 -9019984 -8844245 -6194128 -4924570 -4439088 -3034044
8787c034044J813717J817877L047153L780308Q55090m216214o493387m730334
8779g159834k082501P0829L151401N668250L236787l172016n659755o26820M360759
8770b212900J469692m435651k679623N672175P982005n65846q568402n130226
8762h468776M018433N935330j84567l817942m96902K916252R77790k660958l375070
8753e156410k615233k557545j099940K815979N103940K962244K4674M5025P29426
8744B52160r02562k513561j645528j197816k992853j971860M806938R401531L920781
8735G157230m601032l187307N852758P347137k572115j0106694n781223J877157
8727d014089K188985j072181O64071M648470K693728l321288m327347P97359M262476
$$ plain form
8787 -3034044 -1220327 597550 3644703 7425011 8280101 4063887 -2429500 -7159834
8779 -7159834 -9242335 -9171506 -6020105 -351855 2884932 -287084 -5946839 -6573659 -2212900
8770 -2212900 -743208 -5178859 -7858482 -2186307 5795698 5229852 -3338550 -8468776
8762 -8468776 -4450343 1484987 1300420 -2517522 -3014424 -98172 879618 -1781340 -5156410
8753 -5156410 -7771643 -10329188 -11429128 -8613149 -3509209 -546965 -522291 -477266 252160
8744 252160 -650402 -3163963 -4809491 -6007307 -9000160 -10972020 -6165082 3236449 7157230
8735 7157230 2556198 -631109 5221649 12568786 9996671 -110023 -5891246 -4014089
8727 -4014089 -1825104 -2897285 -2233214 2415256 5108984 1787696 -2539651 -1742292 2520184
8718B520184K305430p96514j561301j417314j267656L99405K661137J958983j739269
8709C063085m078624k912543q72508l37608m77309k87561k42473l358J534426
8700d614473L253470K704139L43519r39892n79519n85720j297654j335192j372383
8691d423705k823676l174926J142731O904232O339322r52149n751846k273620
8683e013637L576875L802526j17137j507428M48945J087031j025279k616316j965814
8674c330234q64896n00512l0508P00868P73297L83205L52425J02900r73050j314536
8664d701041M02443K022359P52881j904101j999105R16759L610809M182038L227024
8655F510066Q07319l155123n765972l389787K425998N780857M040998M96829j225193
$$ plain form
8718 2520184 4825614 4029100 2467799 1050485 -217171 182234 2843371 4802354 3063085
8709 3063085 -1015539 -3928082 -4800590 -5138198 -5615507 -5903068 -6145541 -6148899 -4614473
8700 -4614473 -1361003 1343136 1686655 746763 167244 -418476 -1716130 -3051322 -4423705
8691 -4423705 -7247381 -10422307 -9279576 -2375344 3963978 3011829 -2740017 -5013637
8683 -5013637 -1436762 2365764 2248627 741199 1190144 2277175 1251896 -1364420 -3330234
8674 -3330234 -4195130 -4695642 -4726150 -4025282 -3251985 -2868780 -2516355 -2413455 -3386505 -4701041
8664 -4701041 -4298598 -2276239 -1523358 -3427459 -5426564 -4509805 -898996 3283042 6510066
8655 6510066 7317385 4162262 -1603710 -4993497 -2567499 3213358 7254356 7751185 6525992
8646F525992r72555M65550K775296L633893l9699o164236p849326k603500L456889
8637g71696M028614Q12077q61866n51411j627395m258406m798549j308487M197829
8628e139290Q269751Q104817K907637m016020o814822l853590k83627n35814j813329
8619c174287K27144L025661J010074m345411n820003j239686M067487N700225
8611e48796M243618P14002m526374p300657k318800P069039R989731K902004m473249
8602E750518l284648J977865K166853j988539l022419k8041J082102j112803j510653
8593C0235J737476L771103J248264k802417m651698m511009l121717O18162N416401
8584b265200O060384M05265n733902n250450Q65015N129689L503428l36156q64202
$$ plain form
8646 6525992 5553437 6018987 8794283 12428176 12388477 6224241 -1625085 -4228585 -771696
8637 -771696 3256918 4068995 3207129 2655718 1028323 -3230083 -8028632 -9337119 -5139290
8628 -5139290 3130461 11235278 14142915 10126895 3312073 -541517 -825144 -1360958 -3174287
8619 -3174287 -2947143 78518 1088592 -3256819 -9076822 -10316508 -6249021 -548796
8611 -548796 3694822 4408824 -117550 -7418207 -9737007 -2667968 7321763 10223767 5750518
8602 5750518 2465870 4443735 6610588 4622049 1599630 1571589 2653691 1540888 30235
8593 30235 1767711 5538814 6787078 3984661 -667037 -5178046 -8299763 -7681601 -2265200
8584 -2265200 3795184 4200449 -1533453 -6783903 -5918888 -789199 2714229 2378073 1513871
8575A513871K427975N329097M157815p56839n938911p726460m737017R29214M432570
8566c68685K053753l955543o105526k52087P760568Q393420J152139m591803k934574
8557A151662R79825M28542k501362k289880k02385q55781k414723K38022M592405
8548h73675L226020k650712l348950L423827P736526K966711l890944l911410
8540B677393M21846J479434q84100j789118j264390k570595m046246j632445K478118
8531e130103K265769j970391l828208j012626J975241J750921K539j113507j477739
8522h538104l38465L076043N887546M364832O20060J79075K543304J484831l905552
8513E373570o428690k134183L059178K705303p08482j304328M36987k1927k682871
$$ plain form
8575 1513871 3941846 9270943 13428758 12671919 6733008 -993452 -5730469 -4801255 -368685
8566 -368685 1685068 -2270475 -8376001 -8628088 -867520 7525900 8678039 4086236 1151662
8557 1151662 2131487 2560029 58667 -2231213 -2433598 -3289379 -5704102 -5466080 -873675
8548 -873675 2352345 -298367 -3647317 -223490 7513036 10479747 6588803 2677393
8540 2677393 3099239 4578673 3694573 1905455 641065 -1929530 -5975776 -7608221 -5130103
8531 -5130103 -2864334 -4834725 -8662933 -9675559 -7700318 -5949397 -5946858 -7060365 -8538104
8522 -8538104 -8876569 -5800526 87020 4451852 5071912 5250987 7794291 9279122 5373570
8513 5373570 -1055120 -3189303 -130125 2575178 1866696 562368 999355 977428 -1705443
8504a705443l276530n49633K229708K494548Q59159j199424k649694k257526M45010
8495e609825L690063M946796L413782J3682l587283n030602k792507J003986K201114
8486a750794N13326J52640K575664L291180o34021m691557l548440O11294K346096
8477a134612J993392L363881N014000K030161m299737o935277l895782p13940
8469d577914n78300p4316K448724K358250k651260o406843k959136L747595N607812
8460c085388K025552r98277q90183m87458j056482l63296J607407J175384k752771
8451d825512n642537l275006K311764N295221K789118k439501m844332j231365
8443a1862150N663980R033044N344107r08490k653650L88172K070484l78614k572558
$$ plain form
8504 -1705443 -4981973 -5531606 -3301898 -807350 51809 -1147615 -3797309 -6054835 -5609825
8495 -5609825 -1919762 3027034 6440816 6454498 2867215 -2163387 -4955894 -3951908 -1750794
8486 -1750794 -1237468 -1084828 1490836 4782016 4147995 -543562 -4092002 -3480708 -1134612
8477 -1134612 858780 4222661 9236661 11266822 6967085 31808 -3863974 -4577914
8469 -4577914 -5156214 -5230530 -2781806 -423556 -3074816 -9481659 -12440795 -8693200 -3085388
8460 -3085388 -1059836 -2058113 -2948296 -3435754 -4492236 -4855532 -3248125 -2072741 -4825512
8451 -4825512 -10468049 -13743055 -11431291 -6136070 -3346952 -5786453 -10630785 -11862150
8443 -11862150 -6198170 2834874 8178981 7270491 4616841 5005013 7075497 6696883 4124325
8434D124325j208251k16056l789213p814489n229996K184051N216325R25732k828400
8425h635972M10431N880184N445427K02346j944599J132976L344869P50468k702967
8416C883163k111263J327429L401420K726965J89113l617997o729365n203260
8408f133795J336550O454563M262068k057798m455029j271596J631083M99357
8400B65403j887395k307891j626537j250560k34078J711056K803270K919917M160844
8391D554029N671376L300626k709233n629723k093922J836918J44639l151234
8383A923476r79097M156136L730358k678645o547260l923864m07555m70345n96981
8374e793777K762459N806771L696919r69561k168863K65187J235816j298716l801569
$$ plain form
8434 4124325 2916074 2700018 -1089195 -8903684 -14133680 -11949629 -6733304 -5807572 -8635972
8425 -8635972 -8225541 -2345357 3100070 3302416 1357817 2490793 5835662 6586130 3883163
8416 3883163 1771900 3099329 6500749 9227714 9416827 5798830 -930535 -6133795
8408 -6133795 -4797245 1657318 5919386 3861588 -593441 -1865037 -233954 265403
8400 265403 -1621992 -3929883 -5556420 -6806980 -7041058 -5330002 -2526732 393185 4554029
8391 4554029 10225405 13526031 10816798 5187075 3093153 4930071 5074710 1923476
8383 1923476 944379 5100515 8830873 6152228 -395032 -4318896 -4726451 -5196796 -5793777
8374 -5793777 -3031318 2775453 6472372 5502811 3333948 3599135 4834951 3536235 -265334
8365b65334k853726N40142L057932L061252J634502O30288K25663j127114l694413
8356A209192m677643j784318K313858K663636q36044l115964j545365O76149M79729
8347d616770l72471N91314J906570J284391p827L01186J363490J397836J377074
8338C224793K629413L176980O55638l063198m320474l070660j834815j020970
8330c623293L79975J011933j105866l902719l106904J339736M915281M610783
8322E18926J719621j222318k675903j684145J109697K475192K40299k827918k643193
8313d989742j92629K97685j378484j436686Q27009J845747L58722o09506K51545
8304e026339J84598j902683k651951J8502L005694K957574J292245J177225K606368
$$ plain form
8365 -265334 -3119060 -2578918 479014 3540266 5174768 5805056 6030719 4903605 1209192
8356 1209192 -3468451 -5252769 -2938911 -275275 -1111319 -4227283 -5772648 -5096499 -4616770
8347 -4616770 -4989241 -4397927 -2491357 -1206966 -1214793 -913607 449883 1847719 3224793
8338 3224793 5854206 9031186 9686824 6623626 2303152 -767508 -2602323 -3623293
8330 -3623293 -3243318 -2231385 -3337251 -7239970 -10346874 -9007138 -4091857 518926
8322 518926 2238547 1016229 -1659674 -3343819 -2234122 241070 481369 -2346549 -4989742
8313 -4989742 -5182371 -4884686 -6263170 -7699856 -6872847 -5027100 -4668378 -5277884 -5026339
8304 -5026339 -4841741 -6744424 -9396375 -9377873 -6372179 -3414605 -2122360 -945135 1661233
8295A661233L327809K233031k69194k956276l653619j203900J693049J170530
8287B002663j672362j825425J464311K964684j23911l714568l850625k602804
8279g358037k861928k357979J897507O980156P361761K674560k289433l719601
8271C27006j672721J225535J492142k175087n663023l101011M160259P415014
8263B008114K640516l195409k447353K501256M729995L398610J813991j63987
8255A1285733l699066n002107o04774M375021K480296l632067m659064M46385
8247I90357L213425j38788l359378j481928J611147Q17728k265666l259678j367996
8238e240777J617747M172910M476639J291158k930820m073850k253084r65297
$$ plain form
8295 1661233 4989042 7222073 6952879 3996603 342984 -860916 832133 2002663
8287 2002663 330301 -1495124 -30813 2933871 2809960 -904608 -4755233 -7358037
8279 -7358037 -10219965 -12577944 -10680437 -3700281 3661480 6336040 4046607 327006
8271 327006 -1345715 -120180 1371962 -803125 -6466148 -9567159 -5406900 2008114
8263 2008114 4648630 1453221 -994132 1507124 6237119 9635729 11449720 11285733
8255 11285733 7586667 2584560 1979786 6354807 8835103 5203036 543972 990357
8247 990357 4203782 4064994 705616 -776312 834835 1652563 -613103 -3872781 -5240777
8238 -5240777 -3623030 549880 5026519 6317677 3386857 -686993 -2940077 -3905374
8230c905374n00104J712606M258761K731560j580579k218779J389715K160026
8222D047832k371230n168721j660576K432226J361054r26774J089719L999623
8214B803153J985455j904860p84832L595532L419632j923147m736584j391139
8206A063210K656605J958776j587774l148245j846086l11363n6197K26639K256613
8197A212178M853359M000587j914535p756123o731359k24930L138407J22652k307022
8188e606786J248748N398979L100468k331133k912089Q41166J878699j042400
8180E75652k679418j648245j781125l138398j111898M160019O271263K717850
8172C365700j308980j862766j405880k014501r29529K959848M890517J500860
$$ plain form
8230 -3905374 -4405478 -2692872 1565889 4297449 2716870 498091 1887806 4047832
8222 4047832 1676602 -3492119 -5152695 -2720469 -1359415 -2286189 -1196470 2803153
8214 2803153 4788608 2883748 2098916 5694448 9114080 7190933 2454349 1063210
8206 1063210 3719815 5678591 4090817 942572 -903514 -1214877 -1271074 -1044435 1212178
8197 1212178 6065537 10066124 8151589 395466 -6335893 -6560823 -3422416 -3299764 -5606786
8188 -5606786 -4358038 1040941 4141409 1810276 -1101813 -260647 1618052 575652
8180 575652 -2103766 -3752011 -5533136 -8671534 -9783432 -5623413 647850 3365700
8172 3365700 2056720 193954 -1211926 -3226427 -4155956 -1196108 3694409 5195269
8164E195269l055418l395041q71095r1219j066993k23579K904508M791894K941084
8155G129410j392405m849149m677941j216867J481821q8283l551247l267399J045631
8146i386429L457140J411075R990K949672N381335J817235l821080l602309K040187
8137B56816N377596L407688N98055m31840k448460n686046m547070L121976R732342
8128I381057P065457k137808p887479o105590j990362r29026k099702k329942
8120g033395j267145j30270J226984L142386M236876L206911R67499r78575k567651
8111H03620l578670k248165J630985M296592K555598o91730j15424L379153L092074
8102I124033l248703r065618p532741m02079N179863N502417K482945l79553p52403
$$ plain form
8164 5195269 2139851 -1255190 -2126285 -2217504 -3284497 -3508076 -603568 4188326 7129410
8155 7129410 5737005 887856 -3790085 -5006952 -3525131 -3613414 -7164661 -10432060 -9386429
8146 -9386429 -5929289 -4518214 -4508224 -1558552 3822783 5640018 1818938 -1783371 256816
8137 256816 5634412 9042100 9640155 9208315 6759855 1073809 -3473261 -351285 9381057
8128 9381057 16446514 14308706 6421227 315637 -1674725 -2603751 -4703453 -7033395
8120 -7033395 -8300540 -8430810 -7203826 -4061440 175436 3382347 4349846 3371271 803620
8111 803620 -2775050 -5023215 -3392230 904362 3459960 2768230 2652806 6031959 9124033
8102 9124033 5875330 -3190288 -10723029 -11125108 -5945245 -442828 2040117 1660564 908161
8093I08161J810306M719155L813201j174233m934252l448587K69284J183486K972
8084C149493P40784K806843J889745k045183m190824k898083j954632l235649
8076e737506l082956J014803N168189M436685j11347l646662m373059m131764
8068a0463617l757168j806854K080628N542907O114145L945474J104043j017852
8060A741706k637397l918430l543036m34806L403376M113001R21182k459318k799851
8051e613573j221858j62475N53420J633936J342559j205307k302303J553196O736184
8042A313779O291292J91085m305293l149574k85195k28861j615712j090557R75860
8033a903176K131510J904225J083155m61734k464225k968509r64392J374762J403508
$$ plain form
8093 908161 2718467 7437622 11250823 10076590 5142338 1693751 1963035 3146521 3149493
8084 3149493 3890277 6697120 8586865 6541682 2350858 -547225 -2501857 -5737506
8076 -5737506 -8820462 -7805659 -2637470 1799215 1687868 -1958794 -6331853 -10463617
8068 -10463617 -14220785 -16027639 -13947011 -8404104 -2289959 1655515 2759558 1741706
8060 1741706 -895691 -4814121 -8357157 -8791963 -5388587 -1275586 -354404 -2813722 -5613573
8051 -5613573 -6835431 -6997906 -6444486 -4810550 -3467991 -4673298 -6975601 -5422405 1313779
8042 1313779 7605071 7796156 3490863 341289 56094 -172767 -1788479 -2879036 -1903176
8033 -1903176 228334 2132559 3215714 2753980 289755 -2678754 -3643146 -2268384 -864876
8024h64876k73331p66549J092077L188159K605225p21403l239995j805669J642294
8015H55932K140876o88637j223386L303589P296107M909474p84392l174357k733566
8006I901640m237131o417031m100106P05614N48907m147305m516958J794455O189598
7997d278317L580816M06074K313704L982804p59635o832197n145861L340922R276095
7988E884405P260570o9118p110563r034773m053801L254316M898981j49915l721605
7979b841503o94213L283958J867800j617113j349580L57839j428972l919160j600574
7970g941518K920062L153506K30032j1595J539131n66911m667382l583993K449839
7961f478829N129200J365671k443465j238001K161008L414797K147085p19142
$$ plain form
8024 -864876 -1138207 -1904756 -812679 2375480 4980705 4259302 1019307 -786362 855932
8015 855932 2996808 2308171 1084785 4388374 11684481 16593955 15809563 12635206 9901640
8006 9901640 5664509 -752522 -4852628 -4147014 -3598107 -7745412 -12262370 -10467915 -4278317
7997 -4278317 -697501 -291427 2022277 6005081 5245446 -1586751 -6732612 -3391690 5884405
7988 5884405 13144975 13075857 5965294 -3069479 -7123280 -3868964 1030017 880102 -2841503
7979 -2841503 -3535716 -251758 1616042 -1071 -1350651 -992812 -2421784 -6340944 -7941518
7970 -7941518 -5021456 -1867950 -1637918 -1649513 -110382 -677293 -5344675 -8928668 -6478829
7961 -6478829 -1349629 16042 -2427423 -3665424 -1504416 1910381 4057466 3338324
7953C338324m389161n785060k267429K604415K879330M143J032726O372850Q038471
7944A1828609K392391l851603m139103j281840j476132m764573o339571l705602
7936a1337424J270312N075936N257948K662553J511037M416991P847775O326774
7928B3031902K00892n348399p762816q148665o374825j799269K070330J046434
7920c084416j986653o41207L771468L486492k321474m983900Q2186O303373O418302
7911G044171K002747j800694l802182m492208k798469M64845J730188Q36852J954168
7902A139418N348771N443623O73534k625563p59229R84547j858552m857840l245953
$$ plain form
7953 3338324 -1050837 -6835897 -9103326 -6498911 -3619581 -3615438 -2582712 3790138 11828609
7944 11828609 14221000 10369397 6230294 4948454 3472322 -1292251 -7631822 -11337424
7936 -11337424 -10067112 -4991176 266772 2929325 4440362 8857353 16705128 23031902
7928 23031902 23232794 17884395 10121579 1972914 -4401911 -6201180 -4130850 -3084416
7920 -3084416 -5071069 -5712276 -1940808 1545684 -775790 -5759690 -5677504 625869 7044171
7911 7044171 9046918 7246224 3444042 -1048166 -3846635 -3381790 -1651602 -814750 1139418
7902 1139418 6488189 11931812 12605346 9979783 9220554 10205101 8346549 3488709 242756
$$ [...]
##END NTUPLES=NMR SPECTRUM
##END=
