##TITLE=31Pdec_SR90_rm3
 , 124 sc
 30.09.2021
##JCAMPDX= 6.0         $$ Bruker NMR JCAMP-DX V2.0
##DATA TYPE= NMR SPECTRUM
##DATA CLASS= NTUPLES
##ORIGIN= UXNMR, Bruker Analytische Messtechnik GmbH
##OWNER= root
$$ XWIN-NMR		Version 3.5
$$ Thu Sep 30 12:07:33 2021 Russian Standard Time (UT+4h)  she@DPX200
##.OBSERVE FREQUENCY= 81.013821
##.OBSERVE NUCLEUS= ^31P
##.ACQUISITION MODE= SIMULTANEOUS
##.ACQUISITION SCHEME= undefined
##.AVERAGES= 124
##.DIGITISER RES= 16
##SPECTROMETER/DATA SYSTEM= spect
##.PULSE SEQUENCE= zgpg30
##.SOLVENT NAME= CDCl3
##.SHIFT REFERENCE= (INTERNAL, CDCl3, 0, 248.564)
##AUDIT TRAIL= $$ (NUMBER, WHEN, WHO, WHERE, WHAT)
$$ ##TITLE= Audit trail, XWIN-NMR		Version 3.5
$$ ##JCAMPDX= 5.01
$$ ##ORIGIN= Bruker BioSpin GmbH
$$ ##OWNER= she
$$ F:/spectra/data/she/nmr/P31/1/pdata/1/auditp.txt
$$ ##AUDIT TRAIL=  $$ (NUMBER, WHEN, WHO, WHERE, WHAT)
(   1,<2021-09-30 12:02:47.06 +0400>,<she>,<DPX200>,
      <created by zg, POWCHK disabled, PULCHK disabled
       configuration hash MD5:
       00 E9 B6 7A A2 85 ED C7 34 08 36 98 17 FE 4E 26
       data hash MD5: 32K
       FD 1F F4 91 C6 77 92 68 23 FE D6 62 FB 54 B9 89>)
(   2,<2021-09-30 12:06:34.85 +0400>,<she>,<DPX200>,
      <Start of raw data processing
       efp BC_mod = 2 LB = 1 FT_mod = 6 PKNL = 1 PHC0 = -8830.657 PHC1 = 85.66933 SI = 64K 
       data hash MD5: 64K
       D5 37 04 9E 22 C4 91 E7 41 5C 76 6F D7 DC 6F 4C>)
(   3,<2021-09-30 12:06:44.67 +0400>,<she>,<DPX200>,
      <pk PHC0 = 148.2395 PHC1 = 0 
       data hash MD5: 64K
       CA A1 DC C5 16 3D B8 22 6B EF F1 E0 36 8F B2 51>)
(   4,<2021-09-30 12:07:06.25 +0400>,<she>,<DPX200>,
      <pk PHC0 = -147.2057 PHC1 = -22.2 
       data hash MD5: 64K
       2A 95 A5 2E 03 AB 0B E5 5D D3 49 62 13 95 BE B2>)
(   5,<2021-09-30 12:07:09.75 +0400>,<she>,<DPX200>,
      <abs ABSG = 5 
       data hash MD5: 64K
       EB 5C 78 8C 5C CB 63 FA D7 01 88 B5 74 40 A0 7F>)
$$ ##END=
$$ 
$$ hash MD5
$$ DA D7 60 21 84 ED 89 81 F1 75 20 D1 E4 7B 99 42
##$RELAX= 
##$RELAX= 
##$RELAX= 
##$RELAX= 
##$RELAX= 
##$RELAX= 
##$RELAX= 
##$RELAX= 
$$ Bruker specific parameters
$$ --------------------------
##$DU= <F:/spectra>
##$EXPNO= 1
##$NAME= <P31>
##$PROCNO= 1
##$TYPE= <nmr>
##$USER= <she>
##$AMP= (0..31)
100 100 100 100 100 100 100 100 100 100 100 100 100 100 100 100 100 100 
100 100 100 100 100 100 100 100 100 100 100 100 100 100 
##$AQSEQ= 0
##$AQ_mod= 1
##$AUNM= <au_zg>
##$AUTOPOS= <>
##$BF1= 81.014009
##$BF2= 200.13
##$BF3= 200.13
##$BF4= 200.13
##$BF5= 200.13
##$BF6= 200.13
##$BF7= 200.13
##$BF8= 200.13
##$BYTORDA= 1
##$CFDGTYP= 0
##$CFRGTYP= 5
##$CHEMSTR= <none>
##$CNST= (0..31)
1 1 145 1 1 1 1 1 1 1 1 1 1 1 1 1 1 1 1 1 1 1 1 1 1 1 1 1 1 1 1 1 
##$CPDPRG= <waltz16>
##$CPDPRG1= <>
##$CPDPRG2= <waltz16>
##$CPDPRG3= <>
##$CPDPRG4= <mlev>
##$CPDPRG5= <mlev>
##$CPDPRG6= <mlev>
##$CPDPRG7= <mlev>
##$CPDPRG8= <mlev>
##$CPDPRGB= <>
##$CPDPRGT= <>
##$D= (0..31)
0 1 0 0 0 0 0 0 0 0 0 0.03 2e-05 3e-06 0 0 0 0 0 0 0 0 0 0 0 0 0 0 0 0 
0 0 
$$ [...]
##$SUBNAM3= <"">
##$SUBNAM4= <"">
##$SUBNAM5= <"">
##$SUBNAM6= <"">
##$SUBNAM7= <"">
##$SUBNAM8= <"">
##$SUBNAM9= <"">
##$SW= 501.771253377433
##$SWIBOX= (0..15)
0 1 3 0 0 0 0 0 0 0 0 0 0 0 0 0 
##$SW_h= 40650.406504065
##$TD= 32768
##$TD0= 1
##$TE= 0
##$TE2= 300
##$TE3= 300
##$TEG= 300
##$TL= (0..7)
0 120 53 12 22 120 120 120 
##$TP= (0..7)
150 150 150 150 150 150 150 150 
##$TP07= 0
##$TPNAME0= <>
##$TPNAME1= <>
##$TPNAME2= <>
##$TPNAME3= <>
##$TPNAME4= <>
##$TPNAME5= <>
##$TPNAME6= <>
##$TPNAME7= <>
##$TPOAL= (0..7)
0.5 0.5 0.5 0.5 0.5 0.5 0.5 0.5 
##$TPOFFS= (0..7)
0 0 0 0 0 0 0 0 
##$TUNHIN= 0
##$TUNHOUT= 0
##$TUNXOUT= 0
##$USERA1= <user>
##$USERA2= <user>
##$USERA3= <user>
##$USERA4= <user>
##$USERA5= <user>
##$V9= 5
##$VALIST= <valist>
##$VCLIST= <CCCCCCCCCCCCCCC>
##$VD= 0
##$VDLIST= <DDDDDDDDDDDDDDD>
##$VPLIST= <PPPPPPPPPPPPPPP>
##$VTLIST= <TTTTTTTTTTTTTTT>
##$WBST= 1024
##$WBSW= 4
##$XGAIN= (0..3)
0 0 0 0 
##$XL= 0
##$YL= 0
##$YMAX_a= 28814
##$YMIN_a= -45638
##$ZGOPTNS= <>
##$ZL1= 120
##$ZL2= 120
##$ZL3= 120
##$ZL4= 120
##$ABSF1= 248.5645
##$ABSF2= -253.2056
##$ABSG= 5
##$ABSL= 3
##$ALPHA= 0
##$AQORDER= 0
##$ASSFAC= 0
##$ASSFACI= 0
##$ASSFACX= 0
##$ASSWID= 0
##$AUNMP= <proc_1d>
##$AZFE= 0.1
##$AZFW= 0.5
##$BCFW= 0
##$BC_mod= 2
##$BYTORDP= 0
##$COROFFS= 0
##$CY= -3
##$DATMOD= 1
##$DC= 0
##$DFILT= <>
##$DTYPP= 0
##$F1P= 0
##$F2P= 0
##$FCOR= 1
##$FTSIZE= 65536
##$FT_mod= 6
##$GAMMA= 0
##$GB= 0
##$INTBC= 1
##$INTSCL= 5.30512e-09
##$ISEN= 30
##$LB= 1
##$LEV0= 0
##$LPBIN= 0
##$MAXI= 10000
##$MC2= 0
##$MEAN= 0
##$ME_mod= 0
##$MI= 50
##$NCOEF= 0
##$NC_proc= -7
##$NLEV= 6
##$NOISF1= 182.463
##$NOISF2= 159.3651
##$NSP= 0
##$NTH_PI= 0
##$NZP= 0
##$OFFSET= 248.5645
##$PC= 4
##$PHC0= -8829.624
##$PHC1= 63.46933
##$PH_mod= 1
##$PKNL= yes
##$PPARMOD= 0
##$PSCAL= 0
##$PSIGN= 0
##$REVERSE= no
##$SF= 81.014009
##$SI= 65536
##$SIGF1= 159.3651
##$SIGF2= -187.1042
##$SINO= 113.3802
##$SIOLD= 16384
##$SREGLST= <1H.CDCl3>
##$SSB= 0
##$STSI= 65536
##$STSR= 0
##$SW_p= 40650.406504065
##$SYMM= 0
##$S_DEV= 0
##$TDeff= 32768
##$TDoff= 0
##$TI= <>
##$TILT= no
##$TM1= 0
##$TM2= 0
##$TOPLEV= 0
##$USERP1= <user>
##$USERP2= <user>
##$USERP3= <user>
##$USERP4= <user>
##$USERP5= <user>
##$WDW= 1
##$XDIM= 65536
##$YMAX_p= 193539903
##$YMIN_p= -378865790
$$ End of Bruker specific parameters
$$ ---------------------------------
##NTUPLES= NMR SPECTRUM
##VAR_NAME=  FREQUENCY,     SPECTRUM/REAL,   SPECTRUM/IMAG
##SYMBOL=    X,             R,               I
##VAR_TYPE=  INDEPENDENT,   DEPENDENT,       DEPENDENT
##VAR_FORM=  AFFN,          ASDF,            ASDF
##VAR_DIM=   65536,         65536,           65536
##UNITS=     HZ,            ARBITRARY UNITS, ARBITRARY UNITS
##FACTOR=    0.620285442955139, 1,           1
##FIRST=     20137.2065510759, 0,            0
##LAST=      -20513.1999529892, 0,           0
##MIN=       -20513.1999529892, -378865790,  0
##MAX=       20137.2065510759, 193539903,    0
$$ Real data points
##PAGE= N=1
##DATA TABLE= (X++(R..R)), XYDATA
$$ [...]
13021e93691M329130N304146m275799p477478J092490O800197R56909n427965
13013G07939k108985L721303J911285l431678k992673J809312L413501J237582
13005D267586n264M60052N30198P68717J773452P97755k869462m505213j701358
12996d83537N92399j212624k465975Q12926L271483q51860o385917m668789K355673
12987i036221N597217L043406N79059P98905N84472j238634k393059k557131k854760
12978g476746j438839L048082N798001J784385m695975n175241J22951L834694
12970d198688M090710N167116O491571K661451m705854o915797k386535M75655
12962F79629k120112l398394O38995L437567J36549k957029N34220N465861L973346
$$ y = [-593691, 3735439, 9039585, 4763786, -2713692, -1621202, 5178995, 6135904, 707939, -1401046, 2320257, 4231542, 799864, -2192809, -383497, 3030004, 4267586, 4262322, 4722374, 5252572, 6021289, 7794741, 8592496, 5723034, 1217821, -483537, 108862, -1103762, -3569737, -2756811, 514672, -337188, -6723105, -11391894, -9036221, -3439004, -395598, 183461, 982366, 1566838, 328204, -2064855, -4621986, -7476746, -8915585, -5867503, -69502, 1714883, -2981092, -8156333, -8033382, -4198688, -107978, 5059138, 11550709, 14212160, 9506306, 2590509, 203974, 679629, -1440483, -4838877, -4199882, -762315, -625766, -3582795, -3048575, 2417286, 6390632]
12953F390632j436077l215121j239808k62393q07K208536L146567j181296n336811
12944i26578r76024P768190P781875k824118j0139626m483710N598332O498347
12936H296688j175136n493368j259187M154963K949114k757834n684612l743652
12928d713024j151334p56419m9308L457297O481200L995504k118673m056828O13094
12919A701509M248894N3106o833722n852449L452978J0165751P049143m16228
12911A3568982l284229j424681j181065m309364n702595j940192L271153M336490
12903C334499J217814j384071j026190l65960k146472m124106j952932L748457
12895b698961O909554L782212j917189m023296j712109Q40238R85633R4382L139
$$ y = [6390632, 4954555, 1739434, 499626, 237233, 236426, 2444962, 5591529, 4410233, -926578, -1902602, 5865588, 13647463, 10823345, 683719, -3799991, 1798341, 8296688, 7121552, 1628184, 368997, 4523960, 7473074, 4715240, -969372, -4713024, -5864358, -6620777, -6670085, -3212788, 3268412, 7263916, 5145243, 1088415, 1701509, 5950403, 6003509, -830213, -6682662, -3229684, 6936067, 13985210, 13568982, 10284753, 8860072, 7679007, 3369643, -2332952, -4273144, -1001991, 3334499, 4552313, 3168242, 2142052, 1776092, -370380, -4494486, -6447418, -2698961, 4210593, 7992805, 6075616, 2052320, 340211, 1180449, 2166082, 2260464, 2263603]
12886B263603N61780J130869J602017J437077K54932m48704J004124K969869K087291
12877A2862858j185450k648568j082416l07102k281080l086882K01290L178086
12869E650736N67550m085945k681496M272094O940739O88159o301952m725799
12861C24086K358354M538719o90650n385727l643613O66275J222330j332555j749122
12852c691903J180228L281421J698205j132715j242607J648733M224983L763615
12844I729960Q80747j742646k436741j748825q45033P5603Q67964J47698k863395
12835B065332n515847l776732J879789N643444L612921p34872j441584J552932
12827C285383K989781M85305k314652j618766J256490K388834M46430k524247
$$ y = [2263603, 2825383, 3956252, 5558269, 6995346, 7250278, 6801574, 7805698, 10775567, 12862858, 11677408, 9028840, 7946424, 7639322, 5358242, 2271360, 2472650, 5650736, 6218286, 2132341, -549155, 3722939, 10663678, 11351837, 5049885, 324086, 2682440, 7221159, 6530509, 1144782, -2498831, -1832556, -610226, -1942781, -3691903, -2511675, 769746, 2467951, 1335236, 92629, 1741362, 5966345, 9729960, 10610707, 8868061, 6431320, 4682495, 3837462, 3913065, 4781029, 4928727, 2065332, -3450515, -7227247, -5347458, 295986, 3908907, 3174035, 1732451, 3285383, 6275164, 6760469, 4445817, 2827051, 4083541, 6472375, 6918805, 4394558]
12819D394558l825595k168900J575585M503144L815297j60369m060073m988911
12811i15264k788022R47312M096885M426651J502195j515649j038567J503814
12803F219355J111632k895274n093608k465719L02020j656801m879925k659886
12795a2018206M013228P534932M974363J306574N42179M97484j056996j407213
12787D386345J516572L535951M4060n528046n463210R03964N857954M239523j08385
12778I384728j508635r23833k480773m890147k767110L901641P943212M693565
12770A3352648j661394m729805m429874m269935l880582o30139L287375K753458
12762b08248j168310j526293L270683O016645K238005k052772k3934M577773L482719
$$ y = [4394558, 568963, -1599937, -24352, 4478792, 8294089, 8133720, 4073647, -915264, -3703286, -2755974, 1340911, 5767562, 7269757, 5754108, 4715541, 6219355, 7330987, 4435713, -657895, -3123614, -2821594, -4478395, -9358320, -12018206, -8004978, -470046, 4504317, 5810891, 6353070, 6850554, 5793558, 4386345, 5902917, 9438868, 9482928, 3954882, -1508328, -604364, 5253590, 9493113, 9384728, 7876093, 6952260, 4471487, -418660, -3185770, 715871, 8659083, 13352648, 11691254, 6961449, 2531575, -1738360, -5618942, -6249081, -2961706, -208248, -1376558, -2902851, 367832, 6384477, 8622482, 6569710, 6545776, 11123549, 14606268]
12753A4606268k625585n507125k599695Q4806j162066k408409j65002K389269
12745B612461J249062j756496k573689j337931q47452j320856q19741O10804P97783
12736c386055j012719k875250k417092O50302L982046M553566K119621m1698L82338
12727A955059J069484q57287k944687r91307K449908M93018o053798p454659M01662
12718a1932607Q378636P172590P73189j370811L09396j560527o479962o073231
12710a0783327J021658N686196K689410j503614k17693K689663M20517m662499
12702d659689m588874J628728O444297M327726j789436n244339l008169K426147
12694d463609O105163N090627J075888j781308j895129j255796j053292J70938
$$ y = [14606268, 11980683, 6473558, 3873863, 3958669, 2796603, 388194, 223192, 2612461, 3861523, 2105027, -468662, -1806593, -2654045, -3974901, -4794642, -4183838, -3386055, -4398774, -7274024, -9691116, -9040814, -5058768, -505202, 1614419, 1572721, 1955059, 3024543, 2167256, -777431, -1768738, 681170, 1174188, -4879610, -12334269, -11932607, -3553971, 3618619, 4391808, 3020997, 3330393, 1769866, -4710096, -10783327, -9761669, -4075473, -1386063, -2889677, -3107370, -417707, 2810, -4659689, -9248563, -7619835, -1175538, 3152188, 1362752, -3881587, -6889756, -4463609, 1641554, 6732181, 7808069, 6026761, 4131632, 2875836, 1822544, 1993482]
12686A993482K277345J706102k520312m890994p03650N563517N510945q86202
12678H050233n174981k934248P76989P44217m36397J734883M952474L511429k016165
12669I208434m747796j175918M118054M898024Q90888l158853l911778k517019
12661C604036j905025k929247l760531k349717J151079M311434M425978Q69602
12653C417609l823270n446792k135050K698524L324953j190829n070271l273630
12645a1498756J502115L062293J115920R84971M138691N417732J719777k610516
12637C832227k778836p30923o04944j432197p5139J998297J193776j384510k032405
12628b014654j409481k547390l585587m01661M338000L770511r61266j027692
$$ y = [1993482, 4270827, 5976929, 3456617, -1434377, -2138027, 3425490, 8936435, 8050233, 2875252, -58996, 717993, 1462210, 1025813, 2760696, 7713170, 11224599, 9208434, 4460638, 3284720, 7402774, 12300798, 13191686, 10032833, 6121055, 3604036, 1699011, -1230236, -4990767, -7340484, -6189405, -1877971, 2548007, 3417609, -405661, -5852453, -7987503, -5288979, -1964026, -3154855, -8225126, -11498756, -9996641, -6934348, -5818428, -4833457, -694766, 4722966, 6442743, 3832227, 1053391, 322468, -282476, -1714673, -1789812, 208485, 1402261, 17751, -2014654, -3424135, -5971525, -9557112, -9958773, -5620773, -1850262, -2811528, -3839220]
12620c839220N140744P815479J814095m110388j479629L718457J482938m929676
12612E612800m810026J402479L138383j922389m451803k86432K716674o98950
12604G00736l790656j66759M654461L018890j530426r83870K753328J479452m263988
12595A871168n364463N57175M808753J358170m243012m353375m85540J010307
12587d840817l80155J12950L430610M769468J378105k823743k723013R57179L051893
12578B932477J138014j753222k126926r89692j472516l002943j576675L547853
12570c303630P211061M956500n09559l065674j665738p43652k543289l792833
12562c456814j461503K166316K925885P58900q04664L1288J357494Q62160j030432
$$ y = [-3839220, 1301524, 9117003, 10931098, 6820710, 5341081, 9059538, 10542476, 5612800, 802774, 2205253, 5343636, 3421247, -1030556, -1316988, 1399686, 700736, -3089920, -3256679, 1397782, 4416672, 2886246, 1902376, 4655704, 6135156, 1871168, -3493295, -2936120, 1872633, 3230803, -1012209, -5365584, -5851124, -4840817, -5220972, -5108022, -1677412, 3092056, 4470161, 1646418, -1076595, -119416, 2932477, 4070491, 2317269, 190343, -799349, -2271865, -5274808, -6851483, -3303630, 3907431, 8863931, 8354372, 5288698, 3622960, 2879308, 336019, -3456814, -4918317, -2752001, 173884, 932784, 128120, 159408, 1516902, 2379062, 1348630]
12553A348630k091493j336438j56129k20546q61189J87214K985088M119039J170920
12544E145096k874305k817195J304949L542625J00626n107898n439853q067N604092
12535e49930O213029K156409k315166l799669k325241j29583J275417K177002
12527B702268K675884J331678k138581m194960j298674L691077L757562j990527
12519D535727n449853o68639O720865O968887K06178m038851p86215M048981L161708
12510A4698788k229548n591216m250712j264860j15731j130680k615021l055267
12502e554247k044908j56933J999959M394201O351630N554058O81435n088545
12494F136650o418952k536194J552994J952584N50105N54000R58088p32623k836187
$$ y = [1348630, -742863, -2079301, -2235430, -2455976, -3317165, -3129951, -144863, 3974176, 5145096, 2270791, -546404, 758545, 4301170, 4401796, -706102, -6145955, -6154022, -549930, 5663099, 7819508, 5504342, 1704673, -620568, -750151, 525266, 2702268, 5378152, 6709830, 4571249, 376289, -922385, 2768692, 6526254, 4535727, -914126, -1582765, 5138100, 12106987, 12313165, 8274314, 7488099, 11537080, 14698788, 12469240, 6878024, 2627312, 1362452, 1246721, 116041, -2498980, -5554247, -7599155, -7756088, -5756129, -1361928, 4989702, 10543760, 11225195, 6136650, -282302, -2818496, -1265502, 687082, 1237187, 1791187, 2749275, 2016652, -819535]
12485h19535j431060K844942M723434J734611k336653l028011r57606L02264l24028
12476G08358j083341j336798k536525m813708n361276k030432L049988N831846
12468g571888N699329N581328O300531M381339k023599q030683p261069j007449
12460c932161K859410O67605k445220q29954L405974M233843O33351k815253k763906
12451i86311l86255J665549K116355R54529o76692n97496J811398L510164J185564
12442H596805l486101n244008k330149J142676J077473j365225k316851o73823
12434d599203J376895J998500J490627P98612K26968L61O90049K177153K877743
12425G037705J244094j772045l034183j071530J428851Q89557j949481k768514
$$ y = [-819535, -2250595, 594347, 5317781, 7052392, 4715739, 1687728, 730122, 1032386, 708358, -374983, -1711781, -4248306, -9062014, -14423290, -16453722, -13403734, -7571888, -1872559, 3708769, 10009300, 14390639, 12367040, 4336357, -2924712, -3932161, -1072751, -405146, -2850366, -3680320, -274346, 3959497, 4592848, 1777595, -986311, -1372566, 292983, 2409338, 3363867, 2687175, 2089679, 3901077, 7411241, 8596805, 5110704, -133304, -2463453, -1320777, -243304, -1608529, -3925380, -4599203, -3222308, -1223808, 266819, 1065431, 1292399, 1292760, 1982809, 4159962, 7037705, 8281799, 6509754, 3475571, 2404041, 3832892, 4722449, 2772968, 4454]
12417D454N1775K927270K196836j115509l651335m142811l026468k97326L086085
12408c967029M008636J179347j555065K8012L966251M761441J400463k113616
12400G708440l361610l248170j659687K351216N647745L300310k455073l023669
12392E259502L363080O911341L82399q936141r335319j717597L049399J110310
12384H6974o96406J616088K755035j105434m504030j818867K826683K339096j560740
12375f1601j769760J784772K310279j613364l204789P90156M031473J015004l393990
12366a11820j590086M344252N633281K6255n613852n672779j910474J511603K923314
12357d60306J760282j818867m171792q77373N547368O709801K14049n797085m261303
$$ y = [4454, 56229, 2983499, 5180335, 4064826, 413491, -3729320, -6755788, -7053114, -3967029, 41607, 1220954, -334111, -306099, 3660152, 8421593, 9822056, 7708440, 4346830, 1098660, -561027, 1790189, 7437934, 10738244, 8283171, 5259502, 8622582, 15533923, 15916322, 6980181, -2355138, -4072735, -1023336, 86974, -609432, 1006656, 3761691, 2656257, -1847773, -3666640, -839957, 1499139, -61601, -1831361, -46589, 2263690, 650326, -2554463, -1764307, 2267166, 3282170, -111820, -1701906, 2642346, 8275627, 8301882, 2688030, -2984749, -4895223, -3383620, -460306, 1299976, -518891, -4690683, -5568056, -20688, 6689113, 6903162, 1106077, -3155226]
12348c155226Q67635K139072L90475J356856M502844M034770n44777l390496j988540
12339D212613l15381j185359k201139j259879k41583p29012q00493J284429L732963
12330B497159L711759P20655l442947n783350l562731K252220N976329L555307
12322E924401j366145k536121o33060j295951m579305m316975J107195N487425
12314b208536M669690K022504R03802o98963l829306m331219m40736K085788j101810
12305b928786m687100j711711M787085O328371K144530p20956O94330J601676
12297E507439j368138m508707l300316P83469L186413K893150K541360L057001
12289H791671J685955l233108p647145n433964K778003Q434057N655782o62790
$$ y = [-3155226, -2287591, -148519, 241956, 1598812, 6101656, 10136426, 9591649, 6201153, 4212613, 3897232, 2711873, 510734, -749145, -990728, -1719740, -2520233, -1235804, 2497159, 6208918, 6929573, 3486626, -2296724, -5859455, -3607235, 2369094, 5924401, 4558256, 2022135, 1389075, 93124, -4486181, -8803156, -7695961, -2208536, 2461154, 4483658, 5387460, 4688497, 859191, -3472028, -3912764, -1826976, -2928786, -7615886, -9327597, -4540512, 1787859, 3932389, 3211433, 3905763, 5507439, 4139301, -369406, -3669722, -2886253, 300160, 3193310, 5734670, 8791671, 10477626, 7244518, -402627, -5836591, -3058588, 5375469, 11031251, 10368461]
12281A0368461k224715N05499O62112k435599k277843K530282M697175L09202
12273A2134574m491852l813363r28090r17975j750562K37644K260277L62041k248687
12264H44007l66838L477326K699547k368279m926354j817141L373338O297281
12256G212887N481875J408466l198029m050386o40904J745757m75653l501341
12248C982672k730806l71813m72947j227122N62375J925523j064493m461801j961493
12239e819905L753999M704148N10296k014157o00148R68027J937023M789911O662264
12230A4891458J542723p710635j0409989l813835K312081P45929l105619j459774
12222g007661L622157M831400Q82530l154100l625521j445464Q49981J904919
$$ y = [10368461, 8143746, 8649245, 9311357, 6875758, 4597915, 7128197, 11825372, 12134574, 7642722, 3829359, 2901269, 1983294, 232732, 470376, 2730653, 3092694, 844007, 477169, 3954495, 6654042, 4285763, -640591, -2457732, 915606, 7212887, 12694762, 14103228, 10905199, 6854813, 6213909, 7959666, 7484013, 3982672, 1251866, 880053, 407106, -820016, -257641, 1667882, 603389, -3858412, -5819905, -2065906, 2638242, 3148538, 1134381, 534233, 1502260, 3439283, 8229194, 14891458, 16434181, 8723546, -1686443, -5500278, -3188197, -2442268, -5547887, -7007661, -3385504, 1445896, 2328426, -825674, -4451195, -5896659, -5046678, -3141759]
12214c141759K051073K166241J679565q95312m082933l460154J300446L801936
12206e80897L30729l139297l93758L827139J631933l507822k035618M485317N093123
12197E710849j681510m892535K08874M427131M82122n747378o233114k408342
12189a0133903R49636L979882P140205O995769L158157J231306K712095Q07069
12181A6840216o819162j0524148k825190Q077538R159093R24200n397651m631917
12173D802979j485680k12334N0251K85616m14235j607517j580863n24461K0282
12164f65962k07158p13942j292016p02449K258972M914125K868867k180393l094863
12155A185181J606433M519836J011904l607521l545247j323980r66476p1343L875284
$$ y = [-3141759, -1090686, 1075555, 2755120, 1859808, -2223125, -5683279, -4382833, -580897, -250168, -3389465, -3783223, 43916, 1675849, -1831973, -3867591, 617726, 5710849, 4029339, -863196, -654322, 3772809, 4254931, -1492447, -7725561, -10133903, -9184267, -5204385, 1935820, 8931589, 12089746, 13321052, 16033147, 16840216, 10021054, -503094, -3328284, 4749254, 13908347, 14832547, 9434896, 4802979, 3317299, 3104965, 3155216, 3440832, 3026597, 1419080, -161783, -686244, -665962, -873120, -1587062, -2879078, -3581527, -1322555, 3591570, 6460437, 4280044, 1185181, 2791614, 7311450, 8323354, 4715833, 1170586, -153394, -1119870, -1191213, 2684071]
12146B684071O230189K521315k848661l554289j555590j897090k667701N96264
12138d91492N040566M638029O09777j581692k197150m615756o051318j405066
12130f054102N577291N764764j119524n716787l012405K040243L849826K690605
12122D019911N45358j824381k212584J458111N513962L475646l711169p217129
12114D7725k487114M251696M709882j009871n880390m706561J125225N833455
12106A884047M885642n05017m688592m139634r97483J013995J112788o268k242203
12097c682725l883178j681769L377031N154703J301458k253656p21135J692032
12089f97239j87188k791701m74616L414573J854490l168138l511274J751149N630383
$$ y = [2684071, 8914260, 11435575, 8586914, 5032625, 3477035, 1579945, -1087756, -491492, 4549074, 9187103, 9796880, 8215188, 6018038, 1402282, -4649036, -6054102, -476811, 5287953, 4168429, -1548358, -4560763, -2520520, 1329306, 4019911, 4565269, 2740888, 528304, 1986415, 7500377, 10976023, 7264854, 47725, -2439389, 1812307, 6522189, 5512318, -368072, -5074633, -3949408, 1884047, 6769689, 6264672, 1576080, -2563554, -3561037, -2547042, -1434254, -1440522, -3682725, -7565903, -9247672, -5870641, -715938, 585520, -1668136, -2389271, -697239, -884427, -3676128, -4150744, -736171, 1118319, -2049819, -5561093, -3809944, 1820439]
12080A820439M691539K108872J87910j595448k146183n69897p48243n554527q925642
12071a0731180l549286N818173P930462K462407m98384J965804K013968l261206
12063B150758o291871l159793m23222k388302l399046O25578L816703J063447
12055h005748k494176p97725K715565K484174J127379L365003N890517K846977
12047G131966l076585m321087l49738K593483J770504L51895N45679J047443R63299
12038F656859O97451o43708l814910o009817l639953J814311N132083M295114
12030D487430J919350k6444k336002m716539m434197r94321J406352o49707m060460
12021i404538k855051L006684O834019M517751L36125Q6463K200547J295115j930764
$$ y = [1820439, 6511978, 8620850, 8808760, 7213312, 5067129, 4497232, 3748989, -1805538, -10731180, -14280466, -8462293, -531831, 1930576, 1432192, 3397996, 5411964, 2150758, -4141113, -7300906, -7724128, -10112430, -13511476, -12885898, -9069195, -8005748, -10499924, -11297649, -8582084, -6097910, -4970531, -1605528, 4284989, 7131966, 4055381, -265706, -615444, 1978039, 3748543, 4100438, 4646117, 5693560, 6656859, 7354310, 6710602, 2895692, -3114125, -6754078, -4939767, 192316, 4487430, 6406780, 6380336, 4044334, -672205, -5106402, -6100723, -4694371, -5344078, -9404538, -12259589, -9252905, -2418886, 2098865, 2434990, 2521453, 4722000, 6017115, 4086351]
12012D086351j966955Q24728j15890n125321n456779K123592P619637K735005
12004D724368n016248l760376L711370N006486j491228m875204M2116N556078
11996C897362M420271m40043l056336k592681r15083J029229J695589k74256k365956
11987A398096j065809J582699R43225j461803k24067L524787L255967j183997
11979F769098k942115l88905M29522k447453l324724n85K042215K49101o42631
11970b56477R94265l03387n450304o122772J419255P933518M823371k530189l927752
11961c420472L94972K860494J325873j93399J97893J008153J686527K193903R09996
11952F963940k311784m078637k324531K26454N37326p86594k262831l439831k529293
$$ y = [4086351, 2119396, 2944124, 2828234, -2297087, -7753866, -5630274, 1989363, 4724368, -291880, -4052256, -340886, 4665600, 3174372, -1700832, -1658716, 3897362, 8317633, 7877590, 4821254, 2228573, 1313490, 2342719, 4038308, 3764052, 1398096, 332287, 1914986, 2858211, 1396408, 1172341, 4697128, 7953095, 6769098, 3826983, 3438078, 3867600, 1420147, -1904577, -1905162, 137053, 386154, -256477, 737788, 434401, -5015903, -11138675, -9719420, -1785902, 3037469, 507280, -3420472, -3025500, -165006, 1160867, 967468, 1165361, 2173514, 3860041, 6053944, 6963940, 4652156, 573519, -1751012, -1524558, -987232, -1773826, -4036657, -7476488, -10005781]
11943a0005781J876146N724989L689272q10347N77036N983941M232233n676673
11935E590816r991344j811565O841941M212898l138392l588809K9577j454854
11927c309732n367940k877233L674548M761245O52141m84382J698703N10330l199270
11918c941590j715625M520886O248448R63580l217576j431327J234794k73504
11910B388086l721986n233940m462119j983775J733554L650628R30125l185465
11902i884892k710343J951284M720331L226526P30193p59004k310099l357511
11894h393515j902375Q07735J838841J825825K827326L057968L58362j808876
11886a388709N34899L631025J488325l076467k769866Q48346n45275p068254r195657
$$ y = [-10005781, -8129635, -2404646, 1284626, 474279, 1051315, 7035256, 11267489, 5590816, -4400528, -6212093, 629848, 4842746, 1704354, -1884455, -1854878, -3309732, -8677672, -11554905, -7880357, -3119112, -2466971, -2951353, -1252650, -742320, -3941590, -5657215, -1136329, 5112119, 6075699, 2858123, 1426796, 2661590, 2388086, -1333900, -6567840, -11029959, -13013734, -11280180, -7629552, -6699427, -9884892, -12595235, -10643951, -5923620, -2697094, -1966901, -2725905, -5036004, -8393515, -10295890, -9488155, -7649314, -5823489, -2996163, 61805, 420167, -1388709, -853810, 2777215, 4265540, 1189073, -1580793, -732447, -1277722, -8345976, -17541633]
11877a7541633k781031M916954O671782L675962J95808j800106p48213L738381
11869c672096O805370L187167l162427l334063J952136K609824l940972p614741
11861g169802j687425O700989Q043292L351073r94122l395499n068544m358383
11853d578421r0603L999627M055515J574858k03167j211988k201347k116728j261335
11844b033589k096021l756038j592332M282851O592143J745785l502789k234254
11836b594244J865344J230686k841296k601808L343374P734327N185021j256406
11828A0064998n106422l722637L77250K671206O70978l457880m760001j293913
11820d556421L207895L982933R43850k013790j908590R00376L922758M608222
$$ y = [-17541633, -20322664, -15405710, -8733928, -5057966, -4862158, -6662264, -7410477, -3672096, 3133274, 6320441, 3158014, -176049, 1776087, 4385911, 444939, -7169802, -8857227, -2156238, 5887054, 9238127, 8244005, 4848506, -220038, -4578421, -4669024, -669397, 3386118, 4960976, 4757809, 3545821, 1344474, -772254, -2033589, -4129610, -7885648, -9477980, -5195129, 1397014, 3142799, -359990, -2594244, -728900, 501786, -2339510, -4941318, -1597944, 6136383, 11321404, 10064998, 4958576, 1235939, 1613189, 4284395, 4955373, 1497493, -3262508, -4556421, -1348526, 2634407, 3578257, 1564467, -344123, 556253, 4479011, 9087233]
11812I087233K254076j015801k191405r43709M8069j156863l173827l178361m23269
11803f93857K540379J993480k726566p001319n317251J196256N111090K604797
11795b292991j363637j242668P60754q709j725173J14752L453283K774704o56544
11786a86229o29456K936298L892087P33619j642328j621348k892635n443811m133250
11777h987053J334579M218409J550253j563097j475571r93517j576123J49560
11769g342560M036772M001163j200361m100703r05538J701749j471508m809535
11761a0090521k174848K403671K929503K047721M077856N220456J132698k719320
11753B827216K42999M608195J114859o541728o531148J696718O407402K145349
$$ y = [9087233, 11341309, 10325508, 8134103, 7190394, 7238463, 6081600, 2907773, -270588, -693857, 1846522, 3840002, 1113436, -5887883, -11205134, -10008878, -4897788, -2292991, -3656628, -4899296, -4138542, -4147251, -5872424, -5757672, -2304389, 470315, -186229, -815685, 2120613, 6012700, 6746319, 5103991, 3482643, 590008, -4853803, -8987053, -7652474, -3434065, -1883812, -3446909, -4922480, -5915997, -7492120, -7342560, -3305788, 695375, -504986, -4605689, -5511227, -3809478, -5280986, -10090521, -12265369, -9861698, -6932195, -4884474, -806618, 4413838, 5546536, 2827216, 3070215, 7678410, 8793269, 2251541, -4279607, -2582889, 3824513, 5969862]
11745E969862l418065l203327L7677J411067J109565K94972j989106m344040k928729
11736g060124J068103J311390l079135m533984J089274P086653O003961P68610
11728B654748j001610J044911J265869j528487k555269L52542L169870K138245
11720E540819r60820k233901j240612n56777j361356j969549p26137J426873K241718
11711A60258J207613q9902o08439j131855k070428j777844R69133L978952L802237
11702D439725O84086j450618o30686L68132j354622l814657k900484Q48737K154360
11693a656027j200502m122915j016246N382406O735104O68336n545254n061804
11685e816902n08921J185163o73775j078224J349922K355338J12625j054475K142931
$$ y = [5969862, 2551797, -651530, -613853, 797214, 1906779, 2201751, 212645, -4131395, -7060124, -5992021, -4680631, -7759766, -12293750, -11204476, -4117823, 1886138, 2654748, 1653138, 2698049, 3963918, 2435431, -119838, 232704, 3402574, 5540819, 4579999, 2346098, 1105486, 548709, -812647, -2782196, -3508333, -2081460, 160258, 1367871, 1277969, 669530, -462325, -2532753, -4310597, -3341464, 637488, 4439725, 5123811, 3673193, 3042507, 3410639, 2056017, -1758640, -4659124, -3810387, -1656027, -2856529, -6979444, -7995690, -2613284, 4121820, 4790156, -755098, -5816902, -6325823, -5140660, -5814435, -6892659, -5542737, -3187399, -3074774, -4129249, -1986318]
11676a986318N878939M267339k310354p610940o878335j147568M682127O019473
11668I14363J944659l688155n317256j343785L948677N193688J781177k112679
11660A320689k523645L43454K900699K286382o63905k967008l424434l052267
11652e780035j635274K482744P466875P345030K99037o368917n172449Q17340
11644e45649K944068J51123j155403P31854N64204k781657l050116J953955N035450
11635C847829J225422l443545j695009L176962L213772j410707l912808k222209
11627a220293o05487j205589j333261N16766J860840N69286j953787k780192l53490
11618f505207M153056O721912L768522k389279m501862N0022M386159J418177
$$ y = [-1986318, 3892621, 8159960, 5849606, -1761334, -8639669, -9787237, -5105110, 914363, 2859022, -829133, -6146389, -7490174, -3541497, 1652191, 3433368, 1320689, -1202956, -859502, 2041197, 4327579, 3663674, 696666, -2727768, -5780035, -7415309, -4932565, 2534310, 9879340, 10178377, 3809460, -1362989, -545649, 2398419, 2549542, 1394139, 2125993, 2690197, -91460, -3141576, -1187621, 3847829, 5073251, 1629706, -65303, 3111659, 6325431, 4914724, 1001916, -1220293, -1825780, -3031369, -4364630, -3847864, -1987024, -1417738, -3371525, -6151717, -6505207, -2352151, 4369761, 8138283, 5749004, 1247142, 1297164, 5683323, 7101500]
11610G101500n449297p069930j889569K485854Q76888l075883l701131q78619
11602a1600187J844712K655929K039256O08689r34040j306502k36354N58709l27925
11593f697713j607457r16188J603539L151976K148572O61525J463394L532165
11585C339813K914031j431665n161611l695612J878437O061828M952940n42393
11577H315768n992711o597734j378475M250179L369876k950000n643381m41777
11569g068255N143739L250467k017579j954222K274664K956489p1746o50810M59094
11560B321841l101571q872186o794801K945409P787426K702539k145799M42179
11552d714963L375753J87138k832574J30706J983872l952992r427704m163005
$$ y = [7101500, 1652203, -5417727, -7307296, -4821442, -3944554, -7020437, -10721568, -11600187, -9755475, -7099546, -5060290, -4451601, -5385641, -6692143, -6928497, -6369788, -6697713, -8305170, -9221358, -7617819, -4465843, -2317271, -1655746, -192352, 3339813, 6253844, 4822179, -339432, -4035044, -2156607, 3905221, 8858161, 8315768, 2323057, -4274677, -5653152, -1402973, 1966903, -983097, -6626478, -7068255, -1924516, 1325951, -691628, -2645850, -371186, 2585303, 2513557, 1862747, 2321841, -779730, -9651916, -16446717, -13501308, -5713882, -3011343, -5157142, -4714963, -1339210, -1152072, -3984646, -3853940, -1870068, -5823060, -15250764, -19413769]
11544a9413769N783959P461521J792457l29333K488595K110291k558646l891161
11536f556086K68436L768871L514295K393559J327125j170755k660553k27960
11528F56932J795653j715936n453759j232962O098292M783008l297307m490811
11520b856890L197394N883171k524649r290905l519412O791212Q784966M042647
11512A0507534K021051L028545N07963m747205m978411J067637M960125M14531
11504A2781770q163707j1390665n940160K248511N228082K172351p39859J46055
11496c657622Q70664k311683m983232j238410N256251N701866R4098k813823M66819
11487b615072L855461K852129N52635P415n31471j586234n4716L702738M315300
$$ y = [-19413769, -13629810, -6168289, -4375832, -4705165, -2216570, -106279, -2664925, -6556086, -6287650, -2518779, 995516, 3389075, 4716200, 3545445, 884892, 656932, 2452585, 736649, -4717110, -5950072, 148220, 4931228, 1633921, -2856890, 340504, 6223675, 3699026, -5591879, -9111291, -2320079, 6464887, 10507534, 12528585, 15557130, 16065093, 11317888, 6339477, 7407114, 12367239, 12781770, 4618063, -6772602, -12712762, -10464251, -5236169, -3063818, -3803677, -3657622, -2786958, -5098641, -10081873, -11320283, -6064032, -362166, -268068, -3081891, -2615072, 1240389, 4092518, 4645153, 4652568, 4121097, 2534863, 2480147, 6182885, 10498185]
11478A0498185M24423k531935j856193j579534l246059j881446L723669N908785
11470I459895J97179n730568l301477L290339L613930l303965q547445o227891
11462a0550003M87391N164962M500500k00413m277825l778032k25316J444593
11454g434143P29872K242983O696611P853290K259227m432018n800572l477098
11446a361848k193436j557779R99792L614680K766110n27387k642583k524102
11438c426553q14823K275778M466810J895650l624493m008208K958994P585626
11430G308781J690016q077545r248574j313277N071428L843898p49447k817791
11422d292511r94500L253698O556803M251966l492102q503205m518513K720224
$$ y = [10498185, 10922608, 8390673, 6534480, 4954946, 1708887, -172559, 3551110, 9459895, 9657074, 3926506, 625029, 3915368, 7529298, 4225333, -4322112, -10550003, -10062612, -4897650, -397150, -597563, -4875388, -8653420, -8878736, -7434143, -6704271, -4461288, 2235323, 10088613, 12347840, 7915822, 2115250, -1361848, -3555284, -5113063, -4113271, -498591, 2267519, 1740132, -902451, -3426553, -4241376, -1965598, 2501212, 4396862, 772369, -3235839, -276845, 7308781, 8998797, 921252, -8327322, -9640599, -4569171, -725273, -1474720, -4292511, -5287011, -2033313, 4523490, 8775456, 5283354, -3219851, -7738364, -5018140]
11414e018140L425489j256366k121942K230166L877271K15357j655451K013827
11406A710211N056257K486667j370732j599194j190176l972516o014951k141838
11398g036272L809956L782727j888497m751865q09572M330199M421266J054352
11390B912294R1910L020798N428546L183894k463503o411658n162523k52204L315658
11381C663212J934262k809717n309767j977026L886250N327022P43328l449360
11373B008204j898791J368521q89959o872686p334969J23750O818691O078018
11365e99221K395604K213850L088123l24444n212253m685590M29453L113613J894692
11356B313827K024071N009797N678433J276639l902420n341700l814308j997260
$$ y = [-5018140, -1592651, -2849017, -4970959, -2740793, 1136478, 1351835, -303616, 1710211, 6766468, 9253135, 7882403, 6283209, 5093033, 1120517, -4894434, -7036272, -3226316, 556411, -1332086, -6083951, -6893523, -2563324, 1857942, 2912294, 3004204, 6025002, 11453548, 14637442, 12173939, 5762281, 599758, 347554, 3663212, 5597474, 2787757, -2522010, -4499036, -612786, 4714236, 5457564, 2008204, 109413, 1477934, 587975, -6284711, -13619680, -13495930, -6677239, -599221, 1796383, 4010233, 7098356, 6773912, 1561659, -3123931, -2694478, 419135, 2313827, 4337898, 9347695, 15026128, 16302767, 12400347, 7058647, 3244339, 1247079]
11348A247079p66217n38517j443031j019574L097123P352410N152773k901860
11340A0180186q088429n399127m3762J246215o49821j245820k45150Q1213L39301
11331c825194K216932L945140K866266P02374J230216L688653L204148k043208
11323A1985327p669423p980686k217446M457160N715907N81594m963001m847528
11315d938096p42242Q56843r33156j67645M786528O564683N20812n927258l843350
11306c822881K607420K441791m054742n534581J503118O397697J410616n872270
11298d923832m857621J796835L858735j8090k001070J152913M238407L673677
11290B919954K303360K267104J000376k692408n383773n259110n287569o235911
$$ y = [1247079, 480862, -57655, -1500686, -2520260, 576863, 7929273, 13082046, 10180186, 2091757, -3307370, -3351132, -2104917, -2754738, -4000558, -4245708, -4164495, -3825194, -1608262, 2336878, 5203144, 5905518, 7135734, 10824387, 14028535, 11985327, 4315904, -3664782, -5882228, -1425068, 4290839, 4872433, -90568, -4938096, -5680338, -4823495, -5756651, -5924296, -1137768, 5426915, 5947727, 20469, -3822881, -1215461, 1226330, -2828412, -8362993, -6859875, -462178, 948438, -4923832, -9781453, -7984618, -4125883, -4143973, -6145043, -4992130, -753723, 2919954, 5223314, 7490418, 8490794, 5798386, 414613, -4844497, -10132066, -16367977]
11282a6367977l087587N870849J2355777Q348221r35073l506293J660326L500083
11274G838326l240080r282726n198885L847084N990710L55261k915435P87252
11266a818493L891204l23160o270286m397007L660732O756047O04609n800588
11258c696942l414052L859083N534728J1997m101546j475860K948521K754342
11250B420271p14364k112910l86459J561504K343813K528404J854931K69785l65259
11241G399716L65713j022513o260409j0012296o329654J570698N026899K569221
11233f692625J137781M115044O218184K934246k135733l396164j212839M37685
11225A405579O9240j252620k489870k424228k34784J848652O45240j896855m91986
$$ y = [-16367977, -19455564, -13584715, -1228938, 7119283, 6184210, 2677917, 4338243, 7838326, 4598246, -4684480, -9883365, -6036281, -45571, 309690, -2605745, -1818493, 2072711, 1749551, -4520735, -8917742, -5257010, 1499037, 2103646, -3696942, -7110994, -3251911, 2282817, 2294814, -1806732, -3282592, -334071, 2420271, 1705907, -407003, -793462, 768042, 3111855, 5640259, 7495190, 7764975, 7399716, 7765429, 6742916, 482507, -9529789, -15859443, -14288745, -9261846, -6692625, -5554844, -1439800, 4778384, 7712630, 5576897, 2180733, 967894, 1405579, 1474819, 222199, -2267671, -4691899, -4926683, -3078031, -2432791, -4329646, -4821632]
11216d821632L776770L162591l515990o031472J926974J0588079P229210m254204
11208H060326q828984k608004L217491J340831j588586J632168O163901L637159
11200A1026302l886287p094572l006793K434873M039191K786461J208512p28485
11192F779202l071848l656878j586880r7856k211223n028025k821631L916055
11184g779084P426337L263259k494193j463646M644800O530271J265401l946911
11176G446234l538635j324590k456450m501723k635024J336458K129750j30458
11168c674438j168345m74190r64533k069074k60388L780265N315960L348275J868524
11159E702056K448308J935049r14866k693664j554434n02533j706272k740104
$$ y = [-4821632, -1044862, 2117729, -1398261, -7429733, -5502759, 5085320, 12314530, 8060326, -768658, -3376662, -159171, 1181660, -406926, 1225242, 7389143, 11026302, 7140015, 45443, -2961350, -526477, 3512714, 6299175, 7507687, 6779202, 3707354, 50476, -1536404, -1634260, -3845483, -8873508, -11695139, -7779084, -352747, 2910512, 416319, -1047327, 3597473, 10127744, 11393145, 7446234, 3907599, 2583009, 126559, -4375164, -7010188, -5673730, -3543980, -3674438, -4842783, -5316973, -6281506, -8350580, -8610968, -4830703, 485257, 3833532, 5702056, 8150364, 10085413, 9170547, 6476883, 4922449, 4419916, 2713644, -26460]
11151b6460j592893m30408q24337j18005L055261M151673p02093o724730n671021
11142h883013K129312P361920M208175k276302l771243L29713L382633J240013
11134C721208k668708l090786p17830p94683m513131o124532j190679N679008
11126i700133O236639M25509l230088j09006L915335K045958k639471k171375
11118e226632L438934N803985R60395m458694l030679K698034M324368k36095
11110D273616m478378l258940L20217N27920k230275k500881J657258N651534
11102c7929M799128L13469l146813l394398j671672M39527K039307J933537m7427
11093A226729j146742J348627M977803L972810k300832o938839m564961Q23899
$$ y = [-26460, -1619353, -2049761, -2874098, -2992103, 63158, 4214831, 3512738, -3211992, -8883013, -6753701, 608219, 4816394, 2540092, -1231151, -901438, 2481195, 3721208, 1052500, -2038286, -2756116, -3550799, -8063930, -14188462, -15379141, -9700133, -3463494, -3037985, -6268073, -6377079, -2461744, -415786, -3055257, -5226632, -1787698, 4016287, 4976682, 517988, -2512691, 185343, 4509711, 4273616, -204762, -3463702, -3143485, -2615565, -4845840, -7346721, -5689463, -37929, 4761199, 5074668, 1927855, -1466543, -3138215, -2698688, -659381, 1274156, 1226729, 79987, 1428614, 6406417, 10379227, 8078395, 1139556, -3425405, -2601506]
11085b601506J702899j755326k497647J638755M014217j29870n282119l509301
11077h419898L330243O273244K598900j141256l30737J061029j496452m917193
11069c042120l872886K48879K176785J574510K184595L830141K587108j195441
11061D491571k439320k06761K03935l258123m765603J00862O300288O332243J113237
11052G872329k323674j272701O90665P00343m02788j629150k998407k960746L47323
11043a976806M603530M771106L04410l422408k547587M10963J252248m7056r97988
11034B350412j057735j025595j77961K318893M441543L451541M10461j107086
11026I604473o69880j295706l443789l404153j1473J764216j658575n246550k099608
$$ y = [-2601506, -898607, -2653933, -5151580, -3512825, 501392, 371522, -4910597, -8419898, -5089655, 1183589, 3782489, 2641233, 2310496, 3371525, 1875073, -3042120, -6915006, -6666127, -4489342, -2914832, -730237, 3099904, 5687012, 4491571, 2052251, 1845490, 2049425, -1208698, -5974301, -5873439, 426849, 6759092, 7872329, 5548655, 4275954, 4966619, 5666962, 5264174, 3635024, 636617, -2324129, -1976806, 2626724, 7397830, 7702240, 4279832, 1732245, 2143208, 3395456, 3348400, 2350412, 1292677, 267082, 89121, 2408014, 6849557, 10301098, 10711559, 9604473, 8934593, 7638887, 4195098, 790945, 779472, 2543688, 885113, -4361437, -6461045]
11017f461045M758852N494955j242295n162940N0082O740795N463832k86996q48641
11008H506599L253258L059880k663288n122996q11790K322455j622932o616675
11000C04511m678031J750282M630216K270340n85173j011241L5999J293442J558131
10991E568476r79587n126519n477794K12435N670971L861712k559463m822912
10983c652681l27788N077148O350519M554731K532467P72390j136695k851864
10975A1318227m061902m307116k464499Q20490J762271j587059m621746j562092
10967d703426N252243P321496J880522l968944l203564J931457M059741P29148
10959I298673l522551l870333o89471K059674K029282O59177K29987K58364j354776
$$ y = [-6461045, -1702193, 3792762, 2550467, -2612473, -2562391, 4178404, 9642236, 9355240, 8506599, 11759857, 14819737, 12156449, 7033453, 6221663, 8544118, 6921186, 304511, -4373520, -2623238, 2006978, 4277318, 3692145, 2680904, 2716903, 4010345, 5568476, 4588889, -537630, -6015424, -5802989, -132018, 3729694, 1170231, -3652681, -3980469, 1096679, 7447198, 12001929, 14534396, 15306786, 14170091, 11318227, 7256325, 2949209, 484710, 1305200, 3067471, 1480412, -3141334, -4703426, 548817, 7870313, 9750835, 5781891, 2578327, 4509784, 8569525, 9298673, 5776122, 1905789, 1216318, 3275992, 5305274, 5964451, 6194438, 6452802, 5098026]
10950E098026m095161m608064j549765K170946L555135L104739K263475M02558
10942F341889k621270l736604n58518L674160L345776j828035o061845m774433
10934f218880K16509L411569J789871k281611l709492m25325L860548M104432
10926G47621M93479k262385j847838m97665J33684J266521K707072J649049j734614
10917F54924k832401Q8697K380007N15069k247450j963714l62651j99578L68308
10908c598789L150772M824438K615803J37950R85909J561616k232946n999129
10900A445624l232264L097643M612151N38597k542137k037581j159219n42067
10892A80747K599396O823244O513333N96291n598191p531042m811259J267259
$$ y = [5098026, 1002865, -3605199, -5154964, -2984018, 571117, 3675856, 5939331, 6341889, 3720619, -15985, -574503, 3099657, 6445433, 4617398, -1444447, -6218880, -6002371, -2590802, -800931, -3082542, -6792034, -7217359, -3356811, 747621, 1241100, -1021285, -2869123, -3366788, -3233104, -1966583, 740489, 2389538, 654924, -2177477, -2088780, 291227, 806296, -1441154, -3404868, -3767519, -3967097, -3598789, -448017, 4376421, 6992224, 7130174, 8116083, 9677699, 7444753, 1445624, -1786640, 1311003, 5923154, 6461751, 3919614, 1882033, 722814, 180747, 2780143, 9603387, 16116720, 16713011, 11114820, 3583778, -1227481, 39778]
10884C9778P309974P318892r5792o596937m220848K461208L460883p43438j635548
10875G298172J544778J415194k736769l421180M69140J201642k864867l492684
10867e86574J949128M567131m06386m593543p88113M850646L696854j657290l752524
10858C279329k476373j908822j487861R88131K888594J186049j335098j199029
10850f5080o30424k264943k875497N22149L554836J270362k497581q27751M548082
10841G34153N538044j3890n748790n936426j341289L713587N663832L576196j26555
10832F058862j800135j111813r24265j718015q26972J151003l99429n229306n780798
10823a0580868J203198P590559N285620j281264k294115K433678M630898J059141
$$ y = [39778, 7349752, 14668644, 14572852, 7975915, 3755067, 6216275, 9677158, 8933720, 7298172, 8842950, 10258144, 7521375, 4100195, 4569335, 5770977, 2906110, -586574, 1362554, 5929685, 5523299, 929756, 141643, 4992289, 8689143, 7031853, 3279329, 802956, -1105866, -2593727, -1605596, 1282998, 2469047, 1133949, -65080, -695504, -2960447, -5835944, -5313795, -1758959, -488597, -2986178, -3813929, 734153, 6272197, 6258307, 509517, -5426909, -6768198, -3054611, 2609221, 6185417, 6058862, 4258727, 3146914, 2222649, 504634, -322338, 828665, 429236, -4800070, -10580868, -9377670, -1787111, 3498509, 2217245, -76870, 2356808, 6987706, 8046847]
10815H046847l123453l638341j801180K30998K160036K809505M30048l308498
10807A805962m318547j900791L51798m7170j666698k179340j180837M54445J745798
10798f935380J945060J266869R05233J266797J296430M48299m02880q44134j430284
10789b483990j552343J77110K417008J724462j671735k841886O16091M299256
10781F83973L149363j531889m700131m405512k497486o15142J183753K926180
10773e806891M156546M192089K305450q88222k567029q07936K093468K769683
10765E447158K101502K880897L563666M65733m566928n863362l354668k487700
10757a813702m108143l107024J306135L339680J277401P24818L578212L831598
$$ y = [8046847, 4923394, 1285053, -516127, -285129, 1874907, 4684412, 5114460, 1805962, -2512585, -4413376, -4061578, -4108748, -5775446, -7954786, -9135623, -8681178, -6935380, -4990320, -3723451, -2818218, -1551421, -254991, 193308, -209572, -1053706, -2483990, -4036333, -3859223, -1442215, 282247, -1389488, -4231374, -3615283, 683973, 3833336, 2301447, -2398684, -6804196, -9301682, -9916824, -8733071, -5806891, -1650345, 2541744, 4847194, 3958972, 1391943, 584007, 2677475, 5447158, 7548660, 10429557, 13993223, 14458956, 9892028, 4028666, 673998, -1813702, -5921845, -9028869, -7722734, -4383054, -3105653, -2380835, 1197377, 5028975]
10749E028975p30676k974664J066592M229068O53630l458748j077832K334460
10741E070805j886051r514583q982843O02828Q575427Q326813L745637M65974
10733F404007o09411n15502K36098O28534K30489O85392K579031L064100K73589
10724A2976327k985051l727864l229600l122431j711490J390285K148063j153576
10716E84663l315366j82541L946527L112755j046884l330819l469726l851279
10708g552670l289903L2216L437114L953824L494564M026606K724619j778743
10700E047627m069423j40065M608237L283683j741612l828731k743977k325873
10692a910134k399735j033044o5006p37991Q36121O190546Q737499L867242j929511
$$ y = [5028975, 4298299, 1323635, 2390227, 6619295, 7272925, 3814177, 2736345, 5070805, 3184754, -6329829, -15312672, -14709844, -6134417, 2192396, 5938033, 6404007, 5794596, 5279094, 5515192, 6143726, 6374215, 7059607, 9638638, 12702738, 12976327, 9991276, 6263412, 3033812, -88619, -1800109, -409824, 1738239, 584663, -2730703, -2913244, 1033283, 4146038, 3099154, -231665, -3701391, -7552670, -10842573, -10810357, -7373243, -3419419, 75145, 4101751, 6826370, 5047627, 978204, 838139, 5446376, 8730059, 6988447, 3159716, 415739, -1910134, -4309869, -5342913, -5407919, -6145910, -5309789, 880757, 9618256, 13485498, 11555987]
10683A1555987j266335J888599L80481l039256k328643p26896l791378o416037
10675c743478j083646O389191M700750l393165n291516L05000K670097j527447
10667i74214m119857j388389R93671N55250J551360M029945K641009j692843j667905
10658g1973K964343M301281L53360k248047j259893j772973m201124k449459L201771
10649a182714M387483p72204l944153j093860J615370M14703J39874L204422M159727
10640F928648M35286k459791j523713j451425m276956m364181Q73870N147680
10632f90582L556978m21719k748661m333869m753026n69152N707727N576657j520107
10623a95754m970294N79041O441169M350125q69741j243118J210547M21462k339105
$$ y = [11555987, 10289652, 12178251, 12558732, 9519476, 7190833, 6463937, 2672559, -3743478, -4827124, 1562067, 6262817, 2869652, -2421864, -2116864, 553233, -974214, -5094071, -6482460, -5488789, -4933539, -3382179, 647766, 3288775, 1595932, -71973, 2892370, 7193651, 7547011, 5298964, 4039071, 2266098, -1935026, -4384485, -1182714, 3204769, 2432565, -1511588, -2605448, -990078, -575375, -435501, 2768921, 6928648, 7363934, 4904143, 3380430, 1929005, -2347951, -6712132, -5838262, -690582, 2866396, 2444677, -303984, -4637853, -9390879, -9960031, -4252304, 1324353, -195754, -5166048, -4587007, 1854162, 6204287, 5334546, 4091428, 5301975, 5723437, 3384332]
10614C384332k341941q09017j681757l353212j461930L111329N445424L602266
10606E895494l8311k273042j161428K518723M464129J338400l451645l641496
10598C650824J49556J230188k067259l803193n49130L577712M248089K239605
10590H676392n28283l388437l954741J2966M701966L858749r87164k341937O49964
10581F699475J117042k644560l758184P27313M113330J258224l269150l090133
10573A153357R50754L816574K810936j432928n659904n338246m19279K166662
10565a952074j744324n164072k79172P465578P368938J353860l04194K019475
10557H764015j109004q736640r272363j092709L924969N92393k433706K89907
$$ y = [3384332, 1042391, 233374, -1448383, -4801595, -6263525, -3152196, 2293228, 5895494, 5857183, 3584141, 2422713, 4941436, 9405565, 10743965, 7292320, 3650824, 3800380, 5030568, 2963309, -839884, -1389014, 2188698, 6436787, 8676392, 8148109, 4759672, 804931, 817897, 5519863, 9378612, 8391448, 6049511, 6699475, 7816517, 5171957, 1413773, 2141086, 6254416, 7512640, 4243490, 1153357, 2104111, 5920685, 8731621, 7298693, 1638789, -3699457, -4118736, -1952074, -3696398, -8860470, -9139642, -1674064, 5694874, 7048734, 6744540, 8764015, 7655011, -1081629, -10353992, -11446701, -7521732, -6929339, -9363045, -9073138]
10549i073138K734777R65293q6885J664021J125507k175868j720702K865583L978338
10540B76926J50400j920910j040258k259194l459943K046241R309456O729601
10532I832319k398875l605774L046048L389685l619438l917119L703590M193033
10524A0623469m479200o211912K586574N477389k901006o918169k92952K859885
10516G44078k785490l587318L660342L577146n642973n321435O868587R214048
10508F726985k242560l821091R190452R786636q658780j5096759J708195R471487
10500G064565o189331j1705296R134265J8988212k276908j4112577O558207J3303339
10492B0764476j8893110k7587265K2814141L8039927o8956901j93883110j51163948
$$ y = [-9073138, -6338361, -5373068, -5459953, -3795932, -2670425, -4846293, -6566995, -3701412, 276926, 427326, -1493584, -2533842, -4793036, -8252979, -6206738, 3102718, 9832319, 7433444, 3827670, 6873718, 10263403, 6643965, 2726846, 6430436, 10623469, 6144269, -67643, 2518931, 7996320, 5095314, -1822855, -2115807, 744078, -2041412, -5628730, -1968388, 1608758, -4034215, -9355650, -2487063, 6726985, 4484425, 663334, 9853786, 19640422, 10981642, -4115117, -2406922, 7064565, 875234, -10830062, -1695797, 17292415, 15015507, 902930, 7461137, 20764476, 1871366, -25715899, -2901758, 35138169, -33818732, -227701842, -378865790]
10485c78865790M5496137J77129051J21283612K384773k1053154K6094719L0289775
10478B759123j3480735k5545953N527784J8511885k446833j2087494M243046J1947171
10470a0572006n54241n154338O497453R667870j799945m827381N764709P552101
10462F574222n372025j1416731j804604O006196K147113j905521N30323J282000
10454c959027j830460q16798L087638N84676m854795j653018N978257L864810
10446D01283m753458l847038N395336O290777k390829m684642K485327M664406
10438C561162k006007m189985K799949O956606K530336j406529l93010j460978
10430F391544n826760m967597J389645K809855k153801k957734K419606L419187
$$ y = [-378865790, -333369653, -156240602, -34956990, -32572217, -53625371, -27530652, 2759123, -10721612, -36267565, -30739781, -12227896, -14674729, -26762223, -22519177, -10572006, -11126247, -16280585, -9783132, -115262, -1915207, -6742588, -977879, 6574222, 1202197, -10214534, -12019138, -6012942, -3865829, -5771350, -5241027, -3959027, -5789487, -6606285, -3518647, -2933971, -7788766, -9441784, -3463527, 401283, -4352175, -8199213, -2803877, 3486900, 1096071, -3588571, -1103244, 3561162, 1555155, -2634830, 165119, 7121725, 9652061, 8245532, 7852522, 6391544, 564784, -4402813, -3013168, -203313, -2357114, -5314848, -2895242, 523945]
10422E23945k443348m487190N42694K248574l031400m633522K325687P162052
10414a792508K290797m448207m582162j518966l07860J311804L910177J630249
10406c506676n735074q233211j033077P072682P609054M060190K698473K244254
10398E176615j47618j846435m88480J080564Q27878R16852J421594q89200m398046
10389A653724k695143L807028O150636P08005m868922l933670J02393J471630
10381B395681K42737j394309l059079k950472J359031O202986M386334l052072
10373D130837o626570k492680K558537K836472Q75754p6603j035199j714617M32922
10364a111147K990650M60561m397355k561239N130945O827241q55600n971254
$$ y = [523945, -1919403, -6406593, -5863899, -3615325, -6646725, -11280247, -8954560, -1792508, 498289, -3949918, -8532080, -10051046, -10358906, -9047102, -5136925, -3506676, -9241750, -17474961, -18508038, -11435356, -3826302, 233888, 2932361, 5176615, 5028997, 3182562, 2694082, 3774646, 4602524, 5519376, 6940970, 6051770, 1653724, -1041419, 2765609, 8916245, 9624250, 4755328, 821658, 924051, 2395681, 2638418, 1244109, -1814970, -4765442, -3406411, 2796575, 7182909, 4130837, -2495733, -4988413, -2429876, 406596, 1282350, 1205747, 170548, -1544069, -1111147, 1879503, 2340064, -2057291, -4618530, 512415, 7339656, 6484056, 512802]
10356E12802q17234N123164J409156o070247n756185P58200L140927m35059k493956
10347d628432N01663M419224N556340M398084K010581j224933l791784m047343
10339C193400k199597O76573L232415K775765j958606o376288m521206R93995
10331d183549J369114m061706n350932J936283Q081425L896296m586610n461031
10323h360710J185798M992048J563474k874125k426855J105506L095229K490909
10315G71274J313404J024818J182082O68220n05492j197080j399820k667420m389068
10306e199082k667549L150959O404376J911951m358644l001393L649028M750208
10298D639854j021890l136411K611512O501408J137654o463040o969816k989403
$$ y = [512802, -304432, 4818732, 6227888, 157641, -5598544, -4840344, -1699417, -2134476, -4628432, -4126769, 292455, 5848795, 10246879, 12257460, 11032527, 7240743, 3193400, 993803, 1670376, 4902791, 7678556, 5719950, -656338, -5177544, -4183549, -2814435, -6876141, -12227073, -10290790, -2209365, 1686931, -2899679, -8360710, -7174912, -2182864, -619390, -3493515, -5920370, -4814864, -1719635, 771274, 2084678, 3109496, 4291578, 4959798, 4454306, 3257226, 1857406, -810014, -5199082, -7866631, -4715672, 1688704, 3600655, -757989, -3759382, -110354, 4639854, 3617964, 481553, 3093065, 9594473, 10732127, 4269087, -2700729, -5690132]
10290e690132j967585k899670k89559M353889N058037J908241J56525J126959
10282A756705J601438N29888j70327j27237m77350p40260Q2691J208424K082679
10273E746651L719639N189679L013214k582885n791731l720514j437611l570415
10265E66027o220288l344782L313957P215948O453713L957138J226234k060570
10257A1107377m375530l741300j295713N16074J280174J235353k17706j947039
10249B561690j267094P09963o13218m696147m503686J995612O798725M176594
10241E162439j06936O30635K343793j266561n889510l628515K525878L471061
10233C242284m67711j314562J523864R16741l840410n358979j857054k77543l056129
$$ y = [-5690132, -7657717, -10557387, -10846946, -6493057, -1435020, 473221, 629746, 1756705, 3358143, 3888031, 3717704, 3590467, 3113117, 2372857, 2455548, 3663972, 5746651, 9466290, 14655969, 17669183, 15086298, 9294567, 5574053, 4136442, 566027, -5654261, -8999043, -5685086, 1530862, 7984575, 11941713, 13167947, 11107377, 6731847, 2990547, 1694834, 2210908, 3491082, 4726435, 4508729, 2561690, 1294596, 2004559, 1391341, -3304806, -7808492, -5812880, 985845, 5162439, 5055503, 5686138, 8029931, 6763370, 873860, -2754655, -228777, 3242284, 2774573, 1460011, 2983875, 3900616, 60206, -5298773, -7155827, -7433370, -10489499]
10224a0489499l423576J842626N673505K581750j797016j72530M347264L602433
10216B164957k476741n821054j953640M422437O320278L059494M8726J255953
10208G020410M032667K953079k280860o350165o319203n247409n321048l109704
10200a4622233L365932Q231812N549316n83095j939095Q91902P51509k795091
10192a149043k895191J679204L780321L88576k205813K80987K812228N44163k252648
10183I82784K71470M932606M104936k309033o670575m496862J24472Q56703k727486
10174d930985n169669k481351K184395K273474k663271n246445q39465M871419
10166a2001898M508842Q63685J590464M869863J631013p446763r576858Q29243
$$ y = [-10489499, -13913075, -12070449, -6396944, -3815194, -5612210, -5784740, -1437476, 2164957, -311784, -6132838, -8086478, -3664041, 2656237, 5715731, 5764457, 7020410, 11053077, 14006156, 11725296, 5375131, -944072, -6191481, -11512529, -14622233, -11256301, -3024489, 2524827, 1941732, 2637, 894539, 1646048, -1149043, -4044234, -2365030, 1415291, 1803867, -401946, -120959, 2691269, 3235432, 982784, 1254254, 6186860, 10291796, 7982763, 1312188, -3184674, -3060202, -2203499, -4930985, -10100654, -12582005, -10397610, -8124136, -10787407, -16033852, -16873317, -12001898, -7493056, -6629371, -5038907, -169044, 1461969, -5984794, -15561652, -14732409]
10158a4732409J1538355Q976785k852111r061193m213473L328595M936741J305425
10150g73285j529583J2993M138110N755426J844268m198210o013923k831063j51292
10141c746559o08613l99756K271143K578614j899060m831530j077824L502865
10133d210720J128739m364200l575941K500929M243946l13155l012162j79838
10125g782402K144646M49147m7495L691268N531230P29020m927027m203691L6787
10116d378517N59358k226034k614384k46751N27773j72298J870563N904695O067911
10107E292316J398809j843247k04363J665748p17092m156826l302056P30643K593880
10098A457812R25820q61354q20381p45989k050197l134620j967897R99620L422397
$$ y = [-14732409, -3194054, 5782731, 2930620, -6130573, -10344046, -7015451, -2078710, -773285, -2302868, -2289875, 1848235, 7603661, 9447929, 5249719, -764204, -3595267, -3746559, -4355172, -4754928, -2483785, 94829, -1804231, -6635761, -7713585, -4210720, -3081981, -7446181, -11022122, -8521193, -4277247, -4590402, -7602564, -7782402, -5637756, -5188609, -5236104, -1544836, 3986394, 4715414, -211613, -4415304, -4378517, -3819159, -6045193, -8659577, -8906328, -8378555, -8550853, -6680290, -775595, 5292316, 6691125, 4847878, 4643515, 6309263, 5592171, 1435345, -1866711, -1136068, 1457812, 2383632, 1522278, 701897, -44092, -2094289, -5228909, -7196806, -6197186, -2774789]
10089b774789L278507L05950l565727n235320l039392J571546N481899O453471
10081B476145L939659q82190m721725m016611N66680L433831Q48639l377681k882101
10072d615354J915151M493009K094718p68689j68484J450495M22090j868751k013711
10063I40474m83374q6919r03010j013307n25879p57586q03821J012887L295487
10054F74952L109121O55617j202259j322985p48930P9499Q86083j31162l187201
10045a187265l908787R46106O228099L976174l907609o771409p72186N252997
10037a43880L433051j839019k508501J94755l07463l719485l835092L03819L124627
10028e297188K287685J518945K453493J376810l043913n478171j731966M010776
$$ y = [-2774789, 503718, 809668, -2756059, -7991379, -11030771, -9459225, -3977326, 2476145, 6415804, 5533614, 811889, -3204722, -2638042, 795789, 1644428, -1733253, -4615354, -2700203, 1792806, 3887524, 3118835, 2950351, 4400846, 4822936, 2954185, 940474, 457100, 370181, -532829, -1546136, -2072015, -2829601, -3633422, -2620535, 674952, 3784073, 4439690, 3237431, 1914446, 1165516, 1245015, 2131098, 1999936, -1187265, -5096052, -4149946, 2078153, 6054327, 2146718, -4624691, -5396877, -143880, 3289171, 1450152, -1058349, -863594, -1171057, -4890542, -8725634, -8421815, -5297188, -3009503, -1490558, 962935, 2339745, -704168, -6182339, -7914305, -3903529]
10020c903529M632926j88044m276103l409290M78479L022443K316062m7877j067418
10011b442351M35052J996206K62199l657018m177557J183843O900166N990267
10003F490807j31947l365536m62994K737193P33036l314429l146257N01862J529168
9994A570903j295794k531413N12266K999921M70393l697058l503993M93197K661005
9985b320573R56840j387605k001976j761585r99573J290849L585841K413570j467031
9976a691243k467738J686983N768372M339679n42646k765543n10840K616245K918027
9967I351296p7003m044954n317171j920352L042865L977382N17595j536178M73274
9958D466754J357112k793193o611113l565953K606136L286444j132808k391702
$$ y = [-3903529, 729397, 541353, -3734750, -7144040, -6665561, -3643118, -1327056, -1374933, -2442351, -2007299, -11093, 251106, -3405912, -7583469, -6399626, 500540, 6490807, 6358860, 2993324, 2530330, 5267523, 6000559, 2686130, -460127, 41735, 1570903, 275109, -2256304, -1744038, 1255883, 1726276, -1970782, -5474775, -4981578, -2320573, -1363733, -2751338, -4753314, -6514899, -7514472, -6223623, -2637782, -224212, -1691243, -4158981, -2471998, 3296374, 7636053, 7093407, 4327864, 3817024, 6433269, 9351296, 9274293, 5229339, -87832, -2008184, 1034681, 5012063, 5529658, 3993480, 4466754, 5823866, 3030673, -3580440, -7146393, -4540257, -1253813, -2386621, -4778323]
9950d778323J653317M249241J872525o34007L55027J551649M06317J89439K693109
9941G558294L285834j185201n901674n328213j456774R69323K095813L518632
9933C556034K372802l682606r492170q288167j948167K160576K403792L015670
9925i902236M438185K269845l501698o406990l040186J903459L050197J321839
9917i867585L16381M47668M28110R99562L126817M693504K917234q67037k281139
9908h6485O2121K440463J181204k158483l181116j264561k59521j842406k472974
9899g581758J29991J964914n76997l117422p1984M043305L48708q379167r668492
9890b2908902j024500N610960L309120J26548K810658M880224N06821l914289
$$ y = [-4778323, -3125006, 1124235, 2996760, 2362753, 2717780, 4269429, 4675746, 4865185, 7558294, 10844128, 9658927, 3757253, -1570960, -3027734, -2058411, 37402, 3556034, 5928836, 2246230, -7245940, -15534107, -17482274, -15321698, -12917906, -9902236, -5464051, -3194206, -6695904, -13102894, -16143080, -14239621, -11189424, -9867585, -9551204, -9103536, -8675426, -7675864, -4549047, 144457, 3061691, 2194654, -86485, -24364, 2416099, 3597303, 1438820, -1742296, -3006857, -3266378, -5108784, -7581758, -7451767, -5486853, -6063850, -9181272, -9253256, -5209951, -4861243, -13240410, -22908902, -23933402, -18322442, -15013322, -14886774, -12076116, -7195892, -6689071, -10603360]
9882a0603360l547394n479208j1611715q736736N354261N689825k1035955l8578361
9874h8548643l014657O3244057Q6245181L8461610k2720299l4855069q333808
9867C0478372O270735m649696j3926464p373203J086894K028247K079500K687845
9859A8682230k838425r502764m376440P817799Q195927m277553r438211M06362
9851D668925Q381164K750831m834954k171546L283829Q16798m248412k589898
9843F056737J462888q01734n989079n272955K48031L083018K142099J673311K534027
9834E136343K885823K823765K137110r44811m316237k755583K056475J890464
9826H913349l479936m010129K555520M314212m240158r884649j558470R680182
$$ y = [-10603360, -14150754, -19629962, -31241677, -39978413, -34624152, -28934327, -49970282, -88548643, -91563300, -28319243, 57925938, 96387548, 73667249, 38812180, 30478372, 36749107, 32099411, 18172947, 10799744, 11886638, 13914885, 15994385, 18682230, 15843805, 6341041, 1964601, 9782400, 17978327, 13700774, 4262563, 4668925, 13050089, 15800920, 10965966, 8794420, 12078249, 12895047, 8646635, 6056737, 7519625, 6717891, 728812, -4544143, -4296112, -1213094, 929005, 2602316, 5136343, 8022166, 10845931, 12983041, 12038230, 7721993, 4966410, 7022885, 8913349, 5433413, 1423284, 3978804, 8293016, 4052858, -5831791, -7390261, 2289921]
9818B289921P438751l845673p263923m71951M141786J901259M5435J066520o57134
9809D644991m833833l891927K100420L659572j827586n389115j930371J991629
9801e476220O75488j666792o5386K604667K246331Q42239J307821J657044k94303
9792A830889j971919p06093J287040Q65553r76688j560708p70598r7999j18053
9783b218576n57838n28711J429876M721018N345961J195102l227241k675824L84849
9774C868616q2885l028254k055593K946860N034698J770772j443084j233944p40504
9765E036682k038452k555511j567036j943511k864528M68232O846105Q000857
9757I382838J441541m851226n071166l460822m145597k992459L113238P935859
$$ y = [2289921, 9728672, 5882999, -1380924, -1852875, 2288911, 4190170, 4235605, 5302125, 4644991, -188842, -4080769, -1980349, 1679223, -148363, -5537478, -7467849, -5476220, -4800732, -6467524, -6532910, -3928243, -1681912, -839673, 468148, 2125192, 1830889, -141030, -847123, 439917, 1305470, 328782, -1231926, -2002524, -2100523, -2218576, -2776414, -3305125, -1875249, 2845769, 8191730, 9386832, 6159591, 3483767, 3868616, 3785731, 757477, -1298116, 1648744, 6683442, 8454214, 7011130, 5777186, 5036682, 2998230, 442719, -1124317, -3067828, -5932356, -5464124, 1381981, 9382838, 10824379, 5973153, 901987, -2558835, -6704432, -9696891, -6583653, 1352206]
9749A352206N466636K51446o69679P61789o19979k544029n89119J458552k330663
9740B537160p610524m956716M563032J0012628O254533p94003m541254m356561
9732A108295j608081K400827L944311J68216m634567l498548K353896M847055
9724E081404J345366k553925k944450j774479k61512K749177M329691q09505r317913
9715d156146j0093951p08370P028367M200834k007622p04245N288664N228605
9707D076136j483348m818703k59171N189365M319994j276468n665820n606492
9699e524507j133240N365917Q685417M526872l975971p988086l803827K206098
9691a641327K485383j728704l375672J24776M269486M475748J524814q26811q67913
$$ y = [1352206, 6818842, 7070288, 6400609, 7162398, 6542419, 3998390, 3409271, 4867823, 2537160, -5073364, -10030080, -5467048, 4545580, 10800113, 10006110, 5464856, 1108295, -499786, 1901041, 5845352, 6013568, 1379001, -2119547, 234349, 5081404, 6426770, 3872845, 928395, -846084, -1107596, 1641581, 5971272, 5161767, -4156146, -14250097, -14958467, -7930100, -3729266, -5736888, -6441133, -1152469, 4076136, 2592788, -2225915, -2485086, 2704279, 7024273, 5747805, 81985, -5524507, -6657747, -1291830, 7393587, 11920459, 7944488, -43598, -3847425, -1641327, 844056, -884648, -4260320, -4135544, 133942, 4609690, 6134504, 5307693, 4439780]
9682D439780j09512p11314k801078m167208k683082P38666K577487J094160r08870
9673b530971K93060L741924M677124J335786k241954j794318J435425L074175
9665G990251J822580J59776k01199k07713p38926j042068p25111q76410k083215
9656D097965l124025k619010p27523J170919J317415j329799m876199m566461
9648a0656718J399652O989997M462128m135069p888810j953637N152214M090402
9640b539841j654289k220149K793350M426791p01178n137499k453974L501376
9632c985413N154166J406232k916395l995182j766289J471121K492363k16276
9624b355673l417625j960816L616489O446175K774984k488507l282618r76807
$$ y = [4439780, 4330268, 3618954, 817876, -3349332, -6032414, -5293748, -2716261, -1622101, -2530971, -2237911, 1504013, 6181137, 7516923, 5274969, 3480651, 4916076, 7990251, 9812831, 9972607, 9771408, 9563695, 8824769, 7782701, 7057590, 6181180, 4097965, 973940, -1645070, -2372593, -1201674, 115741, -1214058, -6090257, -10656718, -9257066, -2267069, 2195059, -1940010, -9828820, -11782457, -6630243, -2539841, -4194130, -6414279, -3620929, 805862, 104684, -5032815, -7486789, -3985413, 1168753, 2574985, -341410, -4336592, -6102881, -4631760, -2139397, -2355673, -5773298, -7734114, -4117625, 2328550, 5103534, 2615027, -667591, -1644398]
9616a644398m93376j597947l38197K914289L557806O44271j432584j05555J736977
9607C241286R94927j079740j635014j68129K166084M254624M328695N42711n656860
9598F988584r322013p448039k548146J230269L177754M585991M552552J113109
9590B330061m185547o729430m579611q78120O53539L08936Q57297L062292M866177
9581d294406M570014K940474J660041Q30997r57885m144934o567185n229762n8941
9572a1251587M948270N667539K821888J110266K541709L058237j490952p726366
9564c20996p727232k42469O178279M364446j519477k418186K108576L940192k86563
9555D076570l726907k33366N840268O066792q7084n736976o638637m718045k459920
$$ y = [-1644398, -2137774, -3735721, -4073918, -1159629, 2398177, 3042448, 1609864, 1504309, 3241286, 4236213, 3156473, 1521459, 1353330, 3519414, 7774038, 12102733, 12645444, 6988584, -2333429, -9781468, -12329614, -11099345, -7921591, -3335600, 1216952, 2330061, -1855486, -8584916, -13164527, -14042647, -13389108, -13080172, -12222875, -9160583, -4294406, 275608, 3216082, 4876123, 5707120, 4749235, 604301, -5962884, -11192646, -11251587, -6303317, -635778, 2186110, 3296376, 5838085, 8896322, 7405370, -320996, -8048228, -8290697, -2112418, 2252028, 732551, -1685635, 422941, 4363133, 4076570, 349663, 116297, 5956565, 12023357, 11936273, 6199297, -439340, -5157385, -7617305]
9546g617305L21920L421283M825505L820288J931176j93794l279210n876811m363345
9537g010293J522072O528301N847076Q92906l072074l113856m69247J909208J694120
9528D728213j317234m286572l475141J092469M778703L843440J11679j766026
9520C709531k07179K195024K363173k60800l546563m264754j033491L326803M131654
9511F413398O89081k421834j564589J060472J260287p89275j472267L15355J708711
9502E199339K23978l061447m872834k893531J860919M992478K827407k317921
9494A958388l799950N08072M661031L175613q45077j169265J372938R85153k560051
9485D286852l285097O50457L541730J345416k314123k780113j477404k064425
$$ y = [-7617305, -7295385, -3874102, 951403, 4771691, 6702867, 6509073, 3229863, -2646948, -7010293, -5488221, 1040080, 6887156, 7780062, 4707988, 1594132, 1124885, 3034093, 4728213, 3410979, -875593, -4350734, -3258265, 1520438, 5363878, 5475557, 3709531, 3502352, 5697376, 8060549, 7799749, 4253186, -11568, -1045059, 2281744, 6413398, 7102479, 4680645, 3116056, 4176528, 5436815, 4647540, 3175273, 3490628, 5199339, 5423317, 2361870, -2510964, -5404495, -3543576, 1448902, 4276309, 1958388, -1841562, -1333490, 3327541, 6503154, 5658077, 4488812, 5861750, 6846903, 4286852, 1001755, 1652212, 5193942, 6539358, 4225235, 1445122, -32282, -2096707]
9477b096707l581416k225712K232508N816538N265024J270678k303070j508919
9469B868924L496613O911839L016022n751667j0330186o232842J043391M179020
9461g98886L073194K054249K106048R13819j632554k929248j855195K06469J866197
9452C004093K394372J006281j776766l303175j962288J89444M30514p70458j524640
9443b312623j973268k757621k224554R28419L908223L011886m78861j879151m1145
9434c818695J550761O55659q54186p55902L40390P74918L53562k2358K15846P14622
9424h45383L34775j456926k795471r61086L225051N415897L921508K177544K296942
9415A1312851Q22683m396510p839138l882090K685885K459366l712192n309691
$$ y = [-2096707, -5678123, -7903835, -5671327, 145211, 5410235, 6680913, 4377843, 2868924, 6365537, 13277376, 16293398, 10541731, 211545, -6021297, -4977906, -798886, 2274308, 4328557, 6434605, 7348424, 5715870, 2786622, 931427, 1137896, 3004093, 5398465, 6404746, 4627980, 1324805, -637483, -448039, -17525, -787983, -2312623, -4285891, -7043512, -9268066, -8339647, -4431424, -1419538, -1898399, -3777550, -3818695, -2267934, -1612275, -2466461, -3222363, -2881973, -2107055, -1753493, -1775851, -1560005, -845383, -510608, -1967534, -4763005, -5724091, -2499040, 2916857, 6838365, 9015909, 11312851, 12135534, 7739024, -100114, -3982204, -1296319, 1163047, -2549145, -7858836]
9407g858836J447877P518852M947047j718937l600208n65632P60984j829174l836981
9398d735008j684454K702765N174898L979778P77225j318467q47041M02180o2129
9389D389747j577910j308189J085780K853742K459419J010431q97025l652269
9381D363726n355879k942934J958450L395899l94522l882739k529817R11227K061715
9372b414874J914748L394866N042319L510796n34102l970955o061909p020295
9364f139406m708915J630833O748187M879529j173664k794346K492652P696558
9356H631428O165967l61038n495803o046463l691080j327956j23413O22602J843319
9347B17563L064657K959238J648633O96316J78639j525995l690490k645454K088961
$$ y = [-7858836, -6410959, 1107893, 6054940, 4336003, 735795, 170163, 931147, -898027, -4735008, -6419462, -3716697, 1458201, 5437979, 6215204, 4896737, 4049696, 4451876, 4389747, 2811837, 1503648, 2589428, 5443170, 7902589, 8913020, 8015995, 4363726, -992153, -3935087, -1976637, 1419262, 1024740, -2857999, -5387816, -4476589, -2414874, -500126, 2894740, 7937059, 11447855, 10913753, 6942798, 880889, -6139406, -10848321, -9217488, -2469301, 2410228, 1236564, -1557782, 934870, 8631428, 14797395, 14436357, 8940554, 2894091, -796989, -2124945, -2248358, -1625756, 217563, 3282220, 6241458, 7890091, 8586407, 8765046, 7239051, 3548561, 903107, 2992068]
9338B992068N028224K199519k278837k451466j16015j275972n061448m502134
9330e466061J348672M554259L49022n296800m732443M16357L038684J611787J121129
9321c055394L933794N573453J388441n953629q630966k975484N569392Q355018
9313D204625L560529k246225l037799m68205J63034k124586l990223l670790k369642
9304i979282q17176J098987J959520N75002n10801J789869M898286L279782k379388
9295h5201n008966j533844K909895L426616J805034J310315R88742o59166j558636
9286A594789k55355L88901j551110k639455j12479K220176K96517k197154L62845
9277a892325M951963L889454j997788l676250J640879N514771J199251o200989
$$ y = [2992068, 8020292, 10219811, 7940974, 5489508, 5373493, 4097521, -963927, -5466061, -4117389, 436870, 785892, -4510908, -9243351, -8826994, -5788310, -4176523, -3055394, 878400, 6451853, 7840294, 1886665, -6744301, -9719785, -4150393, 4204625, 7765154, 5518929, 2481130, 2012925, 2175959, 51373, -3938850, -7609640, -9979282, -10796458, -9697471, -7737951, -7162949, -7673750, -5883881, -985595, 2294187, -85201, -5094167, -6628011, -3718116, -291500, 1513534, 2823849, 3812591, 3153425, 1594789, 1339434, 1728335, 177225, -2462230, -2574709, -354533, -58016, -2255170, -1892325, 3059638, 6949092, 4951304, 1275054, 2915933, 8430704, 9629955, 3428966]
9269C428966p716377k983929J377218K288417K554804L775677L042532j602750
9261D164558o380783n572739R51935O640305N566806o64471n128491l967800J22518
9252d268162K911702L336787J555897l133299q501974p771876J877075J1782815
9244b211035J0565939j17673o885881k924055L752567L685970j044391l168076
9236A653365k208736k204749k623531k60623K892848K232670q45505j187977N74539
9227a977699n28990l356492j358222N058523P016661J396219l245031m41745L533170
9218F096394M55207n862526n917896L2222L186522O34276j537453K72057J804231
9209h36966o94018m123392l875936l02705L183061M621145L871558J706599Q2013
$$ y = [3428966, -4287411, -7271340, -5894122, -3605705, -1050901, 2724776, 5767308, 4164558, -2216225, -7788964, -6837029, -196724, 5370082, 4705611, -422880, -4390680, -4268162, -1356460, 1980327, 3536224, 402925, -8099049, -15870925, -13993850, -2211035, 8354904, 8237231, 1351350, -1572705, 2179862, 5865832, 4821441, 1653365, -555371, -2760120, -5383651, -5644274, -2751426, -518756, -1364261, -2552238, -1977699, -2506689, -5863181, -7221403, -2162880, 4853781, 6250000, 3004969, 2563224, 6096394, 6551601, 689075, -5228821, -5196599, -2010077, -1375801, -2913254, -2641197, -836966, -1530984, -5654376, -9530312, -9833017, -6649956, -2028811, 1842747, 3549346, 3631359]
9200C631359L66841O72277j630124m644075l717377R71756L782391K013233l58959
9191A087322L54479J953241R07678j770458k702239r21597K262931N027537M775285
9182A0974179J89566m657839l480637K466025M042899k556122r048326p136751
9174i207006p18077J445405n24317l93305J862839R27345k613884k347020K636386
9165h931634O033355M822573K563728J124669j783265n010772l327062K584903
9157a923505M660978J06697l323847J14557M823762L654494o11623j470975j84165
9148E846373k205736o317898o183048o05055N308004P760679O719637K667518
9140A2990474k834095n342769k667249K25368j973157n524696k860461M474964
$$ y = [3631359, 3998200, 4670477, 3040353, -1603722, -5321099, -4349343, -566952, 1446281, 1087322, 1441801, 3395042, 4302720, 2532262, -169977, -1091574, 1171357, 6198894, 10974179, 11163745, 6505906, 3025269, 5491294, 9534193, 6978071, -2070255, -9207006, -9925083, -8479678, -9003995, -9397300, -7534461, -6607116, -9221000, -11568020, -8931634, -2898279, 1924294, 4488022, 5612691, 3829426, -1181346, -4508408, -1923505, 2737473, 2844170, -479677, -365120, 4458642, 8113136, 7501513, 6030538, 5846373, 3640637, -2677261, -8860309, -9465364, -4157360, 3603319, 10322956, 12990474, 10156379, 4813610, 2146361, 2371729, 398572, -5126124, -7986585, -3511621]
9132c511621P084977K052578l051160k263283J165448K260325J636585J260403
9124F634252k87547l420783m012814M49468N420143N063071K29133l718981m058323
9115B297619j670298K028896M917922L830415j257046n225158m147944r27887
9107a53481k85766j280571k19113J853920J208296q54369K27094L266255K070687
9098E832952l612552n993381j264330L783431K249123k129880j559270K989752
9090B95845L745958r07724l932476j119132K465450R11687l412980m156397q71007
9081f980776J119646l39087j034964K478556O870679O332210P30280m114139m029055
9072A033350j180484q2599j485761k521577j545704N9018R00022J608980K764660
$$ y = [-3511621, 3573356, 5625934, 2574774, 311491, 1476939, 3737264, 5373849, 6634252, 6346705, 2925922, -1086892, -637424, 4782719, 9845790, 10074923, 6355942, 2297619, 627321, 2656217, 7574139, 11404554, 10147508, 4922350, 774406, -153481, -439247, -1719818, -1938931, -85011, 1123285, 268916, 496010, 3762265, 5832952, 2220400, -3772981, -5037311, -1253880, 995243, -1134637, -2693907, 295845, 4041803, 3134079, -798397, -1917529, 547921, 1459608, -1953372, -6109769, -6980776, -5861130, -6200217, -7235181, -4756625, 2114054, 8446264, 9176544, 5062405, 1033350, -147134, -229733, -1715494, -4237071, -5782775, -5723757, -4823735, -3214755, -450095]
9063d50095L092463J653756J94008Q41925K371645J637060j303294k660088o51868
9054D725512J249380o92265m424801m648736o76332K338719J021786j261974J32567
9045b236144L542205L193272j781510n218483k313952L569615N402245J560017
9037E717265l026775l926531j939026l09524j20522m3377Q62618J740754J113218
9028F8100j057322k543176q91632K879882M063344j2095n132379m603995J510379
9019e718894N799809L516994j238025k227148J14347J045087k78507o43932L79234
9010G48965n09037l717846m677805p15289M123172M278471K02794k434541n7112
9001b758228M591591N595086N12705o218074p440057j815799L672489K410670
$$ y = [-450095, 2642368, 4296124, 4490132, 5332057, 7703702, 9340762, 8037468, 5377380, 4725512, 5974892, 5282627, 857826, -3790910, -4467242, -2128523, -1106737, -2368711, -2236144, 1306061, 4499333, 2717823, -2500660, -4814612, -1244997, 4157248, 5717265, 2690490, -1236041, -3175067, -3484591, -3605113, -3648490, -2785872, -1045118, 68100, -989222, -3532398, -4424030, -1544148, 2519196, 2507101, -2625278, -7229273, -5718894, 80915, 3597909, 2359884, 132736, 247083, 1292170, 1013663, 369731, 748965, 239928, -3477918, -8155723, -8871012, -4747840, -469369, -266575, -2701116, -2758228, 1833363, 7428449, 7941154, 1723080, -5716977, -7532776, -3860287, -1449617]
8993a449617k688490l364109J679122M992911K090273j905106r81439K339139
8985G12684J910365j867616l350092j046381P31125o76006k708697k287985K03440
8976h379163K690594L897619L255867R95071j150764j528608p97084m55909L3224
8967a439153J832287L377405K162475m23109j90852L268309N152774K178087k698986
8958A3219237m499351k648521p34853j323182l315557m134233k943002j150199
8950g529661p8938R18639K858099M256034K547647j084520j843222J742268M760359
8941F546705L037844m39249p66470O97086o20051l808523l862176n12954J663481
8932A935693J624615K652592M341187K109193l534099n738027k398203j03407
$$ y = [-1449617, -4138107, -7502216, -5823094, -830183, 1260090, -645016, -1626455, 712684, 2623049, 755433, -2594659, -3641040, -2909915, -3585921, -6294618, -8582603, -8379163, -5688569, -1790950, 1464917, 2459988, 1309224, -219384, -1016468, -1472377, -1439153, 393134, 3770539, 5933014, 5509905, 5319053, 8587362, 13740136, 15918223, 13219237, 8719886, 6071365, 5336512, 4013330, 697773, -3436460, -6379462, -7529661, -7608599, -6689960, -3831861, 424173, 2971820, 1887300, 44078, 1786346, 6546705, 9584549, 9145300, 8378830, 9075916, 8455865, 4647342, 785166, 272212, 1935693, 3560308, 6212900, 10554087, 12663280, 9129181, 3391154, 992951, 889544]
8924H89544k728095m471234k44096M782632L689261o01622j079708J054269k60787
8915A030164l554850j580717N186445P396821J202661n362993m237067J698111
8907A778575M337666J654607k124324m115644m908682m514808j448135L333600
8899f007145N402104K094873l118443m354753j080789J078975j376466m288172
8891a1649816k196129K675791L689248Q33514R37002N597716P178298J014446
8883H080070n889120m795799J944203N482326L547133Q99203k86102k111522m449736
8874B420656m515117k417382n10999J673327N214244O489283J942189l699814
8866F596387l089741J269255P82305l648160k479190M447668N116178m195887
$$ y = [889544, -1838551, -6309785, -6553881, -1771249, 1918012, 1316390, 236682, 1290951, 1030164, -2524686, -4105403, 1081042, 8477863, 9680524, 4317531, 80464, 1778575, 6116241, 7770848, 5646524, 1530880, -3377802, -7892610, -9340745, -6007145, -605041, 1489832, -1628611, -5983364, -7064153, -5985178, -7361644, -11649816, -13845945, -11170154, -7480906, -6647392, -5710390, -112674, 7065624, 8080070, 2190950, -2604849, -660646, 4821680, 8368813, 9268016, 8981914, 6870392, 2420656, -2094461, -4511843, -5022842, -3349515, 1864729, 8354012, 10296201, 6596387, 3506646, 4775901, 5558206, 1910046, -569144, 3878524, 8994702, 4798815]
8858D798815j0106966k935244O659060M418567m483093m528270M641312Q695910
8850G160091K375643l864379k669431m939j726128l171609M49314L864417Q76292
8841C289271m039949k777637K946857M652112O28011k621205j353582J265078
8833A988956K237332K415107J801410j793814o859342p238896q60534N665034
8825b644747N576512J005247j330865o03J227323Q63796O85344L94283j950128
8816C826162m123030j492523M044997M453002j903860n662068J17581Q566378
8808G826639Q603054J024442l939453k325170O5247o97100j475070l81968j096615
8799G604006m977818o586748k122135L805717N138851K962876J669265J176481
$$ y = [4798815, -5308151, -8243395, -1584335, 2834232, -1648861, -6177131, -1535819, 7160091, 9535734, 5671355, 3001924, 2996985, 1270857, -1900752, -1451438, 2412979, 3289271, -750678, -3528315, -581458, 4070654, 4698665, 2077460, 723878, 1988956, 4226288, 6641395, 8442805, 6648991, -210351, -7449247, -8309781, -2644747, 2931765, 3937012, 2606147, 2605544, 3832867, 4696663, 5382007, 5776290, 3826162, -296868, -1789391, 2255606, 6708608, 4804748, -857320, -739739, 7826639, 16429693, 17454135, 13514682, 11189512, 11254759, 10557659, 9082589, 8700621, 7604006, 2626188, -3960560, -6082695, -2276978, 2861873, 5824749, 7494014, 8670495]
8791H670495q19026k470018m84531K873215K120140k818533o145077m349115J33258
8782c289192L511188M329184K438228j237653l487434j645255J813414J796857
8774D229337j585327k532420J409343M712591J709489m563190n981879m17485
8766c019541N217796L756211l370084q001023m929991K328465O149059L781403
8758A912295l60840j300852M81330J389648O08456L33444J136674R08048j053641
8749D054562k225299p01515J565363J417399j020884k585509j388296P66623O56457
8740E38901k440794n649650n371232j044446M290264P069783O200514L026134
8732F619474m41605k602661k727500j469136l64370j30947j61077q2673m77464
$$ y = [8670495, 7851469, 5381451, 4896920, 7770135, 9890275, 7071742, 926665, -3422450, -3289192, 221996, 4551180, 6989408, 5751755, 2264321, 619066, 2432480, 4229337, 2644010, 111590, 1520933, 6233524, 7943013, 3379823, -2602056, -3019541, 2198255, 5954466, 2584382, -5416641, -10346632, -8018167, -1869108, 1912295, 1551455, 250603, 731933, 2121581, 2730037, 3063481, 4200155, 5108203, 4054562, 1829263, 1127748, 2693111, 4110510, 3089626, 504117, -884179, -117556, 538901, -1901893, -7551543, -12922775, -13967221, -9676957, -2607174, 3593340, 6619474, 6177869, 3575208, 847708, -621428, -985798, -1116745, -1277822, -1360495, -1837959]
8723a837959j308957j250166K34766J661958J663830P52681l12766j810646k978056
8714e185315j218167L858193P881968O719636K302744l37462l68846j016365l008602
8705I627784l346666j072473O98008j955j000316j58102J163545J022743J48097
8696G080665n9186k04512j348390k797098l215588k188300K82212L511725M823063
8687E884591J867472k790851l579435r0108J530026j796800m505428j220603L894863
8678h06273L483301q96406j356182L097976N039278J233910k315220j250201l19347
8669E910836m235427q110195m933787K023220L456702j226533k990973K105480
8661h000677O547577L540564k310839k731944J386040K567285p74313k657034
$$ y = [-1837959, -3146916, -4397082, -4162316, -2500358, -836528, -83847, -396613, -2207259, -5185315, -6403482, -2545289, 5336679, 12056315, 14359059, 14021597, 13652751, 12636386, 9627784, 6281118, 5208645, 5906653, 5904698, 4904382, 4746280, 5909825, 6932568, 7080665, 7021479, 6816967, 5468577, 2671479, -544109, -2732409, -2450197, 1061528, 5884591, 7752063, 4961212, 1381777, 1291669, 2821695, 1024895, -3480533, -4701136, -806273, 2677028, 1780622, 424440, 3522416, 8561694, 9795604, 7480384, 6230183, 5910836, 1675409, -6434786, -11368573, -9345353, -5888651, -7115184, -10106157, -8000677, -1453100, 2087464, -223375, -2955319, -1569279, 998006, 223693, -2433341]
8653b433341q1096K465592J068204j515564j285689N00677N16833o54935l69182
8644a788501Q06124L94145r91350o19915J199878J509707P3192j52652J579745
8635B010373K323087N82831j132900p73669o4169r23911j786844m98593J631804
8626A368009K008573J166284J495275K681938K133962k94491j705271r99882q64553
8617F989844l112400m898910k594014K071961L458660l542k856789r36N415743
8608D469617N475636j417107p319963m799895L101363O712989K063001m855339
8600C430302o422832k132853K776881M542764L836590K664963J311878q35418
8592I172275l095214l729575k288282m34125L31301P57573K189509L597017K696274
$$ y = [-2433341, -2514437, -48845, 1019359, -496205, -1781894, -1281217, -764384, -1419319, -1788501, -982377, -588232, -1579582, -2199497, -999619, 510088, 583280, 430628, 2010373, 4333460, 4916291, 3783391, 3009722, 2945553, 2021642, 234798, -263795, 1368009, 3376582, 4542866, 6038141, 8720079, 10854041, 10559550, 8854279, 7854397, 6989844, 3877444, -1021466, -3615480, -1543519, 1915141, 1911599, -945190, -946126, 4469617, 9945253, 8528146, 1208183, -3591712, -490349, 6222640, 8285641, 3430302, -2992530, -5125383, -2348502, 2194262, 6030852, 8695815, 10007693, 9172275, 6077061, 2347486, 59204, -374921, -43620, 713953, 2903462, 6500479, 9196753]
8583I196753J2003j300941o19226j225050m377961n793724j766152M249757N941269
8574D316728K964451K02214m83436j799011m362633m618302r39281L224571M211810
8565B717111K093875j501359n185521o319161k656523K910536M392954J420748
8557b127340K95879L763802O052489K292655l160914l586425k15328R02594j164228
8548C053184k354955j509644j332153k322618j821288Q72862L302047L728929
8540A616364K302636p56002m158655m294353L00701M687020L108196k209016l704758
8531c107867M66112M278612L310687K02842r45031k3741J500982L513373N014967
8522A4210936L152078k373893o965001o173191j171870K914190K647495j028501
$$ y = [9196753, 9208756, 7907815, 7288589, 6063539, 1685578, -4108146, -5874298, -1624541, 4316728, 7281179, 7483393, 6999957, 5200946, 838313, -3779989, -4719270, -1494699, 2717111, 4810986, 3309627, -1875894, -8195055, -10851578, -7941042, -3548088, -2127340, -1831461, 1932341, 7984830, 10277485, 7116571, 3530146, 3314818, 4217412, 3053184, 698229, -811415, -2143568, -4466186, -6287474, -5414612, -2112565, 1616364, 3919000, 3162998, -995657, -5290010, -4989309, -302289, 2805907, 596891, -3107867, -2641755, 1636857, 4947544, 5150386, 4205355, 4181614, 5682596, 9195969, 14210936, 17363014, 14989121, 8024120, 1850929, 679059, 3593249, 6240744, 5212243]
8514E212243m274520l835561l39827K095938J104730m12135J312807M700919N077385
8505A0641979J934355r15083j846224k688468l509351k090989N38833K52672k780347
8496d62623l089672J116225M157128J705182k341498k389174L99106J416366L54087
8487H65127l2949O7412j384452k947690j163750L076276M556018Q25004m197275
8478c36279m748054M44690O733036P749614J771463n756633p720169l561877O61138
8469d763071P83751q37865n79912J070844K104432K812573L573566K441888j257834
8460E348372m113289l237635p28268K05187L06318J394189J934374L19729p38123
8451F90854J396550L448695R41151l657576m205368o53550J535961P94612O98331
$$ y = [5212243, 937723, -2897838, -3237665, -1141727, -36997, -449132, 863675, 5564594, 10641979, 12576334, 11661251, 9815027, 7126559, 3617208, 1526219, 2065052, 2317724, -462623, -3552295, -2436070, 1721058, 3426240, 1084742, -1304432, -905326, 511040, 865127, 832178, 899590, -484862, -3432552, -4596302, -1520026, 3035992, 3860996, -336279, -5084333, -4639643, 2093393, 9843007, 11614470, 5857837, -1862332, -5424209, -4763071, -3979320, -4817185, -5397097, -4326253, -2221821, 590752, 4164318, 6606206, 5348372, 1235083, -2002552, -2730820, -2525633, -2219315, -825126, 1109248, 1428977, 690854, 2087404, 5536099, 6477250, 2819674, -1385694, -2039244, -503283, 291329, 989660]
8442I89660J718022k60040n306176o873787j445410N233199N905667J470541j437102
8433e426L72802L792290M164685J24588n328769p241609l541761K063004M080641
8424a519555K082182M14502R93643Q06613k021482m395035l362500j059664q03982
8415h865278j407592K43564L082776L185830M44530q61120J204165L208821J981080
8406B216776k07213P16689L838788M208772M80959k623127j403302R34528p26131
8397G436739m907832n266275m30828L532463K037375j789012k561497Q9125L085757
8388A226015M863519N011158K515439j644437l539489j918954r17899k742281
8380B853071k605466K832198P154143L013970m623247m652973K572678N491830
$$ y = [989660, 2707682, 2447642, -2858534, -9732321, -11177731, -5944532, -38865, 1431676, -5426, 367376, 4159666, 8324351, 8448939, 3120170, -4121439, -7663200, -5600196, -1519555, 562627, 977129, 1970772, 2777385, 755903, -3639132, -7001632, -8061296, -8865278, -10272870, -10029306, -6946530, -3760700, -3316170, -4177290, -2973125, 235696, 2216776, 2009563, 2726252, 6565040, 10773812, 11254771, 8631644, 7228342, 8162870, 7436739, 2528907, -2737368, -3168196, 364267, 2401642, 612630, -1948867, -1859742, 1226015, 6089534, 11100692, 13616131, 11971694, 8432205, 6513251, 5595352, 2853071, 247605, 3079803, 10233946, 13247916, 8624669, 3971696, 6544374, 12036204]
8372A2036204k31206n496242l147279J757893K349775N75639O53530N29805k296736
8363F731383l589165M24782M342766J105820n901198p432845k432412J607130
8355e143739J187728P47586L252660M871073J869472k880456l803290O1562M308222
8346D470818M346996K4743m402618m867341k059001k4109l17678n86188L86949
8337c027429N07651q34316n78513K236205L364385K34848k813998j371389J553870
8328g28686J103850o67523Q62691L286420P66326m666522m896448J216169N718240
8319A994517L830996k74669k152897l148177m447027k978954K008822M931513
8311b35876J872893k662726k514561J037063K639137J684503J569970K457599
$$ y = [12036204, 11804998, 6308756, 3161477, 4919370, 7269145, 7844784, 8498314, 9028119, 6731383, 3142218, 3567000, 7909766, 9015586, 3114388, -4318457, -6750869, -5143739, -3956011, -3208425, 44235, 4915308, 6784780, 3904324, 101034, 162596, 4470818, 8817814, 8842557, 4439939, -427402, -2486403, -2510512, -2828190, -3414378, -3027429, -2519778, -3354094, -3932607, -1696402, 1667983, 1902831, -911167, -2282556, -728686, 375164, -292359, 570332, 3856752, 4623078, -43444, -4939892, -3723723, 1994517, 5825513, 5550844, 3397947, 249770, -4197257, -7176211, -5167389, -235876, 1637017, -1025709, -3540270, -2503207, 135930, 1820433, 3390403, 5848002]
8303E848002J096909k684474m799369k951260K12037J201692Q8796n29890P69188
8294a748369K763095L169861J150046j750974l239125k566187o50303J422951
8286a449005K786498K454572N34003p46357N41463K991266L676489K347817Q78683
8277A4015429n67010k824548l876458r72581L073485J868876m412413p235377
8269i30597j540583O504841Q298314M153387J90696j611726l434392m875190l664866
8260C089884j556920k296635m359169k766321J896643L630116J118105L1842K830227
8251A617772L859215r32352n886735l438862M273257Q213805M603532j848553
8243A0461079n811433o620154n484580k662748R46468L095411K984115K420154
$$ y = [5848002, 6944911, 4260437, -538932, -3490192, -3278155, -2076463, -1987667, -2517557, -1748369, 1014726, 4184587, 5334633, 3583659, 344534, -2221653, -2871956, -1449005, 1337493, 3792065, 4326068, 3579711, 4121174, 7112440, 10788929, 13136746, 14015429, 13448419, 10623871, 6747413, 5774832, 8848317, 10717193, 6304780, -930597, -2471180, 4033661, 12331975, 16485362, 16676058, 15064332, 11629940, 6754750, 3089884, 1532964, -763671, -5122840, -7889161, -5992518, -2362402, -1244297, -1212455, 1617772, 5476987, 4544635, -1342100, -4780962, -507705, 7706100, 12309632, 10461079, 4649646, -1970508, -7455088, -10117836, -9171368, -6075957, -3091842, -671688]
8235f71688K878541L394455K465983K95812j860175l141023l204115k328560j805602
8226c976372k547451k957254l70222M520137P042377M020275j990255n851416
8218b110181n666253l262946k66349L261923O423575O766622L287263j523848
8210F909806m062312l356202j460973n37705n81653l66811Q9724p52845l280423
8201g399394m995071l137502J365438M529061L975778R92071k052782l618319
8193a0340720k087539L145049Q187879O767029j012090o382825l038047L458877
8185a302387L639468j727006l678395O3897J932976k010649m956667n32720O519580
8176b051903P434600J975112k927172l632186k271468q75353O84989J617115L81221
$$ y = [-671688, 2206853, 5601308, 8067291, 8363103, 6502928, 3361905, 157790, -2170770, -3976372, -6523823, -9481077, -9851299, -5331162, 1711215, 5731490, 3741235, -2110181, -7776434, -11039380, -11305729, -8043806, -1620231, 5146391, 8433654, 6909806, 2847494, -508708, -1969681, -2507386, -3089039, -3455850, -3366126, -4118971, -7399394, -12394465, -15531967, -14166529, -9637468, -5661690, -4669619, -6722401, -10340720, -12428259, -9283210, -1095331, 5671698, 4659608, -1723217, -4761264, -1302387, 2337081, 610075, -3068320, -3004423, -1071447, -3082096, -8038763, -8571483, -2051903, 5382697, 7357809, 4430637, 798451, -1473017, -2348370, -1663381, -46266, 334955]
8167C34955j966351k516419n20769K206579M015852L969333J416785k045578k476692
8158B417695J009509L303235J40725m576648l740173K297896O020287L338660
8150A0211186j895191m539690m098127k738436j688566j166116r20409n5710J473642
8141e417417J837525L50134k88877J639421K669465o88988m859867l639254J702518
8132f695340L930252J004522j793956j226682K27380J082542L080626M919452
8124D528796K281636l128495l521677K017182L865737k881697q628958l337894
8116h805370O906521P977824j683019r294325n789911L562003Q087709M588164
8108E549596j155265k121945K397886O018359K829299m231952o425685j629762
$$ y = [334955, -1631396, -4147815, -4668584, -2462005, 1553847, 5523180, 6939965, 4894387, 2417695, 3427204, 6730439, 6871164, 2294516, -1445657, 852239, 6872526, 10211186, 8315995, 3776305, -321822, -3060258, -4748824, -5914940, -6835349, -6891059, -5417417, -3579892, -3229758, -3518635, -1879214, 790251, 101263, -4758604, -8397858, -6695340, -2765088, -1760566, -3554522, -4781204, -4553824, -3471282, -390656, 4528796, 6810432, 3681937, 160260, 2177442, 6043179, 3161482, -5467476, -8805370, -1898849, 6078975, 4395956, -4898369, -10688280, -7126277, 961432, 5549596, 4394331, 2272386, 4670272, 10688631, 13517930, 9285978, 2860293, 1230531]
8100A230531K396225K87222k664056l42636L218404J175164l480298k830710K038603
8091A028449K950549j286355l726334j917605p34110j638162o4284M180991M671053
8082C464192J15803k050068J369326L043224j774715n707255j533129M345487
8074A272865J539557o849763q293359j05461O828363M399365k440506m653668
8066h302607q85932L668676N099534L568638J204886J25760R33427J767261L89975
8057G569618k413473l626454k315716n95732k1488J57034N93341O50732N19467
8048E17329J553693L151320K255826j978203n521663m091046J205453N419661
8040B512370N791078L582259O79848k545759n582716o667989m777933j307367
$$ y = [1230531, 3626756, 3913978, 1249922, 907286, 4125690, 5300854, 1820556, -1010154, 1028449, 3978998, 2692643, -1033691, -2951296, -3685406, -5323568, -5387852, -1206861, 3464192, 3579995, 1529927, 2899253, 5942477, 4167762, -1539493, -3072622, 1272865, 2812422, -4037341, -12330700, -12436161, -5607798, -1208433, -3648939, -8302607, -9188539, -5519863, -420329, 3148309, 4353195, 4478955, 5412382, 7179643, 7569618, 5156145, 1529691, -786025, -1381757, -1403245, -1246211, -652870, -2138, 517329, 2071022, 5222342, 7478168, 5499965, -21698, -4112744, -2907291, 2512370, 8303448, 11885707, 12565555, 10019796, 4437080, -2230909, -7008842, -8316209]
8032h316209J452822K581036K381820J134112o09434j264525L48275K755831K869507
8023C333235O3477k373192j371303J423460J558875j830786m118474j208732M389198
8014a34242O218383K200283k682988l090094l4269J536516J24105r02953P95986
8005D030727K912525K391513J04690r79611n39201q38462k612451l831149k774133
7996b135552k24947J761279J768388k64266k786185l481155j940004o61243j363935
7987i327620j662833J323072N167091M606090o1685k440371M14660L402421J637098
7978C057923j768024j176311K131014K228193j588538l636776o62669L766797
7970B351609M996895K961652L20245j577086k735451k917772j919360j37140J941123
$$ y = [-8316209, -6863387, -4282351, -1900531, -766419, -1375853, -2640378, -2292103, 463728, 3333235, 3396712, 1023520, -347783, 1075677, 2634552, 803766, -3314708, -4523440, -134242, 6084141, 8284424, 5601436, 2511342, 2477073, 4013589, 4137694, 3234741, 4030727, 6943252, 9334765, 9439455, 8459844, 7920643, 7082181, 4469730, 638581, -2135552, -2360499, -599220, 1169168, 904902, -1881283, -5362438, -7302442, -7963685, -9327620, -10990453, -9667381, -4500290, 105800, 44115, -2396256, -1981596, 1420825, 3057923, 1289899, 113588, 2244602, 4472795, 2884257, -752519, -1415188, 2351609, 7348504, 10310156, 10630401, 9053315, 6317864, 3400092, 1480732, 1343592, 3284715]
7961C284715L481638K640168j522844o220413o838819k704543J538583J715618
7953d625897r06345k120292m00493K066928K874778J837614K34579p75198p62125
7944b576451l6309N66540L43453m92983q24034J43719J462122R81964j754967
7935b186946l869429k262182J749709L408343P95432k608430l015170j034829
7927i023502R02339K802039N410727O624799L799373j433157m540163l793482
7919G48973j323638P28714J721405J143357m80053k41222L390879O318506L219906
7910A5226827m077221p931123m998310L51466L438673M235837L510330L55326
7902A0111805l695728m131654o60924P65128k584237m594965n519N570337L234257
$$ y = [3284715, 6766353, 9406521, 7883677, 1663264, -5175555, -7880098, -6341515, -4625897, -5532242, -7652534, -8053027, -5986099, -3111321, -1273707, -1039128, -1814326, -2576451, -2612760, -2046220, -1702767, -2195750, -3019784, -2876065, -1413943, -431979, -2186946, -6056375, -8318557, -6568848, -3160505, -2365073, -4973503, -7988673, -9023502, -8121163, -5319124, 91603, 6716402, 10515775, 9082618, 4542455, 748973, -574665, 154049, 1875454, 3018811, 2538758, 2297536, 5688415, 12006921, 15226827, 11149606, 3218483, -1779827, -1428361, 2010312, 6246149, 9756479, 10111805, 6416077, 2284423, 1623499, 2388627, -195610, -4790575, -4796094, 774243, 4008500]
7893D008500m752921p115855P3391P694923O654491k47054l826563j292004J918415
7884C115323J400668m01084Q51279L985885L519898j965249o507685m460112J176544
$$ y = [4008500, -744421, -7860276, -7786885, -91962, 6562529, 6315475, 2488912, 1196908, 3115323, 4515991, 4114907, 4966186, 8952071, 12471969, 10506720, 3999035, -461077, 715467]
$$ [...]
##END NTUPLES=NMR SPECTRUM
##END=
