##TITLE=31Pdec_SR90_rm2
 , 90 sc
 30.09.2021
##JCAMPDX= 6.0         $$ Bruker NMR JCAMP-DX V2.0
##DATA TYPE= NMR SPECTRUM
##DATA CLASS= NTUPLES
##ORIGIN= UXNMR, Bruker Analytische Messtechnik GmbH
##OWNER= root
$$ XWIN-NMR		Version 3.5
$$ Thu Sep 30 10:51:48 2021 Russian Standard Time (UT+4h)  she@DPX200
##.OBSERVE FREQUENCY= 81.013821
##.OBSERVE NUCLEUS= ^31P
##.ACQUISITION MODE= SIMULTANEOUS
##.ACQUISITION SCHEME= undefined
##.AVERAGES= 91
##.DIGITISER RES= 16
##SPECTROMETER/DATA SYSTEM= spect
##.PULSE SEQUENCE= zgpg30
##.SOLVENT NAME= CDCl3
##.SHIFT REFERENCE= (INTERNAL, CDCl3, 0, 248.564)
##AUDIT TRAIL= $$ (NUMBER, WHEN, WHO, WHERE, WHAT)
$$ ##TITLE= Audit trail, XWIN-NMR		Version 3.5
$$ ##JCAMPDX= 5.01
$$ ##ORIGIN= Bruker BioSpin GmbH
$$ ##OWNER= she
$$ F:/spectra/data/she/nmr/P31/1/pdata/1/auditp.txt
$$ ##AUDIT TRAIL=  $$ (NUMBER, WHEN, WHO, WHERE, WHAT)
(   1,<2021-09-30 10:50:56.01 +0400>,<she>,<DPX200>,
      <created by zg, POWCHK disabled, PULCHK disabled
       terminated by command 'halt'
       configuration hash MD5:
       00 E9 B6 7A A2 85 ED C7 34 08 36 98 17 FE 4E 26
       data hash MD5: 32K
       9E 65 02 45 37 CD 51 93 02 E2 6C 10 EC 6F F7 70>)
(   2,<2021-09-30 10:51:01.15 +0400>,<she>,<DPX200>,
      <Start of raw data processing
       efp BC_mod = 2 LB = 1 FT_mod = 6 PKNL = 1 PHC0 = -8808.528 PHC1 = 5.269344 SI = 64K 
       data hash MD5: 64K
       62 A4 C5 A8 68 54 0F C5 DF 37 F1 80 DB 34 C4 AD>)
$$ ##END=
$$ 
$$ hash MD5
$$ B7 13 23 4A 3D A0 D8 09 7B 83 BD 93 C8 D9 2F C6
##$RELAX= 
##$RELAX= 
##$RELAX= 
##$RELAX= 
##$RELAX= 
##$RELAX= 
##$RELAX= 
##$RELAX= 
$$ Bruker specific parameters
$$ --------------------------
##$DU= <F:/spectra>
##$EXPNO= 1
##$NAME= <P31>
##$PROCNO= 1
##$TYPE= <nmr>
##$USER= <she>
##$AMP= (0..31)
100 100 100 100 100 100 100 100 100 100 100 100 100 100 100 100 100 100 
100 100 100 100 100 100 100 100 100 100 100 100 100 100 
##$AQSEQ= 0
##$AQ_mod= 1
##$AUNM= <au_zg>
##$AUTOPOS= <>
##$BF1= 81.014009
##$BF2= 200.13
##$BF3= 200.13
##$BF4= 200.13
##$BF5= 200.13
##$BF6= 200.13
##$BF7= 200.13
##$BF8= 200.13
##$BYTORDA= 1
##$CFDGTYP= 0
##$CFRGTYP= 5
##$CHEMSTR= <none>
##$CNST= (0..31)
1 1 145 1 1 1 1 1 1 1 1 1 1 1 1 1 1 1 1 1 1 1 1 1 1 1 1 1 1 1 1 1 
##$CPDPRG= <waltz16>
##$CPDPRG1= <>
##$CPDPRG2= <waltz16>
##$CPDPRG3= <>
##$CPDPRG4= <mlev>
##$CPDPRG5= <mlev>
##$CPDPRG6= <mlev>
##$CPDPRG7= <mlev>
##$CPDPRG8= <mlev>
##$CPDPRGB= <>
##$CPDPRGT= <>
##$D= (0..31)
0 1 0 0 0 0 0 0 0 0 0 0.03 2e-05 3e-06 0 0 0 0 0 0 0 0 0 0 0 0 0 0 0 0 
0 0 
##$DATE= 1632984559
##$DBL= (0..7)
120 120 120 11 120 120 24 19 
##$DBP= (0..7)
150 150 150 150 150 150 150 150 
##$DBP07= 0
##$DBPNAM0= <>
##$DBPNAM1= <>
##$DBPNAM2= <>
##$DBPNAM3= <>
##$DBPNAM4= <>
##$DBPNAM5= <>
##$DBPNAM6= <>
##$DBPNAM7= <>
##$DBPOAL= (0..7)
0.5 0.5 0.5 0.5 0.5 0.5 0.5 0.5 
##$DBPOFFS= (0..7)
0 0 0 0 0 0 0 0 
##$DE= 6
##$DECBNUC= <off>
##$DECIM= 3
##$DECNUC= <off>
##$DECSTAT= 4
##$DIGMOD= 1
##$DIGTYP= 9
##$DL= (0..7)
0 0 52 120 120 21 21 25 
$$ [...]
##$SUBNAM2= <"">
##$SUBNAM3= <"">
##$SUBNAM4= <"">
##$SUBNAM5= <"">
##$SUBNAM6= <"">
##$SUBNAM7= <"">
##$SUBNAM8= <"">
##$SUBNAM9= <"">
##$SW= 501.771253377433
##$SWIBOX= (0..15)
0 1 3 0 0 0 0 0 0 0 0 0 0 0 0 0 
##$SW_h= 40650.406504065
##$TD= 32768
##$TD0= 1
##$TE= 0
##$TE2= 300
##$TE3= 300
##$TEG= 300
##$TL= (0..7)
0 120 53 12 22 120 120 120 
##$TP= (0..7)
150 150 150 150 150 150 150 150 
##$TP07= 0
##$TPNAME0= <>
##$TPNAME1= <>
##$TPNAME2= <>
##$TPNAME3= <>
##$TPNAME4= <>
##$TPNAME5= <>
##$TPNAME6= <>
##$TPNAME7= <>
##$TPOAL= (0..7)
0.5 0.5 0.5 0.5 0.5 0.5 0.5 0.5 
##$TPOFFS= (0..7)
0 0 0 0 0 0 0 0 
##$TUNHIN= 0
##$TUNHOUT= 0
##$TUNXOUT= 0
##$USERA1= <user>
##$USERA2= <user>
##$USERA3= <user>
##$USERA4= <user>
##$USERA5= <user>
##$V9= 5
##$VALIST= <valist>
##$VCLIST= <CCCCCCCCCCCCCCC>
##$VD= 0
##$VDLIST= <DDDDDDDDDDDDDDD>
##$VPLIST= <PPPPPPPPPPPPPPP>
##$VTLIST= <TTTTTTTTTTTTTTT>
##$WBST= 1024
##$WBSW= 4
##$XGAIN= (0..3)
0 0 0 0 
##$XL= 0
##$YL= 0
##$YMAX_a= 20911
##$YMIN_a= -32079
##$ZGOPTNS= <>
##$ZL1= 120
##$ZL2= 120
##$ZL3= 120
##$ZL4= 120
##$ABSF1= 0
##$ABSF2= 0
##$ABSG= 0
##$ABSL= 0
##$ALPHA= 0
##$AQORDER= 0
##$ASSFAC= 0
##$ASSFACI= 0
##$ASSFACX= 0
##$ASSWID= 0
##$AUNMP= <proc_1d>
##$AZFE= 0.1
##$AZFW= 0.5
##$BCFW= 0
##$BC_mod= 2
##$BYTORDP= 0
##$COROFFS= 0
##$CY= -3
##$DATMOD= 1
##$DC= 0
##$DFILT= <>
##$DTYPP= 0
##$F1P= 0
##$F2P= 0
##$FCOR= 1
##$FTSIZE= 65536
##$FT_mod= 6
##$GAMMA= 0
##$GB= 0
##$INTBC= 1
##$INTSCL= 5.30512e-09
##$ISEN= 30
##$LB= 1
##$LEV0= 0
##$LPBIN= 0
##$MAXI= 10000
##$MC2= 0
##$MEAN= 0
##$ME_mod= 0
##$MI= 50
##$NCOEF= 0
##$NC_proc= -8
##$NLEV= 6
##$NOISF1= 182.463
##$NOISF2= 159.3651
##$NSP= 0
##$NTH_PI= 0
##$NZP= 0
##$OFFSET= 248.5645
##$PC= 4
##$PHC0= -8808.528
##$PHC1= 5.269344
##$PH_mod= 1
##$PKNL= yes
##$PPARMOD= 0
##$PSCAL= 0
##$PSIGN= 0
##$REVERSE= no
##$SF= 81.014009
##$SI= 65536
##$SIGF1= 159.3651
##$SIGF2= -187.1042
##$SINO= 113.3802
##$SIOLD= 16384
##$SREGLST= <1H.CDCl3>
##$SSB= 0
##$STSI= 65536
##$STSR= 0
##$SW_p= 40650.406504065
##$SYMM= 0
##$S_DEV= 0
##$TDeff= 32768
##$TDoff= 0
##$TI= <>
##$TILT= no
##$TM1= 0
##$TM2= 0
##$TOPLEV= 0
##$USERP1= <user>
##$USERP2= <user>
##$USERP3= <user>
##$USERP4= <user>
##$USERP5= <user>
##$WDW= 1
##$XDIM= 65536
##$YMAX_p= 278561709
##$YMIN_p= -481026755
$$ End of Bruker specific parameters
$$ ---------------------------------
##NTUPLES= NMR SPECTRUM
##VAR_NAME=  FREQUENCY,     SPECTRUM/REAL,   SPECTRUM/IMAG
##SYMBOL=    X,             R,               I
##VAR_TYPE=  INDEPENDENT,   DEPENDENT,       DEPENDENT
##VAR_FORM=  AFFN,          ASDF,            ASDF
##VAR_DIM=   65536,         65536,           65536
##UNITS=     HZ,            ARBITRARY UNITS, ARBITRARY UNITS
##FACTOR=    0.620285442955139, 1,           1
##FIRST=     20137.2065510759, 0,            0
##LAST=      -20513.1999529892, 0,           0
##MIN=       -20513.1999529892, -481026755,  0
##MAX=       20137.2065510759, 278561709,    0
$$ Real data points
##PAGE= N=1
##DATA TABLE= (X++(R..R)), XYDATA
$$ [...]
14912 -15829853 -917804 7947488 5234554 1212302 5230800 12185806 10790398 -603512
14904 -603512 -13356914 -20782050 -23261638 -21269451 -11858653 3773107 15809937 15566165
14896 15566165 6272694 -2050890 -5453099 -6701744 -5945813 -563963 5491291 2886674
14888 2886674 -8821856 -17409903 -14067635 -5208912 -1389817 -1903126 569656 5632222
14880 5632222 6374196 2269390 -101257 857997 -638845 -6091585 -8401822 -3509431
14872 -3509431 1754156 -517548 -7273885 -8904242 -2553574 4936239 6101787 241365
14864 241365 -7595993 -11350028 -8288678 -1839217 455792 -5124974 -13073110 -14454559
14856 -14454559 -7989710 -1587154 -1945195 -6637479 -9154384 -8361530 -8155678 -8931263 -5430780
14847 -5430780 4472006 13453320 12064722 672205 -10664395 -13950808 -10335824 -5087721
14839 -5087721 -956575 933195 -1469767 -8080333 -13735300 -13172412 -8027118 -4941933
14831 -4941933 -7112831 -10999407 -11230889 -6126230 1241370 5303305 2408568 -4833892
14823 -4833892 -9375162 -8134237 -5511051 -5195457 -3125747 4844560 12163655 8208946
14815 8208946 -4996712 -13171184 -9024654 -1117442 495735 -2508205 -4268756 -6255481
14807 -6255481 -11869472 -16202971 -12112043 -3142619 112322 -4571709 -8736135 -6428633
14799 -6428633 -1212294 819039 -2475497 -10391589 -19455871 -21916959 -12692940 559617
14791 559617 3357404 -6524893 -15001583 -11352057 -2592628 -854359 -4666697 -3198203
14783 -3198203 5696513 12998614 12913456 9479892 7547451 5945227 2703521 168825
14775 168825 800548 2560183 2344773 692672 -202377 -368390 -821820 -841627 260883
14766 260883 442655 -2525763 -6751696 -7963533 -5686880 -4518982 -8052752 -13899156
14758 -13899156 -16723757 -14942609 -12067546 -11543361 -12624217 -12507539 -10695787 -8941250
14750 -8941250 -7471371 -3962190 2820377 10237171 14121810 13040660 9147757 5570131
14742 5570131 3951003 3864301 3502971 1310157 -2123479 -4089413 -2628700 701097 1827690
14733 1827690 -1611306 -7397787 -10827933 -10083382 -8631434 -10681822 -14726198 -14637030 -8213988
14724 -8213988 -902486 1786103 1619594 2558287 1949243 -5480101 -16060440 -18842535
14716 -18842535 -10854866 -2108307 -1430535 -5304086 -6307026 -4989871 -5553692 -5782668
14708 -5782668 -789986 6638993 8797197 4372203 -1549529 -7110186 -13929563 -18393155
14700 -18393155 -13236544 47922 9841772 9077976 3320323 330997 -589760 -3639323
14692 -3639323 -7766355 -9463531 -9637846 -11336049 -13675725 -13540679 -11043972 -8636052
14684 -8636052 -6782636 -4595512 -2794093 -2368128 -2297448 -1902005 -3073900 -6721568 -9531881
14675 -9531881 -8101833 -4091137 -1540373 -1281772 -1740520 -2806752 -4686717 -5269892 -3324413
14666 -3324413 -2217673 -5369995 -9839664 -10113940 -6932111 -5846971 -7268617 -5027786
14658 -5027786 3591156 13004312 17497754 18512025 19682751 19455477 14203175 5832629
14650 5832629 133320 -1874641 -5217500 -12319590 -18119251 -17189996 -12403376 -11619193
14642 -11619193 -16599318 -20421130 -17436216 -11002934 -7618766 -7135744 -4484973 869632
14634 869632 4299358 5101492 8322978 14299295 13956406 1099263 -15692477 -21549248
14626 -21549248 -13535101 -2580400 2123483 2368442 2920843 2480987 -2175482 -8213488
14618 -8213488 -9308633 -4471244 942943 2888407 2905560 3642246 3828095 751654 -3767333
14609 -3767333 -3694124 3468705 11607043 11671716 2113085 -9238904 -14399379 -13404281 -11584906
14600 -11584906 -11695615 -12317917 -12673243 -14560398 -18292816 -19774781 -14294684 -2758529
14592 -2758529 7679070 10114466 4682894 -2005644 -4203883 -2277813 37333 949037
14584 949037 380401 -3090182 -10044188 -15862306 -14604386 -7910565 -3504296 -3181216 -228696
14575 -228696 7145130 8610514 -3870714 -20936126 -25863378 -16860458 -8510624 -11122589
14567 -11122589 -18822413 -20365325 -13160291 -3052939 3175829 1670476 -6589461 -14546668
14559 -14546668 -14303423 -6105511 1879517 3841196 1480976 -1557565 -3735549 -2645252
14551 -2645252 4327999 13190861 14488923 5269464 -6973414 -16110605 -24778502 -34312108
14543 -34312108 -36506060 -24913515 -7795365 946851 -330271 -2679870 -2794207 -5643838
14535 -5643838 -11598157 -12969135 -6012797 3221384 8295371 9690302 9777547 8198591
14527 8198591 5839148 6487461 10639834 13540490 12456306 9633914 5418053 -3506408
14519 -3506408 -14725961 -17930318 -9350010 -564658 -3684688 -14029123 -18469922 -16333125
14511 -16333125 -18573373 -27001376 -28670168 -15365716 2883183 10978598 7327097 1422753
14503 1422753 -1258023 -3259647 -6954501 -10563659 -12213012 -11967743 -9552505 -4832662
14495 -4832662 -647305 -547186 -3371471 -4584449 -3509126 -4140663 -7218920 -7113707 -550369
14486 -550369 5877547 2774763 -8958020 -17870920 -15646075 -6349617 106387 -126443
14478 -126443 -3137380 -5171007 -7151003 -10397788 -11960614 -7726873 852582 6383294
14470 6383294 3094539 -6445687 -13384813 -11316299 -2514895 4722980 4783830 -59198
14462 -59198 -3979254 -5797525 -9478472 -15684780 -17585401 -9729024 1712438 4377938
14454 4377938 -4423123 -14223747 -16005742 -13181842 -13241394 -15028760 -12235709 -5634449
14446 -5634449 -2492491 -4650211 -6249440 -4533162 -4208001 -7973675 -10754118 -8284988
14438 -8284988 -4665289 -5134872 -6788536 -3911596 1122879 621988 -5852489 -9479256
14430 -9479256 -3963138 6597832 13617793 13594730 9877572 7693354 8734207 9268617
14422 9268617 4336461 -4475334 -8357065 -2559445 4822330 2365597 -7966486 -12619832
14414 -12619832 -5940949 2062313 1583456 -3053958 -2907102 -42287 -3228059 -12267231
14406 -12267231 -17785612 -15746361 -11873155 -10535953 -8786285 -4194687 -11533 1413943
14398 1413943 2675030 4281064 1328045 -6827136 -11100991 -5135969 3003704 1816440
14390 1816440 -5341860 -5209306 3544695 7095100 -1971956 -12693554 -12173578 -3702054
14382 -3702054 767814 -1201224 -2567469 -848465 -1176846 -6119236 -11768323 -14839806
14374 -14839806 -15925939 -14369175 -7100542 5012373 15608398 20327808 20988526 19915922
14366 19915922 15130948 4714736 -7664132 -15324242 -14884839 -7809557 2421264 12577781
14358 12577781 20222462 23382963 19973389 9222474 -4823159 -14115516 -14630322 -11188113
14350 -11188113 -10041237 -10045604 -7368847 -4965443 -7754326 -10731744 -4316873 7600659
14342 7600659 8670859 -6133745 -20678144 -19269305 -6910587 1257251 905153 -1668060
14334 -1668060 -2315042 -180092 7113439 17822889 21769650 13569258 4059285 5397385
14326 5397385 10926335 5829039 -6557787 -8004114 5119965 14974157 9343446 -1862610
14318 -1862610 -4685338 -759196 577514 -1993684 -3957862 -4322310 -4242561 -3226062 -3015726
14309 -3015726 -7716436 -14823839 -15281794 -8141100 -4445865 -9218986 -11468683 -2508322
14301 -2508322 7267035 3853518 -6932155 -7710629 3662611 12024673 8418041 417713
14293 417713 -2675491 -1743100 -1380961 -2035580 -2738665 -3838200 -3792179 282475 6772557
14284 6772557 10261398 9245748 7247567 5815842 2868318 -1702025 -5586259 -9427346
14276 -9427346 -15291510 -19535445 -15561698 -5014545 2358907 2317130 1043324 3394403
14268 3394403 5098433 1475949 -4114902 -6705011 -7966728 -11313610 -14077418 -11780259
14260 -11780259 -6560440 -4380585 -6037447 -7098572 -5343686 -2680654 -413089 2218347
14252 2218347 4428867 2902096 -4359671 -15184947 -24624061 -28150118 -24221797 -15240755
14244 -15240755 -5989600 -595649 -731882 -5120444 -9132707 -7044960 1731354 10106095
14236 10106095 11099459 6480907 2462915 -825484 -7509417 -14638279 -13276384 -3247264
14228 -3247264 3942981 1749533 -2169396 -134578 2340256 -2815234 -10980124 -12242322
14220 -12242322 -8194667 -8454631 -13640183 -14668238 -8101820 -264396 4243591 6942823
14212 6942823 7506855 2581708 -5248272 -7773447 -3403950 405763 -324118 -976686 1215906
14203 1215906 2112463 332602 1369698 6470703 7885285 2082210 -2530511 619245
14195 619245 4555666 619596 -7022719 -10130732 -11484944 -17774160 -23605435 -17852711
14187 -17852711 -3060357 6500094 5591973 2640360 3001191 2024203 -2433994 -4479266
14179 -4479266 -2129610 -2505692 -9057533 -14501401 -12886199 -8439893 -5616759 -865724
14171 -865724 7202385 9585061 -152840 -12498464 -13756917 -5956732 -2711206 -8417846
14163 -8417846 -13923166 -12055494 -6003624 -1229442 995157 117287 -4979176 -11551796
14155 -11551796 -14593447 -14379623 -15265604 -16293207 -11967694 -4405921 -4304229 -14477346
14147 -14477346 -21901381 -14396903 1676263 10059522 6638442 2303208 4953779 9313338
14139 9313338 7481599 1155616 -2181895 -357547 1974761 729339 -3593428 -8586037
14131 -8586037 -12522322 -13986059 -12239856 -8798557 -6109105 -4151794 -1233011 1223420
14123 1223420 -1272448 -9124559 -15538207 -14483095 -8564549 -4165440 -1839171 1900412
14115 1900412 5509663 3990138 -270438 1822895 11273733 16518584 9784666 -462083
14107 -462083 -1521218 5782228 10837970 9823024 7891430 7465399 5358649 1453906
14099 1453906 286828 2755935 4846497 5734673 8690363 12759061 12719189 9375205 10133926
14090 10133926 15817998 16954403 8745968 160701 338752 4115373 795429 -8479871
14082 -8479871 -12889856 -8359932 -1182820 3896827 8614258 12281536 7771365 -7846174
14074 -7846174 -24516957 -27978552 -16045271 -1299795 3074693 -2986397 -8576601 -5814201
14066 -5814201 1636859 4971077 1879369 -2109041 -2844279 -3112386 -7262628 -14021132
14058 -14021132 -17607457 -14356081 -6301838 695225 1673709 -2825872 -6601294 -4601132
14050 -4601132 267574 760348 -4117744 -7209914 -3730485 1539104 1207106 -4650760
14042 -4650760 -9763077 -10344985 -8241251 -6859312 -7443052 -8738290 -8384184 -5617545 -3245072
14033 -3245072 -4641726 -8596301 -10895686 -11247974 -12961979 -14408120 -8333915 6063835
14025 6063835 17579114 16101544 5811335 -1841711 -3429216 -3569654 -3792229 -1386271
14017 -1386271 2231057 2073439 -951101 -401797 4096727 4546748 -2550467 -8859832 -5202187
14008 -5202187 5516237 12172712 9088091 654573 -5903609 -7532797 -5172594 -679877
14000 -679877 3890274 5505393 1651040 -5843549 -10231995 -6458380 1786813 5717155
13992 5717155 3062850 808413 3759002 6570872 2624651 -4528506 -6305145 -2263488
13984 -2263488 444319 -868373 -1707794 523681 3384807 5929740 9708223 12009554
13976 12009554 7379030 -1662082 -5137359 -927746 382692 -7860376 -16596832 -14705367
13968 -14705367 -6149099 -2345728 -3637877 -1736668 2490859 -1108343 -12672160 -17709588
13960 -17709588 -8295991 3331905 2286994 -6839743 -7926446 1513992 7489833 2306255
13952 2306255 -3810988 230753 8858602 9258980 1533641 -2471613 1504298 3950587
13944 3950587 -2607777 -11575545 -12160615 -4870687 89028 -3123424 -10116250 -13632322
13936 -13632322 -11373408 -5840986 -334769 3297582 4751008 4281095 1699239 -2819534
13928 -2819534 -6923307 -7306211 -3726924 507536 3143344 5138509 6774775 5427246
13920 5427246 104107 -5199654 -6407467 -5023938 -5250350 -7893456 -10888669 -13422601
13912 -13422601 -15474057 -15606326 -13533031 -12554596 -14751527 -16060840 -11471521 -3211105
13904 -3211105 2015661 2365809 1052076 -1610399 -8535756 -17148156 -18062869 -6614693
13896 -6614693 8974103 15357546 8129152 -4638256 -11928800 -10825892 -7376669 -6795573
13888 -6795573 -5550067 2399845 12619155 12050289 -2210033 -14818274 -11270452 1760266
13880 1760266 6457742 -9858 -2996608 5961340 16435102 14436465 476195 -13088799
13872 -13088799 -15977736 -7360087 4814553 9131478 1026180 -10601948 -13098626 -6534099
13864 -6534099 -2382348 -5429296 -7658206 -3041585 2755021 3023375 556643 808911
13856 808911 2947191 4788347 9080303 17409090 24201112 23682950 17076553 7418308
13848 7418308 -5428561 -18591878 -23799425 -19237460 -15420814 -20024110 -25241524 -21068753
13840 -21068753 -12806884 -11602639 -13882268 -6301124 11183264 23050251 20061292 9689609
13832 9689609 2533577 641673 2331832 7097304 11424831 9410883 1876004 -3327941
13824 -3327941 -3401883 -4559979 -10512152 -15706914 -14589278 -9827518 -6447198 -4574595
13816 -4574595 -2694769 -1950444 -2947380 -4156825 -6854923 -14726630 -24905632 -27558176
13808 -27558176 -19759837 -11761855 -12597756 -16986927 -14967133 -8012171 -5370274 -8535573
13800 -8535573 -10049948 -6237720 -1525888 -59349 -1079344 -3008370 -5168916 -5439970
13792 -5439970 -2818840 -1672566 -6203466 -11664268 -9946887 -3801780 -4792587 -14810661
13784 -14810661 -21179932 -15541828 -6336012 -3898311 -3426101 4692688 14847268 12387423
13776 12387423 -2017292 -10562139 -4280487 3954883 127003 -9378546 -8389155 4626645
13768 4626645 15820779 16607866 12448300 10421411 9474508 6937888 5613334 8283003
13760 8283003 11305519 10339961 8533575 11966016 18600759 19050632 9827175 13973
13752 13973 669001 10500841 17180562 13024645 4280805 1420461 4021404 2119986 -7651364
13743 -7651364 -15666420 -13396998 -6625845 -6509508 -12195671 -13086314 -7237547 -5338065
13735 -5338065 -12976294 -20235577 -16409334 -6634215 -4038987 -10302619 -14688746 -10890917
13727 -10890917 -4554140 -2419162 -2753436 -736673 2805850 3450217 812615 -841728
13719 -841728 1172606 4704963 5974655 3619130 -1118956 -6434834 -10744048 -12209860
13711 -12209860 -9518074 -3931979 893446 2715026 3358325 5608684 8229301 6869643
13703 6869643 112697 -8148303 -13186296 -14047678 -13102342 -13332707 -16491810 -21243907 -22701790
13694 -22701790 -17067084 -7476114 -1557804 -2063270 -4022711 -2735466 290370 2070289
13686 2070289 3676912 6653314 8055069 4460664 -1702221 -5002466 -4297728 -2370832
13678 -2370832 -63684 3913353 8098206 8426229 3846275 -1893840 -4477690 -2493547
13670 -2493547 2520207 6641014 5448602 -1167195 -7038824 -6078462 70617 3779831
13662 3779831 -258086 -11222032 -24288030 -32529408 -29405331 -15424088 -1338903 1628918
13654 1628918 -4913959 -8930032 -4443525 799322 -3169936 -14862164 -23422763 -21368966
13646 -21368966 -11333068 -1396299 3282928 3913064 4284072 4640449 1384914 -6299428
13638 -6299428 -13180505 -14962029 -15160854 -18978653 -22489482 -16322852 -986480 10324231
13630 10324231 8386746 186338 -1542692 4391522 8183815 3793316 -4770980 -11513827
13622 -11513827 -15472723 -17728050 -17141339 -12665130 -6682750 -2761618 -1942413 -3726787
13614 -3726787 -8561368 -15800445 -20452687 -16636176 -5566517 3496021 2837969 -5257298
13606 -5257298 -12073660 -12642983 -9396971 -6952502 -6972809 -8451785 -10063546 -11065158 -11075768
13597 -11075768 -8982667 -1976936 11248367 24242906 24708571 8825557 -9844678 -14273791
13589 -14273791 -5125005 1926871 -371234 -2820577 1525041 4774321 -913881 -7999763
13581 -7999763 -5882723 11822 -3600393 -15115766 -18952798 -8827475 3919493 7493554
13573 7493554 2986452 -3034606 -8349261 -12154594 -11092077 -4678088 849325 -582149
13565 -582149 -7758262 -15042438 -18568734 -17572005 -14033875 -13079885 -19207411 -29832905
13557 -29832905 -36410105 -33597048 -23915266 -13126031 -5430136 -2974558 -4457168 -4123753
13549 -4123753 1657256 6811286 1921600 -11095880 -19066489 -14550587 -4466357 1458861
13541 1458861 2500321 2737948 2908219 2238217 2204124 2909763 1036133 -3836421 -6436402
13532 -6436402 -3974535 -1207661 -2555292 -5535881 -7283841 -10421055 -15742790 -16359955
13524 -16359955 -7890311 1518106 1331054 -5620836 -8217355 -5060322 -5884252 -14995410
13516 -14995410 -24172858 -24819578 -18733224 -13004054 -10258629 -7836150 -2900371 4600338
13508 4600338 12164432 16768774 17710891 16530590 13296484 6676469 146306 2153865
13500 2153865 14019115 23399094 19196614 8995969 9547050 20914485 24279834 9315423
13492 9315423 -9825338 -14297167 -5746009 -392157 -4879935 -11159692 -13024995 -14439070
13484 -14439070 -18884335 -21332265 -16614182 -8497238 -3708980 -1534654 3521110 10940766
13476 10940766 13257375 6412285 -4605085 -12120905 -13454898 -10492072 -5796968 -1841640
13468 -1841640 -617288 -825128 1770590 8070502 12698407 11208095 7407773 8481967
13460 8481967 14635464 19077058 17443088 11624769 4357720 -4072741 -12432569 -16816999
13452 -16816999 -14341241 -5646693 6276090 16370659 18158254 9702616 -1678269 -6576936
13444 -6576936 -4551416 -1411956 2436547 10765911 18998180 16111834 3011924 -4165068
13436 -4165068 3479060 13665834 11152960 -716636 -8580177 -10232260 -13134870 -17963792
13428 -17963792 -18877913 -17016959 -18567878 -20289881 -12009952 5022596 16694186 16468025
13420 16468025 13839164 16943422 19153292 11037698 -3933599 -14615442 -16439229 -12137258
13412 -12137258 -3565719 8350564 18080305 17971256 7110426 -6253543 -11603754 -4633943
13404 -4633943 8873347 16723013 11414563 -1114600 -7972682 -5607553 -3637783 -9652518
13396 -9652518 -17148944 -14706876 -2457670 7952334 8060399 887406 -5256682 -6082739
13388 -6082739 -3370156 -1038771 -763608 -799528 925652 3361034 4425366 6034682 12237023
13379 12237023 20857061 22732106 13322598 283508 -5979434 -5520403 -6088980 -9808241
13371 -9808241 -10614930 -5124476 1578599 3642703 2239721 2150203 4603597 7206468 8184326
13362 8184326 6986442 2485795 -5607196 -13952259 -17334265 -13835494 -6610687 -453354
13354 -453354 1986903 1039408 -789002 -409886 2723368 4718464 1342756 -4866764 -5348763
13345 -5348763 3350279 12442779 10475084 -1174086 -9116736 -5544948 2017418 2604946
13337 2604946 -2699982 -4119152 1276891 5475945 1290039 -8427781 -15589040 -16377022
13329 -16377022 -13289806 -10458274 -9307716 -7739870 -2609258 6375180 15593357 21118841
13321 21118841 21813275 17778064 9236521 94383 -1658303 6782323 16152233 15098590
13313 15098590 5769179 870180 5037302 9095648 5750322 813457 2542777 8076378
13305 8076378 8805366 3639560 -1806143 -5459957 -9080062 -10073194 -2442852 12675069
13297 12675069 24750197 25226294 16937189 9980302 11137540 18720716 25326715 24369019
13289 24369019 15443765 4130087 -3631068 -5970373 -4065416 -115833 1943328 -2125774
13281 -2125774 -10922336 -16223818 -12304841 -3761015 731922 -345779 -2063350 -2426564
13273 -2426564 -4003141 -7217357 -9164895 -9146158 -8773065 -6726879 -785539 4602996 1305870
13264 1305870 -9891550 -18144111 -17316650 -13514191 -13348938 -13296262 -7552233 908028 5657940
13255 5657940 7713332 11794909 15377034 11285620 -123976 -10338002 -14101010 -13581747
13247 -13581747 -11355504 -7701062 -5844447 -11081585 -21520478 -27064867 -21742277 -11358702
13239 -11358702 -5112326 -4847463 -6501299 -7070921 -5472470 -741272 5664612 9064692
13231 9064692 7603440 5887048 7935545 9883114 5460646 -3606625 -9004029 -6840757
13223 -6840757 -1615249 675995 -1621875 -6660609 -10564971 -7951870 3343528 16712487
13215 16712487 21047047 12560775 -1787420 -13772339 -21353245 -24561924 -20774014 -9806292
13207 -9806292 755167 2540247 -2663169 -5228834 -801228 4891540 5522333 2802811
13199 2802811 2449027 5342610 6722510 2649038 -5725322 -13561062 -16103688 -12417470
13191 -12417470 -7356449 -7871211 -14340453 -17558115 -9061854 6298817 14168788 8462068
13183 8462068 -1158005 -3380961 -417377 -2031743 -8946613 -11965904 -6900211 -345575
13175 -345575 1732990 1911291 3336795 2453525 -3348663 -7656792 -3367088 5213268 7639977
13166 7639977 2223090 -3216756 -4022076 -2938942 -1857701 1162597 4949717 4264969
13158 4264969 -1191217 -4863955 -3922167 -3793355 -7693899 -9704951 -4719828 1601301
13150 1601301 809360 -5296347 -8112216 -5670131 -4033611 -6399292 -8977122 -8590289
13142 -8590289 -7629703 -9340784 -12929159 -15508878 -15888797 -15088479 -15163644 -17774636 -22071174
13133 -22071174 -24547549 -22774724 -17905671 -11760281 -4396712 2326431 2746010 -5268790
13125 -5268790 -13678465 -12318868 -2888993 2789844 -573447 -4796492 -1100540 7318280
13117 7318280 11087958 7977128 3831307 2685792 2539250 1127660 446016 3062287
13109 3062287 6751736 5876835 -1825298 -11559469 -16014369 -13437386 -9331041 -9036378
13101 -9036378 -10786481 -8895177 -2388005 3674238 5626213 5597991 6890329 8940795
13093 8940795 9814273 10689304 14004263 18486283 19561733 14473403 4547793 -6867376
13085 -6867376 -15891422 -18385735 -12901817 -4201030 214482 -824010 -422428 5631896
13077 5631896 10450749 4790709 -7651569 -12385285 -3681998 6664528 5847734 -2197825
13069 -2197825 -4717027 -697252 -1229944 -9984525 -16407799 -12549722 -5420563 -5402671 -10965509
13060 -10965509 -13390038 -10290121 -5518452 -519451 4932501 6961365 2178286 -4063605
13052 -4063605 -3302929 3415514 7569310 6569880 5234524 4280448 -1342956 -10553490 -13686678
13043 -13686678 -6498118 2695908 5135148 2711156 1417384 1477502 563975 240658 2110769
13034 2110769 2768565 -751515 -5146762 -6528541 -6768459 -7709060 -4885880 4693224 13572413
13025 13572413 12505246 4840702 2038906 6728136 10781558 9574807 6941282 4840038
13017 4840038 -187190 -6544878 -4838295 7608847 18389705 14710683 565332 -9310250
13009 -9310250 -8648318 -4153074 -2854631 -3731896 -2842361 57988 2522410 2905216 877644
13000 877644 -2845130 -6224707 -7504992 -7343150 -7185670 -6106844 -2421364 1862533 2283721
12991 2283721 -1383557 -3624739 -618807 3851128 2986887 -4007625 -10349288 -9077489
12983 -9077489 -542712 7666965 8020898 683301 -6572714 -7205603 -3432948 -2102111
12975 -2102111 -4093542 -3007141 4223312 11072308 9812673 1886075 -5287450 -8728360
12967 -8728360 -11143898 -13795767 -14844443 -14297013 -13923949 -11829392 -4023548 7029651
12959 7029651 12463400 8623761 2301874 757514 2844972 4591886 6833861 10477988
12951 10477988 10000477 866321 -9720498 -9437448 2072101 11892446 11040408 4511430
12943 4511430 1174747 1472672 394301 -2843274 -4239209 -1503909 3763720 8913671
12935 8913671 11574594 9545698 2916717 -4332992 -7752483 -7272552 -6624624 -8243367
12927 -8243367 -10500543 -9959889 -5329135 737892 3661808 1689815 -1589066 -1410243
12919 -1410243 1597810 2167723 -1424984 -3988792 -1005104 4007867 4145325 -1008041
12911 -1008041 -5183942 -4361553 -819083 1969471 3187969 1949587 -3877964 -12744626
12903 -12744626 -17592948 -13460080 -4257574 2163020 3126004 878910 -3491902 -9222442
12895 -9222442 -11194369 -4947058 3354518 1671797 -10376099 -18656712 -14349799 -6471925
12887 -6471925 -6527164 -10583614 -8549772 -3243881 -4726299 -10206496 -7381469 2565456
12879 2565456 3998973 -7118717 -14298704 -5512052 9231145 15527284 14563641 12773245
12871 12773245 6008685 -9372117 -21119077 -16083311 -3231512 -1959208 -12057300
12864 -12057300 -15778934 -7905193 -2152248 -5527938 -7660301 -2079786 1234284 -5601198
12856 -5601198 -13357135 -10756424 -1934011 2700938 2707370 3397251 3951561 731527 -4266253
12847 -4266253 -7687852 -10927873 -13662474 -9385173 3095719 12144213 8504001 205872
12839 205872 -372640 2980878 -2025025 -13084099 -15303568 -5503990 2592961 198310
12831 198310 -5178832 -5541617 -5399405 -10626393 -15579010 -11766033 -2366781 2128957 -714547
12822 -714547 -3049903 1036822 7758401 9047214 2213080 -6845998 -9551134 -4489911
12814 -4489911 -209076 -4705074 -13195530 -12747413 -423704 10657235 7774361 -5358930
12806 -5358930 -15380938 -17017002 -15868743 -16334513 -16218544 -14172353 -14031901 -18075908
12798 -18075908 -21900018 -20629824 -16516950 -15649088 -19016714 -21154639 -17379148 -9329651
12790 -9329651 -2966780 -2751235 -7771263 -12564335 -12262313 -7628312 -3890334 -4111430 -6019851
12781 -6019851 -6614684 -6672555 -7952114 -9153893 -8754585 -9078945 -12376164 -15195855 -13132220
12772 -13132220 -9556600 -11665184 -17951898 -18706531 -10930047 -3397406 -3107989 -6008330
12764 -6008330 -6513587 -6807321 -9403539 -9696333 -5297702 -4133970 -11564367 -17072012 -8195453
12755 -8195453 7522089 10787811 -1466894 -13332673 -15377939 -14746735 -15936068 -9976942
12747 -9976942 7945239 25105085 27355682 17950337 9081637 3857655 -1574136 -5554928
12739 -5554928 -3332735 2417205 4757227 3284303 2154753 393085 -5985879 -14032246
12731 -14032246 -15342907 -7110957 5384123 15986700 20877871 17253702 6723641 -1627877
12723 -1627877 453895 9722784 16009617 16084529 15392250 17115514 18043796 15902218 12942782
12714 12942782 10607501 7084422 1665100 -4024233 -9759231 -15870631 -18583654 -13389226
12706 -13389226 -4445356 -3002115 -12933059 -24010105 -24017597 -12975261 -766902 5796817
12698 5796817 8319618 10785716 13257742 12904243 8821837 3754146 891191 154455
12690 154455 -948306 -3232584 -5048785 -6115289 -8854466 -13675548 -15829774 -10542579
12682 -10542579 78270 8469752 9373235 3958968 -2756890 -6330854 -5568624 -2846661
12674 -2846661 -1526650 -2502252 -4388707 -6479787 -8432527 -7512004 -1182587 6658037
12666 6658037 7887920 913000 -6644155 -8958649 -9303034 -12207813 -14969406 -12755496
12658 -12755496 -6522607 334795 7975346 16312898 20575820 17944658 13828834 14057853
12650 14057853 15697321 13594770 10646352 11901686 13257083 7224076 -3270700 -8453758
12642 -8453758 -6883440 -5239141 -4711448 -793536 3439670 -1849374 -16178199 -25660473
12634 -25660473 -21838020 -12007699 -5479623 -1070104 4636637 7384820 3420758 -128182
12626 -128182 6225667 19437521 27102954 23986146 17460708 16087250 18707663 17049143
12618 17049143 6576773 -7399475 -15214620 -14071823 -10818205 -11494991 -12599815 -8260403
12610 -8260403 -1910088 -1805526 -6717210 -6931965 -568667 2585246 -2415223 -6362163
12602 -6362163 -361588 9152413 9255355 -812993 -9158020 -7383163 466906 5149016
12594 5149016 2960130 -1937636 -3368402 -390681 1803636 -443884 -2885658 627102
12586 627102 7380268 8531011 3061663 -9777 3494278 5148859 -2773427 -14141844
12578 -14141844 -17563227 -12898336 -10031447 -13616736 -17616105 -14935195 -5718544 4856960
12570 4856960 11872648 12393892 5814618 -5247367 -15487137 -19445079 -14529952 -3304984
12562 -3304984 7484657 12788313 14200224 16126778 17845160 14358679 5280118 -3324726
12554 -3324726 -7409594 -8684314 -7686112 -911011 10600539 17330724 12818193 3493689
12546 3493689 -501481 264248 -2228236 -8787109 -11144610 -4835540 4392303 9220174
12538 9220174 9522842 9367593 9521350 6706815 -938655 -9968297 -13842877 -9447927 -1159201
12529 -1159201 3344690 1536585 -2419948 -5038875 -7851261 -11792485 -12172640 -4695980
12521 -4695980 6102997 10553019 5903230 -172657 722136 7747543 12037486 6342019
12513 6342019 -7340385 -19457289 -22642009 -19416051 -18072874 -21066385 -21751794 -14704103
12505 -14704103 -4653980 -571661 -3721448 -7012014 -5152336 -225484 2995509 2376648
12497 2376648 -2141270 -9780122 -16768850 -16491083 -6237236 7237989 13336832 9701442
12489 9701442 4727564 5691054 8551137 4949128 -3199311 -4552320 4486710 12027320
12481 12027320 5977110 -9153242 -18378100 -15155562 -5938086 1555193 5504197 6100643
12473 6100643 3612292 1554508 3897375 7692489 6239590 1161078 2586720 13797274
12465 13797274 23858651 20994950 7428491 -4368869 -5932866 847825 7679445 6535864
12457 6535864 -4137748 -17102713 -23207113 -21461665 -18064708 -16034653 -13034974 -9932594
12449 -9932594 -12115995 -19238581 -22864836 -18761365 -12733943 -9501027 -5597070 287494
12441 287494 569975 -8217142 -15226830 -9959083 311146 1107849 -6549174 -8777413
12433 -8777413 -1757627 3540248 946600 -1542514 2567177 5712740 -1750143 -14873580
12425 -14873580 -19060410 -8555544 7600639 17170659 16381437 9766726 3543146 1524626
12417 1524626 4471025 9793129 12418171 9328424 4115941 3781874 9249346 12943040
12409 12943040 9215114 2853712 1442320 3245374 1284262 -2822841 -85902 9936725
12401 9936725 16008038 11872510 5192351 3931825 3992733 -1522440 -9506390 -13080369
12393 -13080369 -13856443 -17243487 -20090721 -14317571 -1304894 7478621 5080612 -3157655
12385 -3157655 -7678940 -5176021 196114 2701386 1425243 1458987 6780092 12597298
12377 12597298 10454482 1508623 -3641242 -1118088 324097 -4974648 -9028764 -4522617
12369 -4522617 630874 -4316218 -13701830 -13292167 -3010311 3214912 -1020951 -7508472
12361 -7508472 -8825195 -7836187 -9075000 -11702244 -14461769 -18341129 -21180321 -18229205
12353 -18229205 -11182550 -8413945 -12606579 -15822009 -11241184 -3180777 -336743 -4037649
12345 -4037649 -8524401 -9904784 -9893683 -11403535 -13934729 -14490662 -11968792 -8773203 -6848235
12336 -6848235 -4228037 804923 4032614 331906 -5993348 -4802782 3952703 8206263
12328 8206263 2420621 -2668806 3250963 13943790 17572124 14902616 14310383 15528640
12320 15528640 11856989 4318826 736152 3047568 6324416 7576392 6064421 -358658
12312 -358658 -9214484 -10355606 -796541 5217505 -4433993 -18288832 -17083514 -4156437
12304 -4156437 1049187 -4664529 -6516296 -1597427 -4427641 -18242372 -26003763 -18781027
12296 -18781027 -10143292 -11313924 -13447185 -7786809 -3287639 -8159501 -11548247 -1921112
12288 -1921112 10498357 8907194 -3218708 -9391402 -6098760 -2929397 -2539178 968406
12280 968406 6178280 3889765 -7073781 -17242372 -20560185 -19792073 -17594874 -12839469
12272 -12839469 -6915669 -4521860 -6479831 -8560733 -8075046 -5992925 -3076667 652481
12264 652481 3434557 3456754 1687018 -532471 -3815130 -7245306 -7206185 -4090462 -4575514
12255 -4575514 -11408475 -16722522 -12759904 -4050121 -751350 -4212924 -7837174 -8775465
12247 -8775465 -9506617 -9869413 -6679616 -958066 2025398 35841 -4583025 -9616582
12239 -9616582 -13637376 -13704969 -8595225 -3067645 -2989998 -7171304 -9330308 -6951614 -3143455
12230 -3143455 -1047465 -1127178 -2615506 -3755020 -2794600 -1945131 -6229778 -14347565 -16340621
12221 -16340621 -6587480 6368914 10723778 7131575 4406314 3950941 -189703 -7609654
12213 -7609654 -9928385 -4267372 2134510 3804648 4727691 10070786 17146803 19340803
12205 19340803 14723567 7205174 2020545 2035063 5904543 8996841 8568417 7494970
12197 7494970 9597442 12666993 11118661 5026127 800673 2112741 5490774 6463665
12189 6463665 5078722 2903439 -1172500 -8594842 -16938164 -21467844 -20545252 -17274339
12181 -17274339 -15070962 -12708179 -5643693 6970926 18912836 23376320 21054279 17384171
12173 17384171 13297980 5541029 -3585970 -5663232 875647 5349432 -1281354 -13270239
12165 -13270239 -17725702 -10590410 1760157 12293526 17216209 13896691 3118865 -8369205
12157 -8369205 -14233834 -15676627 -16834259 -16831328 -13246591 -9552265 -10603875 -13378026 -11072374
12148 -11072374 -4770005 -2063012 -4720682 -6345968 -2477245 4667845 11563188 16275583
12140 16275583 16395843 11237246 5362388 2928922 565595 -5847614 -10344624 -4167048
12132 -4167048 7521925 9597319 -866063 -10009641 -8634735 -4744929 -8172953 -15110904
12124 -15110904 -16921579 -14179631 -11828878 -8421287 -695875 7429251 10900945 13274666
12116 13274666 19604288 24111445 17358216 3781442 -976741 8184290 18410604 17161456
12108 17161456 7886418 1532379 485907 -975899 -4944672 -7149256 -4862274 -631222
12100 -631222 2541739 4439656 4899025 2675233 -832047 -981352 3788795 8403749 7667139
12091 7667139 3269398 -541868 -5407125 -15659146 -27264343 -28779215 -16532959 -1292680
12083 -1292680 5320578 4641172 4823819 6882629 5733379 1521803 -291609 608176 -1112532
12074 -1112532 -5177510 -3859997 4822922 11067691 6719434 -2087678 -3542711 2935842
12066 2935842 7166495 4242334 1191308 5046636 11083457 8614331 -4094184 -16538261
12058 -16538261 -18574549 -12012388 -6579212 -7038333 -9248174 -8783234 -7495991 -8271520
12050 -8271520 -8087671 -2332178 5817461 6980033 -2296159 -14250452 -19351058 -17105887
12042 -17105887 -13940927 -12927851 -10480853 -3729714 2925478 2095500 -6590059 -14473686
12034 -14473686 -13722532 -6547783 -1230310 -609630 544986 6402049 13748882 17329035
12026 17329035 17147839 16938269 18376198 20149796 20347732 17057022 9412793 676834
12018 676834 -3274907 -1695448 -1102104 -5623647 -9774215 -6632686 583277 2227570
12010 2227570 -4599726 -13526938 -18281481 -17835791 -13054495 -5243729 1656348 3618919
12002 3618919 1742171 -219755 -2361699 -6021920 -6111748 4594773 22054499 31235064
11994 31235064 23935256 8876353 -534492 -1650531 -362929 192100 1211595 2157198
11986 2157198 790693 -1528155 -643322 3806607 7054877 5427581 675250 -3090023
11978 -3090023 -4501507 -5429720 -7406676 -9245788 -8894455 -6913676 -6440270 -9040064 -12117666
11969 -12117666 -11694476 -6582278 1065197 7338942 7595203 -817349 -14032926 -22796060
11961 -22796060 -21750557 -15272497 -10694614 -9073308 -7273586 -5425942 -5621819 -5723946
11953 -5723946 -1946705 3827694 6791244 7734537 10187054 10303014 625572 -14797828
11945 -14797828 -21102904 -12933371 -2879058 -2817267 -7240320 -4715977 2668049 3787454
11937 3787454 -2260756 -4748074 941236 6091442 2714480 -4192868 -4206996 3917168
11929 3917168 11205288 10266860 3281973 -2636188 -5018821 -7988112 -14475694 -19901903
11921 -19901903 -17423283 -8291144 -1563719 -2043188 -3887865 191136 7920284 10853061
11913 10853061 5871722 -2425863 -9311536 -13830118 -15003104 -10097776 835190 12317612
11905 12317612 17884997 15478236 7613837 -1312360 -6890190 -6804173 -3192041 -977622
11897 -977622 -1950483 -2322364 1750863 8210581 11742814 11051951 9503507 8625897 5613425
11888 5613425 -904044 -6847630 -7842667 -5266704 -3118682 -1515816 1484063 3353954
11880 3353954 -968811 -10169874 -16000705 -13723295 -7760364 -4591781 -5149871 -6858195
11872 -6858195 -7935248 -6618122 -1567732 3532455 1853813 -5871930 -9346862 -3153005
11864 -3153005 4058609 2708000 -2458046 -895773 5381994 5023885 -3374797 -8887664
11856 -8887664 -5913781 -1158676 -105310 929389 3985824 2189631 -8703637 -19874982
11848 -19874982 -19507675 -8481862 1482817 2292430 -3818387 -9618578 -10030534 -5491765
11840 -5491765 -1234961 -1577507 -3971663 -2273522 3642981 7311897 6282847 6221294 10791585
11831 10791585 14373248 10322575 993151 -6325943 -8929177 -8431124 -5427138 -899942
11823 -899942 686395 -3139905 -6544805 -1735271 9233825 15786840 12460315 5235574
11815 5235574 2548332 4866183 6291666 3666457 151840 -516672 -360236 -4545352
11807 -4545352 -12549294 -16271604 -10175001 203413 5207171 4138166 4273400 7478802
11799 7478802 6325745 -3993824 -17236753 -23571224 -20097106 -10653864 -428941 5886192
11791 5886192 5650971 1607411 -298242 1706571 4929274 9703937 19041162 28646529
11783 28646529 27181700 11687365 -6165003 -15193881 -17084260 -17009280 -12425037 -1421792
11775 -1421792 6969007 3787914 -4600245 -5227970 2100139 7301102 8077161 10986281
11767 10986281 16012467 15065986 7304835 2309048 4850909 8364286 7064611 3694745
11759 3694745 1570497 -774733 -3246997 -2383199 590703 21459 -2509727 1706939
11751 1706939 12180342 15748866 6595530 -2937868 -1340948 4117403 977550 -7054643
11743 -7054643 -7730098 -2273743 -2779648 -10731334 -15264785 -13117691 -13530026 -19612408 -20590415
11734 -20590415 -9900402 2097009 3130729 -3108685 -4641444 367866 3847902 2118192
11726 2118192 -810849 -2345982 -3934393 -4727999 -1325002 4958406 7915018 5346220
11718 5346220 1863140 998857 728074 -582641 143538 4846903 8753252 5823500 -2365220
11709 -2365220 -7548020 -4075622 5235995 12039615 9915229 40581 -9631400 -12186800
11701 -12186800 -8910012 -6447886 -7198867 -6563871 -683316 7729035 13697545 16042417
11693 16042417 16021705 13450440 7933175 1797280 -1271041 740264 7447704 15616869
11685 15616869 19177157 14479365 6496671 3745909 5487748 1837312 -10071817 -19151370
11677 -19151370 -15567699 -4196462 4751429 9996143 14613306 15426917 8845263 1009740
11669 1009740 -191824 2342998 2844380 6116804 17406174 25376040 15179531 -4584924
11661 -4584924 -10357995 252257 4781378 -6594188 -14847394 -4486621 10844526 11362510
11653 11362510 1001691 -4331006 -3459709 -4969082 -6827959 -1513956 6006687 4974331
11645 4974331 -1512449 -1704760 3836896 4120386 -2256543 -6354687 -6524817 -9537757 -14338177
11636 -14338177 -11606723 -928573 7302210 8868834 9499311 10237846 5364203 -2329119
11628 -2329119 -1440595 7720986 9871222 -644273 -8575478 -1408045 10816237 12240449
11620 12240449 5191280 2675810 6328404 7482865 4172366 1837933 625999 -3626969
11612 -3626969 -7694055 -4479126 1907364 -1014347 -13531947 -19728487 -9889632 4679382
11604 4679382 7551442 -903457 -7403723 -5903646 -3025074 -5174257 -10188019 -13041075
11596 -13041075 -11994423 -6713627 2957683 12850611 14826329 6022149 -6057031 -11969680
11588 -11969680 -10379487 -5509642 943697 8898243 14316867 12863998 8071623 7457203
11580 7457203 10180761 7314128 -3719861 -13878372 -15369323 -11546113 -9011583 -7678988
11572 -7678988 -5252524 -4806720 -9728191 -15582071 -15110961 -8764191 -3499358 -3319753 -6674659
11563 -6674659 -10350158 -10312815 -2390805 11336534 20576294 18715006 13162645 15237442
11555 15237442 22679485 22568017 10970611 -1083914 -3405513 790479 1852579 -3829273
11547 -3829273 -12372603 -18213974 -17671690 -10455761 -648004 6113111 7743552 6046073
11539 6046073 2562487 -2507567 -7874535 -11655506 -14130657 -16468857 -17385381 -14614002
11531 -14614002 -8595716 -1358860 6012365 10965859 8422690 -1680125 -9290424 -4776206
11523 -4776206 7366405 13821007 10311589 4931435 3597976 2208268 -4105490 -12445463
11515 -12445463 -16614458 -13935300 -5327653 5240090 9928476 3022058 -9766136 -15030568
11507 -15030568 -7604510 3791491 9311456 9091955 8290215 8586732 9522960 11970585
11499 11970585 14855066 13418672 5864071 -2339093 -5149353 -3128720 -265058 1998607
11491 1998607 3551707 2887129 328177 279445 5261367 10550918 9826014 4354111 1716685
11482 1716685 5798637 11926375 12781453 7014129 589936 -492006 2205470 1471360
11474 1471360 -5739418 -14197168 -18082448 -17798849 -15151241 -7847003 3998583 11468003
11466 11468003 7114655 -2083454 -3756681 342229 -2192097 -11648673 -13226868 -1184821
11458 -1184821 10040888 7447005 -1505443 -2835397 1705109 -511279 -12506441 -24533219
11450 -24533219 -27933645 -22406294 -12651005 -5934230 -8855212 -18353794 -20751325 -8762690
11442 -8762690 5728381 6698630 -2764097 -5552160 2968993 8595431 1272166 -9598794
11434 -9598794 -10366563 -3311607 -1349348 -8000042 -13469827 -10291486 -3510665 -1370497
11426 -1370497 -2098421 2883185 14092686 20348340 13496904 765614 -4022934 1951252
11418 1951252 9323582 10979458 8526327 4164519 -3645335 -13073366 -16863114 -12672733
11410 -12672733 -7686196 -7405321 -7542202 -3453809 167242 -2733030 -8465102 -9648427
11402 -9648427 -7147797 -6483115 -6878507 -4290829 -1955427 -6444792 -14392654 -14542771 -4132767
11393 -4132767 6812637 9691403 6858837 4023793 1178205 -4589100 -12765500 -19557160
11385 -19557160 -20901431 -14444710 -3109156 3479570 -2120385 -13713585 -16342130 -5214570
11377 -5214570 7740176 10249548 5036454 2388503 3771603 1975486 -5145883 -10653394
11369 -10653394 -9335642 -4873636 -3097673 -3820035 -3606012 -2514322 -2772257 -2982368 514834
11360 514834 6753302 10240531 9022899 7061462 6263413 2204175 -7608908 -16498622
11352 -16498622 -16140351 -7698358 1360880 8046044 13142029 13031512 3522995 -8503138
11344 -8503138 -9749308 203804 6064317 -1653734 -13549282 -16644576 -11860286 -6950616
11336 -6950616 -1880023 6714995 13591914 10849581 2094665 -1981440 -189966 -751872
11328 -751872 -5236530 -5145077 3235980 11498043 10886644 3465120 -2568619 -2855205 868490
11319 868490 3714711 1034398 -6856554 -13039454 -11850693 -7255388 -6814796 -8855777
11311 -8855777 -5174957 2925927 2786219 -10803341 -25297985 -26588215 -17542860 -11005199
11303 -11005199 -9957679 -6158846 2818020 6837627 -2563648 -19103086 -28977185 -26930626
11295 -26930626 -18838823 -10438168 -1262717 8274205 11198699 2216962 -11680899 -17076811
11287 -17076811 -10946427 -3999943 -4934155 -9018641 -7224494 -87698 4666450 4137288
11279 4137288 2333390 2405228 3573568 4552633 4219940 406122 -6289724 -9518073 -4432348
11270 -4432348 4024874 7195918 5209634 5176877 8243280 8311769 4174055 2276492 4665565
11261 4665565 4755705 4012 -1315702 6577372 15368607 13829301 4733665 246685
11253 246685 3726270 6823561 4068738 -217966 -1936130 -4789842 -12580479 -20529833
11245 -20529833 -21290703 -16409449 -14736158 -19601903 -23567341 -18040861 -4178306 8582282
11237 8582282 12455321 7206358 -1813044 -8357635 -9190036 -6548042 -6222546 -10320858
11229 -10320858 -12947929 -6932659 5853859 15981587 18792359 19416520 23043476 25894427
11221 25894427 20778351 8313224 -2640972 -4944172 -153794 4218968 2637099 -2990324
11213 -2990324 -5876455 -3734511 -3292340 -10702099 -19611172 -17262615 -3081730 8949999
11205 8949999 9964619 7412424 10106713 13104607 8126739 249146 571242 7233259
11197 7233259 8102328 851150 -3474347 1595123 8624178 8607552 3117379 -371138 1445978
11188 1445978 6204539 9984260 10591517 9522001 10202579 11584141 7160843 -4575147
11180 -4575147 -13772597 -11257410 -2314938 1330938 -854520 -356401 3676465 3403148
11172 3403148 -2883108 -8572194 -11568800 -15330352 -16580140 -7797731 5514455 7080851
11164 7080851 -5192074 -13307188 -6108623 4131375 2480522 -6299785 -9003254 -4917329
11156 -4917329 -1428531 1084377 5605527 7859640 3165604 -2913700 -3603251 -3464820
11148 -3464820 -8728439 -12665460 -5800965 5514311 7323850 581938 -1736340 2476856
11140 2476856 2464437 -4473905 -8068556 -3865435 11589 -511480 1635733 8217984 7437462
11131 7437462 -7708739 -24681923 -26517889 -13853960 -1563204 691429 -4995183 -13206752
11123 -13206752 -20841159 -26000962 -28087399 -28262538 -26255369 -19744141 -10310437 -5165879
11115 -5165879 -7836059 -11784096 -9727436 -5383899 -8101130 -17838254 -24070584 -20424362
11107 -20424362 -12788903 -9808444 -11090691 -9682909 -3274323 2472123 2118908 -1998045
11099 -1998045 -3013096 1314761 6068505 6398980 4108027 4435011 8220065 10891475
11091 10891475 8984597 4248830 414161 -1402395 -2492077 -3281509 -1870226 3948796
11083 3948796 13093827 20155596 20051100 14274886 9487425 8500253 6973210 1966116
11075 1966116 -1967269 -1253538 -2278477 -12187831 -24006526 -23407341 -10820342 -3349552
11067 -3349552 -10110499 -18570670 -13814105 -357504 6742160 4453657 1980466 3038892
11059 3038892 2213964 -1848941 -3152379 -282438 334302 -3184621 -3378562 3619973 9857518
11050 9857518 7144005 -736790 -4918508 -4494113 -4657753 -6345539 -6100653 -3638527 -1814827
11041 -1814827 -600206 1935820 3833019 1191665 -4850869 -9535767 -12120751 -15537766
11033 -15537766 -19306155 -20224419 -19697604 -21873870 -23970896 -18263324 -6168342 230443
11025 230443 -4073360 -7881231 -277512 12443466 16326078 9581707 1561608 -3339938
11017 -3339938 -8040942 -11185978 -6798454 3124801 8211947 5564843 4757506 11780667
11009 11780667 18386841 14718785 3906391 -4587561 -9345498 -14858885 -19608376 -17120060
11001 -17120060 -7903432 -847035 -1368069 -5216051 -5745828 -1854946 2727242 3341771
10993 3341771 -3433595 -16865876 -30074121 -35273412 -32295898 -27763455 -24795704 -18793536
10985 -18793536 -6171421 7587265 13377283 9744522 4394078 5009063 11733531 18844272
10977 18844272 21515402 20145421 18818045 19881897 20603501 16526735 7971050 622974
10969 622974 -1544833 -1350357 -3899591 -8799808 -10274644 -4790512 4552714 11859464
10961 11859464 13820823 9928399 330505 -12961778 -23577478 -23937685 -13587268 -2445779
10953 -2445779 -2158642 -13509816 -24781882 -24011577 -11256919 2890951 9260089 7628241
10945 7628241 2905343 -2134644 -7894379 -13917332 -17421413 -16508631 -12717180 -8970371
10937 -8970371 -5958713 -2209640 2239687 4060655 116189 -7862571 -14120648 -14923571
10929 -14923571 -11814702 -7743844 -2517371 4887441 11344179 11890346 7532610 5521479
10921 5521479 9175534 12148896 7448532 -1429134 -4739450 -339775 3845564 1952861
10913 1952861 -2316735 -3253418 -1929253 -2522493 -4245355 -2656612 3205955 9832776
10905 9832776 13738919 12971340 6536354 -2877672 -7928827 -4193466 2771604 4082301
10897 4082301 59230 -947321 4210832 9713919 11439743 12421639 14220519 11709540
10889 11709540 2517325 -5592754 -4485607 2244520 4944047 2199847 1216663 5642239
10881 5642239 10968648 12071280 8716711 3156604 -1949933 -2759906 2955926 11180615
10873 11180615 14736851 12154495 9054767 9683159 11564076 10330676 6176007 3246167
10865 3246167 4411116 7494977 5895628 -5182469 -20722585 -27345610 -17781598 -1382239
10857 -1382239 6350224 2923983 -706575 1589588 2907133 -3130103 -10500266 -9802709
10849 -9802709 -2564364 1902972 556244 -396910 4340503 12355713 17353659 15623349
10841 15623349 8561084 1610172 -215829 1659826 -53092 -8401969 -15352043 -10748864
10833 -10748864 2976029 11817395 7415591 -2791081 -6143438 -805181 4101090 2265523
10825 2265523 -2021238 -1329119 3981576 6066748 -82958 -9808551 -13536198 -7182525
10817 -7182525 3451165 8622803 4311750 -4430568 -9608432 -8714262 -5583168 -3308007
10809 -3308007 254120 7578233 15278061 17782704 15994954 16246838 20005391 21312566
10801 21312566 17110682 13193887 14747206 16880602 11752170 1238905 -5284354 -3669785
10793 -3669785 1970717 7361098 11223813 10979288 3872108 -6292654 -11167370 -8670806
10785 -8670806 -5161452 -5202925 -6266306 -5752147 -5695816 -7078047 -6515845 -2641600 749513
10776 749513 1906652 4515900 9246595 9518512 2152473 -4967700 -4082962 -221613 -2820748
10767 -2820748 -9244634 -8167491 2133068 10415271 8806159 2341341 -986390 -890781
10759 -890781 -757560 3423 3546496 7823597 8752434 5818740 1534169 -2451618 -5085733
10750 -5085733 -4066909 1414320 7110061 7038408 768289 -5612987 -6677526 -3720370
10742 -3720370 -2484682 -5928960 -10622808 -10879112 -6228237 -3214083 -7755968 -16481593
10734 -16481593 -19388879 -12503513 -3855407 -3239799 -9294070 -12410735 -8961304 -5482924
10726 -5482924 -7659953 -12523964 -15127230 -16016158 -16274387 -11332452 1808573 15204379
10718 15204379 17919963 11861229 8838722 11212718 7606014 -7625004 -22230179 -21940564
10710 -21940564 -10262864 -2372518 -4395267 -9009539 -9093266 -5891516 -3511195 -3019134
10702 -3019134 -3099786 -1431417 4368737 12779098 17121765 13426124 7235534 6406770 9369268
10693 9369268 7916027 449180 -5466709 -4002190 2672089 9702467 14483112 15369938
10685 15369938 11718950 6466882 3563214 2602527 1057816 716432 5191861 11680724
10677 11680724 12876259 7670468 2631998 1977375 3262542 3871886 4202506 3141198
10669 3141198 -1763382 -7595382 -7143002 620454 7766794 7515227 1032742 -7265901
10661 -7265901 -14412624 -17420258 -14387883 -9124503 -8056550 -11141138 -12542871 -10659785
10653 -10659785 -9487201 -9839817 -8563185 -7069416 -10121744 -14841878 -12634468 -4411673
10645 -4411673 -1142142 -5413871 -6149341 2251852 9320478 5711347 -1511098 -1189900
10637 -1189900 4872247 8173035 7880762 7895272 7219198 4043892 2675935 6125725 8267179
10628 8267179 3328465 -3434090 -4663173 -3595882 -6813724 -10823460 -7978579 -519237
10620 -519237 3745931 5602091 11558046 19585351 20344830 11871249 2173129 -2396945
10612 -2396945 -2023057 2020707 8303248 11924010 9477558 6363208 10380764 19131799
10604 19131799 22507055 16753740 7502873 -273783 -6536082 -10664840 -10170577 -5819337
10596 -5819337 -1557368 716712 971855 -2393662 -9448387 -14587845 -12868053 -8629274
10588 -8629274 -10238014 -17619953 -22558804 -20490043 -14765836 -9733031 -6376041 -4785317
10580 -4785317 -5135413 -6090841 -6316970 -6395063 -6178137 -3569748 593407 1508230 -1082747
10571 -1082747 431955 9854454 18526624 16682416 8035584 3625148 5325026 5678181
10563 5678181 1778572 -871287 1438155 4591758 2575305 -4676949 -10005707 -5145231
10555 -5145231 8821253 18118210 10952664 -4499271 -8027252 4501716 15039009 10735484
10547 10735484 1579358 1205989 5763239 5099852 1268864 687672 -522533 -7632552
10539 -7632552 -13872717 -11275696 -5336667 -4253943 -4359856 -1359395 -3352985 -15000927
10531 -15000927 -21983744 -12062950 603263 -4559320 -20845995 -25508922 -15772886 -7179264
10523 -7179264 -3022411 6426748 18104343 17889332 7661384 4555349 12445056 17839413
10515 17839413 14289121 8405886 2706673 -5374544 -9833768 -3696022 3819457 206086
10507 206086 -7036183 -4226954 1055247 -5757451 -15704936 -11785309 -2664605 -5286797
10499 -5286797 -8025311 7499753 23755329 15260256 1827990 15033772 30324012
10492 30324012 7339557 -19369053 8829513 33220002 -82695514 -326633578 -481026755
10485 -481026755 -386007304 -157191908 -26416673 -44076681 -75314729 -41279478 -6261771
10478 -6261771 -24039603 -45335566 -22716722 5405077 -5801446 -28478970 -21727821
10471 -21727821 -4572600 -11039972 -24201187 -11782291 12148192 14379794 1197116
10464 1197116 1054744 12091271 11906904 2208934 2645460 12229491 12758529 1910308
10456 1910308 -7438305 -12802872 -20318338 -25563711 -20769623 -13712481 -17106045 -26556222
10448 -26556222 -29514201 -27841360 -30939269 -34468395 -27091206 -12548917 -5033262 -6835435
10440 -6835435 -8501093 -6932944 -6247715 -4639848 2767385 10682435 8776872 -1645846
10432 -1645846 -9325991 -9058134 -4332067 1989593 7380552 4676558 -8925317 -21128638
10424 -21128638 -16553437 2074990 17100466 18761603 12828770 6742700 818930 -5518627
10416 -5518627 -9562224 -10164865 -9538881 -8842367 -7238025 -4705049 -1217093 4266759 9387167
10407 9387167 7784394 -986851 -6924031 -3034082 2919058 296495 -6783779 -6762510
10399 -6762510 -1627865 -4950171 -18593416 -27118586 -20305476 -7870438 -3865278 -6788304
10391 -6788304 -5289529 2764329 7938919 4403717 -1746550 -1466445 5607996 11747087
10383 11747087 10759973 4188971 -1528153 -2132082 863065 3092967 3143534 4531550 10883226
10374 10883226 19615829 23127288 17821878 8847007 2261375 -4044910 -14666005 -24252978
10366 -24252978 -21980081 -10570682 -7672328 -20355283 -30613785 -19503080 3582654
10359 3582654 12822344 2279302 -8721222 -6492115 125739 -1127941 -7335997 -9899768
10351 -9899768 -8932867 -7925607 -4655374 2432609 7426241 6210988 4922486 9605372
10343 9605372 14419701 10419235 732074 -3354606 1810674 9323284 12244178 9619075
10335 9619075 4347347 1341845 4967564 12751716 15464769 9044128 1568894 1907112
10327 1907112 6878050 7665971 3785520 1008935 -637750 -5813437 -12557841 -13175700
10319 -13175700 -6966302 -1939090 -1838912 -676051 6345345 14292783 15730915 11056661
10311 11056661 6844627 7272895 11043361 14461850 14402582 9758499 2486375 -3502175
10303 -3502175 -5927067 -5943519 -5608203 -4655510 -1146142 4799343 9166975 7478435 618453
10294 618453 -4513119 -2494625 3415635 4811621 -1291413 -9387551 -13730595 -14941667
10286 -14941667 -15899394 -15547985 -11372814 -5591243 -3836450 -7730400 -12342916 -11846312
10278 -11846312 -5686422 1398835 4162465 1219253 -4462494 -8670144 -9308165 -7063455
10270 -7063455 -3939353 -1698122 -611216 876175 3857706 6259996 5300359 3099650
10262 3099650 5074383 10621652 11431791 3591963 -4911590 -5706973 -3096055 -5968869
10254 -5968869 -11264857 -7977100 3591453 9968167 4392845 -3462572 -2389752 5777359
10246 5777359 12049302 12370463 8228641 2534790 300889 6543325 18023978 23512184
10238 23512184 17733722 8694878 5309800 4347351 -2631322 -14131364 -19327654 -12719639
10230 -12719639 -1384986 3688729 191933 -3275444 2077115 12752380 15258440 3993509
10222 3993509 -8990391 -9695797 -2160862 -890760 -6808103 -6400426 4474718 13102716
10214 13102716 11332938 7999920 11495050 15052330 10672431 4837619 7227440 13697053
10206 13697053 13734953 7234275 1503238 -1837485 -5495348 -8290461 -8970808 -11652183
10198 -11652183 -17215300 -17068345 -6600475 3872386 4427662 2596948 9660835 18486657
10190 18486657 13948954 -49116 -4812515 3275291 7827251 -197381 -9486166 -8368449
10182 -8368449 -1323333 2082253 1699539 2393986 4872606 7239666 8066254 4330232 -5568654
10173 -5568654 -14670730 -12991544 -2553909 3397317 -1065961 -7640285 -8639825 -6957843
10165 -6957843 -6237066 -2928824 4510794 8529372 3095205 -5968271 -8867426 -4011226
10157 -4011226 3830439 11008544 14411127 10114588 -46926 -5862170 -46560 11534157
10149 11534157 17123275 13325952 6810226 4848375 8896911 14920269 16369713 9623597
10141 9623597 -795796 -5754523 -2126463 4398268 8189811 8968844 6407836 -2103193
10133 -2103193 -13703480 -18216948 -10875958 -519913 2121800 -1236330 -1683420 2060240
10125 2060240 3222552 -864355 -4891581 -3968924 611819 4591196 5130023 2029793
10117 2029793 -1896752 -2529250 558991 2650466 209140 -4324072 -7261784 -9023239
10109 -9023239 -10189893 -7036698 2009791 9049667 4526769 -8768745 -17948824 -16516673
10101 -16516673 -10313551 -5661207 -619762 7473455 13337350 9884200 -740807 -9260177
10093 -9260177 -11113286 -9982991 -9197402 -5789628 3554967 14564054 18539623 13056278
10085 13056278 5231895 2959768 6303308 10054498 11732896 12792956 13536174 12197275
10077 12197275 9491850 8808298 10038067 8251976 1758043 -3151200 -559182 5010928
10069 5010928 3186256 -7961563 -17917491 -15828466 -2870860 9739187 12836300 7229429
10061 7229429 690574 -845081 1527495 2710600 592102 -1592207 46064 5286043
10053 5286043 11092606 15372430 16940096 13681452 4623065 -6386209 -12665295 -11323021
10045 -11323021 -5588150 -337790 1991117 1015714 -2258063 -4578068 -2858169 536824
10037 536824 -1023361 -8894546 -14963035 -11749724 -3378418 -274743 -4830425 -9313032
10029 -9313032 -7492961 -847878 7324368 15345430 18250641 9023027 -9456448 -22087850
10021 -22087850 -19199840 -9676508 -7277248 -10422401 -7775736 605582 3027003 -2946415
10013 -2946415 -5135311 3176285 11971326 10987227 5487202 5564985 9034220 6490021 -2627457
10004 -2627457 -10280678 -12462494 -11535270 -8788997 -4235067 -1677915 -4646983 -8732263
9996 -8732263 -6907303 -1001905 1489704 552798 2640024 6609787 3371301 -7047724
9988 -7047724 -10606998 1183095 16591781 18318001 6618935 -2636535 -156566 6958687
9980 6958687 8387415 4463597 2296873 3478302 2158700 -5161976 -13156202 -13848092
9972 -13848092 -6979563 -322222 365105 -2406928 -3459328 -2500192 -1605553 1934065 13244571
9963 13244571 29252368 36693032 25507839 2140026 -14867577 -13151585 1942243
9956 1942243 14958340 17112874 12624951 9255820 7869844 4924958 1245517 1563258
9948 1563258 6190636 10165369 11507350 13103607 14504772 10214406 456128 -4716106
9940 -4716106 1019373 9588274 9899055 4175136 2976711 7947536 10862194 8560280
9932 8560280 7332609 10789543 13442125 10080684 3901784 1130359 2986970 6361569
9924 6361569 8132936 6384449 1327140 -3163243 -2822032 880327 2020803 -1190920
9916 -1190920 -3691676 -1247755 3598404 6008921 5750460 6145700 7900677 7431691 1983028
9907 1983028 -5424323 -8386376 -4892294 253139 3398699 8516107 19505257 29500967
9899 29500967 28263442 19559934 17997385 25748161 27446048 15149503 2804204 4634498
9891 4634498 13545714 15227616 10619590 8068604 5803014 992318 3903940 21117712
9883 21117712 36220914 32278241 22276028 28110434 41216965 41018748 41487486 68087427
9875 68087427 87827434 26250233 -119429999 -241654144 -242851239 -153844479 -81228055
9868 -81228055 -68978035 -73503888 -58133370 -41727570 -44977726 -49236214 -34707903 -17155457
9860 -17155457 -17813969 -26626718 -22824847 -10111236 -5578640 -9593986 -10519180 -8200893
9852 -8200893 -11286722 -18447860 -20651537 -17226574 -14548241 -13232527 -10109944 -8688715
9844 -8688715 -14596763 -23439657 -25112750 -18644677 -12487594 -11146158 -10732065 -7575038
9836 -7575038 -3635803 -2926618 -7425751 -15429762 -20464436 -15456884 -2469522 6333929
9828 6333929 3069376 -5348463 -7589381 -3541923 -1040682 -1302076 1736121 8855584
9820 8855584 12811420 9469676 3079745 -1587167 -4734779 -6645388 -4498658 1988643
9812 1988643 7358749 7287979 4756163 5309961 9214751 12255704 12129496 10155967 7952641
9803 7952641 6176331 6264077 9855387 15303580 17137073 11119862 -574550 -10716565
9795 -10716565 -13933879 -11418481 -8211876 -6956216 -6169293 -4480881 -3770151 -6124819
9787 -6124819 -9323344 -8355882 -1733058 6027427 9293989 7075190 2409604 -2667705
9779 -2667705 -8887950 -16061381 -20287511 -17407135 -8603320 -30471 3648989 3351895
9771 3351895 2579026 2786985 3384743 4092802 4622575 3279995 -1280224 -7473148 -12404760
9762 -12404760 -15344837 -16911292 -15804438 -10182099 -2240503 2784811 3193600 2431485
9754 2431485 2701466 1252548 -4400636 -11478916 -15534834 -15697649 -12721523 -5574205 4804939
9745 4804939 11498045 8474171 532779 -1001022 6662055 14237685 13919238 8929352
9737 8929352 5588789 3272927 -1174669 -4859154 -3055172 1491241 2292093 164083
9729 164083 1152501 3993141 250260 -10767371 -17665524 -12640917 -2658855 1611587
9721 1611587 357729 88110 941924 -1656856 -6430869 -7319211 -3579637 189388 3209840
9712 3209840 8616076 14413599 13916861 7068430 2355170 4152796 6252630 2464654
9704 2464654 -3390175 -3823719 1013039 4240423 1537453 -5199504 -11551683 -14396631
9696 -14396631 -13378436 -10578052 -7270134 -988626 10503777 22077570 23662823 12268185
9688 12268185 -3199556 -12106198 -13005431 -11621290 -12048719 -13294996 -11694141 -4571776
9680 -4571776 5780136 11430483 6708801 -3019848 -6867384 -3569516 -3083404 -10656391
9672 -10656391 -18366867 -17152422 -8602787 951320 9392208 14874717 11870168 373198
9664 373198 -8486339 -6178163 477969 929129 -1590155 2798848 11306574 11731701 3169905
9655 3169905 -2118090 1276688 4674743 1462235 -3073675 -3468849 -3652432 -7621943 -10316140
9646 -10316140 -6120379 435013 711768 -5475810 -10246001 -8345389 -2469989 917825
9638 917825 -1726415 -7643890 -10667477 -9055621 -8301998 -12264327 -15074723 -9290729 587553
9629 587553 2861058 -3609102 -7709852 -3743844 1141205 867522 -400206 968277 -273061
9620 -273061 -7522187 -13303617 -10496319 -4166246 -2346471 -2778666 428181 3995970 1487055
9611 1487055 -3309669 -1895513 3665388 4031177 -1148204 -3656821 -2608227 -5928851
9603 -5928851 -14426088 -18109699 -12484964 -6195609 -6714017 -9242573 -6796099 -1978409
9595 -1978409 -609335 -1013472 1615190 5265490 3868873 -3047290 -10256450 -13877035
9587 -13877035 -12980399 -7281664 904967 5150576 1317312 -6562702 -11977848 -14731387
9579 -14731387 -18267883 -21280012 -19429494 -14023575 -11403849 -13695753 -16919350 -18379126
9571 -18379126 -19018495 -18031603 -12770512 -5756103 -4185415 -9222423 -12451659 -7026590
9563 -7026590 3200970 9580343 8459775 1295635 -9379873 -19300893 -22892099 -19642413
9555 -19642413 -15649585 -14101137 -9869903 303974 8547218 5648235 -4482160 -10332836
9547 -10332836 -9874594 -11083281 -16653070 -20198592 -18925033 -18057923 -19025426 -14743497 -2843492
9538 -2843492 6449981 3994791 -4228320 -5917788 -103405 3505215 21253 -5079363
9530 -5079363 -5888461 -3827947 -3404471 -5065367 -4810923 871980 10551393 17903718 17473104
9521 17473104 11084373 6136724 6306752 7163873 3236537 -3907108 -8096431 -6988749
9513 -6988749 -4562541 -5682782 -10146672 -12186325 -6191754 5945811 14922766 14290202
9505 14290202 8200576 4410576 2937828 -946042 -5579466 -5399424 -3130285 -6312728
9497 -6312728 -10880847 -4094435 11564178 15042982 -2844860 -22261771 -21931332 -9454984
9489 -9454984 -6177332 -13454825 -15546959 -9249806 -7403912 -13939225 -17173203 -11027766
9481 -11027766 -4171990 -3357085 -4161371 -3591278 -6484361 -13064231 -14203804 -6282162 1532714
9472 1532714 1809823 -733653 -69050 1161457 -108803 249289 4728935 6857179 803829
9463 803829 -9312081 -16493399 -19608843 -19311699 -14007253 -6206182 -3744269 -7726925
9455 -7726925 -8598048 -1735375 3073126 -2900081 -11883462 -11053185 -2089222 2750961 -821431
9446 -821431 -5825146 -6065827 -1680694 4912863 10410993 10579098 5627681 2104500 3550381
9437 3550381 4641711 1048682 -1814654 1907611 7485947 7412429 3550960 1157520 -2233989
9428 -2233989 -9770945 -13673049 -5297981 7377070 8006568 -3865784 -12040186 -7505560
9420 -7505560 1563378 5405960 4237992 1031200 -4214459 -8666491 -6789674 -811615
9412 -811615 -232960 -6393851 -8373051 366545 11588141 14731879 10344714 4493101
9404 4493101 -1423715 -7911720 -11975584 -11947768 -11541633 -12682151 -10862792 -4119485 676899
9395 676899 -1464736 -3373257 4183437 17018783 22491014 17109562 9064774 4426833
9387 4426833 807615 -4389801 -8376477 -8388338 -6097334 -3831178 -1484756 527531 -125393
9378 -125393 -3858837 -8077316 -11967695 -17931373 -25370522 -27577392 -19633743 -6764571
9370 -6764571 608148 -506949 -3069624 -701625 4024372 4528581 -555628 -7023669
9362 -7023669 -11361799 -12827022 -10823631 -5468886 -631398 -1005882 -5248150 -7451147
9354 -7451147 -6916769 -10044356 -19218531 -26453038 -23763341 -14636643 -8488394 -7818521 -8184649
9345 -8184649 -7501240 -6995962 -5076367 787718 6760834 6027543 -416810 -5033254 -5928322
9336 -5928322 -7932787 -10428177 -5742663 6140782 12862937 7123425 -829715 2326960
9328 2326960 13236022 17213421 8846590 -3493997 -11651373 -15902190 -18748811 -19171855
9320 -19171855 -15504562 -8634256 -806942 5152802 6018227 1856979 -1669513 122829
9312 122829 3231034 -78644 -9100804 -14462427 -11241712 -5587508 -5496682 -10622618 -14975470
9303 -14975470 -15494050 -13657116 -11047394 -7353247 -2332680 2483047 4282617 1139598
9295 1139598 -5433201 -10829610 -12047451 -10913332 -10095324 -7831672 -1163560 6811668
9287 6811668 9168986 5343570 2513764 4406670 5282833 -393874 -7612879 -6367864
9279 -6367864 4955883 17153629 20209144 12034011 -1515388 -12066930 -15226713 -13858969
9271 -13858969 -13335485 -13007972 -7251335 2947117 6812611 -1684027 -12650323 -12585653
9263 -12585653 -3154067 2994217 1899871 847497 1720318 -3375538 -15593786 -22349534
9255 -22349534 -15120651 -3367053 -797384 -6213528 -8680272 -5034025 -750358 1723067
9247 1723067 3448446 980640 -9583394 -21528375 -22782503 -13065386 -4160856 -1434796
9239 -1434796 2576118 12143765 18367635 12991486 2644687 -248973 5444478 11033945
9231 11033945 12456429 13502107 15717540 14051417 4936702 -6700421 -11681960 -6133808
9223 -6133808 4465094 10372995 6991848 -791958 -4828408 -3542420 -2656283 -6380251
9215 -6380251 -12199756 -15594236 -15635549 -13904385 -11734972 -10695238 -12143652 -14311445 -13562188
9206 -13562188 -10167951 -8349346 -8915031 -7559890 -3276836 -2178622 -8407336 -16684316
9198 -16684316 -19162341 -15159796 -9025099 -3022477 1992109 3316643 266414 -2312651
9190 -2312651 -654442 1231914 -2193265 -8530857 -11050755 -8633616 -5008977 -1150859
9182 -1150859 3621983 5349511 -1003434 -12304683 -19371602 -18182009 -12204691 -4585372
9174 -4585372 4290319 11686404 12874518 7896855 2024339 -1059873 -1656483 -943925 -950332
9165 -950332 -5147078 -12602417 -15020547 -7664061 894618 168700 -5305415 -3573148 3226179
9156 3226179 1357945 -10142155 -15557886 -7406120 2183066 2508574 124886 3288786
9148 3288786 5910954 442426 -5730719 -1774201 8122522 12581572 11548855 12065633
9140 12065633 12388532 6356755 -1276387 -478961 5740131 4930973 -4033673 -10087874 -10086955
9131 -10086955 -12778230 -19826538 -19877800 -7975137 3972094 4734795 -433168 -1011344
9123 -1011344 2024178 1248232 -3022706 -4593348 -2994090 -3443143 -7386184 -10770938 -10569374
9114 -10569374 -7464638 -3418508 -494488 174710 1086658 6053093 12267143 10677162
9106 10677162 -830958 -11125587 -9888727 -2258090 -260045 -3852336 -1691972 10184875
9098 10184875 21757570 23426725 17652082 12299234 10007364 9134084 9389363 10751923
9090 10751923 10270342 5178720 -2453806 -7873446 -9044178 -7079897 -3072916 2133883
9082 2133883 5902913 5070718 214792 -3316956 -432200 7413479 12193871 7589521
9074 7589521 -2645059 -7778140 -3311449 2954451 2246078 -1877223 921199 10657987
9066 10657987 15166599 7407722 -4507246 -9375736 -7203459 -4990236 -4641880 -3117062
9058 -3117062 -555757 -198219 -2400395 -5494212 -10228155 -16698145 -19745942 -15151786
9050 -15151786 -8007787 -6438414 -8951417 -7477798 -1534672 1622340 875713 2876315
9042 2876315 7666111 5873047 -4598075 -11692206 -6663195 2824163 6155756 5845512
9034 5845512 9004036 11944475 6954520 -1746192 -3357807 1184831 78141 -10936996
9026 -10936996 -23409229 -29413180 -28450466 -21149298 -8066789 4068468 6614885 1434767
9018 1434767 -1958600 -2644634 -8552795 -18249196 -18184834 -4771311 5950614 1179379
9010 1179379 -9069223 -8317800 1009537 4228471 -519898 -1128462 6476753 11792468
9002 11792468 7828046 1861116 2434335 5918888 3334209 -5636853 -12392547 -10580144
8994 -10580144 -2754566 3257286 1979168 -5548637 -14040597 -19485870 -20944658 -17705195
8986 -17705195 -9513778 -1418463 -1901706 -10841191 -15185372 -4659138 12478423 19025886
8978 19025886 11470615 1903166 -1737566 -4309094 -9860768 -12884948 -9992174 -8917957
8970 -8917957 -16207505 -24360509 -22148366 -11840685 -4618054 -2590846 2154706 11342789
8962 11342789 15894697 10549307 2729997 1452949 4804217 4485912 -2040961 -9660261
8954 -9660261 -12958640 -10894220 -5958005 -2050632 -1669480 -2994314 -1772107 2400647
8946 2400647 4859818 2869638 -107367 -53157 1727723 2033905 880568 -1337537 -7128656
8937 -7128656 -15832638 -18366034 -7023509 10989900 19539585 14148872 7389153 10826230
8929 10826230 20293378 23972303 17689303 5993043 -6047863 -15003253 -17131265 -11584075
8921 -11584075 -3680603 672176 1968069 3694812 4811874 1685041 -4555223 -9225973
8913 -9225973 -11813801 -16070063 -22290898 -25494013 -22442058 -15863016 -10745619 -10117854
8905 -10117854 -14369297 -20567374 -22650664 -16893967 -7366493 -1567984 -658162 1098318
8897 1098318 6685618 11280637 8688111 -620350 -9352251 -9481150 539628 12057383
8889 12057383 12312529 -1167061 -14876650 -14057641 -837892 9485635 8213069 485284
8881 485284 -6064464 -9260280 -7900448 -658250 6762984 3912047 -9291156 -18768927
8873 -18768927 -14066796 -1955345 4623506 3864156 3531394 7952096 14483259 18746494
8865 18746494 16924221 7424029 -3761814 -4993223 6647920 18360340 16792836 5063412
8857 5063412 -3861272 -5662417 -6297800 -8702144 -9300383 -7157979 -6188142 -6997822 -5144252
8848 -5144252 568971 4930613 3317912 -3244617 -10653860 -14862107 -12996935 -6031848
8840 -6031848 577673 2986534 3328781 3892568 1648461 -4989682 -9390683 -5860970 -1002910
8831 -1002910 -4854050 -14054456 -16546631 -11150248 -8098932 -9834063 -7138950 1946989
8823 1946989 5472520 -2515411 -9622788 -3351611 9411540 13231831 6462909 366680
8815 366680 1056218 4216965 5239593 4042944 604624 -5570478 -11464802 -12784006 -9992130
8806 -9992130 -6983170 -5361665 -5190172 -8571942 -15830404 -20482530 -15774769 -5350845
8798 -5350845 170066 -2838650 -7989497 -10239334 -11805292 -14077628 -11893385 -1829344
8790 -1829344 8982631 9422780 -1675825 -13736190 -16791712 -11141001 -3272628 3680803
8782 3680803 11112835 17758617 17118855 5810392 -8489197 -13154230 -5004508 6486373
8774 6486373 11956346 12695107 14599633 16463164 11242888 -1992104 -14022559 -15644113
8766 -15644113 -8001335 -55466 2169500 934715 1671622 5165831 7072765 4828891
8758 4828891 1778743 1929969 3075280 -252002 -7728628 -12765287 -12027090 -9395220 -7928447
8749 -7928447 -4396928 3293989 9083896 6422879 -601565 -1734436 5373447 13195771
8741 13195771 16013521 15843769 15708914 14456444 10938275 7314721 5235406 3624694
8733 3624694 2357259 2634135 1694368 -5735282 -16859038 -19427819 -7603531 7415602
8725 7415602 11349225 6175652 4691685 9026367 8145177 -2041919 -10248462 -7777017
8717 -7777017 -2796433 -6455672 -13617892 -10558160 2543784 10906695 7070504 258265
8709 258265 25331 2252715 -1357433 -8606503 -10903988 -6970296 -3174792 -2606551 -2569111
8700 -2569111 -2600228 -6670045 -15214878 -21399436 -19032071 -10566914 -3949223 -3408593 -5745376
8691 -5745376 -4835543 1579733 9334318 11901748 7263200 -187519 -4993098 -5638160 -2937454
8682 -2937454 2978280 10444340 14084923 10200943 2868855 -839368 -770328 -2643274 -7423300
8673 -7423300 -9275118 -5949809 -3546306 -6635732 -10053985 -6608233 1333800 4681796
8665 4681796 28410 -6964137 -10135482 -9453361 -8329760 -8493504 -9093992 -8414440 -5357774
8656 -5357774 -881171 1679298 -390301 -5237009 -7310040 -3495504 2521282 3515326
8648 3515326 -3482760 -13693243 -19628948 -18759673 -14621758 -11057422 -8566487 -7222029
8640 -7222029 -9042233 -13989422 -16712799 -12265257 -3666819 1288201 155730 -2421168
8632 -2421168 -2944661 -3192100 -5036059 -6872221 -7377964 -7742137 -7607843 -3669697 4481924
8623 4481924 11414582 12409561 9606848 8198783 9403606 10489961 9429431 6636682
8615 6636682 3687883 1788436 -336771 -6722084 -18472005 -28443108 -27805439 -18438995
8607 -18438995 -11350411 -11370165 -12658635 -12441351 -17564226 -29933647 -36650091 -26656035
8599 -26656035 -9512513 -3853951 -11549838 -17457397 -13004674 -5551726 -3040850 -2917630
8591 -2917630 -500053 2743782 4613211 7163648 11045186 11806753 6392552 -2494934
8583 -2494934 -11641508 -20539606 -26571294 -24380513 -14111459 -3569060 1900824 5002176
8575 5002176 8040350 6813023 -1073982 -8970359 -9722014 -5979313 -4575663 -5526937 -4590045
8566 -4590045 -2642703 -3686643 -5946968 -3663546 3176836 8673221 10060512 9509095
8558 9509095 7101195 -178237 -11183155 -19321722 -20696217 -18062423 -15234534 -13152436
8550 -13152436 -12885252 -16193795 -20570436 -19925218 -13812433 -10167292 -14123121 -19272684
8542 -19272684 -16211994 -6095619 1400775 1831612 226559 1219585 2127756 -1274041
8534 -1274041 -7639362 -12927765 -16551246 -19702550 -19975713 -13643655 -3237793 3189164
8526 3189164 2814720 3045340 11299660 23120747 26504478 17350772 4577194 -1378135
8518 -1378135 355898 3877629 4863559 1839352 -6073937 -16343745 -20913840 -14361178
8510 -14361178 -3379677 -567635 -7975615 -14562127 -12327179 -6729951 -6145110 -8668677
8502 -8668677 -7351651 -3209457 -3316986 -8255902 -11328712 -10381778 -10878587 -15027064 -16749666
8493 -16749666 -11704184 -4879220 -2765637 -3741080 -2071449 2972504 7684496 9903946
8485 9903946 9067185 3993039 -3614773 -6930755 -1663085 6754761 9826597 7038971
8477 7038971 3802548 1790392 -722588 -1958997 415110 1535321 -4671592 -12586715
8469 -12586715 -10158961 1810572 8654245 3472869 -3626274 -3716446 -2880016 -8772048
8461 -8772048 -15599108 -14410312 -8712363 -6654313 -5299885 2923873 13437988 14373949
8453 14373949 5743677 -791412 -544910 -168685 -2972996 -4052558 -2438367 -4506395
8445 -4506395 -11151996 -14181860 -10731534 -9176783 -13892058 -15560663 -5741704 8219705
8437 8219705 13285220 9124870 5774473 7124022 7404725 2908876 -2069160 -2389335 994055
8428 994055 3140050 989501 -3565420 -5056818 -82421 7360058 9072058 3033407
8420 3033407 -3090422 -1722777 5060793 9755606 10250711 11475337 17043441 23235948
8412 23235948 22406502 11576058 -2603387 -9152847 -5308887 -1138139 -6458243 -15666627
8404 -15666627 -14400676 -1317418 8074356 3756563 -3631529 1335822 15873321 22811780
8396 22811780 13592321 -2730782 -12448136 -11026932 -3908037 391915 -2348027 -7819774
8388 -7819774 -7709473 -1230640 2011026 -4833693 -15023517 -17330722 -11454931 -5942650
8380 -5942650 -3965393 -819738 5300728 9276022 6807954 -1018827 -11383127 -21038890
8372 -21038890 -24006685 -15952029 -2550234 3701844 -2234486 -12307230 -16132356 -12283186
8364 -12283186 -6693785 -4487288 -6167237 -9041425 -10508614 -11269457 -14825364 -21992521
8356 -21992521 -27901293 -27362309 -20926538 -12711130 -5752103 -2847392 -6525870 -13022001
8348 -13022001 -13043184 -6007963 -5658926 -20356502 -35298954 -29997321 -9003531 3281114
8340 3281114 -2035218 -8199097 -2066537 6834166 6046246 1246462 3748582 9861365
8332 9861365 7740543 -3358914 -14030350 -18850472 -18083099 -11235671 -391468 5227229
8324 5227229 -397443 -9135086 -9026506 -1975559 -174702 -7680427 -16579577 -19834075
8316 -19834075 -17273557 -9538701 3384443 16282533 19885835 10293247 -7389140 -24181457
8308 -24181457 -32003080 -27090453 -15000080 -8536653 -13681720 -21395748 -20496722 -13342289
8300 -13342289 -9762398 -11305066 -12914284 -14964419 -19922831 -21002822 -10027624 4951717
8292 4951717 6947734 -4102780 -10371139 -4282827 946394 -4198030 -8990970 -2054966
8284 -2054966 8110549 7081129 -2280545 -6330233 -2857768 -1340805 -5432807 -9774155
8276 -9774155 -12411428 -17133909 -23086316 -23332669 -15639263 -6255376 -1579937 -2764450
8268 -2764450 -8501125 -16050978 -19510521 -14429213 -5096305 -843967 -4268229 -9056478
8260 -9056478 -9939486 -8202005 -5910353 -1265601 7086196 15667231 19359508 16505349
8252 16505349 9239365 1137425 -4616195 -7180018 -8753612 -11312847 -13141788 -11240222
8244 -11240222 -6370784 -2510393 -1922456 -3893295 -7134339 -9611166 -7505345 447051
8236 447051 8130599 7337893 -1427541 -8912021 -9086283 -5539836 -3829450 -3260363 -255397
8227 -255397 4471085 6943339 5633424 1780947 -4308327 -12795420 -20452651 -21458297
8219 -21458297 -13633176 -1707908 7305631 11073676 12867078 15972760 19235565 19404846
8211 19404846 16228162 12371705 8783870 3930566 -1515060 -3584408 -1018709 1882262
8203 1882262 1915558 2131065 5474128 7731776 3917329 -1594633 -246032 6713732 9404190
8194 9404190 5301435 3258796 7847830 10337244 2520831 -8883343 -11113627 -3439460
8186 -3439460 3459685 3661233 2078021 4349155 8690093 9766293 5339825 -2584186
8178 -2584186 -9599384 -11515309 -8485391 -5981198 -8115736 -11451089 -10139616 -5806395
8170 -5806395 -6257116 -14374246 -24224274 -28778730 -25710238 -15056912 1717218 17928343
8162 17928343 23778726 16504932 3790754 -6035585 -12049801 -15931583 -15845372 -10840515
8154 -10840515 -5917781 -5732113 -7059901 -4492679 -173637 4563 -2747292 -2136676 1314695
8145 1314695 142629 -7120698 -12494132 -11271652 -9305027 -12468966 -16505562 -14054695
8137 -14054695 -6089736 803408 4308546 6297890 6230871 2480270 -1653914 -1250526 1402826
8128 1402826 -905305 -8551074 -13434890 -11247759 -7793062 -9013304 -11302361 -7797334
8120 -7797334 7121 3892394 702820 -3663492 -2680465 2885461 7032308 5703239
8112 5703239 345932 -4189944 -4182440 -143035 4035628 4978704 2314325 -2652312 -8720437
8103 -8720437 -13844001 -14565090 -9555094 -3055589 -1299637 -4805248 -7364860 -4338355
8095 -4338355 825214 1121168 -4712632 -10872815 -11892030 -7632022 -467992 8065161
8087 8065161 15308256 16287838 9432823 1465397 896397 6895525 10386436 6856636 1387115
8078 1387115 -1466880 -5221938 -13311217 -19948897 -17613654 -9804012 -6818279 -10322575
8070 -10322575 -12051991 -8459839 -6390578 -10888968 -16687403 -17169282 -14051576 -11700928
8062 -11700928 -8358683 -750827 7174687 8298837 2721836 -2939249 -4788998 -3729148
8054 -3729148 -346372 5071886 8548963 5973167 679143 168315 4499370 5540932
8046 5540932 -53322 -4689489 -937087 7197409 9723464 3813333 -3919000 -6486469
8038 -6486469 -3244822 1860969 5115020 5751492 5826954 7328126 8627678 5478673 -2748627
8029 -2748627 -9810876 -8753051 -720135 5732657 4795949 -194037 -2409445 -965118
8021 -965118 -832456 -3835630 -4671019 1232490 9472877 11338283 5480316 -599633 -1180550
8012 -1180550 1245944 1961302 527923 -2031095 -6677371 -11864350 -10996162 -1476711 7677743
8003 7677743 5789227 -4011793 -8479687 -3108268 2561183 541237 -4610896 -5599143
7995 -5599143 -4896702 -9393735 -17002417 -17143121 -4567078 12770438 20921022 12855451
7987 12855451 -5540140 -20735549 -23558027 -17017670 -11289470 -11412975 -13249436 -11959473
7979 -11959473 -9334029 -9416638 -10774421 -8077602 -159881 7540392 9022886 4250519
7971 4250519 -702038 288032 6599092 10934284 8158425 2621956 2665274 8861474 13808147
7962 13808147 14160238 15283784 20687602 24316163 19285983 8667716 811863 -1859918
7954 -1859918 -2575254 -2522798 -1107711 -1147880 -5621359 -10701736 -10114021 -5472020 -3746614
7945 -3746614 -4886115 -1880990 5332475 6820942 -1815643 -10639524 -9533752 -3547949
7937 -3547949 -4695619 -13051444 -16350063 -7568231 6074308 13153081 10158381 1354659
7929 1354659 -7746447 -13517631 -14671833 -12858798 -10837213 -8497902 -3275075 4186918
7921 4186918 8395003 5802227 229044 -2161497 -1167892 -1538943 -4743179 -6628225 -4007524
7912 -4007524 766378 3828248 5018529 6243145 6883693 4264234 -1838902 -7872503
7904 -7872503 -10141569 -8307132 -5021733 -3127094 -3510383 -5258077 -7614674 -11069742
7896 -11069742 -15419005 -17424531 -13050270 -3094847 5557582 6193033 -1123333 -10110159
7888 -10110159 -14225006 -11521359 -5393134 -1269731 -932700 -277075 4523584 9443200
7880 9443200 6456525 -4406760 -13677715 -15813807 -16343613 -20594618 -23086491 -16226064
7872 -16226064 -3451201 5660361 8443479 7265011 -118513 -15276525 -27583055 -23611858
7864 -23611858 -8310872 -909022 -7017760 -11400280 -4049023 4103689 1744554 -2832408
7856 -2832408 2682067 11393320 7519802 -7246981 -15792397 -11078342 -2852530 847000
7848 847000 3057634 6230135 5470585 -1109789 -6166471 -3475239 3169657 6641414 5850404
7839 5850404 3899615 2217540 971768 1490425 4636509 9182969 13411319 15675975
7831 15675975 13364877 5497084 -3439348 -7216498 -6180439 -6589597 -10459793 -11909591
7823 -11909591 -6376256 1691543 4561924 1551726 -616621 3184730 10295432 13624603
7815 13624603 9641341 1430136 -6579477 -14381196 -23279892 -28796592 -23839499 -10727278
7807 -10727278 -2247921 -6031917 -14781555 -17725139 -14419654 -9911078 -4397976 2005008
7799 2005008 1981301 -7957574 -15124398 -5761198 10488351 9709803 -11502616 -29061667
7791 -29061667 -24192654 -5845988 7081461 9261363 4515654 -6434487 -19883545 -23038411
7783 -23038411 -9842390 5183049 4257767 -8269597 -13030005 -4297895 4162588 1440434
7775 1440434 -6973376 -10736153 -7966107 -2787339 1643062 3314977 760283 -4294776
7767 -4294776 -7913144 -9115250 -10101441 -11224954 -10596447 -8902453 -9580624 -13544294 -18037002
7758 -18037002 -20851092 -21506108 -18766962 -11816721 -3645799 1554550 4100225 7057580
7750 7057580 9489567 7383325 1484894 -2085762 -412335 2761974 3985762 4955916
7742 4955916 7741120 10058055 8852126 5087806 1547618 -1652599 -6207051 -11737639
7734 -11737639 -15199981 -13740479 -7522060 -650816 1343021 -2726320 -7291038 -7014673
7726 -7014673 -5402880 -10599169 -21331730 -24336360 -11141251 7993797 14941413 6339680
7718 6339680 -3549383 -3450049 1057465 -532562 -6120644 -5258009 2780725 6841486 1128904
7709 1128904 -6217285 -6709031 -4438201 -7705737 -14733135 -17235861 -13760165 -9479612
7701 -9479612 -5649682 230174 5510136 5007982 2199673 5707003 13441336 13231044 2439053
7692 2439053 -6601740 -6137564 -4025848 -7099672 -7418227 2939508 15024989 15425128
7684 15425128 7019649 2355459 2887162 695685 -3660541 -1890162 5049411 7132992
7676 7132992 3160444 3032350 9732537 13490023 7905150 -933675 -5845330 -7327923
7668 -7327923 -6672490 -1929033 4486923 5526991 1984368 3785106 13140459 18553515
7660 18553515 13094871 6584854 9767182 17112451 17131097 11242579 9522178 13543222
7652 13543222 16139715 14534981 11806269 7520327 -1903273 -14146053 -21826681 -22172440
7644 -22172440 -18173756 -11735083 -3923577 -54258 -4861125 -12976178 -13612517 -5362095
7636 -5362095 2405141 3580792 1546035 -209640 -3791653 -9066430 -8692995 2641978
7628 2641978 19100800 29314990 28135101 19306182 9671180 3807823 1554049 -1575190
7620 -1575190 -8805503 -15747334 -13909621 -2573261 7857258 8105506 1589772 -756348
7612 -756348 5615226 14892242 19302250 17041821 12048817 9243655 10340717 12263040
7604 12263040 9711861 966194 -9054576 -12982884 -8386921 -356071 3055050 -2014308
7596 -2014308 -11541876 -16908455 -13200512 -4466916 697309 -1317463 -6040664 -7317731
7588 -7317731 -4068179 98975 1436629 -908357 -4327624 -4602333 -697749 2271804
7580 2271804 -1389701 -8843041 -10324544 -2499856 4901656 616870 -13342942 -23842969
7572 -23842969 -21907179 -10853339 -54961 4534619 3394370 1065932 1897489 5954776
7564 5954776 9014651 7912011 4335683 1492319 -246301 -1419218 -684025 1564922
7556 1564922 431324 -6321141 -11474338 -6960895 2483257 4124677 -3824573 -8710516
7548 -8710516 -2084313 8305526 10644323 4430800 -2870592 -6969661 -7393269 -3978829
7540 -3978829 -429277 -4451713 -15547078 -19752559 -7708531 8078012 7659603 -8302207
7532 -8302207 -20142659 -18008824 -12561228 -13942679 -16827675 -14280747 -12227185 -18651243
7524 -18651243 -28257770 -29925901 -22999039 -15199887 -9540002 -4223697 -1430316 -4534938
7516 -4534938 -8664816 -5587093 2182829 3261213 -5273253 -13292944 -13644346 -12281927
7508 -12281927 -16355322 -20995592 -16847252 -5537255 2232968 2616336 3227020 9660076
7500 9660076 15235908 9869472 -4920782 -16640320 -16962373 -10164389 -4755938 -2432430
7492 -2432430 281371 3614683 4223964 1761054 -635333 -2302391 -5155188 -7222557
7484 -7222557 -3287993 5593225 10405166 6220543 -472991 -1870631 -391584 -3146807
7476 -3146807 -9366714 -11688509 -8137779 -4991458 -7436190 -13324837 -16941720 -14808514
7468 -14808514 -7911120 -1571418 -1766534 -8067716 -12555354 -9662536 -3499510 -27903
7460 -27903 3488321 12803856 23536798 24304429 13216525 1090511 -3929680 -5460957
7452 -5460957 -8934787 -11472166 -7670998 661275 6684814 6779945 2285590 -3591730 -7069099
7443 -7069099 -5400243 -306006 3474139 5232256 9476027 17396105 22373687 18442027
7435 18442027 9254625 3761605 5476253 10076431 11538237 7226398 -1075683 -8247516
7427 -8247516 -9867833 -7238537 -5726615 -6516206 -4270254 4122085 13098485 15170346
7419 15170346 10480331 4708603 453267 -3646204 -6906881 -5738354 632061 7723830
7411 7723830 10330713 7419461 2186675 -1482101 -2741716 -4166827 -7235905 -8427259
7403 -8427259 -3543329 4280796 6666978 1970172 -1333104 2578080 6931816 1859812
7395 1859812 -10546307 -18631921 -16774147 -10912576 -8457551 -9473518 -9594799 -6705743
7387 -6705743 -2400588 391801 -212758 -3527107 -6936472 -8777615 -9078643 -6879597 -705719
7378 -705719 6055434 5545818 -3753784 -11291924 -6654862 5623626 11589227 6480936
7370 6480936 -1063262 -3211848 -1677074 24838 3681778 10561213 15431665 12849276
7362 12849276 5502146 779883 1362086 3456610 2607207 -2068775 -7892252 -10445986
7354 -10445986 -7117458 -607070 3190030 2050335 -619907 -1598059 -1515504 -1189342 385634
7345 385634 1205521 -4790272 -18352584 -29092158 -26323868 -13451306 -4156255 -5031210
7337 -5031210 -9357688 -8717181 -3276049 2158417 5857589 8579571 9676995 8434607
7329 8434607 6509089 4876339 559929 -9178381 -20549122 -25609296 -21321124 -12949005
7321 -12949005 -7617899 -6931296 -6893602 -3311430 3787045 10179146 11387252 7048087 988365
7312 988365 -3502247 -6899316 -10397636 -11891616 -8823817 -4241889 -4978270 -12122475 -17631430
7303 -17631430 -13779025 -3233062 4112741 2936900 -2705495 -6052627 -5363147 -3779895
7295 -3779895 -4147818 -6236464 -8446271 -10340879 -12415102 -13757784 -11597320 -4535306
7287 -4535306 4614546 11123044 13137458 12181538 9550096 5370251 1220519 -317533
7279 -317533 154115 -1024260 -4855816 -8303475 -10184074 -13086874 -16673462 -15408077 -7935552
7270 -7935552 -2697492 -7209972 -16433743 -19694369 -15382257 -10164560 -6948937 -3785608
7262 -3785608 -2701656 -8114852 -16246419 -17708834 -12452887 -10532998 -14956977 -16234857
7254 -16234857 -9679646 -5782907 -14066427 -26273013 -26831827 -13937165 580846 8439181
7246 8439181 11679643 14172584 15558094 14083469 9487997 3013081 -2081504 -2300863
7238 -2300863 801583 1300479 -1893108 -2675724 860102 689099 -8134894 -16844520 -15408752
7229 -15408752 -8539399 -7176668 -9906159 -7203041 -413551 -236471 -6711413 -7407894
7221 -7407894 1449147 7874482 3956440 -1350537 2643576 12059186 16380126 13694183
7213 13694183 9253005 6133200 5317611 8491268 13264254 11865605 1779499 -8497696
7205 -8497696 -11202266 -9977303 -11348817 -13033023 -9965469 -5098825 -3572926 -1987222
7197 -1987222 4931847 12000335 10734895 4953969 5072528 9255181 6227837 -2988114
7189 -2988114 -3784511 7248128 13617095 3739234 -10786959 -13583072 -7353260 -4763503
7181 -4763503 -5475277 190186 10073155 11518269 3827243 1504636 10752889 18663477
7173 18663477 13871984 4630525 4874978 11733542 10638076 -1324681 -10657682 -6808488
7165 -6808488 4515926 11054171 9427098 5821036 5582911 7493154 7627836 5173292
7157 5173292 2688766 1529940 -393728 -4202163 -5503710 610622 9931639 11399638
7149 11399638 2102326 -7176140 -7044096 -2892282 -4377862 -7804970 -1679792 12750763
7141 12750763 20853084 16081917 8376696 6773399 6831144 2576896 -1073475 2097207
7133 2097207 7113171 6391495 3737080 7488432 14450600 13451754 3128156 -5489178
7125 -5489178 -4345035 3153300 9094706 8049023 -2282655 -18524754 -30029590 -28696419
7117 -28696419 -20164820 -16347067 -18051867 -16240994 -10212199 -10315559 -18880703 -22903121
7109 -22903121 -13769465 -2121224 -2352903 -11529556 -15971983 -12634115 -10768024 -14835155
7101 -14835155 -18415164 -16182974 -11462247 -8549176 -5374304 1592454 9893455 13057334
7093 13057334 8286526 -439720 -6441718 -6698163 -4410172 -4832902 -8541849 -10942768
7085 -10942768 -9292250 -6808709 -7193876 -8376768 -5836525 114456 5015373 6820020
7077 6820020 6968601 5757360 1978979 -2478881 -3020313 940189 4124351 2705280 -185451
7068 -185451 700694 4984276 7033326 2875243 -5631954 -12606590 -12631424 -5293684 2655418
7059 2655418 1907952 -9166146 -20301832 -19697376 -8344978 874504 -521207 -6697782
7051 -6697782 -7041658 -387143 6006272 8102205 8042389 6419212 124265 -9793097 -15635719
7042 -15635719 -12928217 -7050230 -4800872 -4276210 359903 7621957 9908375 4753551
7034 4753551 -2268015 -5947195 -6118233 -3266316 3400110 10826502 11558595 3172022 -5884329
7025 -5884329 -5211602 4856363 14431799 16971718 15708926 16101342 17000611 13672945 7079464
7016 7079464 3985546 6689227 8663863 4796607 1031713 6350646 17537530 21345501
7008 21345501 12801732 1804643 -1960830 -1167662 -1943725 -1881779 3897590 11147123 11469877
6999 11469877 5473533 1344480 2566514 5902465 9413033 13428974 15291433 12306703
6991 12306703 8553492 9554272 11759479 7435789 -1153573 -3600979 2612687 9287747
6983 9287747 11499081 12833056 15206121 15516043 14805673 18395162 23716358 20950793 10122471
6974 10122471 4127617 8877170 14047294 11144797 7053160 9736992 13356320 9733579
6966 9733579 3638284 3218998 4177421 -2430781 -13525066 -19084727 -18434819 -17712535 -15562643
6957 -15562643 -5664734 8759248 16487934 13917781 7783176 3053576 -1075126 -3853475
6949 -3853475 -2386051 1416764 2540972 1218582 1243679 1689403 -612084 -2563733 1027665
6940 1027665 6634355 6208718 803916 -1425793 177753 -1296705 -5608656 -4069640
6932 -4069640 4432548 9100809 3794881 -3126519 -1413257 7381562 14297309 13981936
6924 13981936 7046875 -2144643 -6921873 -3879194 1106895 -610691 -7244912 -8887724
6916 -8887724 -4149447 -3348607 -11436567 -18916447 -15844945 -5406024 3112809 6507893
6908 6507893 6045406 1579636 -5110564 -7684073 -3646673 -179716 -4445874 -12513030
6900 -12513030 -14528790 -7264933 4044669 12755803 14979802 10613631 4419985 2131355
6892 2131355 2605249 -536180 -6771987 -6314707 4958340 16400200 15829701 5433521
6884 5433521 -3031754 -3198337 2988839 11261747 15884609 10232626 -4537278 -15976712
6876 -15976712 -14154530 -4592791 888175 655522 542679 216231 -5055081 -12133444 -12853616
6867 -12853616 -8270505 -7236432 -10509613 -9232164 -878897 6275593 7749620 8978135
6859 8978135 12052933 9332564 -2124684 -11285196 -8237627 391990 2133561 -1859452
6851 -1859452 -49966 10251301 18659491 16559210 6630561 -3586530 -9851058 -11152070
6843 -11152070 -7843798 -2260503 2883996 7569604 12110074 12447419 3781984 -10349641
6835 -10349641 -19074137 -16820067 -9470630 -4864913 -2759939 1130705 5995908 7396350
6827 7396350 5407960 4583774 6301267 7303201 6513786 7341870 10927214 12145097 6130042
6818 6130042 -4076102 -9836829 -5520093 7041641 20538394 26677587 21287126 7931557
6810 7931557 -4806217 -11482337 -13513071 -13812636 -11765108 -6635621 -1878651 -979931
6802 -979931 -1783349 -492772 946679 -2046397 -7447808 -7722725 -567331 8265354 13942213
6793 13942213 17441416 19616785 17643979 10952838 4441812 1592505 -155226 -3006269
6785 -3006269 -3576368 678326 5137358 4530979 1534704 1927981 4519808 3433955 -1655480
6776 -1655480 -5273637 -5251993 -4629912 -4489793 -2327081 1404606 2376808 264608 905525
6767 905525 7245731 13815070 14386497 10634279 8662317 10465794 13692376 17268397 21723465
6758 21723465 24671908 21355364 11280338 900734 -2711152 501046 4252899 3974500
6750 3974500 2248272 4649955 10975953 13833391 7955423 -1842026 -6327720 -4460109
6742 -4460109 -4608871 -11744083 -19535429 -19768047 -14886338 -14157778 -19429643 -22914263 -20286751
6733 -20286751 -17886925 -22336947 -29246895 -29273312 -22118641 -16536939 -16632698 -15824609 -7170121
6724 -7170121 6079642 14450844 13362864 6414392 -39317 -1914113 1247457 6197121
6716 6197121 7879596 4194890 -1624740 -5146139 -5619567 -4624022 -2281310 1737787 5335017
6707 5335017 6078225 4872043 3768662 1875615 -1952394 -4219203 -731676 5328691
6699 5328691 6335774 1938073 446807 6240007 13120217 14123003 11097299 9029357
6691 9029357 6755191 569316 -6701516 -8107171 -2866890 2403603 2666602 -803489
6683 -803489 -4662474 -7284551 -7849124 -6463450 -6067277 -9819276 -15573148 -17273568 -13110370
6674 -13110370 -7769346 -4799836 -1896556 2830303 5176637 1669293 -1330978 5945525
6666 5945525 20650896 26889932 16250467 1345499 310413 12094567 18332838 9719628
6658 9719628 -1845631 -2416466 4033569 4556247 -1874820 -5199147 -2366347 -997136
6650 -997136 -4507457 -6267585 -1937474 3442031 5373131 6696545 8529293 4383625
6642 4383625 -8264831 -18752927 -15795215 -3855925 3252750 1369953 -1828504 -1424465
6634 -1424465 -1000419 -3109250 -3916571 -536684 3439720 3350344 -381643 -4148518 -5560745
6625 -5560745 -4351708 -2297187 -3080355 -8404306 -13300353 -9532606 4220123 18622025
6617 18622025 22409381 13377130 -474712 -9361165 -10229128 -7404739 -5580183 -3902131
6609 -3902131 707954 6084396 6426056 2352614 2284506 9896492 17122605 15831511 10161606
6600 10161606 9091729 12079060 12108856 9221419 9405995 11664207 8575925 466612 -3405843
6591 -3405843 -475421 713756 -3425022 -3189028 8623536 22418222 23280875 10297248
6583 10297248 -5009174 -14493071 -18078315 -16342329 -8878365 286879 4335313 2283715
6575 2283715 70995 1873344 5012892 4468069 -1208067 -9056989 -14082487 -12740989
6567 -12740989 -6531785 -1288415 -916070 -3792626 -7355174 -12277997 -17918123 -17911451 -7337215
6558 -7337215 7763663 15589604 12975825 7294549 3750355 -617204 -7458134 -10281460
6550 -10281460 -3540125 7020635 10739518 6400349 3111309 6924730 12711068 11386289
6542 11386289 1313865 -10069408 -14231055 -9426246 -1443878 2567502 1098872 -1247430
6534 -1247430 -355355 2506845 4296779 6065421 10662368 15478942 13523401 3780060
6526 3780060 -4760860 -3264008 6494225 15856328 19888924 19263078 14927283 7818297
6518 7818297 2345586 2663035 5403270 3556068 -1747900 -1821918 4974470 8722392 3060860
6509 3060860 -4352574 -4172373 -23965 -554962 -3169891 1270296 10264464 10420489 -1968770
6500 -1968770 -14016857 -14410116 -7315903 -1859889 2212903 9397493 16345340 15655284
6492 15655284 8276239 2082049 -875337 -6351367 -16165587 -23165301 -21628394 -16241993
6484 -16241993 -15463936 -19763751 -22095152 -18491769 -12603824 -9019600 -6976315 -3460412
6476 -3460412 838722 2658217 1498400 -533037 -3417006 -8558376 -12899781 -9890229
6468 -9890229 674623 9456802 9058108 4054649 3537533 7490910 8257696 3663950 498941
6459 498941 4678307 14939021 26597565 34427757 31609473 14812195 -6901618 -16865629
6451 -16865629 -9458693 2754302 5477461 -416030 -4642027 -3821355 -3217701 -5267134
6443 -5267134 -5452882 -193886 7556411 12111543 10556484 3914303 -3860003 -7743536
6435 -7743536 -5422469 222958 4083085 3953642 1427323 -1056289 -2216002 -2105929 -1915889
6426 -1915889 -2541554 -2569241 236895 4725347 6922986 6251129 7020370 10982989 12862029
6417 12862029 7884877 353495 -1028351 5160118 11419438 11028193 4811367 -1956740
6409 -1956740 -5432529 -5158251 -2937439 -684296 1600939 4824038 6892638 2823585
6401 2823585 -8207302 -18650379 -19952627 -12782337 -5333149 -2328472 -961492 1816723
6393 1816723 3495394 184798 -7047341 -13372739 -15978544 -15697948 -13656434 -9486186
6385 -9486186 -4052935 -1499038 -5147078 -11293467 -11178124 -2066795 6799859 4303377
6377 4303377 -7923661 -16818484 -14001342 -4404329 2583341 3935786 1701664 -2850076
6369 -2850076 -8497045 -11554103 -9401366 -4246724 264745 3492258 5811276 5712869 2378049
6360 2378049 -2163129 -6345862 -10481025 -12378904 -7571190 2190550 7610891 4764893
6352 4764893 2234634 7810167 14980282 12482192 1949836 -5019012 -3908432 -288255
6344 -288255 1642539 2084256 -1029987 -9726820 -17589009 -15812992 -8001673 -6559266 -13400014
6335 -13400014 -17540190 -14109195 -11278759 -13524618 -12675375 -3518165 4882148 3552438
6327 3552438 -1720829 -1157470 2938850 2789477 -44628 491329 1108814 -5854652 -16584222
6318 -16584222 -18591843 -9229718 670464 2946620 1046850 346933 -659031 -5241289
6310 -5241289 -11732287 -16176656 -16720604 -12836623 -5302825 902132 -588779 -8693236
6302 -8693236 -14042417 -10755276 -4435298 -3814145 -8258513 -9571986 -4469862 1328351
6294 1328351 2575650 2341198 6477069 13547859 15810389 10224137 3245364 2141563
6286 2141563 5661570 7518642 6192612 5570648 6880083 6223246 1193042 -5387101 -10087202
6277 -10087202 -12683334 -13805350 -13447790 -13297786 -15323912 -16554513 -11815983 -4142743
6269 -4142743 -4381911 -15404705 -24921722 -21922992 -13301956 -13702496 -23426235 -28601656
6261 -28601656 -22102978 -11924089 -6587544 -3622026 1974657 6563607 2850469 -8464402
6253 -8464402 -18871889 -22096390 -18930666 -13081785 -6855816 -1829494 -561576 -4845501
6245 -4845501 -12124365 -15711974 -11064819 -1719593 3831712 1780985 -3831042 -8307181
6237 -8307181 -11385310 -12604374 -8211437 1551998 7958339 4690017 -1273565 618156
6229 618156 7209557 6046812 -3712551 -8324283 -481069 9715490 11201676 7864400
6221 7864400 8798823 11698626 7494553 -3282208 -9943483 -6139270 3627447 11339787
6213 11339787 12323307 5468340 -6819965 -18663539 -25381868 -27380817 -25865416 -18245468
6205 -18245468 -3887708 8978806 10482153 2104689 -5454546 -6545872 -4145758 180165
6197 180165 9053065 19575643 21708840 12001683 280315 -3821064 -3306621 -5540823
6189 -5540823 -9098389 -8534489 -6429893 -8812802 -11311651 -2904581 15075027 25703889
6181 25703889 17399436 -800022 -11285695 -8781269 -2268522 -399316 -2498906 -2910820
6173 -2910820 1484685 8543989 12613569 9562207 2052028 -2173231 531909 5303078
6165 5303078 6616732 6463132 9306886 12375258 8707350 -1054908 -8103962 -8046832 -6429217
6156 -6429217 -8658287 -11319207 -8376396 -857081 5260183 7558622 8352302 9444038
6148 9444038 10294696 10017911 7626537 2093234 -4537069 -6641150 -1624628 5523358 8729217
6139 8729217 8938911 10082789 10038523 3751856 -5565112 -7624386 505791 9447897 10499403
6130 10499403 5960056 1878494 -1819466 -6817569 -8293574 -872723 10338647 14571545
6122 14571545 10872948 9235399 14553181 18881724 14386532 6025741 3834648 7522309
6114 7522309 7571933 263021 -6955290 -6871324 -2449287 -1514156 -5969381 -10845002 -11722634
6105 -11722634 -8834546 -4795136 -2098126 -2763525 -7015102 -11524557 -11691578 -6974053
6097 -6974053 -2235305 -2768705 -9188253 -17613189 -23212291 -22961065 -16869717 -8039084 -736480
6088 -736480 2506792 1707117 -1973665 -6774417 -9896255 -9078780 -5178444 -1084350 2114718
6079 2114718 5332767 7961033 7905554 5815233 4845491 4825748 2020314 -2625634 -1397754
6070 -1397754 8595020 17346777 13356191 -305172 -10122002 -10656713 -9174435 -11162507
6062 -11162507 -11791716 -6273430 33771 -802808 -6705219 -8153638 -1386797 7224167
6054 7224167 9898775 6041195 1355715 1014361 4427105 5960256 1371563 -6249128
6046 -6249128 -8937638 -3147774 5818795 10214049 8306475 4441712 2808180 3683851
6038 3683851 4589988 2847993 -2402589 -9080086 -13373082 -12914567 -8453961 -2674440 1480454
6029 1480454 2031343 -428195 -2913060 -3857877 -5178631 -7541530 -6293325 2243291 12218473
6020 12218473 13545091 5706002 -1913807 -4445730 -6772879 -11564389 -12743922 -6874484
6012 -6874484 -1286909 -2756535 -6499289 -5666406 -3992040 -8010039 -13137897 -9995197
$$ [...]
##END NTUPLES=NMR SPECTRUM
##END=
