##TITLE=31Pdec_SR90_rm1
 , 124 sc
 30.09.2021
##JCAMPDX= 6.0         $$ Bruker NMR JCAMP-DX V2.0
##DATA TYPE= NMR SPECTRUM
##DATA CLASS= NTUPLES
##ORIGIN= UXNMR, Bruker Analytische Messtechnik GmbH
##OWNER= root
$$ XWIN-NMR		Version 3.5
$$ Thu Sep 30 09:52:45 2021 Russian Standard Time (UT+4h)  she@DPX200
##.OBSERVE FREQUENCY= 81.013821
##.OBSERVE NUCLEUS= ^31P
##.ACQUISITION MODE= SIMULTANEOUS
##.ACQUISITION SCHEME= undefined
##.AVERAGES= 125
##.DIGITISER RES= 16
##SPECTROMETER/DATA SYSTEM= spect
##.PULSE SEQUENCE= zgpg30
##.SOLVENT NAME= CDCl3
##.SHIFT REFERENCE= (INTERNAL, CDCl3, 0, 248.564)
##AUDIT TRAIL= $$ (NUMBER, WHEN, WHO, WHERE, WHAT)
$$ ##TITLE= Audit trail, XWIN-NMR		Version 3.5
$$ ##JCAMPDX= 5.01
$$ ##ORIGIN= Bruker BioSpin GmbH
$$ ##OWNER= she
$$ F:/spectra/data/she/nmr/P31/1/pdata/1/auditp.txt
$$ ##AUDIT TRAIL=  $$ (NUMBER, WHEN, WHO, WHERE, WHAT)
(   1,<2021-09-30 09:49:48.64 +0400>,<she>,<DPX200>,
      <continue with go, POWCHK disabled, PULCHK disabled
       configuration hash MD5:
       00 E9 B6 7A A2 85 ED C7 34 08 36 98 17 FE 4E 26
       data hash MD5: 32K
       12 BC E2 52 2E 7E 3C 09 4C 1B 26 B0 3D 7F 38 59>)
(   2,<2021-09-30 09:50:09.17 +0400>,<she>,<DPX200>,
      <Start of raw data processing
       efp BC_mod = 2 LB = 1 FT_mod = 6 PKNL = 1 PHC0 = -8840.371 PHC1 = 124.8694 SI = 64K 
       data hash MD5: 64K
       E6 83 C4 33 30 4B 96 59 C3 51 F0 4A 0B CB 1C 64>)
(   3,<2021-09-30 09:50:28.06 +0400>,<she>,<DPX200>,
      <pk PHC0 = -97.98772 PHC1 = 274.5999 
       data hash MD5: 64K
       C7 85 29 E2 F8 50 AF 19 77 AD 4A D3 83 8B 42 80>)
(   4,<2021-09-30 09:51:50.59 +0400>,<she>,<DPX200>,
      <pk PHC0 = 115.5642 PHC1 = -348.4 
       data hash MD5: 64K
       EA 3D B3 F8 88 55 02 BC 78 EC D8 46 39 EA 70 D5>)
$$ ##END=
$$ 
$$ hash MD5
$$ B0 4A 1D EA B6 C6 99 01 DC C5 6A BF 46 B9 0D B5
##$RELAX= 
##$RELAX= 
##$RELAX= 
##$RELAX= 
##$RELAX= 
##$RELAX= 
##$RELAX= 
##$RELAX= 
$$ Bruker specific parameters
$$ --------------------------
##$DU= <F:/spectra>
##$EXPNO= 1
##$NAME= <P31>
##$PROCNO= 1
##$TYPE= <nmr>
##$USER= <she>
##$AMP= (0..31)
100 100 100 100 100 100 100 100 100 100 100 100 100 100 100 100 100 100 
100 100 100 100 100 100 100 100 100 100 100 100 100 100 
##$AQSEQ= 0
##$AQ_mod= 1
##$AUNM= <au_zg>
##$AUTOPOS= <>
##$BF1= 81.014009
##$BF2= 200.13
##$BF3= 200.13
##$BF4= 200.13
##$BF5= 200.13
##$BF6= 200.13
##$BF7= 200.13
##$BF8= 200.13
##$BYTORDA= 1
##$CFDGTYP= 0
##$CFRGTYP= 5
##$CHEMSTR= <none>
##$CNST= (0..31)
1 1 145 1 1 1 1 1 1 1 1 1 1 1 1 1 1 1 1 1 1 1 1 1 1 1 1 1 1 1 1 1 
##$CPDPRG= <waltz16>
##$CPDPRG1= <>
##$CPDPRG2= <waltz16>
##$CPDPRG3= <>
##$CPDPRG4= <mlev>
##$CPDPRG5= <mlev>
##$CPDPRG6= <mlev>
##$CPDPRG7= <mlev>
##$CPDPRG8= <mlev>
##$CPDPRGB= <>
##$CPDPRGT= <>
##$D= (0..31)
0 1 0 0 0 0 0 0 0 0 0 0.03 2e-05 3e-06 0 0 0 0 0 0 0 0 0 0 0 0 0 0 0 0 
0 0 
##$DATE= 1632980805
##$DBL= (0..7)
120 120 120 11 120 120 24 19 
##$DBP= (0..7)
150 150 150 150 150 150 150 150 
##$DBP07= 0
##$DBPNAM0= <>
$$ [...]
##$SUBNAM2= <"">
##$SUBNAM3= <"">
##$SUBNAM4= <"">
##$SUBNAM5= <"">
##$SUBNAM6= <"">
##$SUBNAM7= <"">
##$SUBNAM8= <"">
##$SUBNAM9= <"">
##$SW= 501.771253377433
##$SWIBOX= (0..15)
0 1 3 0 0 0 0 0 0 0 0 0 0 0 0 0 
##$SW_h= 40650.406504065
##$TD= 32768
##$TD0= 1
##$TE= 0
##$TE2= 300
##$TE3= 300
##$TEG= 300
##$TL= (0..7)
0 120 53 12 22 120 120 120 
##$TP= (0..7)
150 150 150 150 150 150 150 150 
##$TP07= 0
##$TPNAME0= <>
##$TPNAME1= <>
##$TPNAME2= <>
##$TPNAME3= <>
##$TPNAME4= <>
##$TPNAME5= <>
##$TPNAME6= <>
##$TPNAME7= <>
##$TPOAL= (0..7)
0.5 0.5 0.5 0.5 0.5 0.5 0.5 0.5 
##$TPOFFS= (0..7)
0 0 0 0 0 0 0 0 
##$TUNHIN= 0
##$TUNHOUT= 0
##$TUNXOUT= 0
##$USERA1= <user>
##$USERA2= <user>
##$USERA3= <user>
##$USERA4= <user>
##$USERA5= <user>
##$V9= 5
##$VALIST= <valist>
##$VCLIST= <CCCCCCCCCCCCCCC>
##$VD= 0
##$VDLIST= <DDDDDDDDDDDDDDD>
##$VPLIST= <PPPPPPPPPPPPPPP>
##$VTLIST= <TTTTTTTTTTTTTTT>
##$WBST= 1024
##$WBSW= 4
##$XGAIN= (0..3)
0 0 0 0 
##$XL= 0
##$YL= 0
##$YMAX_a= 41994
##$YMIN_a= -63792
##$ZGOPTNS= <>
##$ZL1= 120
##$ZL2= 120
##$ZL3= 120
##$ZL4= 120
##$ABSF1= 0
##$ABSF2= 0
##$ABSG= 0
##$ABSL= 0
##$ALPHA= 0
##$AQORDER= 0
##$ASSFAC= 0
##$ASSFACI= 0
##$ASSFACX= 0
##$ASSWID= 0
##$AUNMP= <proc_1d>
##$AZFE= 0.1
##$AZFW= 0.5
##$BCFW= 0
##$BC_mod= 2
##$BYTORDP= 0
##$COROFFS= 0
##$CY= -3
##$DATMOD= 1
##$DC= 0
##$DFILT= <>
##$DTYPP= 0
##$F1P= 0
##$F2P= 0
##$FCOR= 1
##$FTSIZE= 65536
##$FT_mod= 6
##$GAMMA= 0
##$GB= 0
##$INTBC= 1
##$INTSCL= 5.30512e-09
##$ISEN= 30
##$LB= 1
##$LEV0= 0
##$LPBIN= 0
##$MAXI= 10000
##$MC2= 0
##$MEAN= 0
##$ME_mod= 0
##$MI= 50
##$NCOEF= 0
##$NC_proc= -7
##$NLEV= 6
##$NOISF1= 182.463
##$NOISF2= 159.3651
##$NSP= 0
##$NTH_PI= 0
##$NZP= 0
##$OFFSET= 248.5645
##$PC= 4
##$PHC0= -8822.794
##$PHC1= 51.06931
##$PH_mod= 1
##$PKNL= yes
##$PPARMOD= 0
##$PSCAL= 0
##$PSIGN= 0
##$REVERSE= no
##$SF= 81.014009
##$SI= 65536
##$SIGF1= 159.3651
##$SIGF2= -187.1042
##$SINO= 113.3802
##$SIOLD= 16384
##$SREGLST= <1H.CDCl3>
##$SSB= 0
##$STSI= 65536
##$STSR= 0
##$SW_p= 40650.406504065
##$SYMM= 0
##$S_DEV= 0
##$TDeff= 32768
##$TDoff= 0
##$TI= <>
##$TILT= no
##$TM1= 0
##$TM2= 0
##$TOPLEV= 0
##$USERP1= <user>
##$USERP2= <user>
##$USERP3= <user>
##$USERP4= <user>
##$USERP5= <user>
##$WDW= 1
##$XDIM= 65536
##$YMAX_p= 220343023
##$YMIN_p= -534583215
$$ End of Bruker specific parameters
$$ ---------------------------------
##NTUPLES= NMR SPECTRUM
##VAR_NAME=  FREQUENCY,     SPECTRUM/REAL,   SPECTRUM/IMAG
##SYMBOL=    X,             R,               I
##VAR_TYPE=  INDEPENDENT,   DEPENDENT,       DEPENDENT
##VAR_FORM=  AFFN,          ASDF,            ASDF
##VAR_DIM=   65536,         65536,           65536
##UNITS=     HZ,            ARBITRARY UNITS, ARBITRARY UNITS
##FACTOR=    0.620285442955139, 1,           1
##FIRST=     20137.2065510759, 0,            0
##LAST=      -20513.1999529892, 0,           0
##MIN=       -20513.1999529892, -534583215,  0
##MAX=       20137.2065510759, 220343023,    0
$$ Real data points
##PAGE= N=1
##DATA TABLE= (X++(R..R)), XYDATA
$$ [...]
12966B639950k860159j985107r47301n87326k02904N42133O70183l61747j132270
$$ 2639950 -220209 -2205316 -3152617 -3739943 -3942847 -3400714 -2730531 -3092278 -4224548
12957d224548j23439J672557K103471J190221N61713Q7479j670756l729084l239003
$$ -4224548 -4347987 -2675430 -571959 618262 1179975 1267454 -403302 -4132386 -7371389
12948g371389l79347J367482R15518J104536K761926K163342k427708o218614
$$ -7371389 -7750736 -6383254 -5467736 -4363200 -1601274 562068 -1865640 -8084254
12940h084254m210346J341652M331973L031572M13991j476857k785247l091850
$$ -8084254 -12294600 -10952948 -6620975 -3589403 -3175412 -4652269 -7437516 -10529366
12932a0529366j916444p98710r29610k96168K722545N037649L194015L9263P93495
$$ -10529366 -12445810 -13244520 -14174130 -14470298 -11747753 -6710104 -3516089 -3476826 -2683331
12923b683331L648755J796545m576314o459688N54619Q168013O257994k940228
$$ -2683331 965424 2761969 -1814345 -8274033 -7719414 448599 6706593 3766365
12915C766365q064710l853762L184263M576763K65481k989801p84487M032995
$$ 3766365 -4298345 -8152107 -4967844 -391081 -125600 -3115401 -3899888 133107
12907A33107N234874L76034o642439r819090o972702j016685L738944N350539
$$ 133107 5367981 5744015 -898424 -10717514 -17690216 -18706901 -14967957 -9617418
12899i617418M737160L898429L948610M163127K971360K78354k038442k803296
$$ -9617418 -4880258 -981829 2966781 7129908 10101268 10379622 8341180 5537884
12891E537884l399250n238963o602573m610330O8260L304054K682674J00750j436832
$$ 5537884 2138634 -3100329 -9702902 -14313232 -14244972 -10940918 -8258244 -8157494 -9594326
12882i594326j187950J47400K218877M267519M313177J238894k986858m910308
$$ -9594326 -10782276 -10634876 -8415999 -4148480 164697 1403591 -1583267 -6493575
12874f493575l332592l14786J502146J523854Q21774L7303j176299k510416k196986
$$ -6493575 -9826167 -10140953 -8638807 -7114953 -6293179 -6255876 -7432175 -9942591 -12139577
12865a2139577O84474L738490L291093o85271l855829k844263O55446K554595
$$ -12139577 -11455103 -7716613 -4425520 -5110791 -8966620 -11810883 -11155437 -8600842
12857h600842J418350q68643j950704p86966J903743L384011J028789l439685
$$ -8600842 -7182492 -8051135 -10001839 -10788805 -8885062 -5501051 -4472262 -7911947
12849g911947m387337L71830N383529M478480n67093l081099j364141K97741j66839
$$ -7911947 -12299284 -11927454 -6543925 -2065445 -2632538 -5713637 -7077778 -6780037 -6946876
12840f946876J53061K648719L986086J854942j032849j553419o39149k98183k4811
$$ -6946876 -6793815 -4145096 -159010 1695932 663083 -890336 -1529485 -1827668 -1852479
12831a852479P47710J94784k468692m180563k205437J499988L514105L912250
$$ -1852479 -1104769 -909985 -3378677 -7559240 -9764677 -8264689 -4750584 -838334
12823h38334M289619L447794l46687m505378m498055o45733J984109P61786j454024
$$ -838334 3451285 6899079 6552392 2047014 -2451041 -3096774 -1112665 -350879 -1804903
12814a804903j295318O15901J622512Q96347k91513o35118N136N47064m62973
$$ -1804903 -3100221 -2484320 -861808 34539 -256974 -892092 -886956 -339892 -802865
12805h02865k863207l916817j051701M184162O724516L556799k362681m953837
$$ -802865 -3666072 -7582889 -8634590 -4450428 2274088 5830887 3468206 -1485631
12797a485631j650637L652196M975910J351850k034336r01102J912649M61947
$$ -1485631 -3136268 515928 5491838 6843688 4809352 3908250 5820899 6282846
12789F282846n052142p739099l723675K487664M962758M078545L290650K224582
$$ 6282846 1230704 -6508395 -10232070 -7744406 -2781648 1296897 4587547 6812129
12781F812129j396152n361208m758508L28952M332098L742832O37463j657152
$$ 6812129 5415977 54769 -4703739 -4374787 -42689 3700143 4337606 2680454
12773B680454k203509j415835k89948p42242k934572l000956J827232O838987
$$ 2680454 476945 -938890 -1228838 -1971080 -4905652 -7906608 -6079376 759611
12765G59611M897111k277416n402024j496860J896982m54882l134701k46654L940350
$$ 759611 5656722 3379306 -2022718 -3519578 -1622596 -2077478 -5212179 -5458833 -1518483
12756a518483K556316j571415o16824M727484O221995J430395l144738k917767
$$ -1518483 1037833 -533582 -1150406 3577078 9799073 11229468 8084730 5166963
12748E166963r40143r27382j774016j665872j610410j994687q71778J446385J040138
$$ 5166963 4226820 3299438 1525422 -140450 -1750860 -3745547 -4617325 -3170940 -2130802
12739b130802l099790n722105k381344L698435N900163K810452j282054k672823
$$ -2130802 -5230592 -10952697 -13334041 -9635606 -3735443 -924991 -2207045 -4879868
12731d879868j505116J92943Q36261J07070p99503m53513M98257P920j678545
$$ -4879868 -6384984 -6192041 -5355780 -5248710 -6048213 -6501726 -6003469 -5995549 -7674094
12722g674094j715862N38880J565870j067236m348758l841018Q9884L328151L684451
$$ -7674094 -9389956 -8851076 -7285206 -8352442 -12701200 -16542218 -16452334 -13124183 -9439732
12713i439732K301840O27554q12419j311835m26720R55878K002162L219684M362192
$$ -9439732 -7137892 -6510338 -7322757 -8634592 -9061312 -8105434 -6103272 -2883588 1478604
12704A478604L086931j292674m737813l157999J234343K754004O10024p03640
$$ 1478604 4565535 3272861 -1464952 -4622951 -3388608 -634604 -24580 -728220
12696g28220N36963O87439j977185l071238Q99009N563080L941117l338564q346880
$$ -728220 -191257 496182 -1481003 -4552241 -3653232 1909848 5850965 2512401 -5834479
12687e834479o268267q52385J875316J449642J603406L360860L461435o9131m114043
$$ -5834479 -12102746 -12955131 -11079815 -9630173 -8026767 -4665907 -1204472 -1273603 -5387646
12678e387646m320750r19690K033803K502820K328594K728617J486301k941607
$$ -5387646 -9708396 -10628086 -8594283 -6091463 -3762869 -1034252 452049 -2489558
12670b489558p079961n892846J50058M983986M386845N81429j662321r73621M36157
$$ -2489558 -9569519 -15462365 -15312307 -10328321 -5941476 -5360047 -7022368 -7995989 -7559832
12661g559832Q39756Q47150J498264K427571K549021J606201L43580m64373n67845
$$ -7559832 -6720076 -5872926 -4374662 -1947091 601930 2208131 2551711 2087338 1519493
12652A519493l4035Q11096J166306K94372j333540k252947j903279j265513q29208
$$ 1519493 1485458 2296554 3462860 3757232 2423692 170745 -1732534 -2998047 -3827255
12643c827255N03581K834864L288249n04581n788993o915711k211998M441859
$$ -3827255 -3323674 -488810 2799439 2294858 -3494135 -10409846 -12621844 -8179985
12635h179985Q831364R676782O700639O9957o872535q819713m797174L12004K402100
$$ -8179985 651379 10328161 17028800 17098757 10226222 1406509 -3390665 -3078661 -676561
12626f76561K376435J972543K94464k607333l626931j641724M7474j96050O46234
$$ -676561 1699874 3672417 3966881 1359548 -2267383 -3909107 -3861633 -4057683 -3411449
12617c411449L102552J940535m045514o467875J1576O627321L148576m469335
$$ -3411449 -308897 1631638 -2413876 -8881751 -8870175 -2242854 905722 -3563613
12609c563613k899136N857969O887709k551568p744145p49319O617245K481749
$$ -3563613 -6462749 -604780 6282929 3731361 -4012784 -4762103 1855142 4336891
12601D336891o501708p416893r74685L231272L218871L563788L525423r02614
$$ 4336891 -2164817 -9581710 -10556395 -7325123 -4106252 -542464 2982959 2080345
12593B080345o255770n022665J472770M416129J264893j860042j585798j203899
$$ 2080345 -4175425 -9198090 -7725320 -3309191 -2044298 -3904340 -5490138 -6694037
12585f694037k134885j062403K127537K377066j351530k938587Q18099M274145
$$ -6694037 -8828922 -9891325 -7763788 -5386722 -6738252 -9676839 -8858740 -4584595
12577d584595K050767k210232k124274J289283K339641L23309m93232Q14947M73826
$$ -4584595 -2533828 -4744060 -6868334 -5579051 -3239410 -2916101 -3409333 -2594386 -2120560
12568b120560k279650k485534K447365O704623L218542n247957q163691j384321
$$ -2120560 -4400210 -6885744 -4438379 2266244 5484786 236829 -7926862 -9311183
12560i311183O268959M403432m864246j0002110n580864K067616N401010M845266
$$ -9311183 -3042224 1361208 -3503038 -13505148 -19086012 -17018396 -11617386 -6772120
12552f772120M195218L081346m24080l763545k798237J139843K860712J172096
$$ -6772120 -2576902 504444 80364 -3683181 -6481418 -5341575 -2480863 -1308767
12544a308767j18692J046972K143999Q09024j595340k488217j341821N53837J597400
$$ -1308767 -1427459 -380487 1763512 2572536 977196 -1511021 -2852842 -2299005 -701605
12535g01605Q15255j041029j731244n47071O8401j822948l930276k791751P43474
$$ -701605 113650 -927379 -2658623 -3205694 -3137293 -4960241 -8890517 -11682268 -10938794
12526a0938794K831009K614410K673952L538741K287040k038492n475238m059948
$$ -10938794 -8107785 -5493375 -2819423 719318 3006358 967866 -4507372 -8567320
12518h567320N48473K873096L39677l620748l707155O46045M216661K682145j233269
$$ -8567320 -8018847 -5145751 -4806074 -8426822 -12133977 -11487932 -7271271 -4589126 -5822395
12509e822395j492035K148439L754396Q67592j542160J02945J486804j833953
$$ -5822395 -7314430 -5165991 -1411595 -544003 -2086163 -1983218 -496414 -2330367
12501b330367n615356l285067K667852M129159K57650j831798Q95376L233222
$$ -2330367 -7945723 -11230790 -8562938 -4433779 -4176129 -6007927 -5112551 -1879329
12493a879329J106171k465067l275219j617213M68420K322298K910056R21641
$$ -1879329 -773158 -3238225 -6513444 -8130657 -7662237 -5339939 -2429883 -1508242
12485a508242j604894q00169K384897K568680j253182l300309j1047M418608M798838
$$ -1508242 -3113136 -3913305 -1528408 1040272 -212910 -3513219 -3524266 894342 5693180
12476E693180J871142j060666l260612m474382k712815J521150L337829M20349
$$ 5693180 7564322 6503656 3243044 -1231338 -3944153 -2423003 914826 1335175
12468A335175k366325l30884L079656J559285l734928n514996q26139N442148
$$ 1335175 -1031150 -1362034 1717622 3276907 -458021 -5973017 -6799156 -1357008
12460a357008P417657M246132q84339m240455l879918j022378R91963N94533m01117
$$ -1357008 6060649 10306781 9422442 5181987 1302069 279691 1271654 1866187 1465070
12451A465070m37241r39405l026818m284168k291261Q41086J432461J58900P99163
$$ 1465070 1027829 88424 -2938394 -7222562 -9513823 -8672737 -7240276 -7081376 -6282213
12442f282213L849311N573912L563026l06701l022651l688936k953697j518884
$$ -6282213 -2432902 3141010 6704036 6397335 3374684 -314252 -3267949 -4786833
12434d786833r4197O45293O38313K22710m41772j015107p75242K65819Q41292
$$ -4786833 -4881030 -4235737 -3597424 -3374714 -3816486 -4831593 -5606835 -5341016 -4499724
12425d499724k2822j695447k756496k092698Q96748N217354P206562L591096l192003
$$ -4499724 -4522546 -6217993 -8974489 -11067187 -10170439 -4953085 2253477 5844573 2652570
12416B652570o106883k197095L017333K889456j436740l489304r64287J942574
$$ 2652570 -3454313 -5651408 -2634075 255381 -1181359 -4670663 -5634950 -3692376
12408c692376J424467j073934k079157j068930l08504j170006k305243j472517
$$ -3692376 -2267909 -3341843 -5421000 -6489930 -6798434 -7968440 -10273683 -11746200
12400a1746200J446206L865412L479731J293038K85649J252320J915618N45643
$$ -11746200 -10299994 -6434582 -2954851 -1661813 -1376164 -123844 1791774 2337417
12392B337417j610746k337034j115200R46889K215909J185800k069066m915714
$$ 2337417 726671 -1610363 -2725563 -1778674 437235 1623035 -446031 -5361745
12384e361745m799280k685516j170941J75633L463538O671937M763002j913634
$$ -5361745 -10161025 -12846541 -14017482 -13841849 -10378311 -3706374 1056628 -857006
12376h57006o087465l386790J573832K707044J032120Q29517J565879j55449l223804
$$ -857006 -6944471 -10331261 -8757429 -6050385 -5018265 -4188748 -2622869 -2778318 -6002122
12367f002122l068986O90143L309433K103989L8733P95469L300468L060220j855229
$$ -6002122 -9071108 -8380965 -5071532 -2967543 -2928810 -2133341 1167127 4227347 2372118
12358B372118p290313o716883N26382O738130M917191j543357l700307m51849
$$ 2372118 -4918195 -11635078 -11108696 -4370566 546625 -996732 -4697039 -5148888
12350e148888P39557k686954l751763J352017N478620K201525l031916j989854
$$ -5148888 -4409331 -7096285 -10848048 -9496031 -4017411 -1815886 -4847802 -6837656
12342f837656K792459L197494p72245k567979q91317k2104p46753k99669O36852
$$ -6837656 -4045197 -847703 -1619948 -4187927 -5079244 -5101348 -5848101 -6147770 -5510918
12333e510918k56204m76615K855005N024315N09003n186454k618482M550045L542212
$$ -5510918 -5767122 -6243737 -3388732 1635583 2144586 -3041868 -5660350 -1110305 2431907
12324B431907o153342j0346256k399044O601650N895608J98668j056458J498912
$$ 2431907 -3721435 -14067691 -16466735 -9865085 -3969477 -3770809 -4827267 -3328355
12316c328355K111413P76136K78832n71788k829252k984257K38490J415036k187621
$$ -3328355 -1216942 -440806 -161974 -733762 -3563014 -6547271 -6308781 -4893745 -7081366
12307g081366m050684Q75051O243369M231147j353433k066513Q85802N31046k269362
$$ -7081366 -11132050 -10256999 -4013630 217517 -1135916 -3202429 -2316627 -1785581 -4054943
12298d054943j169899K523110J554182l262639l146350L208073O093285L36796
$$ -4054943 -5224842 -2701732 -1147550 -4410189 -7556539 -4348466 1744819 2081615
12290B081615n846332l196562M952675P898856K067518n499592o485638l40129
$$ 2081615 -3764717 -6961279 -2008604 5890252 7957770 2458178 -4027460 -4367589
12282d367589N844740N173052j403300o262856m654054k04145J447861O22174
$$ -4367589 1477151 6650203 5246903 -1015953 -5670007 -5874152 -4426291 -3804117
12274c804117O39267N62034k478455n841551l779584K974143P047771M663065
$$ -3804117 -3164850 -2602816 -5081271 -10922822 -14702406 -11728263 -4680492 -17427
12266a7427q1899k101091r52911J187946K026934n91399n651572o842757J02415
$$ -17427 -99326 -2200417 -3153328 -1965382 61552 -529847 -6181419 -13024176 -12921761
12257a2921761Q709211Q401065o1834n070461j648074J870100j497881o370804
$$ -12921761 -4212550 4188515 4126681 -943780 -2591854 -721754 -2219635 -8590439
12249h590439n134054j97549J907597J549395K396092K599308j040586m400513
$$ -8590439 -13724493 -13922042 -12014445 -10465050 -8068958 -5469650 -6510236 -10910749
12241a0910749j327533N038060N959222R26412j746010J533863M545967J738410
$$ -10910749 -12238282 -7200222 -1241000 -314588 -2060598 -526735 4019232 5757642
12233E757642l899782o530247n152271k519917q24224r34627k337482k231457
$$ 5757642 1857860 -4672387 -9824658 -12344575 -13168799 -14103426 -16440908 -18672365
12225a8672365J763935O985409P767415L156531j558211k258651p10509l34383
$$ -18672365 -16908430 -9923021 -2155606 1000925 -557286 -2815937 -3526446 -3860829
12217c860829j408051k375172k317895n56476K671403M169742Q13073m283974
$$ -3860829 -5268880 -7644052 -9961947 -10518423 -7847020 -3677278 -2864205 -7148179
12209g148179m027142K172969O160759K711874k590336k218956J939678K745188
$$ -7148179 -11175321 -9002352 -2841593 -129719 -2720055 -4939011 -2999333 -254145
12201b54145n42111k344797o43989P27757m27071j572796q73820j20183o57871
$$ -254145 -796256 -3141053 -3785042 -3057285 -3484356 -5057152 -5930972 -6051155 -6709026
12192f709026j021101k69680K39644p5684K62891J605372K029787P54340m47224
$$ -6709026 -7730127 -7999807 -7760163 -7835847 -7572956 -5967584 -3937797 -3183457 -3630681
12183c630681m80109m16439n51290O27711K982518L627165J230995j679277k710476
$$ -3630681 -4110790 -4527229 -5078519 -4450808 -1468290 2158875 3389870 1710593 -999883
12174i99883k787578l173747k581390n8873K210560K204869J559823K366262K987691
$$ -999883 -3787461 -6961208 -9542598 -9601471 -7390911 -5186042 -3626219 -1259957 1727734
12165A727734J055804j532654j307024N41426q5368k641339k005890K688756N093383
$$ 1727734 2783538 1250884 -56140 485286 399918 -2241421 -4247311 -1558555 3534828
12156C534828P17375n621463o085799p90381K868509J097828j525111K81321M505814
$$ 3534828 4252203 -1369260 -7455059 -8245440 -5376931 -4279103 -5804214 -5522893 -1017079
12147a017079N002967L79893m259644m243110o77403K027688J456144j375839
$$ -1017079 3985888 4365781 106137 -4136973 -4814376 -2786688 -1330544 -2706383
12139b706383l949583m038973j100620K564296L440712J081023r54050j46316
$$ -2706383 -6655966 -10694939 -11795559 -9231263 -5790551 -4709528 -5663578 -5809894
12131e809894J306850N16429j012493m54761K86749k730826p449751o998344j01927
$$ -5809894 -4503044 -3986615 -4999108 -5453869 -5167120 -7897946 -15347697 -22346041 -22447968
12122b2447968O084743O118360L204066K364057K561450Q09249r52140L57466
$$ -22447968 -16363225 -10244865 -7040799 -4676742 -2115292 -1306043 -2258183 -1900717
12114a900717K002956l76840l915945j828375M981464P718670K519836l930406
$$ -1900717 102239 -274601 -4190546 -6018921 -1037457 6681213 9201049 5270643
12106E270643m553830j295520k21984k173892l323228j916629M58334K647854
$$ 5270643 716813 -578707 -800691 -2974583 -6297811 -8214440 -7756106 -5108252
12098e108252M629475N231984K942629j047723l556743l295500j686192L0093
$$ -5108252 -478777 4753207 7695836 6648113 3091370 -204130 -1890322 -1860229
12090a860229J837561K865511J242453k601873m906137l034227N53362J324522
$$ -1860229 -22668 2842843 4085296 1483423 -3422714 -6456941 -5903579 -4579057
12082d579057j114455k780626j407184N03139P5880j612184k083741j590382j279564
$$ -4579057 -5693512 -8474138 -9881322 -9378183 -9302303 -10914487 -12998228 -14588610 -15868174
12073a5868174L14988M282900O623288K662222m117604m825603J603994N527577
$$ -15868174 -15553186 -11270286 -4646998 -1984776 -6102380 -10927983 -9323989 -3796412
12065c796412Q33514n328528l481665L554607N480776L18860l929934k265357
$$ -3796412 -2962898 -8291426 -11773091 -8218484 -2737708 -2418848 -6348782 -8614139
12057h614139J708045L814887M540293M226768Q28279m255421n036757l1371L356044
$$ -8614139 -6906094 -3091207 1449086 5675854 6504133 2248712 -2788045 -2819416 536628
12048E36628j134780q688780r525953k208769N190824O221907K828503M08140
$$ 536628 -598152 -9286932 -18812885 -21021654 -15830830 -9608923 -6780420 -6372280
12040f372280O13093J158551K67656j145661j268420J88953J940771K918950L129247
$$ -6372280 -5759187 -4600636 -4332980 -5478641 -6747061 -6558108 -4617337 -1698387 1430860
12031A430860K646039J116928r35432j783093q28209J67463j52979m66049M92772
$$ 1430860 4076899 5193827 4258395 2475302 1647093 1814556 1661577 1195528 1688300
12022A688300Q47208j554122m759329n083505k817965j279631q01469J373413
$$ 1688300 2535508 981386 -3777943 -8861448 -11679413 -12959044 -13760513 -12387100
12014a2387100M915692N417160J256165l109541l176760k21754J443017M00692
$$ -12387100 -7471408 -2054248 -798083 -3907624 -7084384 -7306138 -5863121 -5462429
12006e462429j038855k78762K768664N178359L303730k581676o802922m519860
$$ -5462429 -6501284 -6780046 -4011382 1166977 4470707 1889031 -4913891 -9433751
11998i433751J404971L805599R90493j675339j78008L288223M857022L492078
$$ -9433751 -8028780 -4223181 -3232688 -4908027 -5086035 -1797812 3059210 6551288
11990F551288k04763m824475o669244k669805L833129N710120J981810q91989
$$ 6551288 6346525 1522050 -5147194 -7816999 -3983870 1726250 3708060 2816071
11982B816071M22570J232719k156786n476316l544864J421225M003682L444702
$$ 2816071 3238641 4471360 2314574 -3161742 -6706606 -5285381 -1281699 2163003
11974B163003K062363M0179k847139l947799j406151J888958K558303J776632
$$ 2163003 4225366 4265545 1418406 -2529393 -3935544 -2046586 511717 2288349
11966B288349J890468J647833o45202k730415j868913L92832J116874M03081o40803
$$ 2288349 4178817 5826650 5181448 2451033 582120 974952 2091826 2494907 1854104
11957A854104k315794l323800n35249M393104M530170j291904m268965R68951
$$ 1854104 -461690 -3785490 -4320739 72365 4602535 3310631 -958334 10617
11949A0617O505328L408378l503529m047371K84761L83517l533028k991487K317012
$$ 10617 6515945 9924323 6420794 2373423 2658184 3041701 -491327 -3482814 -1165802
11940a165802L363426k013930n105801j411514K459389J191107q80080Q13383
$$ -1165802 2197624 183694 -4922107 -6333621 -3874232 -2683125 -3563205 -2749822
11932b749822K716769M10631l263930l495720j198007J0490k8536O12646K110389
$$ -2749822 -33053 377578 -2886352 -6382072 -7580079 -7569589 -7598125 -6985479 -4875090
11923d875090L776578N364244N308129J485143m524195p830044o184575j867720
$$ -4875090 -1098512 4265732 9573861 11059004 6534809 -1295235 -7479810 -9347530
11915i347530K476502N477873N147899R05279l007721k084107J302643J738591
$$ -9347530 -6871028 -1393155 3754744 4660023 1652302 -431805 870838 2609429
11907B609429J2999N10781J370100k515051p618880m895703M320439Q156983K479507
$$ 2609429 2622428 3133209 4503309 1988258 -5630622 -10526325 -6205886 1951097 4430604
11898D430604l431644l047952j159274j483657L11390M613119L161349n107726
$$ 4430604 998960 -2048992 -3208266 -4691923 -4380533 232586 3393935 -1713791
11890a713791p772337Q96092P566530Q47893q663768n455573N152480O978967
$$ -1713791 -9486128 -8590036 -1023506 -175613 -8839381 -14294954 -9142474 -2163507
11882b163507K23354j634427K871770K223890m911292o286690J629269O886587
$$ -2163507 -1940153 -3574580 -702810 1521080 -3390212 -9676902 -8047633 -1161046
11874a161046K638725k294529j40735L363095J235460k668202k592425j371120
$$ -1161046 1477679 -816850 -957585 2405510 3640970 972768 -1619657 -2990777
11866b990777l048384l813950N91580N373785L500027k974705o283943l921011
$$ -2990777 -6039161 -9853111 -9261531 -3887746 -387719 -3362424 -9646367 -13567378
11858a3567378M16374L624192N044097M154817J429571n94651p25315j048845
$$ -13567378 -13151004 -9526812 -4482715 -327898 1101673 507022 -218293 -1267138
11850a267138k707388l252794j132578J106542J360085J722507M078439N727694
$$ -1267138 -3974526 -7227320 -8359898 -7253356 -5893271 -4170764 -92325 5635369
11842E635369L430073j238161m292010m513057l140178j054245R92675J955517
$$ 5635369 9065442 7827281 3535271 -977786 -4117964 -5172209 -4179534 -2224017
11834b224017K328224L307537K964555j905810q309975p863119J030199Q273864
$$ -2224017 104207 3411744 6376299 4470489 -3839486 -11702605 -10672406 -2398542
11826b398542N231971k812294m797909k45933J512562l189535p022643l447014
$$ -2398542 2833429 21135 -4776774 -5022707 -3510145 -6699680 -13722323 -17169337
11818a7169337L724512O270505K380504k406775k812182P85195M016512L773491
$$ -17169337 -13444825 -7174320 -4793816 -7200591 -10012773 -9227578 -5211066 -1437575
11810a437575J278944k6249Q69229J509589K5285j834483j292444J388993L300248
$$ -1437575 -158631 -184880 684349 2193938 2219223 384740 -907704 481289 3781537
11801C781537K403001p95014m172253n427615l551906J08946K948638L506863
$$ 3781537 6184538 5389524 1217271 -4210344 -7762250 -7653304 -4704666 -1197803
11793a197803J948739r35434l244499k072977K306029L981568j421064q062071
$$ -1197803 750936 -184498 -3428997 -5501974 -3195945 785623 -635441 -8697512
11785h697512n874493L938941Q404138J352210o856441m806099L220756N352952
$$ -8697512 -14572005 -10633064 -2228926 -876716 -7733157 -12539256 -9318500 -3965548
11777c965548N91657k218569l03363M04898j948004j623484L149129N631914J833806
$$ -3965548 -3373891 -5592460 -5895823 -5490925 -7438929 -9062413 -5913284 -281370 1552436
11768A552436k431154j056841K850114K960521k59244j934608j387679j818389
$$ 1552436 -878718 -1935559 914555 3875076 3615832 1681224 293545 -1524844
11760a524844l356755k569627J208213L973987K633439q07558k205335n54468
$$ -1524844 -4881599 -7451226 -6243013 -2269026 364413 -443145 -2648480 -3202948
11752c202948J389978J189550k01281l28581P65784O24324j249846j892114N16767
$$ -3202948 -1812970 -623420 -824701 -1153282 -387498 236826 -1013020 -2905134 -2388367
11743b388367L187280K587690m52697k682158l325980l367594k155801P60786
$$ -2388367 798913 3386603 2933906 251748 -3074232 -6441826 -8597627 -7836841
11735g836841K451540N98821j104631K096441O951046N722979j213842m830404
$$ -7836841 -5385301 -4786480 -5891111 -3794670 3156376 8879355 7665513 2835109
11727B835109j270666K501778M89613l247857k656861M14387R69945l15132j25636
$$ 2835109 1564443 4066221 4555834 1307977 -1348884 -934497 35448 -279684 -405320
11718d05320K56298j986675m484949l195110K03343J327754Q02375J764843K256117
$$ -405320 -149022 -2135697 -6620646 -9815756 -9612413 -8284659 -7482284 -5717441 -3461324
11709c461324j711487p004523o075466J131921O434941N562974K845198K021207
$$ -3461324 -5172811 -12177334 -18252800 -17120879 -10685938 -5122964 -2277766 -256559
11701b56559P74704k367123l595079q27921J640996N64032m83081J494214J914689
$$ -256559 518145 -1848978 -5444057 -6271978 -4630982 -4066950 -4550031 -3055817 -1141128
11692a141128l396102q245086l675410O784828R877413J531364o822764m693891
$$ -1141128 -4537230 -12782316 -16457726 -9672898 204515 1735879 -5086885 -9780776
11684i780776L139265N182058M3417l686979j589455J550222J466792Q87048K746729
$$ -9780776 -6641511 -1459453 -1416036 -5103015 -6692470 -5142248 -3675456 -2788408 -41679
11675d1679L588145n53591o004581n948102r42937K045521O41476k42783J980838
$$ -41679 3546466 2992875 -3011706 -8959808 -9902745 -7857224 -7215748 -7458531 -5477693
11666e477693K781783r89192m449419k235708K286405K292233j230624j220769
$$ -5477693 -2695910 -3685102 -8134521 -10370229 -8083824 -5791591 -7022215 -8242984
11658h242984L509818N920505J709591m030193m246570N89362M034807K174696
$$ -8242984 -4733166 1187339 2896930 -1133263 -5379833 -4790471 -755664 1419032
11650A419032k399779m180871r01989L554458K979488l239558p909094m675907
$$ 1419032 -980747 -5161618 -6063607 -2509149 470339 -2769219 -10678313 -15354220
11642a5354220L074686O483797L136643r49409j126354N24970J038908J287106
$$ -15354220 -12279534 -5795737 -2659094 -3608503 -4734857 -4209887 -3170979 -1883873
11634a883873J969430P78832k494961l160593J369358N974918M419774j594770
$$ -1883873 85557 864389 -1630572 -4791165 -3421807 2553111 6972885 5378115
11626E378115n160250l645338m59482R86937L66056j380223k750908j626816J775439
$$ 5378115 217865 -3427473 -3886955 -2900018 -2533962 -3914185 -6665093 -8291909 -6516470
11617f516470L296109r434m756184n437798k015990J333000L207426N042253N511023
$$ -6516470 -3220361 -3229795 -7985979 -13423777 -15439767 -14106767 -10899341 -5857088 -346065
11608c46065J747090l565000l483723K754464P118052L862669k496123m522792
$$ -346065 1401025 -2163975 -5647698 -2893234 4224818 8087487 5591364 1068572
11600A068572k311742j341517l333530n044177m426369k505025K77084M399642
$$ 1068572 -1243170 -2584687 -5918217 -10962394 -15388763 -17893788 -17616704 -13217062
11592a3217062P579946N727873o26583m885102k183177L997445O186119K439561
$$ -13217062 -5637116 90757 -535826 -5420928 -7604105 -3606660 2579459 5019020
11584E019020j883373j782966J171904J878380j072683l800736k653568R84255
$$ 5019020 3135647 1352681 2524585 4402965 3330282 -470454 -3124022 -2139767
11576b139767K812220J366798n32864l76272K73421j394924m151753l611032R14173
$$ -2139767 672453 2039251 1506387 1130115 1403536 8612 -4143141 -7754173 -6840000
11567f840000L927807Q54567m905134o150339j902272J760222J116710n92933
$$ -6840000 -2912193 -2057626 -6962760 -13113099 -15015371 -13255149 -12138439 -12731372
11559a2731372M8613J065193J72291Q3639L138985N084917J288892m099735l457374
$$ -12731372 -12682759 -11617566 -11445275 -11361636 -8222651 -3137734 -1848842 -5948577 -9405951
11550i405951J763353L096750o34257j363812L903731P328389L276406k482690
$$ -9405951 -7642598 -4545848 -5180105 -6543917 -2640186 4688203 7964609 5481919
11542E481919k950694q45766j685905l113202n9041M801769N043310J208751j201075
$$ 5481919 2531225 1685459 -446 -3113648 -3172689 1629080 6672390 7881141 6680066
11533F680066j329548k075496k649111q09770L48437k789385n548438j403714
$$ 6680066 5350518 3275022 625911 -183859 164578 -2624807 -8173245 -9576959
11525i576959N135606M065843k871071m053504K128417M191706j906352m726343
$$ -9576959 -4441353 -375510 -3246581 -7300085 -5171668 -979962 -2886314 -7612657
11517g612657K614487R004655L303991o310895n170571M169073O757116o22386
$$ -7612657 -4998170 4006485 7310476 999581 -4170990 -1917 6755199 6132813
11509F132813o010904k529479K497519J502362k461339l681527l025667l390317
$$ 6132813 121909 -2407570 89949 1592311 -869028 -4550555 -7576222 -10966539
11501a0966539l068653K40870L705457L278702J92560j157803L83577K302263
$$ -10966539 -14035192 -13794322 -10088865 -6810163 -6617603 -7775406 -7391829 -5089566
11493e089566K678390J551746o92744l344983m565692l048730j21490J621804
$$ -5089566 -2411176 -859430 -1552174 -4897157 -9462849 -12511579 -12633069 -11011265
11485a1011265J372821L27819n33487j158440j101654O56391L829805N958875
$$ -11011265 -9638444 -9310625 -9844112 -11002552 -12104206 -11447815 -7618010 -1659135
11477a659135M730937R77627j862559j663043J91371J362056J826560K636293
$$ -1659135 3071802 4049429 2186870 523827 715198 2077254 3903814 6540107
11469F540107K581499o92082o093534r032601p192342l319236o67932J123041
$$ 6540107 9121606 8429524 2335990 -6696611 -13888953 -17208189 -17876121 -16753080
11461a6753080L293717M384847K877431R34386J494728L257491K662541j91865
$$ -16753080 -13459363 -9074516 -6197085 -5262699 -3767971 -510480 2152061 1960196
11453A960196j779079p32785Q78669J565566J573022K66417k992500n230505k567374
$$ 1960196 181117 -551668 327001 1892567 3465589 3732006 739506 -4490999 -7058373
11444g058373K377801J990033m606529p753714n27524R497066R386915j054831
$$ -7058373 -4680572 -2690539 -7297068 -15050782 -15578306 -6081240 3305675 2250844
11436B250844r113216p127796j627890j315253m046048k274065L896826P257315
$$ 2250844 -6862372 -13990168 -15618058 -16933311 -20979359 -23253424 -19356598 -12099283
11428a2099283M980495J570631K43074r75341k657945r82615M578895P104222
$$ -12099283 -7118788 -5548157 -5305083 -6280424 -8938369 -9920984 -5342089 1762133
11420A762133J846198m900090m057003K273645L864226j500166m539722O04504
$$ 1762133 3608331 -1291759 -5348762 -3075117 789109 -711057 -5250779 -4646275
11412d646275P018069N862581m99321l488897j806710j524976m421462m849980
$$ -4646275 2371794 8234375 7735054 4246157 2439447 914471 -3506991 -8356971
11404h356971K03540N131612L754030j317127k438753J918620M914384R96278
$$ -8356971 -8153431 -3021819 732211 -584916 -3023669 -1105049 3809335 4805613
11396D805613o036253p537217j259303N314002M134023l266937p668972l656584
$$ 4805613 -1230640 -8767857 -10027160 -4713158 -579135 -3846072 -11515044 -15171628
11388a5171628M081438P225383L878667o15521j634842m90995p09092j970380
$$ -15171628 -11090190 -3864807 13860 -601661 -2236503 -2727498 -3436590 -5406970
11380e406970q46304K956957M686610R68122m366898m692101R6425L494829K320162
$$ -5406970 -6253274 -3296317 1390293 2358415 -2008483 -6700584 -6604159 -3109330 -789168
11371g89168J016859L070691M019238j101590p789956p513149j021878K473786
$$ -789168 227691 3298382 7317620 6216030 -1573926 -9087075 -10108953 -7635167
11363g635167m86072l069687J5953M486764M345318Q47137j370569j581777j299122
$$ -7635167 -8121239 -11190926 -11174973 -6688209 -2342891 -1495754 -2866323 -4448100 -5747222
11354e747222K5126K568876L444634J229622o70744K27131O70445k226697m560818
$$ -5747222 -5722096 -3153220 291414 1521036 850292 1077423 1747868 -478829 -5039647
11345e039647j673451L168851L295868p91185k720717n31459J584843J146247
$$ -5039647 -6713098 -3544247 -248379 -1039564 -3760281 -4291740 -2706897 -1560650
11337a560650J41360j69761j117071k819287l622038l384513k890902j043943
$$ -1560650 -1419290 -1589051 -2706122 -5525409 -9147447 -12531960 -15422862 -16466805
11329a6466805K547517M177056J190075j788012Q35761N218883L220857l112423
$$ -16466805 -13919288 -9742232 -8552157 -10340169 -9504408 -4285525 -1064668 -4177091
11321d177091l328471L832061O760003m82489p571402l725738N480697P262438
$$ -4177091 -7505562 -3673501 3086502 2604013 -4967389 -8693127 -3212430 4050008
11313D050008Q55776l669782k174308n56274k560046l910170r76854K805508K866558
$$ 4050008 4905784 1236002 -938306 -1494580 -4054626 -7964796 -8941650 -6136142 -3269584
11304c269584J69337j749880k259518k546290k113067p8223J794479Q75118k041829
$$ -3269584 -3100247 -4850127 -7109645 -9655935 -11769002 -11847225 -10052746 -9177628 -11219457
11295a1219457l127476n75116K938424L856890K257048J144654J947424K758033
$$ -11219457 -14346933 -14922049 -11983625 -8126735 -5869687 -4725033 -2777609 -19576
11287a9576J539863p37588j545042k55720J449777K014002J236176n38029k746532
$$ -19576 1520287 782699 -762343 -1018063 431714 2445716 3681892 3143863 397331
11278C97331m053824k986795K39779L167604K877930j221890n828821n846792
$$ 397331 -3656493 -6643288 -6403509 -3235905 -357975 -1579865 -7408686 -13255478
11270a3255478q4223N678161M638544j692508m536531J49667N908274N422935
$$ -13255478 -13339701 -7661540 -3022996 -4715504 -9252035 -9102368 -3194094 2228841
11262B228841O75170j768837j019798p10641j098905O7950J210836n27338k200956
$$ 2228841 2904011 1135174 115376 -595265 -1694170 -1626220 -415384 -942722 -3143678
11253c143678P43278M499689J197022o775269p949759M39135P286243M685049
$$ -3143678 -2400400 2099289 3296311 -3478958 -11428717 -10989582 -3703339 981710
11245I81710q82297r54775J556794J41642k675417p72724L410462K674449k583941
$$ 981710 99413 -855362 701432 843074 -1832343 -2605067 805395 3479844 895903
11236H95903n441376l557654o74383J032338K157128J496720k025994m657921
$$ 895903 -4545473 -8103127 -8777510 -7745172 -5588044 -4091324 -6117318 -10775239
11228a0775239k516941J095026Q07555j061111J090254M494788J772460m598382
$$ -10775239 -13292180 -12197154 -11389599 -12450710 -11360456 -6865668 -5093208 -9691590
11220i691590m022629M321079Q090560Q08794p610330o317467Q05497L719617
$$ -9691590 -13714219 -9393140 -1302580 -493786 -8104116 -14421583 -13616086 -9896469
11212i896469K027691J897048L240939J188146k839970k480037J943603L150698
$$ -9896469 -7868778 -5971730 -2730791 -1542645 -4382615 -6862652 -4919049 -1768351
11204a768351r25869l917822k172899n03197k792663m450837l08546N408608M468522
$$ -1768351 -2694220 -6612042 -8784941 -9288138 -12080801 -16531638 -16840184 -11431576 -6963054
11195f963054k524172o183190j467917N748602P463818L740490L85579q16K54570
$$ -6963054 -9487226 -15670416 -17138333 -11389731 -3925913 -185423 200156 199340 453910
11186D53910l07492K2407J837279K412488O432k813828k898251j219630p56177
$$ 453910 146418 168825 2006104 4418592 4425024 1611196 -1287055 -2506685 -3262862
11177c262862j401133n97245J686639K353210l36k690443k387051J066293M843440
$$ -3262862 -4663995 -5261240 -3574601 -1221391 -1221727 -3912170 -6299221 -5232928 -389488
11168c89488N504679J394912n068548p862982l212185M776519P729140L057909
$$ -389488 5115191 6510103 1441555 -6421427 -9633612 -4857093 2872047 5929956
11160E929956l223923n049211l496519k791717l089631j575737J650326L606223
$$ 5929956 2706033 -2343178 -5839697 -8631414 -11721045 -13296782 -11646456 -8040233
11152h040233L492034L380300L888020L144723P03381j115282j005182p38174
$$ -8040233 -4548199 -1167899 2720121 5864844 6568225 5452943 4447761 3709587
11144C709587j830649k703684j202637J809701L417028K214164n99665k805691
$$ 3709587 1878938 -824746 -2027383 -217682 3199346 5413510 4813845 2008154
11136B008154k644817J49957L337328L273321j062422n751489n720399p87878
$$ 2008154 -636663 -486706 2850622 6123943 5061521 -689968 -6410367 -7198245
11128g198245M102367N045283L320412K101202J180443k133198p365836r565450
$$ -7198245 -3095878 1949405 5269817 7371019 8551462 6418264 -947572 -10513022
11120a0513022n407409J562994M601215K004968j221627l38026L372653N318004
$$ -10513022 -15920431 -14357437 -9756222 -7751254 -8972881 -9310907 -5938254 -620250
11112f20250L676348M05031k212398l232939k117775Q75891L389047K812793p7663
$$ -620250 3056098 3461129 1248731 -1984208 -4101983 -3226092 162955 2975748 2898085
11103B898085j744468o71029R07783P80849k95801o33763k63123p1594k08551
$$ 2898085 1153617 482588 1390371 2171220 1875419 1241656 978533 906939 698388
11094F98388o05195j205801q21014J742403M455286L309452j507449m484470k501108
$$ 698388 93193 -1112608 -1933622 -191219 4264067 7573519 6066070 1581600 -919508
11085i19508L46346n69592k897208j782204J368234J190918k294954l685243j168518
$$ -919508 -573162 -1142754 -4039962 -5822166 -4453932 -3263014 -5557968 -9243211 -10411729
11076a0411729J479170K507676M700453Q305571Q234748J848427n753971q124025
$$ -10411729 -8932559 -6424883 -1724430 6581141 14815889 16664316 10910345 2786320
11068B786320n244533j597626R9303J42915l10907j52826O38078k8084l073644
$$ 2786320 -2458213 -4055839 -3956536 -3813621 -4124528 -4277354 -3639276 -3667360 -6741004
11059f741004m250239R65039Q114044P078612k931861j0105035o241701K037756
$$ -6741004 -10991243 -10026204 -1912160 5166452 2234591 -7870444 -14112145 -12074389
11051a2074389M575460K153080J371937K053529K6256k437045j05624M133588
$$ -12074389 -7498929 -5345849 -3973912 -1920383 -1894127 -4331172 -4436796 -303208
11043c03208K800815k924367m481975l27124K052684j97265q13197L101746M692534
$$ -303208 2497607 -426760 -4908735 -5235859 -3183175 -3380440 -4193637 -1091891 3600643
11034C600643r23714p162561n251972K857881P785058N271425n24324m019059
$$ 3600643 2676929 -4485632 -9737604 -6879723 905335 6176760 5652436 1633377
11026A633377l443515j94147L105977L910488J365354k926896n991205n268542
$$ 1633377 -1810138 -2004285 1101692 5012180 6377534 3450638 -2540567 -7809109
11018g809109p22467L712697L243194j039845k030903L124698P092064K699437
$$ -7809109 -8531576 -4818879 -1575685 -2615530 -4646433 -1521735 5570329 8269766
11010H269766n069147n935106k35016K306404j284933l569991l67590L203534
$$ 8269766 3200619 -2734487 -2969503 -663099 -1948032 -5518023 -5885613 -2682079
11002b682079L363294L475728M910225K687380m059082p338764k983432J308377
$$ -2682079 681215 4156943 9067168 11754548 7695466 356702 -2626730 -1318353
10994a318353j280189m652608l05567P363026P465157k52265n817715m261314
$$ -1318353 -2598542 -7251150 -7556717 -193691 7271466 7019201 1201486 -3059828
10986c059828l02040J397905J690065K165990K133161J289292K72942j389333
$$ -3059828 -3361868 -1963963 -273898 1892092 4025253 5314545 5587487 4198154
10978D198154l724755m142692j173458J805996J398724J51524K165868N255667
$$ 4198154 473399 -3669293 -4842751 -3036755 -1638031 -1486507 679361 5935028
10970E935028L824083k008152o364528n819495k174806J889825M683420M278967
$$ 5935028 9759111 7750959 1386431 -4433064 -6607870 -4718045 -34625 4244342
10962D244342O36368k369431j928629j187181l760691o226263l130060K722076
$$ 4244342 4880710 2511279 582650 -604531 -4365222 -10591485 -13721545 -10999469
10954a0999469L349879j583301l691522J146153O709426O061217P04342l197364
$$ -10999469 -7649590 -9232891 -12924413 -11778260 -5068834 992383 1696725 -1500639
10946a500639k818185J52176K643042K261330q60928l196118j763907J026608
$$ -1500639 -4318824 -4166648 -1523606 737724 -123204 -3319322 -5083229 -4056621
10938d056621L42035l380248m504547o62103L694429L673436k32101m132253m936737
$$ -4056621 -3714586 -7094834 -11599381 -12261484 -8567055 -4893619 -5125720 -9257973 -14194710
10929a4194710j573776M314604Q044552N957513N37723k233899r22573L21831
$$ -14194710 -15768486 -11453882 -3409330 2548183 3085906 852007 -70566 251265
10921B51265q78332k008272j248942p04383j535611r33598K584523N125075K822154
$$ 251265 -627067 -2635339 -3884281 -4588664 -6124275 -7057873 -4473350 651725 3473879
10912C473879j822742l310479p96264J763240J861790P87081k3481j177386k892152
$$ 3473879 1651137 -1659342 -2455606 -692366 1169424 1956505 1933024 755638 -2136514
10903b136514l240389p53901K676522L587140J340672j117598j331548l05433
$$ -2136514 -5376903 -6130804 -3454282 132858 1473530 355932 -975616 -1281049
10895a281049j37335m91905J91472J188174L37583j972553l007307j962582o25607
$$ -1281049 -1418384 -1910289 -1718817 -530643 -193060 -2165613 -5172920 -7135502 -7761109
10886g761109L53061J889285K884135R66431k344648k635546k30879o27032m806057
$$ -7761109 -7408048 -5518763 -2634628 -1668197 -4012845 -6648391 -6879270 -7506302 -12312359
10877a2312359o056040o27672N331138N240965K144885K188540L568402N65408
$$ -12312359 -18368399 -18996071 -13664933 -8423968 -6279083 -4090543 -522141 43267
10869D3267n090089n976842o31172M533051M571196R09346k506844k720133J101732
$$ 43267 -5046822 -11023664 -11654836 -7121785 -2550589 -1641243 -4148087 -6868220 -5766488
10860e766488N347862L681510l864790p917184k453512M754562L211784l662748
$$ -5766488 -418626 3262884 -601906 -8519090 -10972602 -6218040 -3006256 -6669004
10852f669004m115693K903495O856997K965245k143332l162845k553897k176465
$$ -6669004 -10784697 -7881202 -1024205 1941040 -202292 -3365137 -5919034 -8095499
10844h095499J81875L223263J972927j970845j069872M270324M480993k399108
$$ -8095499 -7913624 -4690361 -2717434 -4688279 -5758151 -1487827 2993166 594058
10836E94058n751914l77016L868484p19902n581241p89803O813712M746945l753007
$$ 594058 -5157856 -5534872 -1666388 -2386290 -7967531 -8757334 -1943622 2803323 -949684
10827i49684n333580J023951L579006j104671k903057L093401P232138J379622
$$ -949684 -6283264 -5259313 -1680307 -2784978 -5688035 -2594634 4637504 6017126
10819F017126p168494o772509J295573O229469L899935K93199J86021J020131
$$ 6017126 -1151368 -7923877 -6628304 -398835 3501100 3794299 3980320 5000451
10811E000451n77064l047570l737676l525494l912215l222518l1203K415480L51985
$$ 5000451 4423387 1375817 -2361859 -5887353 -9799568 -13022086 -13053289 -10637809 -10285824
10802a0285824l584934l373632R60421L288070J383761p5224J347580J355914
$$ -10285824 -13870758 -17244390 -16283969 -12995899 -11612138 -11687362 -10339782 -8983868
10794h983868k257535l912793K47347L955626L31282n532999l509745N194015
$$ -8983868 -11241403 -15154196 -14906849 -10951223 -10619941 -16152940 -19662685 -14468670
10786a4468670R334717M503090j745749k760168j049154p58428l00248K990742
$$ -14468670 -5133953 -630863 -2376612 -5136780 -6185934 -6944362 -7244610 -4253868
10778d253868O668744O180356R64937n042797p060952l329967K428453L793736
$$ -4253868 2414876 8595232 9560169 4517372 -2543580 -5873547 -3445094 348642
10770C48642k97518l298835q30875J992408o11506m232248j549250L856110K685964
$$ 348642 51124 -3247711 -4078586 -2086178 -2697684 -6929932 -8479182 -4623072 -1937108
10761a937108l488074m036125K412939N290884P7717m557686k055963K162354
$$ -1937108 -5425182 -9461307 -7048368 -1757484 -1679767 -6237453 -8293416 -6131062
10753f131062K085370R96620K918853M088569N82212l832749m674570m204417
$$ -6131062 -4045692 -3049072 -130219 3958350 4540562 707813 -3966757 -8171174
10745h171174n352430n382928k008716J124014J199655J555056M371858N415041
$$ -8171174 -13523604 -18906532 -20915248 -19791234 -18591579 -17036523 -12664665 -7249624
10737g249624K240985l5274K017883K980023j583495n692421k322405M289724
$$ -7249624 -5008639 -5043913 -3026030 -46007 -1629502 -7321923 -9644328 -5354604
10729e354604N326938J236059p88476P78693J439572R1459j75396P03785m31907
$$ -5354604 -27666 1208393 419917 1198610 2638182 2729641 2554245 3258030 2826123
10720B826123l576190n224136l795718n82307L269153O507157O651426L172295
$$ 2826123 -750067 -5974203 -9769921 -10352228 -7083075 -575918 6075508 9247803
10712I247803m72917j369176q81733j076944j271466j017074j947105l624041
$$ 9247803 8774886 7405710 6523977 5447033 4175567 3158493 1211388 -2412653
10704b412653k685384Q26210K198311K78630n4391K551460K171905l203255n580328
$$ -2412653 -5098037 -4271827 -2073516 -1794886 -1849277 702183 2874088 -329167 -5909495
10695e909495L80456O784785L919260m377016p022555k514774J078632r6516k038913
$$ -5909495 -5529039 1255746 5175006 797990 -6224565 -8739339 -7660707 -7757223 -9796136
10686i796136j779439j031758r58433k44690J354992K540590L041584L136735
$$ -9796136 -11575575 -12607333 -13565766 -13810456 -12455464 -9914874 -6873290 -3736555
10678c736555K431508J890470L694309O312553M604729j688841n397213k389988
$$ -3736555 -1305047 585423 4279732 10592285 15197014 13508173 8110960 5720972
10670E720972J484432o04697o304891q773765o168943q06726N525237R660479
$$ 5720972 7205404 6600707 295816 -8477949 -14646892 -15453618 -9928381 -267902
10662b67902O515716l075520r603421o430470J164024M375162K494664J37162
$$ -267902 6247814 3172294 -6431127 -12861597 -11697573 -7322411 -4827747 -4690585
10654d690585j110635k045468k398718l060708n495855n539715K952467J4345897
$$ -4690585 -5801220 -7846688 -10245406 -13306114 -18801969 -24341684 -21389217 -7043320
10646g043320J3659829m73133r428412j403436R800209O722268m402062n917123
$$ -7043320 6616509 6143376 -3285036 -4688472 5111737 11834005 7431943 1514820
10638A514820J939739M076042k987434p574970l787649J652115L400793L321916
$$ 1514820 3454559 7530601 4543167 -3031803 -6819452 -5167337 -1766544 1555372
10630A555372K216442j167895l393499m74118L048658Q31683k749856L09237N787835
$$ 1555372 3771814 2603919 -789580 -1263698 1784960 2616643 -133213 176024 5963859
10621E963859L214024m980053o226255J001058M788912k22251n566825m370483
$$ 5963859 9177883 4197830 -2028425 -1027367 3761545 3539294 -2027531 -6398014
10613f398014m56235J399284K432885L600986K543118j62537n01593J330778Q23181
$$ -6398014 -6854249 -5454965 -3022080 578906 3122024 2959487 2457894 3788672 4611853
10604D611853k493608m212661k613827j69356J303860Q46079k970052p306033
$$ 4611853 2118245 -2094416 -4708243 -4877599 -3573739 -2727660 -5697712 -13003745
10596a3003745m784484M526045Q767434J624403n431609q71768O893761L440271
$$ -13003745 -17788229 -13262184 -4494750 -2870347 -8301956 -9173724 -2279963 1160308
10588A160308o586445p509428N90044L847840l38435j409398K659885K750501
$$ 1160308 -5426137 -12935565 -12345521 -8497681 -8836116 -10245514 -7585629 -4835128
10580d835128j837236j495269M170225M339453k729022n916148j073934L002955
$$ -4835128 -6672364 -8167633 -3997408 342045 -2386977 -8303125 -9377059 -6374104
10572f374104J886019J613171L835644J771421m776477o481820j045280K407298
$$ -6374104 -4488085 -2874914 960730 2732151 -2044326 -8526146 -9571426 -7164128
10564g164128l92099k547004K75112L356607L240545K065212K77465k867742k692999
$$ -7164128 -7556227 -10103231 -9828119 -6471512 -3230967 -1165755 -888290 -3756032 -6449031
10555f449031L793609P539569k59969j0089635o779289M426325N861066k256939
$$ -6449031 -2655422 4884147 4624178 -5465457 -12244746 -7818421 -1957355 -4214294
10547d214294l645816L703518N098566k038738l660992L179458M500956l415089
$$ -4214294 -7860110 -4156592 941974 -1096764 -4757756 -1578298 2922658 -492431
10539d92431o612784K33393M697418Q11657j363779K533470L019933k760884m855400
$$ -492431 -7105215 -6871822 -2174404 -1362747 -2726526 -193056 2826877 65993 -4789407
10530d789407o82934Q13406q19613L059473Q322078J750446j1140680j0610820
$$ -4789407 -5472341 -4658935 -5478548 -2419075 5903003 7653449 -3487231 -14098051
10522a4098051K199009N509186m329365p498432J273591M617802j569066r57374
$$ -14098051 -11899042 -6389856 -10719221 -18217653 -16944062 -12326260 -13895326 -14852700
10514a4852700P536389N459810o327206n457982P433460O390524q925303q822938
$$ -14852700 -7316311 -1856501 -8183707 -13641689 -6208229 182295 -8743008 -17565946
10506a7565946Q967863J1006219q450464j3724117M609941J0805861n512097p956324
$$ -17565946 -8598083 2408136 -6042328 -19766445 -15156504 -4350643 -9862740 -17819064
10498a7819064J1278730J0173872j6689681j5735186J9930416K0572235k7105585
$$ -17819064 -6540334 3633538 -13056143 -28791329 -8860913 11711322 -15394263
10491a5394263l1376887L2491028K7552004j28830147k63854433j55170517J20920700
$$ -15394263 -46771150 -14280122 13271882 -115558265 -379412698 -534583215 -413662515
10484d13662515K60525581J47491268j5463739l3440889L0600362K9449524k3105015
$$ -413662515 -153136934 -5645666 -21109405 -54550294 -23949932 5499592 -17605423
10477a7605423k4541290J9650207K5929494q584944j5997047J1055889J7494952
$$ -17605423 -42146713 -22496506 3432988 -5151956 -21149003 -10093114 7401838
10470G401838n199010j1621581N965421Q815292r295837j3332121K769036P257353
$$ 7401838 2202828 -9418753 -3453332 5361960 -3933877 -17265998 -14496962 -7239609
10462g239609n943351p967793P197318J2822722J944892k232357O599323Q148721
$$ -7239609 -13182960 -21150753 -13953435 -1130713 814179 -1418178 5181145 13329866
10454A3329866k165039n516665J046851o25930j1372036j1062475K079306O926615
$$ 13329866 11164827 5648162 6695013 6069083 -5302953 -16365428 -14286122 -7359507
10446g359507j077305l231239M602992M528850o447600q260492M540608J1191344
$$ -7359507 -8436812 -11668051 -7065059 -2536209 -8983809 -17244301 -12703693 -1512349
10438a512349J520499p281689k632330L622831J23992n054168l140887J84627
$$ -1512349 8150 -7273539 -9905869 -6283038 -6159046 -11213214 -14354101 -14169474
10430a4169474j62085J228510N537780M411441k568509m112931K149529M490736
$$ -14169474 -14331559 -13103049 -7565269 -3153828 -5722337 -9835268 -7685739 -3195003
10422c195003j176568m169242o8346J404743l284376l708969L613158O498358
$$ -3195003 -4371571 -8540813 -8609159 -7204416 -10488792 -14197761 -10584603 -4086245
10414d086245j117989p472387l367626L248794L646131K568729N112965N117839
$$ -4086245 -5204234 -12676621 -16044247 -12795453 -9149322 -6580593 -1467628 3650211
10406C650211j546289o277915k247307L058752J289009k573808r59266K232704
$$ 3650211 2103922 -4173993 -6421300 -3362548 -2073539 -4647347 -5606613 -3373909
10398c373909J68684l626363k222759K003836K546720N72007J630500N303408
$$ -3373909 -3205225 -6831588 -9054347 -7050511 -4503791 -3931784 -2301284 3002124
10390C002124O604655M024442k31143m222894n792789k830926J949817J967918
$$ 3002124 9606779 13631221 13400078 9177184 3384395 553469 2503286 4471204
10382D471204l695266p630292m729488P46884K726264J690822J013416N36581
$$ 4471204 775938 -6854354 -11583842 -10836958 -8110694 -6419872 -5406456 -4869875
10374d869875j436507l849760m336684k023740K604598P238900P450620J762955
$$ -4869875 -6306382 -10156142 -14492826 -16516566 -13911968 -6673068 777552 2540507
10366B540507l904321k964816J882577K650989j385562l704749k089366n24468
$$ 2540507 -1363814 -4328630 -2446053 204936 -1180626 -4885375 -6974741 -7499209
10358g499209J03498K745913N241409J789584n247099o509277q49166K410913
$$ -7499209 -7395711 -4649798 591611 2381195 -2865904 -9375181 -10224347 -7813434
10350g813434m75475j674211L502339P908516M978274q80481l244451l391383
$$ -7813434 -8288909 -9963120 -6460781 1447735 6426009 5545528 2301077 -1090306
10342a090306m011615k337676K832439N413213J212080m076475l430956J134756
$$ -1090306 -5101921 -7439597 -4607158 806055 2018135 -2058340 -5489296 -4354540
10334d354540L493914K742890J320022m61642k207947j464818J026783M14257
$$ -4354540 -860626 1882264 3202286 2740644 532697 -932121 94662 508919
10326E08919l386274l545098J855080M751046M92514l114971J098542O395257
$$ 508919 -2877355 -6422453 -4567373 183673 676187 -2438784 -1340242 5055015
10318E055015K801365o005396q489451l166632J282336R15600M2718J109947J570462
$$ 5055015 7856380 1850984 -6638467 -9805099 -8522763 -7607163 -7564445 -6454498 -4884036
10309d884036P33220O93036M16800k972040p154052o546326j131090L762761N866468
$$ -4884036 -4150816 -3457780 -3040980 -6013020 -13167072 -19713398 -20844488 -17081727 -11215259
10300a1215259O996566O775921L245727r87154j476842k58299k600297n906056
$$ -11215259 -4218693 2557228 5802955 4815801 3338959 3080660 480363 -5425693
10292e425693k311000O512264Q703642J52096q078426o315858p6692P85529k126211
$$ -5425693 -7736693 -1224429 7479213 7631309 -447117 -6762975 -6839667 -6054138 -8180349
10283h180349r88958L656007M845740J996961O29838J232188n73422l361365r59271
$$ -8180349 -9169307 -5513300 -667560 1329401 1959239 3191427 2618005 -743360 -1702631
10274a702631M574858L107916o505697j1377993l592231O362324N056004l429703
$$ -1702631 2872227 5980143 -525554 -11903547 -15495778 -9133454 -4077450 -7507153
10266g507153m944365K106878N693512N90826m179129j292284L706961L002726
$$ -7507153 -12451518 -10344640 -4651128 -4060302 -8239431 -9531715 -5824754 -2822028
10258b822028j190840k096184N36273J976415O48191j557832l667449m972669
$$ -2822028 -4012868 -6109052 -5572779 -3596364 -2948173 -4506005 -8173454 -13146123
10250a3146123l204798J688944M992071L150566p17826j691482r8981J015875
$$ -13146123 -16350921 -14661977 -9669906 -6519340 -7237166 -8928648 -9027629 -8011754
10242h011754J890967L951665M849603J750905k605650l135224m4240K362493
$$ -8011754 -6120787 -2169122 2680481 4431386 1825736 -1309488 -1353728 1008765
10234A008765K792514L112011K955673L34218l271175m353591l356295l555176
$$ 1008765 3801279 6913290 9868963 10203181 6932006 2578415 -777880 -4333056
10226d333056m570816k879142J346755L753447K630149R51913R99622J620289
$$ -4333056 -8903872 -11783014 -10436259 -6682812 -4052663 -3100750 -2101128 -480839
10218d80839J295161j87266k917722n730565n024024N75675N859505M898780j42097
$$ -480839 814322 627056 -2290666 -8021231 -13045255 -12469580 -6610075 -1711295 -1853392
10209a853392k279283m04131O16584k91841Q74417L944596L043344k926935o558217
$$ -1853392 -4132675 -4536806 -3920222 -4212063 -3337646 606950 3650294 723359 -5834858
10200e834858k904476K812701L379007k91360k503182j710369n67355n3882J228969
$$ -5834858 -8739334 -5926633 -2547626 -2838986 -5342168 -7052537 -7619892 -7673774 -6444805
10191f444805L207177L750827J750501j274354k476044l06367L184018L598675
$$ -6444805 -3237628 513199 2263700 989346 -1486698 -1793065 1390953 4989628
10183D989628j37068l058510o82372L631744L022417k353381n413775k726607
$$ 4989628 4852560 1794050 1111678 4743422 7765839 5412458 -1317 -2727924
10175b727924J542484L021143J956838m69703l890376n291288j023715N504318
$$ -2727924 -1185440 1835703 3792541 3322838 -567538 -5858826 -6882541 -1378223
10167a378223N671509j742263p423862m928197N74548J943148O03365Q79889R97697
$$ -1378223 4293286 2551023 -4872839 -9801036 -9226488 -7283340 -6679975 -5800086 -4802389
10158d802389k137869m860163k232651K591726L288173J165367J856335L990076
$$ -4802389 -6940258 -11800421 -14033072 -11441346 -8153173 -6987806 -5131471 -1141395
10150a141395J464226m036527l791186L261905P125638J822637n358744n248634
$$ -1141395 322831 -3713696 -7504882 -4242977 2882661 4705298 -653446 -5902080
10142e902080J42584K814634J368773N99732J841706J664587p98475k268320j475381
$$ -5902080 -5759496 -2944862 -1576089 -976357 865349 2529936 1731461 -536859 -2012240
10133b012240r38379j656418j530847m47947j317047l763580k558213L869690
$$ -2012240 -2950619 -4607037 -6137884 -6585831 -7902878 -11666458 -14224671 -10354981
10125a0354981Q643935N489830j562704l788699r9252L145449K690299J164688
$$ -10354981 -1711046 3778784 2216080 -1572619 -1671871 1473578 4163877 5328565
10117E328565K6158k293115m600195l266182J61062k96623m470427m755025J163618
$$ 5328565 5354723 3061608 -1538587 -4804769 -4643707 -4940330 -9410757 -14165782 -13002164
10108a3002164N194316J610525l630952l049292O90258J253473r210J759404M709483
$$ -13002164 -7807848 -6197323 -9828275 -12877567 -12187309 -10933836 -10943046 -9183642 -4474159
10099d474159L623340m07135k409123k206578k423617j574897K331962N200075
$$ -4474159 -850819 -1257954 -3667077 -5873655 -8297272 -9872169 -7540207 -2340132
10091b340132K839723m36795J230348L996515P71937n186171n319737j047167
$$ -2340132 499591 62796 1293144 5289659 6061596 875425 -4444312 -5491479
10083e491479o14206l133146n33617N484948M393378l978118p317845j231882
$$ -5491479 -6105685 -9238831 -9772448 -4287500 105878 -3872240 -11190085 -12421967
10075a2421967M041623K232535O39631M217171N274713j548756p452835l680836
$$ -12421967 -8380344 -6147809 -5508178 -1291007 3983706 2434950 -5017885 -8698721
10067h698721L423082L142591k538652m025043L07012M117285L884146J051591
$$ -8698721 -5275639 -2133048 -4671700 -8696743 -8389731 -4272446 -388300 663291
10059F63291k375017l831362p91597L545913J904320m945972o504871J076808
$$ 663291 -1711726 -5543088 -6334685 -2788772 -884452 -5830424 -12335295 -11258487
10051a1258487P125273K905951m486600m665883m52907o7511j630577J250571
$$ -11258487 -4133214 -1227263 -5713863 -10379746 -10832653 -10900164 -12530741 -11280170
10043a1280170N422449L621724j263238j119016K324450J031857l949781m450977
$$ -11280170 -5857721 -2235997 -3499235 -4618251 -2293801 -1261944 -5211725 -9662702
10035i662702m21832N06029k350477k062689J989217K844378l45064k86841M573433
$$ -9662702 -10084534 -9578505 -11928982 -13991671 -12002454 -9158076 -9503140 -9789981 -5216548
10026e216548O433025J770223k573382j146264K057354J774409o83265k002255
$$ -5216548 1216477 2986700 413318 -732946 1324408 3098817 2415552 413297
10018D13297k076313j160463J542592L813835J648080l279453m384166m33088
$$ 413297 -1663016 -2823479 -1280887 2532948 4181028 901575 -3482591 -3915679
10010c915679K380875Q73131m47801J808301L980718K104330j865348m159131
$$ -3915679 -1534804 -661673 -1109474 698827 4679545 6783875 4918527 759396
10002G59396l829178q07863M344276O739375Q86858q994404j0876142j554928
$$ 759396 -3069782 -3877645 466631 7206006 8092864 -901540 -11777682 -13332610
9994a3332610P118811M693697l201147m540621J254577M698006J677442k195490
$$ -13332610 -6213799 -1520102 -4721249 -9261870 -8007293 -3309287 -1631845 -3827335
9986c827335j835307R23642K174909J180599o23963j714682p48801J997737L327455
$$ -3827335 -5662642 -4739000 -2564091 -1383492 -2007455 -3722137 -4470938 -2473201 854254
9977H54254M49630m347973n604408j698869L013962L946255J606948k01178L01742
$$ 854254 1303884 -3044089 -8648497 -10347366 -7333404 -3387149 -1780201 -1981379 -1679637
9968a679637J276716N40754j226960j462071N92325K487594J552758j604598l753129
$$ -1679637 -402921 137833 -1089127 -2551198 -1958873 528721 2081479 476881 -3276248
9959c276248k881851l42900Q44480p05688k959429k079452L044757P993921O824145
$$ -3276248 -6158099 -6500999 -5656519 -6362207 -9321636 -11401088 -8356331 -362410 6461735
9950F461735l75362o670189o613595k502225j0206o16996j671042j358325L10183
$$ 6461735 6086373 -583816 -7197411 -9699636 -9709842 -10326838 -11997880 -13356205 -13046022
9941a3046022L367111O644720O628491K050100k209805r60406K999602K364250
$$ -13046022 -9678911 -3034191 3594300 5644400 3434595 2474189 5473791 7838041
9933G838041l405279o763478l034291L354589N730037L229143n49132k767558
$$ 7838041 4432762 -2330716 -5365007 -2010418 3719619 6948762 6399630 3632072
9925C632072k555605l51710J499188J86134l666151o101536n135145k966229j659361
$$ 3632072 1076467 724757 2223945 2410079 -1256072 -7357608 -12492753 -15458982 -17118343
9916a7118343k03177K162516L229965J259953j533450j841966L24558K608499
$$ -17118343 -17321520 -15159004 -11929039 -10669086 -12202536 -14044502 -13719944 -11111445
9908a1111445L860407M152966K882335k14079l039067k979506o05212Q86318J13131
$$ -11111445 -7251038 -3098072 -215737 -429816 -3468883 -6448389 -7053601 -6167283 -6054152
9899f054152q32039J28515J929320K178251O57912r87254k191686l514611l982890
$$ -6054152 -6886191 -6757676 -4828356 -2650105 -1992193 -2979447 -5171133 -8685744 -12668634
9890a2668634j758320J698867K107970q45115j647570K396839N482392K065334
$$ -12668634 -14426954 -12728087 -10620117 -11465232 -13112802 -10715963 -5233571 -3168237
9882c168237l334486l181900K35409m54619l168718j89272M492913r52802j1585430
$$ -3168237 -6502723 -9684623 -9449214 -9903833 -13072551 -13261823 -8768910 -9721712 -21307142
9873b1307142n287345K2222233M1313503K5544572r413318k5891754j4258059
$$ -21307142 -26594487 -4372254 36941249 62485821 53072503 27180749 12922690
9866A2922690J152861K155674k923469k085444Q88643r03670l504654j732280
$$ 12922690 14075551 16231225 13307756 11222312 12110955 11207285 7702631 5970351
9858E970351M57532j034401k168468N0134N30421l753578o713322m169854j783341
$$ 5970351 6427883 5393482 3225014 3275148 3805569 51991 -6661331 -10831185 -12614526
9849a2614526l726844l837467K545321P998293M980524p70312m51737K466891
$$ -12614526 -16341370 -20178837 -17633516 -9635223 -4654699 -5425011 -5876748 -3409857
9841c409857j28160n094899l665204K199660L387837R2939K17230L350375J337832
$$ -3409857 -3538017 -8632916 -12298120 -10098460 -6710623 -6617684 -6400454 -3050079 -1712247
9832a712247n095958n426461K392527P105180K458856k830307l19652M552951
$$ -1712247 -6808205 -12234666 -9842139 -2736959 -278103 -3108410 -3428062 1124889
9824A124889K994742k332802l292234l65608R2164j553291L76894M527835K967196
$$ 1124889 4119631 1786829 -1505405 -1871013 -1778849 -3332140 -2955246 1572589 4539785
9815D539785m591173p741112j157276N704553K243384o555438p184755J526075
$$ 4539785 -51388 -7792500 -8949776 -3245223 -1001839 -7557277 -14742032 -13215957
9807a3215957O372670L24497o434312k541140O717983P865421L6997m791736j014776
$$ -13215957 -6843287 -6518790 -12953102 -15494242 -8776259 -910838 -873841 -5665577 -6680353
9798f680353L465359J662278k101224j546889Q84665j20858k784145j912724J612111
$$ -6680353 -3214994 -1552716 -3653940 -5200829 -4316164 -4437022 -7221167 -9133891 -7521780
9789g521780K414342o80301l802883m358593l001170o82666J798879K704135J614354
$$ -7521780 -5107438 -5787739 -9590622 -13949215 -16950385 -17633051 -15834172 -13130037 -11515683
9780a1515683J036712K440846L312620J742174N87781K537796M469324K317668
$$ -11515683 -10478971 -8038125 -4725505 -2983331 -2395550 142246 4611570 6929238
9772F929238j352236j065639K229621K427314j757634m687859k356587K455061
$$ 6929238 5577002 4511363 6740984 9168298 7410664 2722805 366218 2821279
9764B821279M752012K905501j096679l711149k261458J770830L088127n36267
$$ 2821279 7573291 10478792 9382113 5670964 3409506 5180336 8268463 7732196
9756G732196m016755k063437K183110J807300k551297l566079Q55932M348657
$$ 7732196 3715441 1652004 3835114 5642414 3091117 -474962 380970 4729627
9748D729627K234760k220222m191378l759014l002173j871201p3591J209857K004439
$$ 4729627 6964387 4744165 552787 -3206227 -6208400 -8079601 -8153192 -6943335 -4938896
9739d938896L811900N303768K614863l689205p131492m030873J153681K780311
$$ -4938896 -1126996 4176772 6791635 3102430 -4029062 -8059935 -6906254 -4125943
9731d125943J543479Q14667J73115k002444l251711n53990L254501K905672o65863
$$ -4125943 -2582464 -1767797 -1594682 -3597126 -6848837 -7402827 -4148326 -1242654 -1908517
9722a908517j370899K393682N209677L095226p88287j471559P26249J718780m8412
$$ -1908517 -3279416 -885734 4323943 7419169 6630882 5159323 5885572 7604352 7555940
9713G555940k122759k170187r81937q11335j996370k311881K5510L280381L524334
$$ 7555940 5433181 3262994 2281057 1469722 -526648 -2838529 -2813019 467362 3991696
9704C991696l34798m371646m124513j60871L034333L056627J671410Q31367j25646
$$ 3991696 3656898 -714748 -4839261 -5000132 -1965799 1090828 2762238 3593605 3467959
9695C467959j897026k735372j084700J157646R01728j568035l098101k237838
$$ 3467959 1570933 -1164439 -2249139 -1091493 -189765 -1757800 -4855901 -7093739
9687g093739m42809J082748K511929L041928J120032j745999j428968K104750
$$ -7093739 -7536548 -6453800 -3941871 -899943 220089 -1525910 -2954878 -850128
9679h50128K652660l417476r614571o685231L874359J0571674P043600k86473
$$ -850128 1802532 -1614944 -11229515 -17914746 -14040387 -3468713 3574887 3288414
9671C288414k501686k8949P44011j770569l413521k237176j030199j520148j423879
$$ 3288414 786728 757779 1501790 -268779 -3682300 -5919476 -6949675 -8469823 -9893702
9662i893702R33241L132270K312126m86879k286802k479830k262840j127984K392022
$$ -9893702 -8960461 -5828191 -3516065 -4002944 -6289746 -8769576 -11032416 -12160400 -9768378
9653i768378O338235N705441m94951n689395l348708L370315M859886j554072
$$ -9768378 -3430143 2275298 1780347 -3909048 -7257756 -3887441 972445 -581627
9645e81627p358852m923991J816174M128270J444993R6015J653162J508616r70249
$$ -581627 -7940479 -12864470 -11048296 -6920026 -5475033 -5379018 -3725856 -2217240 -3187489
9636c187489l99639L953083M667446j745651p510114n208785K71164Q3399l704885
$$ -3187489 -3587128 365955 5033401 3287750 -4222364 -9431149 -9159985 -9076586 -12781471
9627a2781471k132356M502215O139988n12493n894660k100480N373066O465305
$$ -12781471 -14913827 -10411612 -4271624 -4784117 -10678777 -12779257 -7406191 -940886
9619i40886Q53133l573374k794958j80480O96352M51380N80079O16381O5043j90688
$$ -940886 -87753 -3661127 -6456085 -6636565 -5940213 -5488833 -4908754 -4292373 -4227330 -4418018
9609d418018J65978J38101k79047K50191J191236j35099l326698l092232L030268
$$ -4418018 -4252040 -4113939 -4392986 -4142795 -2951559 -3086658 -6413356 -9505588 -6475320
9600f475320Q190725M028177o069646r530604k032605O187151N727861J023475
$$ -6475320 1715405 5743582 -326064 -9856668 -11889273 -5702122 25739 1049214
9592A049214N49589K053235j456745o603292m238305L020543K857471n729064
$$ 1049214 1598803 3652038 2195293 -4407999 -8646304 -5625761 -2768290 -8497354
9584h497354q774338L83587R821751Q062825J104382k42815J556897j483451o048061
$$ -8497354 -17271692 -16888105 -7066354 996471 2100853 1858038 3414935 1931484 -4116577
9575d116577l369832L759182M820176o34478l285296o19648O96635j212574q57525
$$ -4116577 -7486409 -3727227 1092949 458471 -2826825 -3446473 -2749838 -3962412 -4819937
9566d819937J992971N92490n099588n945607Q50690N775600K206227l243116k294868
$$ -4819937 -2826966 -2234476 -7334064 -13279671 -12428981 -6653381 -4447154 -7690270 -9985138
9557i985138K448018L989252K297465J524961J751722O46206r72870j150452q24024
$$ -9985138 -7537120 -3547868 -1250403 274558 2026280 2672486 1699616 549164 -274860
9548b74860j459197k275756k796609l650485k841375K527962Q590186O735215
$$ -274860 -1734057 -4009813 -6806422 -10456907 -13298282 -10770320 -2180134 4555081
9540D555081l038307r374294n251437K271320M280859K952162L984530M564638
$$ 4555081 1516774 -7857520 -13108957 -10837637 -6556778 -3604616 379914 4944552
9532D944552n02513o819807n964772O77941M301158K421229K93713L64463q4987
$$ 4944552 4442039 -2377768 -8342540 -7664599 -3363441 -942212 -648499 -284036 -369023
9523c69023j560354j371814K41324N20646J028J026624K020670K44788j949709
$$ -369023 -1929377 -3301191 -3059867 -2539221 -2538193 -1511569 509101 753889 -1195820
9514a195820j079649J97701j797769k893505K396017Q538002N495770l944667
$$ -1195820 -2275469 -2077768 -3875537 -6769042 -4373025 4164977 9660747 5716080
9506E716080o943687j033904K675241q64997k926093J830714N212967O68384m499844
$$ 5716080 -1227607 -2261511 413730 -451267 -3377360 -1546646 3666321 4334705 -165139
9497a65139k177414K472433J226713k364316o42382L316493J550140l778665m451486
$$ -165139 -2342553 129880 1356593 -1007723 -1650105 1666388 3216528 -562137 -5013623
9488e013623j220467j318887l507443L15673Q744131J0125342R01872p735199
$$ -5013623 -6234090 -7552977 -11060420 -10744747 -2000616 8124726 9026598 1291399
9480A291399o116515J369683N338046M103304J368325j311046l315442k077343
$$ 1291399 -4825116 -3455433 1882613 5985917 7354242 6043196 2727754 650411
9472F50411K263324L924179q25822o851374o809297j465623K397244J976519N69962
$$ 650411 2913735 6837914 6012092 -839282 -7648579 -9114202 -6716958 -4740439 -4170477
9463d170477J039044K490879L155460K326855l23332l882029n302673k810622
$$ -4170477 -3131433 -640554 2514906 4841761 4518429 636400 -4666273 -7476895
9455g476895O56701J042313p45723n19613K051240K879643M30081j788616j195004
$$ -7476895 -6820194 -5777881 -6523604 -7043217 -4991977 -2112334 -1682253 -3470869 -4665873
9446d665873J35997L6947O6669J532995J817439r90162l214636p98669L033606
$$ -4665873 -4529876 -4492929 -4426260 -2893265 -1075826 -2065988 -5280624 -6079293 -3045687
9437c045687J871434l066634l761674J747692N297575J274631m007711k159751
$$ -3045687 -1174253 -4240887 -8002561 -6254869 -957294 317337 -3690374 -5850125
9429e850125L797201M505358m97887k690275P76825K813248p78337m145510k069368
$$ -5850125 -2052924 2452434 1954547 -735728 41097 2854345 2076008 -2069502 -4138870
9420d138870Q91344j067985m448911k885459J319824J617704o03439J283117O091700
$$ -4138870 -3247526 -4315511 -8764422 -11649881 -10330057 -8712353 -9315792 -8032675 -1940975
9411a940975N586372j185786n273773k184535J419006k10443k630494k08630L740390
$$ -1940975 3645397 2459611 -2814162 -4998697 -3579691 -3790134 -6420628 -6629258 -2888868
9402b888868L404361O88393P27653J979666n19281n151322n700372j823868O43842
$$ -2888868 515493 1203886 1931539 3911205 3391924 -1759398 -7459770 -9283638 -8639796
9393h639796n17166j379420M19377K360888K502713J977909P79954k835561o981420
$$ -8639796 -9156962 -10536382 -10117005 -7756117 -5253404 -3275495 -2495541 -5331102 -12312522
9384a2312522o190630M62744O550107O726355L350263J276745M86284j602010
$$ -12312522 -18503152 -18040408 -11490301 -4763946 -1413683 -136938 349346 -1252664
9376a252664l824103k692169J147768K897008N18769k280494j631008P64235L36664
$$ -1252664 -5076767 -7768936 -6621168 -3724160 -3205391 -5485885 -7116893 -6352658 -6015994
9367f015994k943925l585451J387301O701278N439936k32807j322388M038588
$$ -6015994 -8959919 -12545370 -11158069 -4456791 983145 750338 -572050 3466538
9359C466538O467561m24914q927546q138291n71572K331796j551943l032126J825506
$$ 3466538 9934099 9509185 581639 -7556652 -8128224 -5796428 -7348371 -10380497 -8554991
9350h554991N261538J673140l003017j868158J998052K503314J002755J614849
$$ -8554991 -3293453 -1620313 -4623330 -6491488 -4493436 -1990122 -987367 627482
9342F27482K141074j273716m737774j481865O015269P965474J128595p123867
$$ 627482 2768556 1494840 -3242934 -4724799 1290470 9255944 10384539 3260672
9334C260672r295414n729414j116722J305320Q77973o96139q7019L502572N702375
$$ 3260672 -6034742 -11764156 -12880878 -11575558 -10697585 -11393724 -11480743 -7978171 -2275796
9325b275796K739488j819984j775489J702956J916124j819321k686918J873140
$$ -2275796 463692 -1356292 -3131781 -1428825 487299 -1332022 -4018940 -2145800
9317b145800N171657J860412l616438m382446j285557K95300l87359R018J635816
$$ -2145800 3025857 4886269 1269831 -3112615 -4398172 -4102872 -4490231 -4481213 -2845397
9308b845397J163682j730394k993467j14975M326932O003211L332602j716245
$$ -2845397 -1681715 -3412109 -6405576 -6520551 -2193619 3809592 7142194 5425949
9300E425949n410600m888094p16307L371514M491669L373435J823826m90694m006804
$$ 5425949 15349 -4872745 -5589052 -2217538 2274131 5647566 7471392 6980698 2973894
9291B973894n910193l048100K204698L539595p60602n042291m116698j70843J290502
$$ 2973894 -2936299 -5984399 -3779701 -240106 -1000708 -6042999 -10159697 -10330540 -9040038
9282i040038n57157k072246j628650j134099j272550O9145L406749N745534N077961
$$ -9040038 -9597195 -11669441 -13298091 -14432190 -15704740 -15635595 -12228846 -6483312 -1405351
9273a405351L353644K535273R86324k925933o384496n388316q39579K638995K894840
$$ -1405351 1948293 4483566 5469890 2543957 -3840539 -9228855 -10068434 -7429439 -4534599
9264d534599J483577j06857j311687o16142K487043M386106J362336l682992m287480
$$ -4534599 -3051022 -3157879 -4469566 -5085708 -2598665 1787441 3149777 -533215 -4820695
9255d820695k50844K135502M14398q67263P97173J636851k65793p68547J717232
$$ -4820695 -5071539 -2936037 -2521639 -3388902 -2591729 -954878 -1220671 -1989218 -271986
9246b71986J704803l030846m927554J251826P451400L849886m904578p001357
$$ -271986 1432817 -1598029 -6525583 -5273757 2177643 6027529 1122951 -5878406
9238e878406k399159r29677l951312k753535M071498O620139Q75965l748667j14648
$$ -5878406 -8277565 -9207242 -13158554 -15912089 -11840591 -5220452 -4344487 -8093154 -8207802
9229h207802N462201N212371K410505L026604L980189j67257n683001n279236
$$ -8207802 -2745601 2466770 4877275 7903879 11884068 11716811 6033810 754574
9221G54574n08368J295065j049736k913089l185569m100406l983005N17159O156198
$$ 754574 246206 1541271 491535 -2421554 -5607123 -9707529 -13690534 -13173375 -7017177
9212g017177O122841R98507j901262j18915J661499J272196J753893K962378K09835
$$ -7017177 -894336 104171 -1797091 -1916006 -254507 1017689 2771582 5733960 5943795
9203E943795n583565o036004J316370O671216J941386o412219o989271j64037
$$ 5943795 360230 -5675774 -4359404 2311812 4253198 -2159021 -9148292 -9312329
9195i312329M408152L312124J944512K719066J359118l249676n136871j311490
$$ -9312329 -4904177 -1592053 352459 3071525 4430643 1180967 -3955904 -5267394
9187e267394K144121l65164m561554l307481J478388J952366k568715m101982
$$ -5267394 -3123273 -3488437 -8049991 -11357472 -9879084 -7926718 -10495433 -14597415
9179a4597415J364511P158458N437639j772401n821517k931270K350480M401177
$$ -14597415 -13232904 -6074446 -636807 -2409208 -8230725 -11161995 -8811515 -4410338
9171d410338K971334J372288J154183Q52195p65400k352780j947473k63505K20
$$ -4410338 -1439004 -66716 1087467 1939662 1174262 -1178518 -3125991 -3389496 -3389276
9162c389276j565276j948930M83285K528928O26186l030259l186239L78850K500833
$$ -3389276 -4954552 -6903482 -6420197 -3891269 -3265083 -6295342 -9481581 -9102731 -6601898
9153f601898Q78262p18490O87248K485657J594124l61587p54393o19198j361997
$$ -6601898 -5723636 -6442126 -5754878 -3269221 -1675097 -2036684 -2791077 -3410275 -4772272
9144d772272q20479K435328M548001J865628k149427j991360M39317j097215o027638
$$ -4772272 -5592751 -3157423 1390578 3256206 1106779 -884581 -445264 -1542479 -7570117
9135g570117p036462j660540M120424N553009M833271M456900K199167k923967
$$ -7570117 -14606579 -16267119 -12146695 -6593686 -1760415 2696485 4895652 1971685
9127A971685n965977k988083J815361J981828j206461q76025M446431Q093557
$$ 1971685 -3994292 -6982375 -5167014 -3185186 -4391647 -5267672 -821241 7272316
9119G272316M555798l047049p202589n152804r43323R80947J173725K455519L912107
$$ 7272316 11828114 8781065 1578476 -3574328 -4517651 -3536704 -2362979 92540 4004647
9110D004647J750293l387847m897905O36681O817276N281910k380820o974583
$$ 4004647 5754940 2367093 -2530812 -1894131 4923145 10205055 7824235 849652
9102H49652m827875j388217j092634j251177J073069K891711Q17869k212726j369562
$$ 849652 -3978223 -5366440 -6459074 -7710251 -6637182 -3745471 -2927602 -5140328 -6509890
9093f509890K034358K645693k33521j577959J308463M314759K386435k862880
$$ -6509890 -4475532 -1829839 -2063360 -3641319 -2332856 1981903 4368338 1505458
9085A505458m827695j027751K977669J372930k781162j495732N251329P688083
$$ 1505458 -3322237 -4349988 -1372319 611 -2780551 -4276283 975046 8663129
9077H663129O47083p298896n739525K122239M889538L78809k857881n60057J607662
$$ 8663129 9310212 2011316 -3728209 -1605970 3283568 3662377 804496 244439 1852101
9068A852101o24133l091046j321853K321033L800988L073750J034354k767818
$$ 1852101 1227968 -1863078 -3184931 -863898 2937090 6010840 7045194 4277376
9060D277376o045114m046687K476862O110478L239455r39683j547141r31409j996747
$$ 4277376 -1767738 -5814425 -3337563 2772915 6012370 5072687 3525546 2594137 597390
9051E97390k045479J097380L518662J819009p41234n95272l82052k999037n091703
$$ 597390 -1448089 -350709 3167953 4986962 4245728 3650456 3268404 269367 -4822336
9042d822336l019330K46725P47493N22992K320089L082269p4868l056361j589847
$$ -4822336 -7841666 -7594941 -6847448 -6324456 -4004367 -922098 -996966 -4053327 -5643174
9033e643174P58409n95405k172492Q82140M557065K417942k439239k535541Q07753
$$ -5643174 -4884765 -5480170 -7652662 -6770522 -2213457 204485 -2234754 -4770295 -3962542
9024c962542O22392k434189j732335K217545K287903j990319l239735Q49927M145873
$$ -3962542 -3340150 -5774339 -7506674 -5289129 -3001226 -4991545 -8231280 -7381353 -3235480
9015c235480L077215J110384M99410j107387l855843m162734j897424r54589j299255
$$ -3235480 -158265 952119 1451529 344142 -3511701 -7674435 -9571859 -10526448 -11825703
9006a1825703J150530N419860N270678J28060k752184J87088L605149K777563
$$ -11825703 -10675173 -5255313 15365 143425 -2608759 -2421671 1183478 3961041
8998C961041K51087o07784j277250l365421m631500l320142j044248J040030L361226
$$ 3961041 4212128 3604344 2327094 -1038327 -5669827 -8989969 -10034217 -8994187 -5632961
8989e632961L885025l71660o244168o224478L98454N509335L824008o10179k266730
$$ -5632961 -1747936 -2119596 -8363764 -14588242 -14189788 -8680453 -4856445 -5466624 -7733354
8980g733354j345670j52492R90974J405204o9534r98603J961841N251911J791609
$$ -7733354 -9079024 -9231516 -8240542 -6835338 -6904872 -7903475 -5941634 -689723 1101886
8971A101886o304285q359368j421370M654310K877530q10502O84084L899393K718574
$$ 1101886 -5202399 -13561767 -14983137 -10328827 -7451297 -8261799 -7577715 -3678322 -959748
8962i59748n85791o70287J326339J448902K55617m68252k328822n174519l922697
$$ -959748 -1545539 -2215826 -889487 559415 815032 346780 -1982042 -7156561 -11079258
8953a1079258K644698O777216K845390l282667l795716r11164n85980j123141
$$ -11079258 -8434560 -1657344 1188046 -2094621 -5890337 -6801501 -7387481 -8510622
8945h510622J856248M807889J568962m743057n734574q26702L363373M146017
$$ -8510622 -6654374 -1846485 -277523 -5020580 -10755154 -11581856 -8218483 -4072466
8937d072466L941334K802034r69500m683469m402768k162144j974196j716038
$$ -4072466 -131132 2670902 1701402 -2982067 -7384835 -9546979 -11521175 -13237213
8929a3237213K204890N717583K842152k530194j886641L161822L582392q49967
$$ -13237213 -11032323 -5314740 -2472588 -5002782 -6889423 -3727601 -145209 -995176
8921i95176j257922L737163M756883j895568p328943m612779R94845K385960J336989
$$ -995176 -2253098 1484065 6240948 4345380 -2983563 -7596342 -6601497 -4215537 -2878548
8912b878548K149245K954779O99571j786926q14388J188507R9348k736018l459230
$$ -2878548 -729303 2225476 2925047 1138121 323733 1512240 1611588 -1124430 -4583660
8903d583660k106098r76725n8184J244060J130852j270173k646557o6017L730351
$$ -4583660 -6689758 -7666483 -7724667 -6480607 -5349755 -6619928 -9266485 -9332502 -5602151
8894e602151L851946J14688l302458l405568o28556K730942L881924J376292k283128
$$ -5602151 -1750205 -1635517 -4937975 -8343543 -8972099 -6241157 -2359233 -982941 -3266069
8885c266069k293971K062358N520012L799180m97599k076290m33149N47530j132670
$$ -3266069 -5560040 -3497682 2022330 5821510 5323911 3247621 2814472 3362002 2229332
8876B229332l355925l497652j559063M47685P82252l59202j070454j94444R05676
$$ 2229332 -1126593 -4624245 -6183308 -5735623 -4953371 -5312573 -6383027 -6577471 -5671795
8867e671795O12083K33711K037324M564985L853738j47325k689410j263454P28236
$$ -5671795 -5059712 -4826001 -2788677 1776308 5630046 5482721 2793311 1529857 2258093
8858B258093k48933k315083j718191J035614K259498N30174k126205l395769k562957
$$ 2258093 2009160 -305923 -2024114 -988500 1270998 1801172 -325033 -3720802 -6283759
8849f283759j96676K105564K585826J294552j4921p66168k214057m089497l416415
$$ -6283759 -6480435 -4374871 -1789045 -494493 -509414 -1275582 -3489639 -7579136 -10995551
8840a0995551J050168N602297N759141K183399n38950k00315Q78229K6400k003720
$$ -10995551 -9945383 -4343086 1416055 3599454 3060504 2860189 3738418 3764818 1761098
8831A761098k490395n71592J762503K344019J231938m61273k992289o742389q753721
$$ 1761098 -729297 -1300889 461614 2805633 4037571 3576298 584009 -6158380 -14912101
8822a4912101m564301M515902J0222482P380293J365059J10344K148100K59478
$$ -14912101 -19476402 -14960500 -4738018 2642275 4007334 4117678 6265778 6525256
8814F525256n043965n544445K27001K989695k487568p926895l990016M908237
$$ 6525256 1481291 -4063154 -3836153 -846458 -3334026 -11260921 -15250937 -10342700
8806a0342700P037719M09720n687661m735014k53159J727804P36249L3045J047989
$$ -10342700 -3304981 -2895261 -8582922 -13317936 -13571095 -11843291 -11107042 -11073997 -10026008
8797a0026008K308174K096179O79212J52945J694793L081371J129092k934631
$$ -10026008 -7717834 -5621655 -4942443 -4789498 -3094705 -13334 1115758 -1818873
8789a818873m042719p26440K294861J626295M84603K256347L582695p904n229558
$$ -1818873 -5861592 -6588032 -4293171 -2666876 -2182273 74074 3656769 3648865 -1580693
8780a580693n120317L5545L395939K311157P33568P06489o01379l597692l652544
$$ -1580693 -6701010 -6665465 -3269526 -958369 -224801 481688 -119691 -3717383 -7369927
8771g369927P59398L784560O29948m708925n234952r68751K011739O06745k060248
$$ -7369927 -6610529 -2825969 -2196021 -6904946 -12139898 -13108649 -11096910 -10490165 -12550413
8762a2550413k048500M79446K458327J991808K82257k21516O83627M96399j747342
$$ -12550413 -14598913 -14119467 -11661140 -9669332 -9387075 -9608591 -8924964 -8428565 -10175907
8753a0175907k642499R46287N703289N204227l09381l100218J035702O259713
$$ -10175907 -12818406 -11872119 -6168830 -964603 -1273984 -4374202 -3338500 2921213
8745B921213M914183j993692p041712o130723j439229L108221M812127K330535
$$ 2921213 7835396 5841704 -1200008 -7330731 -8769960 -5661739 -849612 1480923
8737A480923k646368n006081j824309K632169K018818k785282m684335q43019
$$ 1480923 -1165445 -6171526 -7995835 -5363666 -3344848 -6130130 -10814465 -11657484
8729a1657484L363554K595531j096995k092291J063254M923303O030753L830048
$$ -11657484 -8293930 -5698399 -6795394 -8887685 -7824431 -2901128 3129625 6959673
8721F959673J12993k334304j698249O48453J110584j709094n016961n372493k465908
$$ 6959673 7072666 4738362 3040113 3688566 4799150 3090056 -1926905 -7299398 -9765306
8712i765306J687959M949437N014852K92669o502528q668234l378535L121820
$$ -9765306 -8077347 -3127910 1886942 2179611 -4322917 -12991151 -16369686 -13247866
8704a3247866L083664j604262j975499M409191R542944P070377J433544R577J700382
$$ -13247866 -10164202 -11768464 -13743963 -9334772 208172 7278549 8712093 8721670 10422052
8695A0422052M38817l302446k994948K314884N240633J281928m336656n100174
$$ 10422052 10860869 7558423 4563475 6878359 12118992 13400920 9064264 3964090
8687C964090k555034j854259k635409j113867J491605K06039m454857n785989
$$ 3964090 1409056 -445203 -3080612 -4194479 -2702874 -2496835 -6951692 -12737681
8679a2737681r90881M367240M794776K311001J686674K733791K122923j18529
$$ -12737681 -13728562 -9361322 -4566546 -2255545 -568871 2164920 4287843 4169314
8671D169314j033010j56928J48391p98418j262535o82204k05080M62052K934495
$$ 4169314 3136304 2979376 3127767 2329349 1066814 384610 179530 641582 3576077
8662C576077O125179N916336N35904o201515q730485n380691O55316M525162L431543
$$ 3576077 9701256 15617592 16153496 9951981 1221496 -4159195 -3503879 1021283 4452826
8653D452826j117257m241043k482931K056206M110445J718011k046420l932523
$$ 4452826 3335569 -905474 -3388405 -1332199 2778246 4496257 2449837 -1482686
8645a482686m089641l761597k439082N45161L531162L921430J284058k238605
$$ -1482686 -5572327 -9333924 -11773006 -11227845 -7696683 -3775253 -2491195 -4729800
8637d729800l941429k427105J372497M535285M656612K214661o43137k930526
$$ -4729800 -8671229 -11098334 -9725837 -5190552 -533940 1680721 1037584 -1892942
8629a892942m498616m140520j353787Q98699l97698k456941K13867O155040P015463
$$ -1892942 -6391558 -10532078 -11885865 -10987166 -11384864 -13841805 -13627938 -7472898 -457435
8620d57435m7182o702743m860841K011139N015735K693117P02274J619061K511507
$$ -457435 -504617 -7207360 -12068201 -10057062 -5041327 -2348210 -1645936 -26875 2484632
8611B484632J593494N76862L73194o1244n70368k17839l63649k623725m638926
$$ 2484632 4078126 4654988 5028182 4966938 4396570 4178731 3815082 1191357 -3447569
8602c447569k979368O63557J770031O20952J331848L613109K599045k156273m619877
$$ -3447569 -6426937 -5763380 -3993349 -3372397 -2040549 1572560 4171605 2015332 -2604545
8593b604545j473441K881952L311498N26325k145303l603506l691548j559924
$$ -2604545 -4077986 -1196034 2115464 2641789 496486 -3107020 -6798568 -8358492
8585h358492J825887L465846K842203K606369L070622R81450l979574o822611
$$ -8358492 -6532605 -3066759 -224556 2381813 5452435 6433885 2454311 -4368300
8577d368300m483467m97886R08394O66091J232082J752103Q39987O5509P61118
$$ -4368300 -8851767 -9349653 -8441259 -7775168 -6543086 -4790983 -3950996 -3885487 -3124369
8568c124369J199165M78314R32755K952431K239916l105911p420264m980495J070488
$$ -3124369 -1925204 -1446890 -514135 2438296 4678212 1572301 -5847963 -10828458 -9757970
8559i757970L200526J00743k837721j639500K663133O828810P584735L014856
$$ -9757970 -6557444 -6456701 -9294422 -10933922 -8270789 -1441979 6142756 9157612
8551I157612m432918q630482o764312k693930m80192R80827L272676L982733J969856
$$ 9157612 4724694 -3905788 -10670100 -13364030 -13844222 -12863395 -9590719 -5607986 -3638130
8542c638130J410751M449819N605479P74676m104655k227175J786210o63212o865731
$$ -3638130 -2227379 2222440 7827919 8602595 4497940 2270765 4056975 3393763 -3471968
8533c471968p027168r75911K351639J086255K372943P062194O449371j907897
$$ -3471968 -10499136 -11475047 -9123408 -8037153 -5664210 1397984 7847355 5939458
8525E939458q028933m902440J140681J988564k70713j48125J253668Q04044M22451
$$ 5939458 -2089475 -6991915 -5851234 -3862670 -4133383 -4281508 -3027840 -2223796 -1801345
8516a801345J881393J283601l455635n951554o49823O630310O423373k86330m687073
$$ -1801345 80048 1363649 -2091986 -8043540 -8693363 -2063053 4360320 4073990 -613083
8507f13083l660102j586907p22070J096966L635931L534133J013600J92171J811561
$$ -613083 -4273185 -5860092 -6582162 -5485196 -1849265 1684868 2698468 2890639 4702200
8498D702200K022223n33544k325501j023236J176664J758255R57489m83150k399156
$$ 4702200 6724423 6190879 3865378 2842142 4018806 5777061 6734550 6251400 3852244
8489C852244l210654j153716J729705J346866j863731l041503q37017K93037j916033
$$ 3852244 641590 -512126 1217579 2564445 700714 -2340789 -3177806 -2884769 -4800802
8480d800802k956851R44329N529274M197533j991664n784038l805333K92962K435249
$$ -4800802 -7757653 -6813324 -1284050 2913483 921819 -4862219 -8667552 -8374590 -5939341
8471e939341K635675K142714Q47264o26221r1120K622750M222257K349436j087534
$$ -5939341 -3303666 -1160952 -313688 -939909 -1031029 1591721 5813978 8163414 7075880
8462G075880l018009k978751j703144P84842K830233O68408n483464q552488l625268
$$ 7075880 4057871 1079120 -624024 160818 2991051 3659459 -1824005 -10376493 -14001761
8453a4001761L329589L195867k119397k696397K661982M074203k235220o363579
$$ -14001761 -10672172 -7476305 -9595702 -12292099 -9630117 -5555914 -7791134 -14154713
8445a4154713r10721O181491M691177r37956O7852N888474N611157j344035m080473
$$ -14154713 -15065434 -8883943 -4192766 -5130722 -5062870 825604 6436761 5092726 1012253
8436A012253R03987L825669j640445q057170o692064m55991K616878J385085P1909
$$ 1012253 1916240 5741909 4101464 -3955706 -10647770 -11103761 -8486883 -7101798 -7029889
8427g029889J77525L93400P99129J930093K597431K212957K014805J578521j428273
$$ -7029889 -6852364 -6458964 -5659835 -3729742 -1132311 1080646 3095451 4673972 3245699
8418C245699n673867n837754q42556L422106L010752J264227J293050J98252l747945
$$ 3245699 -2428168 -8265922 -9108478 -5686372 -2675620 -1411393 -118343 79909 -3668036
8409c668036n206352k42102N265965L794613k026514m304600k615184k650701
$$ -3668036 -8874388 -9116490 -3850525 -55912 -2082426 -6387026 -9002210 -11652911
8401a1652911m827520l845916J291590N706048O993963O948514M989366j378357
$$ -11652911 -16480431 -20326347 -19034757 -13328709 -6334746 613768 5603134 4224777
8393D224777q494887p971585Q27393P711646N258804j277292k653947J373597
$$ 4224777 -4270110 -12241695 -11414302 -3702656 1556148 278856 -2375091 -1001494
8385a001494L769144J246244k708618m385813l924301k648853o11008J905708
$$ -1001494 2767650 4013894 1305276 -3080537 -7004838 -9653691 -10264699 -8358991
8377h358991L174112K026710k67462j584502j740645k185972k954943j906667
$$ -8358991 -5184879 -3158169 -3425631 -5010133 -6750778 -8936750 -11891693 -13798360
8369a3798360J665524M415312K708016j633921k838055R40994M840962M133788
$$ -13798360 -12132836 -7717524 -5009508 -6643429 -9481484 -8540490 -3699528 434260
8361D34260N81910p26130J556308M171254L954474P12161l552170o113057n177880
$$ 434260 1016170 290040 1846348 6017602 9972076 10684237 7132067 1019010 -4158870
8352d158870j775603R76391J454922P13084m69099k713820m880052l449402K226791
$$ -4158870 -5934473 -4958082 -3503160 -2790076 -3259175 -5972995 -10853047 -14302449 -12075658
8343a2075658P181359O575458J857705j799235k070397o58842J05607p12771k285509
$$ -12075658 -4894299 1681159 3538864 1739629 -330768 -989610 -884003 -1596774 -3882283
8334c882283k090499J176342M029994J820298l006388k502655M250043P664762
$$ -3882283 -5972782 -4796440 -766446 1053852 -1952536 -4455191 -205148 7459614
8326G459614J714664o101516o194532j393499n57938l215414j956354K996057
$$ 7459614 9174278 3072762 -3121770 -4515269 -5073207 -8288621 -10244975 -7248918
8318g248918L821435q50292l677174j648522l38143k518375k954108J406438N333910
$$ -7248918 -3427483 -4277775 -7954949 -9603471 -9941614 -12459989 -15414097 -14007659 -8673749
8309h673749M301925J519224R15673N73845j379966j487122K093341L846454m91443
$$ -8673749 -4371824 -2852600 -1936927 -1363082 -2743048 -4230170 -2136829 1709625 1218182
8300A218182n014985j853919N427952O058662j493193o722960k560228M460569
$$ 1218182 -3796803 -5650722 -222770 5835892 4342699 -2380261 -4940489 -479920
8292d79920M028968l360376p788966l897263K680002M119940O93707j570400n57638
$$ -479920 3549048 188672 -7600294 -11497557 -8817555 -4697615 -4003908 -5574308 -6131946
8283f131946J13240j456722k175755p3099J854074J262982P81727K293529K088847
$$ -6131946 -6018706 -7475428 -9651183 -9724282 -7870208 -6607226 -5825499 -3531970 -1443123
8274a443123k331591n468268j526293M930737N064639j31555k012785O93284N08761
$$ -1443123 -3774714 -9242982 -10769275 -5838538 -773899 -905454 -2918239 -2224955 -1716194
8265a716194m244447n605445k80944L680347L45144m114339k208711K736418L528172
$$ -1716194 -5960641 -11566086 -11847030 -8166683 -7821539 -11935878 -14144589 -11408171 -7879999
8256g879999J078112O57498J917085J567592J367624M353278O730753K755230
$$ -7879999 -6801887 -6144389 -4227304 -2659712 -1292088 3061190 9791943 12547173
8248A2547173m760558p723445m795395j505870J51421K958356N778819L418142
$$ 12547173 7786615 63170 -4732225 -6238095 -6086674 -3128318 2650501 6068643
8240F068643l411017p108278m808508k577621m410287n077596P10432Q504967
$$ 6068643 2657626 -4450652 -9259160 -11836781 -16247068 -21324664 -20614232 -12109265
8232a2109265R980006M440516j639570l845099l028200j182774N97174Q99393
$$ -12109265 -2129259 2311257 671687 -3173412 -6201612 -7384386 -6787212 -5887819
8224e887819p27039j739878J93320K606483J183571k920972l687285P27802M541786
$$ -5887819 -6614858 -8354736 -8161416 -5554933 -4371362 -7292334 -10979619 -10251817 -5710031
8215e710031K687313j645669k048379J403988K877443L28222j481355R70401L976924
$$ -5710031 -3022718 -4668387 -6716766 -5312778 -2435335 -2107113 -3588468 -2618067 1358857
8206A358857K271959k574422m108442l08635L586427K427976k192805m700503
$$ 1358857 3630816 1056394 -3052048 -3360683 225744 2653720 460915 -4239588
8198d239588k817726M35793J399148J03851p98518k1103J063627J007070M50822
$$ -4239588 -7057314 -6621521 -5222373 -5118522 -5917040 -5938143 -4874516 -3867446 -3416624
8189c416624O49250J087980L52424j314733k374498k477470k226937q90298K429135
$$ -3416624 -2767374 -1679394 -1326970 -2641703 -5016201 -7493671 -9720608 -10610906 -8181771
8180h181771N250154L505759j773379l989043O5453M807457L361710k668951n656360
$$ -8181771 -2931617 574142 -1199237 -5188280 -5122827 -315370 3046340 377389 -5278971
8171e278971k429846K372991L054952p09410m422887l607647J568744N576198
$$ -5278971 -7708817 -5335826 -2280874 -2990284 -7413171 -11020818 -9452074 -3875876
8163c875876L253513l121352o078185l377571p15297j422997o12408M963063Q581728
$$ -3875876 -622363 -3743715 -9821900 -13199471 -13914768 -15337765 -15950173 -10987110 -2405382
8154b405382L692766l537110k633157M078549M999259j641667n311767j016377
$$ -2405382 1287384 -2249726 -4882883 -804334 4194925 2553258 -2758509 -3774886
8146c774886L346774J375136j885196l33514K781335J931918j147292k154522
$$ -3774886 -428112 947024 -938172 -1271686 1509649 3441567 2294275 139753
8138A39753j904771k394288j038695L977363P486613L892444l517546o636253
$$ 139753 -1765018 -4159306 -5198001 -1220638 6265975 10158419 6640873 4620
8130D620l402125J384208L837614L816938J658383k324988n532009m689273r7865
$$ 4620 -3397505 -2013297 1824317 5641255 7299638 4974650 -557359 -5246632 -5344497
8121e344497M309138N056615K032150j783212k991458j561087j228193l726336
$$ -5344497 -1035359 4021256 6053406 4270194 1278736 -282351 -1510544 -5236880
8113e236880m725452k71594M921774K888903m704260p771272k660873L490825
$$ -5236880 -9962332 -10233926 -5312152 -2423249 -7127509 -14898781 -17559654 -14068829
8105a4068829N202258N459066O671783N151008j90298l307685j277593N9408l012660
$$ -14068829 -8866571 -3407505 3264278 8415286 8224988 4917303 3639710 3699118 686458
8096F86458n017634k046981M41018j269498p49546N904240R502343K139469p301215
$$ 686458 -4331176 -6378157 -5937139 -7206637 -7956183 -2051943 7450400 9589869 2288654
8087B288654o157802J405362K314337l234655m426163m30784l98643m374138k407980
$$ 2288654 -3869148 -2463786 -149449 -3384104 -7810267 -8241051 -8639694 -13013832 -15421812
8078a5421812N860862Q133280k9290p192467m166288L356724O395043M950243
$$ -15421812 -9560950 -1427670 -1456960 -8649427 -12815715 -9458991 -3063948 1886295
8070A886295K378679j668469o084724n647996L8196L387964L30677l245244j835017
$$ 1886295 4264974 2596505 -3488219 -9136215 -9098019 -5710055 -5379378 -8624622 -10459639
8061a0459639J387470K188300K624221M618134M496317O63243j213339K084388
$$ -10459639 -9072169 -6883869 -4259648 358486 4854803 5518046 4304707 6389095
8053F389095M138380n01172n778938l537331K558673K876934k518583m865132
$$ 6389095 10527475 10026303 4247365 710034 3268707 6145641 3627058 -1238074
8045a238074j441723J289254k38942j051978L024653P670999O194189p29728n760365
$$ -1238074 -2679797 -1390543 -1629485 -2681463 343190 8014189 14208378 13478650 7718285
8036G718285m088162J055154K662226j557376o636979o888276k839397Q66285
$$ 7718285 3630123 4685277 7347503 5790127 -846852 -7735128 -10574525 -9708240
8028i708240K555062M033909M818646J800333l975856o142931j852842L058601
$$ -9708240 -7153178 -3119269 1699377 3499710 -476146 -6619077 -8471919 -5413318
8020e413318J909661l439192n646264k102513K543833L504901J661396J178954
$$ -5413318 -3503657 -6942849 -12589113 -14691626 -12147793 -8642892 -6981496 -5802542
8012e802542L224873M017979J45423n242366n129146J074093M693284l52042p336536
$$ -5802542 -2577669 1440310 1585733 -3656633 -8785779 -7711686 -3018402 -3370444 -10706980
8003a0706980n591141L315119P514659K603308k581218m48372M441031L938251
$$ -10706980 -16298121 -12983002 -5468343 -2865035 -5446253 -5894625 -1453594 2484657
7995B484657j445667m823968k862794J659123M278827K595190j789002l770738
$$ 2484657 1038990 -3784978 -6647772 -4988649 -709822 1885368 96366 -3674372
7987c674372o74201K655825K16835m634779l363248K949660L847368k819801n684665
$$ -3674372 -4348573 -1692748 -1475913 -6110692 -9473940 -6524280 -2676912 -5496713 -11181378
7978a1181378J661470Q998388N561091k592760l073527K898088M370255m68664
$$ -11181378 -9519908 -521520 5039571 2446811 -626716 2271372 6641627 6172963
7970F172963l117352o20795N13107k856236n120075k093884K402447L390845J327896
$$ 6172963 3055611 2434816 2947923 91687 -5028388 -7122272 -4719825 -1328980 -1084
7961a084r57652k390130k423160l18182K534660L328906J870379N68358L36005
$$ -1084 -958736 -3348866 -5772026 -6090208 -3555548 -226642 1643737 2212095 2548100
7952B548100L5316l56612J54570P42970j66897j559976j351193m22962j124111
$$ 2548100 2583416 2226804 2381374 3124344 2957447 1397471 46278 -376684 -1500795
7943a500795k571998j724329J371414L523508L259353J948252M74143j541460
$$ -1500795 -4072793 -5797122 -4425708 -902200 2357153 4305405 4779548 3238088
$$ [...]
##END NTUPLES=NMR SPECTRUM
##END=
