##TITLE=31Pdec_SR90_k_vak
 CDCl3, 124 sc
 25.10.2021
##JCAMPDX= 6.0         $$ Bruker NMR JCAMP-DX V2.0
##DATA TYPE= NMR SPECTRUM
##DATA CLASS= NTUPLES
##ORIGIN= UXNMR, Bruker Analytische Messtechnik GmbH
##OWNER= root
$$ XWIN-NMR		Version 3.5
$$ Mon Oct 25 11:33:51 2021 Russian Standard Time (UT+4h)  she@DPX200
##.OBSERVE FREQUENCY= 81.013821
##.OBSERVE NUCLEUS= ^31P
##.ACQUISITION MODE= SIMULTANEOUS
##.ACQUISITION SCHEME= undefined
##.AVERAGES= 124
##.DIGITISER RES= 16
##SPECTROMETER/DATA SYSTEM= spect
##.PULSE SEQUENCE= zgpg30
##.SOLVENT NAME= CDCl3
##.SHIFT REFERENCE= (INTERNAL, CDCl3, 0, 248.564)
##AUDIT TRAIL= $$ (NUMBER, WHEN, WHO, WHERE, WHAT)
$$ ##TITLE= Audit trail, XWIN-NMR		Version 3.5
$$ ##JCAMPDX= 5.01
$$ ##ORIGIN= Bruker BioSpin GmbH
$$ ##OWNER= she
$$ F:/spectra/data/she/nmr/P31/1/pdata/1/auditp.txt
$$ ##AUDIT TRAIL=  $$ (NUMBER, WHEN, WHO, WHERE, WHAT)
(   1,<2021-10-25 11:32:49.73 +0400>,<she>,<DPX200>,
      <continue with go, POWCHK disabled, PULCHK disabled
       configuration hash MD5:
       00 E9 B6 7A A2 85 ED C7 34 08 36 98 17 FE 4E 26
       data hash MD5: 32K
       38 2A F0 E3 D6 4F AD 4F 48 AD 97 6C 5F A8 7D 57>)
(   2,<2021-10-25 11:32:53.65 +0400>,<she>,<DPX200>,
      <Start of raw data processing
       efp BC_mod = 2 LB = 1 FT_mod = 6 PKNL = 1 PHC0 = -8839.808 PHC1 = 115.669 SI = 64K 
       data hash MD5: 64K
       0A 49 3B F9 46 24 09 17 72 59 9A 38 FE AC AE 96>)
(   3,<2021-10-25 11:33:07.89 +0400>,<she>,<DPX200>,
      <abs ABSG = 5 
       data hash MD5: 64K
       32 D2 37 13 00 67 6C CE 3F BD 2F 86 B0 8B 4C 5D>)
$$ ##END=
$$ 
$$ hash MD5
$$ 56 46 E3 75 77 28 F8 38 40 DB 3C 31 34 E1 00 75
##$RELAX= 
##$RELAX= 
##$RELAX= 
##$RELAX= 
##$RELAX= 
##$RELAX= 
##$RELAX= 
##$RELAX= 
$$ Bruker specific parameters
$$ --------------------------
##$DU= <F:/spectra>
##$EXPNO= 1
##$NAME= <P31>
##$PROCNO= 1
##$TYPE= <nmr>
##$USER= <she>
##$AMP= (0..31)
100 100 100 100 100 100 100 100 100 100 100 100 100 100 100 100 100 100 
100 100 100 100 100 100 100 100 100 100 100 100 100 100 
##$AQSEQ= 0
##$AQ_mod= 1
##$AUNM= <au_zg>
##$AUTOPOS= <>
##$BF1= 81.014009
##$BF2= 200.13
##$BF3= 200.13
##$BF4= 200.13
##$BF5= 200.13
##$BF6= 200.13
##$BF7= 200.13
##$BF8= 200.13
##$BYTORDA= 1
##$CFDGTYP= 0
##$CFRGTYP= 5
##$CHEMSTR= <none>
##$CNST= (0..31)
1 1 145 1 1 1 1 1 1 1 1 1 1 1 1 1 1 1 1 1 1 1 1 1 1 1 1 1 1 1 1 1 
##$CPDPRG= <waltz16>
##$CPDPRG1= <>
##$CPDPRG2= <waltz16>
##$CPDPRG3= <>
##$CPDPRG4= <mlev>
##$CPDPRG5= <mlev>
##$CPDPRG6= <mlev>
##$CPDPRG7= <mlev>
##$CPDPRG8= <mlev>
##$CPDPRGB= <>
##$CPDPRGT= <>
##$D= (0..31)
0 1 0 0 0 0 0 0 0 0 0 0.03 2e-05 3e-06 0 0 0 0 0 0 0 0 0 0 0 0 0 0 0 0 
0 0 
##$DATE= 1635147002
##$DBL= (0..7)
120 120 120 11 120 120 24 19 
##$DBP= (0..7)
150 150 150 150 150 150 150 150 
##$DBP07= 0
##$DBPNAM0= <>
##$DBPNAM1= <>
##$DBPNAM2= <>
##$DBPNAM3= <>
##$DBPNAM4= <>
##$DBPNAM5= <>
##$DBPNAM6= <>
##$DBPNAM7= <>
##$DBPOAL= (0..7)
0.5 0.5 0.5 0.5 0.5 0.5 0.5 0.5 
##$DBPOFFS= (0..7)
0 0 0 0 0 0 0 0 
##$DE= 6
$$ [...]
##$SUBNAM3= <"">
##$SUBNAM4= <"">
##$SUBNAM5= <"">
##$SUBNAM6= <"">
##$SUBNAM7= <"">
##$SUBNAM8= <"">
##$SUBNAM9= <"">
##$SW= 501.771253377433
##$SWIBOX= (0..15)
0 1 3 0 0 0 0 0 0 0 0 0 0 0 0 0 
##$SW_h= 40650.406504065
##$TD= 32768
##$TD0= 1
##$TE= 0
##$TE2= 300
##$TE3= 300
##$TEG= 300
##$TL= (0..7)
0 120 53 12 22 120 120 120 
##$TP= (0..7)
150 150 150 150 150 150 150 150 
##$TP07= 0
##$TPNAME0= <>
##$TPNAME1= <>
##$TPNAME2= <>
##$TPNAME3= <>
##$TPNAME4= <>
##$TPNAME5= <>
##$TPNAME6= <>
##$TPNAME7= <>
##$TPOAL= (0..7)
0.5 0.5 0.5 0.5 0.5 0.5 0.5 0.5 
##$TPOFFS= (0..7)
0 0 0 0 0 0 0 0 
##$TUNHIN= 0
##$TUNHOUT= 0
##$TUNXOUT= 0
##$USERA1= <user>
##$USERA2= <user>
##$USERA3= <user>
##$USERA4= <user>
##$USERA5= <user>
##$V9= 5
##$VALIST= <valist>
##$VCLIST= <CCCCCCCCCCCCCCC>
##$VD= 0
##$VDLIST= <DDDDDDDDDDDDDDD>
##$VPLIST= <PPPPPPPPPPPPPPP>
##$VTLIST= <TTTTTTTTTTTTTTT>
##$WBST= 1024
##$WBSW= 4
##$XGAIN= (0..3)
0 0 0 0 
##$XL= 0
##$YL= 0
##$YMAX_a= 5527
##$YMIN_a= -3404
##$ZGOPTNS= <>
##$ZL1= 120
##$ZL2= 120
##$ZL3= 120
##$ZL4= 120
##$ABSF1= 248.5645
##$ABSF2= -253.2056
##$ABSG= 5
##$ABSL= 3
##$ALPHA= 0
##$AQORDER= 0
##$ASSFAC= 0
##$ASSFACI= 0
##$ASSFACX= 0
##$ASSWID= 0
##$AUNMP= <proc_1d>
##$AZFE= 0.1
##$AZFW= 0.5
##$BCFW= 0
##$BC_mod= 2
##$BYTORDP= 0
##$COROFFS= 0
##$CY= -3
##$DATMOD= 1
##$DC= 0
##$DFILT= <>
##$DTYPP= 0
##$F1P= 0
##$F2P= 0
##$FCOR= 1
##$FTSIZE= 65536
##$FT_mod= 6
##$GAMMA= 0
##$GB= 0
##$INTBC= 1
##$INTSCL= 5.30512e-09
##$ISEN= 30
##$LB= 1
##$LEV0= 0
##$LPBIN= 0
##$MAXI= 10000
##$MC2= 0
##$MEAN= 0
##$ME_mod= 0
##$MI= 50
##$NCOEF= 0
##$NC_proc= -7
##$NLEV= 6
##$NOISF1= 182.463
##$NOISF2= 159.3651
##$NSP= 0
##$NTH_PI= 0
##$NZP= 0
##$OFFSET= 248.5645
##$PC= 4
##$PHC0= -8839.808
##$PHC1= 115.669
##$PH_mod= 1
##$PKNL= yes
##$PPARMOD= 0
##$PSCAL= 0
##$PSIGN= 0
##$REVERSE= no
##$SF= 81.014009
##$SI= 65536
##$SIGF1= 159.3651
##$SIGF2= -187.1042
##$SINO= 113.3802
##$SIOLD= 16384
##$SREGLST= <1H.CDCl3>
##$SSB= 0
##$STSI= 65536
##$STSR= 0
##$SW_p= 40650.406504065
##$SYMM= 0
##$S_DEV= 0
##$TDeff= 32768
##$TDoff= 0
##$TI= <>
##$TILT= no
##$TM1= 0
##$TM2= 0
##$TOPLEV= 0
##$USERP1= <user>
##$USERP2= <user>
##$USERP3= <user>
##$USERP4= <user>
##$USERP5= <user>
##$WDW= 1
##$XDIM= 65536
##$YMAX_p= 365733744
##$YMIN_p= -45240782
$$ End of Bruker specific parameters
$$ ---------------------------------
##NTUPLES= NMR SPECTRUM
##VAR_NAME=  FREQUENCY,     SPECTRUM/REAL,   SPECTRUM/IMAG
##SYMBOL=    X,             R,               I
##VAR_TYPE=  INDEPENDENT,   DEPENDENT,       DEPENDENT
##VAR_FORM=  AFFN,          ASDF,            ASDF
##VAR_DIM=   65536,         65536,           65536
##UNITS=     HZ,            ARBITRARY UNITS, ARBITRARY UNITS
##FACTOR=    0.620285442955139, 1,           1
##FIRST=     20137.2065510759, 0,            0
##LAST=      -20513.1999529892, 0,           0
##MIN=       -20513.1999529892, -45240782,   0
##MAX=       20137.2065510759, 365733744,    0
$$ Real data points
##PAGE= N=1
##DATA TABLE= (X++(R..R)), XYDATA
$$ [...]
##PAGE= N=2
##DATA TABLE= (X++(I..I)), XYDATA
$$ plain form
13017 -1666024 -319853 3629912 4762840 5082275 7908655 8623743 1420084 -9052581
13009 -9052581 -13094254 -10383063 -8792229 -10311532 -8944636 -3298677 -807736 -6192728
13001 -6192728 -13991510 -16646081 -13814185 -9797811 -6685811 -3831181 -737869 2435765
12993 2435765 5073992 5736700 4013539 2485587 3430066 4313459 1050280 -4811639 -7424722
12984 -7424722 -5123865 -2032574 -903524 -216576 926462 1236075 1768215 5666275 11704145
12975 11704145 14524333 13232087 12768850 14166555 11320491 1963442 -5661514 -3531100
12967 -3531100 4504697 8699334 6553752 2883247 355693 -2200871 -3787495 -1207588
12959 -1207588 4557955 7911082 5700704 517060 -3722651 -5885090 -6757969 -7104258
$$ packed form
13017a666024J346171L949765J132928L19435K826380P15088p203659j0472665
13009i052581m041673K711191J590834j519303J366896N645959K490941n384992
13001f192728p798782k654571K831896M016374L112000K854630L093312L173634
12993B435765K638227O62708j723161j527952R44479Q83393l263179n861919k613083
12984g424722K300857L091291J129050O86948J143038L09613N32140L898060O037870
12975A1704145K820188j292246m63237J397705k846064r357049p624956K130414
12967c531100Q035797M194637k145582l670505k527554k556564j586624K579907
12959a207588N765543L353127k210378n183644m239711k162439q72879l46289
$$ plain form
12951 -7104258 -7246054 -6708142 -4511540 -1351747 -163431 -2321522 -4781002 -3774437
12943 -3774437 -206826 1584284 -233717 -3054435 -3538296 -973104 2870237 5441075
12935 5441075 5163450 2681389 -16091 -2009846 -3666839 -4498972 -3426674 -1704271
12927 -1704271 -2304669 -5224674 -6928021 -5909057 -4768182 -4847810 -3531948 197210 2445348
12918 2445348 609791 -1833133 -1491371 -1399665 -5413150 -10313726 -10246506 -6075480 -3392000
12909 -3392000 -3416679 -2831461 -867941 558982 2316206 6203609 8756754 4935400 -2297055
12900 -2297055 -4459936 -221742 2963674 1365071 256657 3771279 8038723 8892285
12892 8892285 8884947 11239935 13193281 11320459 8310900 8246772 9191109 6714923 1938711
$$ packed form
12951g104258j41796N37912K196602L159793J188316k158091k459480J006565
12943c774437L567611J791110j818001k820718m83861K565192L843341K570838
12935E441075k77625k482061k697480j993755j656993q32133J072298J722403
12927a704271o00398k920005j703347J018964J140875p9628J315862L729158K248138
12918B445348j835557k442924L41762R1706m013485m900576O7220M171026K683480
12909c392000k4679N85218J963520J426923J757224L887403K553145l821354p232455
12900b297055k162881M238194L185416j598603j108414L514622M267444Q53562
12892H892285p338K354988J953346j872822l009559o4128R44337k476186m776212
$$ plain form
12883 1938711 120970 2913615 7011678 9309264 9277672 7391767 4791724 3401836
12875 3401836 3430610 2206927 -1834428 -5917428 -6481472 -3978472 -1278239 564733 1877648
12866 1877648 1828855 -257230 -2601055 -3022741 -1851047 -309042 1923364 4860965 6391060
12857 6391060 5431018 4414029 5198288 5209814 1827195 -1909336 -1037211 3392486 5280628
12848 5280628 1793313 -3961664 -8227811 -10023949 -9259992 -5900666 -1808558 110330
12840 110330 -604081 -1879186 -2372803 -2298525 -1849169 -1654661 -3407190 -6663856 -7105690
12831 -7105690 -2576913 1362964 -1766666 -8360576 -8376472 -568676 4468312 -531188
12823 -531188 -9323937 -12161078 -9082844 -6526206 -5889087 -3541387 463972 1828401
$$ packed form
12883A938711j817741K792645M098063K297586l1592j885905k600043j389888
12875C401836K8774j223683m041355m083000n64044K503000K700233J842972J312915
12866A877648m8793k086085k343825m21686J171694J542005K232406K937601J530095
12857F391060r60042j016989P84259J1526l382619l736531Q72125M429697J888142
12848E280628l487315n754977m266147j796138P63957L359326M092108J918888
12840A10330p14411j275105m93617P4278M49356J94508j752529l256666m41834
12831g105690M528777L939877l129630o593910j5896P807796N036988m999500
12823e31188q792749k837141L078234K556638O37119K347700M005359J364429
$$ plain form
12815 1828401 -250953 -1925809 -2086732 -4346523 -9546724 -12171524 -7959536 -881550
12807 -881550 1879207 -703340 -3674719 -4163211 -4258582 -5522244 -5495392 -2102275 1952635
12798 1952635 2709863 936549 821095 3646399 6822507 9116364 12167234 15423540
12790 15423540 14397777 7253012 -647645 -3076045 -1163892 -541650 -2256728 -2235304
12782 -2235304 776925 2835593 1584247 -17259 822449 2001316 459230 -2532024
12774 -2532024 -3423604 -1437457 1491322 3962182 5402339 4665274 1333906 -2434854
12766 -2434854 -3957507 -3403861 -3073621 -4001083 -5412952 -6962393 -9037347 -10637744 -9095671
12757 -9095671 -3045899 5157323 10943524 11636023 8870603 6453840 5745782 4416030
$$ packed form
12815A828401k079354j674856j60923k259791n200201k624800M211988P077986
12807h81550K760757k582547k971379m88492r5371j263662K6852L393117M054910
12798A952635P57228j773314j15454K825304L176108K293857L050870L256306
12790A5423540j025763p144765p900657k428400J912153O22242j715078K1424
12782b235304L012229K058668j251346j601506Q39708J178867j542086k991254
12774b532024q91580J986147K928779K470860J440157p37065l331368l768760
12766b434854j522653N53646L30240r27462j411869j549441k074954j600397J542073
12757i095671O049772Q203222N786201O92499k765420k416763p08058j329752
$$ plain form
12749 4416030 778284 -2454967 -1508111 2309334 3580034 378506 -2912442 -1903080
12741 -1903080 2109103 4892343 4747598 2743587 145343 -1629642 -840484 1792435
12733 1792435 2195323 -1927468 -6744736 -6436686 -459167 6438765 10159219 9949317 6553837
12724 6553837 1691237 -1172204 492014 4592483 6658842 5681252 4427074 4269459
12716 4269459 3734718 2549296 2846257 5049113 6394923 5239697 3303620 1737310
12708 1737310 -1407593 -7022867 -11344744 -10003513 -3831648 2528443 6440237 8657978
12700 8657978 9942565 9539673 6980706 2919709 -1893382 -6521929 -9035054 -8041402
12692 -8041402 -5033558 -3040003 -2858737 -2900669 -2844085 -4354864 -7026570 -6956044 -2230881
$$ packed form
12749D416030l637746l233251R46856L817445J270700l201528l290948J009362
12741a903080M012183K783240j44745k004011k598244j774985P89158K632919
12733A792435M02888m122791m817268L08050N977519O897932L720454k09902l395480
12724F553837m862600k863441J664218M100469K066359r77590j254178j57615
12716D269459n34741j185422K96961K202856J345810j155226j936077j566310
12708A737310l144903n615274m321877J341231O171865O360091L911794K217741
12700H657978J284587m02892k558967m060997m813091m628547k513125R93652
12692h041402L007844J993555J81266m1932N6584j510779k671706P0526M725163
$$ plain form
12683 -2230881 2508846 1017577 -5749780 -10065662 -7464099 -2179174 -291452 -1209013
12675 -1209013 20571 4307997 7576504 7794783 7786645 9713219 11223701 9529252 5813800
12666 5813800 2778973 685704 -1142148 -1512048 412905 2246270 1634680 670744 2712846
12657 2712846 5977214 5306007 341241 -3133963 -1344865 2366581 2695660 -873773
12649 -873773 -4938628 -7093416 -7335233 -6295518 -4433246 -2195756 332566 3212162
12641 3212162 5747563 7159340 8022441 8886879 7760527 2245916 -5436207 -9469168
12633 -9469168 -7755081 -4174365 -1764860 1621112 7560231 11604883 8824435 1906335
12625 1906335 -1901641 -451272 2012215 2307342 1593353 1147762 173436 -1157362 -1085120
$$ packed form
12683b230881M739727j491269o767357m315882K601563N284925J887722r17561
12675a209013J229584M287426L268507K18279q138J926574J510482j694449l715452
12666E813800l034827k093269j827852l69900J924953J833365o11590r63936K042102
12657B712846L264368o71207m964766l475204J789098L711446L29079l569433
12649h73773m064855k154788k41817J039715J862272K237490K528322K879596
12641C212162K535401J411777Q63101Q64438j126352n514611p682123m032961
12633i469168J714087L580716K409505L385972N939119M044652k780448o918100
12625A906335l807976J450369K463487K95127p13989m45591r74326j330798P2242
$$ plain form
12616 -1085120 -86041 -1238697 -5264397 -8927162 -9779625 -8710393 -6454551 -2151239
12608 -2151239 2356257 1730625 -5407432 -12209087 -11565926 -5473639 -1396524 -1601016 -1934149
12599 -1934149 -49001 1591665 1504132 1896780 3644005 3912264 1718287 1097979 4718803
12590 4718803 8123200 5364977 -1864248 -6087789 -4301791 -1223969 -1668269 -4371298
12582 -4371298 -5360106 -3789506 -1665736 -202463 536087 -318717 -3824433 -8886445 -12753575
12573 -12753575 -14020475 -13471424 -11807694 -8343208 -2805499 2882926 6089454 6582364
12565 6582364 6994759 9530629 12731872 12683472 7875812 1801150 -572120 1629071 4870209
12556 4870209 6411207 7462834 10019925 12837671 13126441 11237818 10727761 13423482
$$ packed form
12616a085120R99079j152656m025700l662765q52463J069232K255842M303312
12608b151239M507496o25632p138057o801655O43161O092287M077115k04492l33133
12599a934149J885148J640666q7533L92648J747225K68259k193977o20308L620824
12590D718803L404397k758223p229225m223541J785998L077822m44300k703029
12582d371298r88808J570600K123770J463273P38550q54804l505716n062012l867130
12573a2753575j266900N49051J663730L464486N537709N688425L206528M92910
12565F582364M12395K535870L201243m8400m807660o074662k373270K201191L241138
12556D870209J540998J051627K557091K817746K88770j888623n10057K695721
$$ plain form
12548 13423482 16779771 17027541 13161250 6925305 805236 -2482016 -484701 6240471
12540 6240471 12631634 13390089 9104200 5339512 4859795 4204354 324199 -2948513 108976
12531 108976 7359525 10234009 5709213 600604 981083 3343969 1591560 -2159157
12523 -2159157 -1387413 2906613 3010077 -2638628 -6288255 -3092305 1691244 2021491 217947
12514 217947 792372 1460512 -1891903 -5654534 -2856631 4739612 7747698 2761145 -3002504
12505 -3002504 -2484936 2501492 6080182 6228165 4460112 1848344 -966115 -2483387
12497 -2483387 -2094732 -1420626 -1962226 -2957549 -2724865 -534646 3229792 6720784 6694198
12488 6694198 1978002 -3244189 -3400394 871500 3277945 824043 -2356862 -1702124
$$ packed form
12548A3423482L356289K47770l866291o235945o120069l287252J997315O725172
12540F240471O391163P58455m285889l764688m79717o55441l880155l272712L057489
12531A08976P250549K874484m524796n108609L80479K362886j752409l750717
12523b159157P71744M294026J03464n648705l649627L195950M783549L30247j803544
12514B17947N74425O68140l352415l762631K797903P596243L008086m986553n763649
12505c002504N17568M986428L578690J47983j768053k611768k814459j517272
12497b483387L88655O74106n41600r95323K32684K190219L764438L490992k6586
12488F694198m716196n222191j56205M271894K406445k453902l180905O54738
$$ plain form
12480 -1702124 1707580 3954044 3261699 169500 -3415274 -3679606 2034713 9698019
12472 9698019 11301774 5631515 608206 1589910 3868039 1771225 -1423756 192908
12464 192908 4411507 5040116 3030464 4259957 8353893 9163049 5792389 3895531 5290421
12455 5290421 5200105 1620695 -1069694 -610386 -891396 -3750734 -4288033 738410 6378290
12446 6378290 7026858 5075930 5895430 8596795 8518304 5908300 5245832 7286753 8061952
12437 8061952 5586318 2239813 180070 -938399 -1014501 1435869 5867738 8659803
12429 8659803 7149667 2606478 -1883572 -4664121 -5820648 -5934184 -5474667 -4486254 -2593262
12420 -2593262 -142164 1205123 613172 276300 3098281 7950808 9887159 6365426
$$ packed form
12480a702124L409704K246464o92345l092199l584774k64332N714319P663306
12472I698019J603755n670259n023309R81704K278129k096814l194981J616664
12464A92908M218599O28609k009652J229493M093936Q09156l370660j896858J394890
12455E290421r0316l579410k690389M59308k81010k859338n37299N026443N639880
12446F378290O48568j950928Q19500K701365p8491k610004o62468K040921P75199
12437H061952k475634l346505k059743j118469p6102K450370M431869K792065
12429H659803j510136m543189m490050k780549j156527j13536M59517R88413J892992
12420b593262K451098J347287n91951l36872K821981M852527J936351l521733
$$ plain form
12412 6365426 1104083 -315939 2579401 4946370 3032362 -1620258 -5059105 -5926566
12404 -5926566 -5925660 -6564804 -7631087 -8525507 -8785561 -7037125 -2077355 3797960 5250324
12395 5250324 159875 -6456872 -7879011 -3936765 -434302 -792066 -2233626 -1179149
12387 -1179149 1335233 1947310 230415 -1076455 -176501 1542560 1395583 -1329634 -4035599
12378 -4035599 -3084097 1799741 6208911 5926768 2331207 234707 854529 803904 -1318337
12369 -1318337 -1922904 1542834 5555778 5319235 1911780 294108 1580380 1743852 -1952436
12360 -1952436 -7016984 -9205136 -7295123 -3252164 553014 3109189 4707022 6014019
12352 6014019 7142422 7719068 7848970 8084798 8043204 6330893 2726960 -747948 -1952003
$$ packed form
12412F365426n261343j420022K895340K366969j914008m652620l438847q67461
12404e926566R06o39144j066283q94420k60054J748436M959770N875315J452364
12395E250324n090449o616747j422139L942246L502463l57764j441560J054477
12387a179149K514382O12077j716895j306870Q99954J719061j46977k725217k705965
12378d035599R51502M883838M409170k82143l595561k096500O19822n0625k122241
12369a318337o04567L465738M012944k36543l407455j617672J286272J63472l696288
12360a952436n064548k188152J910013M042959L805178K556175J597833J306997
12352F014019J128403N76646J29902K35828m1594j712311l603933l474908j204055
$$ plain form
12343 -1952003 -791507 1382031 3079828 2784467 -100615 -3353833 -3525289 -964639
12335 -964639 -297125 -3574015 -6240094 -3468492 2462625 5751333 5681066 5962569 6736890
12326 6736890 3929269 -2611142 -6751025 -4496625 278352 1762656 -243788 -2268650
12318 -2268650 -3148348 -3837028 -3579358 -748642 3367923 5375226 4216998 1972457 476232
12309 476232 -131885 383067 2686129 5779217 6999187 5273293 2745794 2025965 2995639
12300 2995639 3460381 2133592 -172459 -1872319 -1999852 -392017 2326164 4477914
12292 4477914 4094037 1067359 -1898152 -1864543 818369 3176232 4202225 6625092 12423381
12283 12423381 18387612 19050853 13657738 7391350 5103767 6247297 7187738 6480104
$$ packed form
12343a952003J160496K173538J697797k95361k885082l253218j71456K560650
12335i64639O67514l276890k666079K771602N931117L288708p0267K81503P74321
12326F736890k807621o540411m139883K254400M774977J484304k006444k024862
12318b268650q79698o88680K57670K830716M116565K007303j158228k244541j496225
12309D76232o08117N14952K303062L093088J219970j725894k527499p19829R69674
12300B995639M64742j326789k306051j699860j27533J607835K718181K151750
12292D477914l83877l026678k965511L3609K682912K357863J025993K422867N798289
12283A2423381N964231O63241n393115o266388k287583J143530R40441p07634
$$ plain form
12275 6480104 5794329 6366280 6587436 3949039 -1234746 -5213971 -4809761 -1510212 230224
12266 230224 -955455 -1543730 1172506 4546215 4937797 4177440 6856768 12084720 13549347
12257 13549347 8812758 3266571 2366735 4419282 4530226 2140364 340871 -101851
12249 -101851 -1473715 -4372347 -5958580 -3576961 2015043 7506507 10023728 9402115
12241 9402115 8097204 8216713 8604146 6551317 2530124 428526 2032200 4328258
12233 4328258 4065539 1953011 111784 -1472638 -3142313 -3359219 -1708805 -1155446 -3443908
12224 -3443908 -5133333 -2703300 1084959 1211451 -1380408 -1522384 1594014 3915042
12216 3915042 4091819 5019562 7410035 8206775 6535879 5215398 4979165 3252695 276481
$$ packed form
12275F480104o85775N71951K21156k638397n183785l979225M04210L299549J740436
12266B30224j185679n88275K716236L373709L91582p60357K679328N227952J464627
12257A3549347m736589n546187q99836K052547J10944k389862j799493m42722
12249a01851j371864k898632j586233K381619N592004N491464K517221o21613
12241I402115j304911J19509L87433k052829m021193k101598J603674K296058
12233D328258k62719k112528j841227j584422j669675k16906J650414N53359k288462
12224c443908j689425K430033L788259J26492k591859j41976L116398K321028
12216C915042J76777R27743K390473P96740j670896j320481k36233j726470k976214
$$ plain form
12207 276481 -53550 2213260 1474794 -3985824 -7760079 -5259754 -1545693 -3117168 -7274058
12198 -7274058 -6969477 -2418378 71072 -1220484 -1827159 153165 1030459 -1475136 -4136763
12189 -4136763 -3273921 315287 3410790 4258656 2989928 648520 -1206818 -1824765 -2375831
12180 -2375831 -3949964 -5142288 -4099651 -2097285 -1961734 -3478019 -3757045 -2018280
12172 -2018280 -552968 -684702 -1083361 -652125 -88567 73391 266027 191044 -1058934
12163 -1058934 -2620431 -2078453 1290741 5542528 8602533 9862767 9394446 7642076
12155 7642076 5622611 3593688 548218 -2888721 -3122194 1498468 6614021 7264029
12147 7264029 5414624 6296862 8653562 6052071 -1732513 -6761039 -4817182 -1471972
$$ packed form
12207B76481l30031K266810p38466n460618l774255K500325L714061j571475m156890
12198g274058L04581M551099K489450j291556o06675J980324Q77294k505595k661627
12189d136763Q62842L589208L095503Q47866j268728k341408j855338o17947n51066
12180b375831j574133j192324J042637K002366J35551j516285k79026J738765
12172b018280J465312j31734l98659M31236N63558J61958J92636p4983j249978
12163a058934j561497N41978L369194M251787L060005J260234m68321j752370
12155G642076k019465k028923l045470l436939k33473M620662N115553O50008
12147G264029j849405Q82238K356700k601491p784584n028526J943857L345210
$$ plain form
12139 -1471972 -2040068 -2618526 2583644 10265546 11895591 6039867 -57411 -658738 2189146
12130 2189146 2951412 -834895 -6970751 -11045041 -10343656 -6841896 -5375928 -7467954
12122 -7467954 -8903170 -5473077 1035738 5244515 4748804 1511059 -1697647 -3359668
12114 -3359668 -2920605 -1096187 355813 972062 2267556 4592316 5698905 4555725
12106 4555725 3874669 6081867 9417284 11154087 11921414 13054719 12291487 6762931 -1434149
12097 -1434149 -7327013 -9595399 -10536189 -10581785 -7908744 -3457311 -1366958 -3148259 -5134112
12088 -5134112 -3320436 1614912 5225762 3846546 -1954868 -7590401 -8893603 -6830896
12080 -6830896 -5597970 -5533908 -2292062 4719991 8700585 5161842 170726 1913963
$$ packed form
12139a471972n68096n78458N202170P681902J630045n855724o097278o01327K847884
12130B189146P62266l786307o135856m074290P01385L501760J465968k092026
12122g467954j435216L430093O508815M208777m95711l237745l208706j662021
12114c359668M39063J824418J452000O16249J295494K324760J106589j143180
12106D555725o81056K207198L335417J736803P67327J133305p63232n528556q197080
12097a434149n892864k268386r40790m5596K673041M451433K090353j781301j985853
12088e134112J813676M935348L610850j379216n801414n635533j303202K062707
12080f830896J232926O4062L241846P012053L980594l538743m991116J743237
$$ plain form
12072 1913963 7910614 9109270 4475803 1953493 4940259 7436812 4835858 934628
12064 934628 594377 2559374 3635278 3962284 4030713 1896911 -2336720 -4152527 -1240204
12055 -1240204 1768575 -128168 -4593372 -5690532 -2628375 97213 -268333 -1882049
12047 -1882049 -1923296 90042 2447780 2838334 262538 -3588578 -5685614 -4747275 -1811270
12038 -1811270 1710063 4441988 4598629 2363454 1576385 4807357 7943003 5296477
12030 5296477 -575233 -1189751 5120407 10589135 10248329 8683484 10791340 13527090
12022 13527090 12207629 8466394 5912307 3388011 -1186624 -4869355 -3795499 502308
12014 502308 4223758 6802730 8310435 6146417 104312 -3968929 -1895749 1884211
$$ packed form
12072A913963N996651J198656m633467k522310K986766K496553k600954l901230
12064I34628l40251J964997J075904L27006O8429k133802m233631j815807K912323
12055a240204L008779j896743m465204j097160L062157K725588l65546j613716
12047a882049m1247K013338K357738L90554k575796l851116k097036R38339K936005
12038a811270L521333K731925J56641k235175p87069L230972L135646k646526
12030E296477n871710o14518O310158N468728l40806j564845K107856K735750
12022A3527090j319461l741235k554087k524296m574635l682731J073856M297807
12014E02308L721450K578972J507705k164018o042105m073241K073180L779960
$$ plain form
12006 1884211 1478345 -1163264 -1231720 -299833 -2184201 -4068092 -1215023 3016019 2014340
11997 2014340 -1803769 -196407 6918977 11514770 10898706 10040990 10140365 6414202 -770349
11988 -770349 -3844123 -499982 2197066 259879 -659977 3721411 8095506 6615376
11980 6615376 2194924 123153 -712783 -3354809 -5415518 -3296016 664647 1738137
11972 1738137 83098 -881468 -57307 1901848 5024396 7677773 5966708 -227177
11964 -227177 -4992448 -4428068 -1984947 -1217120 896475 7241498 12837980 11554718 6332911
11955 6332911 4601082 6694939 7195526 5464982 6044334 9403906 10756013 8513954
11947 8513954 6440283 6446312 6003921 3795016 1546308 -967872 -6268411 -12520920 -12734653
$$ packed form
12006A884211m05866k641609o8456R31887j884368j883891K853069M231042j001679
11997B014340l818109J607362P115384M595793o16064q57716R9375l726163p184551
11988g70349l073774L344141K697048j937187r19856M381388M374095j480130
11980F615376m420452k071771q35936k642026k060709K119502L960663J073490
11972A738137j655039r64566Q24161J959155L122548K653377j711065o193885
11964b27177m765271N64380K443121P67827K113595O345023N596482j283262n221807
11955F332911j731829K093857N00587j730544N79352L359572J352107k242059
11947H513954k073671O029m42391k208905k248708k514180n300539o252509k13733
$$ plain form
11938 -12734653 -3924241 7430475 12391104 9063636 2843997 -231725 1319128 3730617
11930 3730617 1644130 -5503316 -11147220 -8773494 -809605 3958556 1944974 -1157453
11922 -1157453 945916 7103953 11541201 10949162 6350267 765448 -2779413 -2895552
11914 -2895552 -760436 2083699 6259964 11932656 14945126 10821387 2736528 -560191
11906 -560191 3657376 8577095 8287922 5413911 4687875 5186668 4227675 3673388 6100842
11897 6100842 8872068 8596250 7869378 10344156 12225817 7210497 -1786831 -5262500
11889 -5262500 -1773274 -332525 -5808802 -11316158 -9817433 -4964402 -3634783 -4179977
11881 -4179977 -340479 7129608 11244580 9443221 5759669 3045495 434382 -1264403
$$ packed form
11938a2734653Q810412J1354716M960629l327468o219639l075722J550853K411489
11930C730617k086487p147446n643904K373726P963889M768161k013582l102427
11922a157453K103369O158037M437248n92039m598895n584819l544861j16139
11914b895552K135116K844135M176265N672692L012470m123739q084859l296719
11906e60191M217567M919719k89173k874011p26036M98793r58993n54287K427454
11897F100842K771226k75818p26872K474778J881661n015320q997328l475669
11889e262500L489226J440749n476277n507356J498725M853031J329619n45194
11881d179977L839498P470087M114972j801359l683552k714174k611113j698785
$$ plain form
11873 -1264403 756812 4599084 3884014 -2289570 -6205255 -2544297 3296809 3281443 -1655517
11864 -1655517 -4441960 -2845331 -517385 993341 3790213 7378332 8037496 5679203
11856 5679203 4864359 6913661 7058334 2415163 -2793204 -3914597 -2944080 -4244854 -7084553
11847 -7084553 -7642493 -5579156 -3196676 -149380 5285846 10789565 11774340 8759643
11839 8759643 7485105 10440482 13070588 10484662 4254274 181551 1746203 7486445
11831 7486445 12863078 13569133 9012996 3368876 1242678 2219853 2457294 1421031 2554012
11822 2554012 6050978 6228391 -313095 -7976052 -8559552 -2139492 3464003 3141404 -531896
11813 -531896 -3005862 -3664071 -4184111 -4523135 -3302557 -566806 2029426 3153579 2747825
$$ packed form
11873a264403K021215L842272p15070o173584l915685L660958N841106j5366m936960
11864a655517k786443J596629K327946J510726K796872L588119O59164k358293
11856E679203q14844K049302J44673m643171n208367j121393R70517j300774k839699
11847g084553n57940K063337K382480L047296N435226N503719R84775l014697
11839H759643j274538K955377K630106k585926o230388m072723J564652N740242
11831G486445N376633P06055m556137n644120k126198R77175K37441j036263J132981
11822B554012L496966J77413o541486p662957n83500O420060N603495l22599l673300
11813e31896k473966o58209n20040l39024J220578K735751K596232J124153m05754
$$ plain form
11804 2747825 1804798 1999053 4485989 8068721 9621122 7621045 4386672 3243951
11796 3243951 4112580 3903591 1267770 -1344697 -1282506 697303 2126490 2565561 3320022
11787 3320022 4401087 4657353 4786324 7012598 10941019 12850547 10749046 7279072
11779 7279072 5423788 4117660 1089381 -2449894 -3807233 -3681214 -4682863 -6144604
11771 -6144604 -5201209 -2557299 -1870563 -2984662 -1523752 3147326 5436586 2085714
11763 2085714 -2178660 -1945715 474687 -504938 -4129087 -4476709 35974 4346403 4152959
11754 4152959 687590 -2648451 -4274895 -4162862 -3153948 -3423064 -6389852 -9440150
11746 -9440150 -7995238 -1732134 4450966 6629011 5698276 3879480 1125481 -2710172
$$ packed form
11804B747825r43027J94255K486936L582732J552401k000077l234373j142721
11796C243951Q68629k08989k635821k612467O2191J979809J429187M39071P54461
11787C320022J081065K56266J28971K226274L928421J909528k101501l469974
11779G279072j855284j306128l028279l539275j357339J26019j001649j461741
11771f144604R43395K643910O86736j114099J460910M671078K289260l350872
11763B085714m264374K32945K420402r79625l624149l47622M512683M310429j93444
11754D152959l465369l336041j626444J12033J008914k69116k966788l050298
11746i440150J444912O263104O183100K178045r30735j818796k753999l835653
$$ plain form
11738 -2710172 -5368071 -5100430 -4211067 -6436637 -11413605 -14286409 -11017919 -2773680
11730 -2773680 5061557 7798074 5814613 4014671 5973442 9156313 8080422 2060888
11722 2060888 -3363694 -3808403 -1613666 -1799500 -5044645 -7725269 -7512384 -5957035 -5894636
11713 -5894636 -8351478 -11743273 -12853731 -9502501 -3488515 481812 282868 -902870
11705 -902870 795083 4622249 7223924 8116867 9430019 11129025 10689424 7858920 5875003
11696 5875003 6659897 7963923 7064637 4833591 3950768 4610919 4276937 1459398 -1714987
11687 -1714987 -1347679 3644782 9022191 8714469 1821801 -5526087 -7280189 -4740947
11679 -4740947 -3634551 -5405221 -6125768 -4125952 -3142964 -5558634 -7470425 -4642581
$$ packed form
11738b710172k657899K67641Q89363k225570m976968k872804L268490Q244239
11730b773680P835237K736517j983461j799942J958771L182871j075891o019534
11722B060888n424582m44709K194737j85834l245145k680624K12885J555349O2399
11713e894636k456842l391795j110458L351230O013986L970327j98944j185738
11705i02870J697953L827166K601675Q92943J313152J699006m39601k830504j983917
11696E875003P84894J304026q99286k231046q82823O60151l33982k817539l174385
11687a714987L67308M992461N377409l07722o892668p347888j754102K539242
11679d740947J106396j770670p20547J999816R82988k415670j911791K827844
$$ plain form
11671 -4642581 120652 643355 -3359208 -5995303 -4017830 -871573 -505037 -1412347 280615
11662 280615 4477437 7359408 7088227 6031593 6689874 7836533 6431875 2219752 -1662829
11653 -1662829 -2691573 -1645015 -418023 1103450 4067871 7442517 8169103 4891173
11645 4891173 -126168 -3230810 -2359907 1988086 6889822 8127178 3606219 -3626115
11637 -3626115 -7921669 -7247323 -4471972 -1963671 1356777 5614171 6805783 2215524
11629 2215524 -3795705 -4686691 -1280392 -816746 -6053528 -10924097 -9343914 -3608770
11621 -3608770 -229104 -627458 -729656 1424685 2607494 56219 -3445996 -2768865 2844885
11612 2844885 8851896 11039928 9905950 8618974 8367507 7562239 5021221 1843714
$$ packed form
11671d642581M763233N22703m002563k636095J977473L146257L66536r07310J692962
11662B80615M196822K881971k71181j056634O58281J146659j404658m212123l882581
11653a662829j028744J046558J226992J521473K964421L374646P26586l277930
11645D891173n017341l104642Q70903M347993M901736J237356m520959p232334
11637c626115m295554O74346K775351K508301L320448M257394J191612m590259
11629B215524o011229q90986L406299M63646n236782m870569J580183N735144
11621c608770L379666l98354j02198K154341J182809k551275l502215O77131N613750
11612B844885O007011K188032j133978j286976k51467q05268k541018l177507
$$ plain form
11604 1843714 -340546 -1354054 -1828034 -1780678 -823293 1030081 3423993 5577013 5713982
11595 5713982 2243932 -3411529 -6855206 -5229554 -433224 3630430 5317149 4830726
11587 4830726 1731106 -3754219 -8187377 -7824836 -4160833 -2637589 -4921743 -6278505
11579 -6278505 -2505855 3871050 7156493 5899885 3480133 2495639 2044646 844773
11571 844773 140711 1920378 5668575 8712221 9609745 9657413 10375628 10798516 8890131
11562 8890131 5063943 2035547 942002 248943 -462190 1198416 5847346 8997420
11554 8997420 6373541 945764 4463 5424541 11236729 11510981 6652850 866437
11546 866437 -2684417 -2534361 1613680 7656278 11772146 12287016 10975379 9600571 7860248
$$ packed form
11604A843714k184260j013508m73980M7356R57385J853374K393912K153020J36969
11595E713982l470050n655461l443677J625652M796330M063654J686719m86423
11587D830726l099620n485325m433158L62541L664003J523244k284154j356762
11579f278505L772650O376905L285443j256608k419752r84494m50993j199873
11571H44773p04062J779667L748197L043646Q97524M7668P18215M22888j908385
11562H890131l826188l028396j093545o93059p11133J660606M648930L150074
11554H997420k623879n427777r41301N420078N812188K74252m858131n786413
11546H66437l550854J50056M148041O042598M115868N14870j311637j374808j740323
$$ plain form
11537 7860248 5809885 5085030 6051359 6756194 6329096 6212024 6413065 4409012 53446
11528 53446 -2515387 -895816 1596727 1411430 138673 306575 107625 -2330939 -3308838
11519 -3308838 1148032 7032776 6695910 124390 -5266023 -5501903 -3533215 -1999597
11511 -1999597 -230123 676785 -2221478 -6653935 -5988912 -318530 1363665 -5211352
11503 -5211352 -11520879 -8417391 170281 3796393 875457 -1658782 -1138386 -1732247
11495 -1732247 -4665826 -5455956 -2856548 -2193548 -6210790 -9531735 -6933497 -1726007
11487 -1726007 -454136 -2984292 -3502966 726041 6812363 11312847 13018423 11103268
11479 11103268 5319618 -1214471 -3654103 -1448286 653277 -590121 -2310861 -388244
$$ packed form
11537G860248k050363p24855R66329P04835m27098j17072K01041k004053m355566
11528E3446k568833J619571K492543j85297j272757J67902j98950k438564r77899
11519c308838M456870N884744l36866o571520n390413k35880J968688J533618
11511a999597J769474R06908k898263m432457O65023N670382J682195o575017
11503e211352o309527L103488Q587672L626112k920936k534239N20396n93861
11495a732247k933579p90130K599408O63000m017242l320945K598238N207490
11487a726007J271871k530156n18674M229007O086322M500484J705576j915155
11479A1103268n783650o534089k439632K205817K101563j243398j720740J922617
$$ plain form
11471 -388244 3698092 4542075 364264 -4638983 -5828430 -3265192 -413846 270072 -797682
11462 -797682 -1756140 -1556123 -1107677 -2150720 -4434522 -5001298 -2072015 1261517 300859
11453 300859 -4278456 -6592923 -4102881 -1805780 -4651990 -9303463 -8417109 -1480484
11445 -1480484 4053229 2715872 -2583722 -5417512 -3322288 1236908 4322057 3221916
11437 3221916 -1698315 -6217666 -5693816 -700884 3268797 3089984 1845427 3222138
11429 3222138 5431611 4353895 501828 -1445388 580045 3423533 3073890 -1161145
11421 -1161145 -7093279 -11898384 -13601554 -12233465 -9761327 -7610025 -4924981 -938496
11413 -938496 2285420 2335038 822190 1563875 4176230 3466109 -3107816 -10568013 -11579550
$$ packed form
11471c88244M086336Q43983m177811n003247j189447K563238K851346O83918j067754
11462g97682r58458K00017M48446j043043k283802n66776K929283L333532r60658
11453C00859m579315k314467K490042K297101k846210m651473Q86354O936625
11445a480484N533713j337357n299594k833790K095224M559196L085149j100141
11437C221916m920231m519351N23850M992932L969681j78813j244557J376711
11429C222138K209473j077716l852067j947216K025433K843488l49643m235035
11421a161145n932134m805105j703170J368089K472138K151302K685044L986485
11413i38496L223916M9618j512848P41685K612355p10121o573925p460197j011537
$$ plain form
11404 -11579550 -4723675 4512538 9748139 8902706 4561936 1208571 1729741 5216893
11396 5216893 8229408 8679287 7669474 7057303 6722181 5479989 3359604 1231074 -935938
11387 -935938 -3469236 -5029551 -3358748 1517479 6364099 7905793 6198863 4216609
11379 4216609 4523447 6851690 8715652 7968002 4719207 1017864 -1109221 -1313962 -914479
11370 -914479 -1335804 -2321929 -1877426 1142213 4364212 3602051 -1544307 -5603390 -3258709
11361 -3258709 3567809 7832606 6360034 3098238 2708753 4886318 7031369 8771007
11353 8771007 10519592 10473728 7164872 3244350 2516372 4203145 4321779 2088920 338177
11344 338177 -443166 -3239924 -8142332 -9897134 -5068517 1993055 4246728 837338
$$ packed form
11404a1579550O855875R236213N235601q45433m340770l353365N21170L487152
11396E216893L012515M49879j009813o12171l35122j242192k120385k128530k167012
11387i35938k533298j560315J670803M876227M846620J541694j706930j982254
11379D216609L06838K328243J863962p47650l248795l701343k127085k04741L99483
11370i14479m21325r86125M44503L019639L221999p62161n146358m059083K344681
11361c258709O826518M264797j472572l261796l89485K177565K145051J739638
11353H771007J748585m5864l308856l920522p27978J686773J18634k232859j750743
11344C38177p81343k796758m902408j754802M828617P061572K253673l409390
$$ plain form
11336 837338 -2875082 -2829603 -130134 2152197 2616164 1491540 -337069 -1293964 26555
11327 26555 2930534 4804870 4132746 2462436 2524195 4902948 7413639 7727088 5908170
11318 5908170 3832330 2405730 479807 -2843196 -5860208 -5690306 -1741176 3608955
11310 3608955 7525169 8507962 6357702 2650909 906484 3240227 6546882 5575257
11302 5575257 827655 -870728 3873723 9109209 7652771 1576889 -1187680 1254740
11294 1254740 2930210 80912 -3523320 -3287271 -141953 2770375 4907563 6067211
11286 6067211 3591084 -3159792 -8402355 -5755800 2497220 7379994 4740729 -178127
11278 -178127 -1004914 1568503 2581441 335786 -2413969 -2973125 -1190806 1567694 3173614
$$ packed form
11336H37338l712420M5479K699469K282331M63967j124624j828609r56895J320519
11327B6555K903979J874336o72124j670310O1759K378753K510691L13449j818918
11318E908170k075840j426600j925923l323003l017012J69902L949130N350131
11310C608955L916214R82793k150260l706793j744425K333743L306655r71625
11302E575257m747602j698383M744451N235486j456438o075882k764569K442420
11294A254740J675470k849298l604232K36049L145318K912328K137188J159648
11286F067211k476127o750876n242563K646555Q253020M882774k639265m918856
11278a78127q26787K573417J012938k245655k749755n59156J782319K758500J605920
$$ plain form
11269 3173614 1301625 -3949585 -8609714 -8966002 -6674147 -6292295 -7897398 -6700036
11261 -6700036 -1231898 3057805 1461111 -3063563 -4954714 -4407456 -5111552 -6314566
11253 -6314566 -4093371 219132 273126 -5368239 -10315125 -9805427 -6809580 -5341391 -3724691
11244 -3724691 617935 4620304 3772600 -201746 -1489580 1887077 6992068 10947298
11236 10947298 12570545 11051891 7538325 6116251 8623625 10553569 7112074 1260103
11228 1260103 33325 4440578 9048730 10474970 9993285 8438377 5196681 2207295
11220 2207295 2310686 3324266 486214 -4835853 -6291701 -3411330 -3185281 -8354197
11212 -8354197 -12252496 -9356311 -3714923 -1819711 -3111162 -3046192 -816218 1308283
$$ packed form
11269C173614j871989n251210m660129l56288K291855L81852j605103J197362
11261f700036N468138M289703j596694m524674j891151N47258p04096j203014
11253f314566K221195M312503N3994n641365m946886N09698K995847J468189J616700
11244c724691M342626M002369q47704l974346j287834L376657N104991L955230
11236A0947298J623247j518654l513566j422074K507374J929944l441495n851971
11228A260103j226778M407253M608152J426240m81685j554908l241696k989386
11220B207295J03391J013580k838052n322067j455848K880371K26049n168916
11212h354197l898299K896185N641388J895212j291451O4970K229974K124501
$$ plain form
11204 1308283 2611157 3367217 2909986 1805706 2369502 4160801 3496814 388406 449035
11195 449035 6064963 11380699 10647898 5995782 2132594 -618989 -2574363 -715142
11187 -715142 4558086 5185914 -3567795 -13453110 -13889019 -7431087 -4269618 -5355271 -2915030
11178 -2915030 4147313 7826484 4655269 523574 -17187 838541 1676600 4989883 9667427
11169 9667427 9547936 3432189 -1605462 -1007892 767850 -1115524 -4016311 -3688653 -1830875
11160 -1830875 -2405403 -5149234 -7280758 -7632739 -5777388 -1497924 2165633 596167
11152 596167 -4917659 -7195685 -3536430 570958 1481311 3294684 8559307 11146365
11144 11146365 5907394 -1251079 -1715571 2481510 2929351 -1255549 -3501107 -1621291
$$ packed form
11204A308283J302874P56060m57231j104280N63796J791299o63987l108408O0629
11195D49035N615928N315736p32801m652116l863188k751583j955374J859221
11187g15142N273228O27828q753709r885315m35909O457932L161469j085653K440241
11178b915030P062343L679171l171215m131695n40761Q55728Q38059L313283M677544
11169I667427j19491o115747n037651N97570J775742j883374k900787L27658J857778
11160a830875n74528k743831k131524l51981J855351M279464L663557j569466
11152E96167n513826k278026L659255M107388R10353J813373N264623K587058
11144A1146365n238971p158473m64492M197081M47841m184900k245558J879816
$$ plain form
11136 -1621291 130628 260601 1931885 4873739 4207502 -418820 -2330224 2167801
11128 2167801 7716700 7895345 4287050 3117567 6209909 9658808 9878521 7419389
11120 7419389 5022928 4007356 3048488 244207 -3687946 -5358289 -2962826 765866
11112 765866 1821626 -107376 -2282374 -3149815 -2946609 -1358565 1637374 3249644 429682
11103 429682 -4808110 -6693623 -3110377 2038512 4701892 4948774 4080578 1720360 -1811464
11094 -1811464 -3806179 -2872221 -1677888 -3071141 -5717324 -6538400 -5442358 -4393273
11086 -4393273 -3427441 -1139726 1869524 3601580 4208933 5370822 6235306 3835410 -1737425
11077 -1737425 -6375090 -7621283 -7570093 -7808300 -5317738 2413489 10689616 11437241 3694388
$$ packed form
11136a621291J751919J29973J671284K941854o66237m626322j911404M498025
11128B167801N548899J78645l608295j169483L092342L448899K19713k459132
11120G419389k396461j015572r58868k804281l932153j670343K395463L728692
11112G65866J055760j929002k174998q67441K03206J588044K995939J612270k819962
11103D29682n237792j885513L583246N148889K663380K46882q68196k360218l531824
11094a811464j994715R33958J194333j393253k646183q21076J096042J049085
11086d393273R65832K287715L009250J732056O07353J161889Q64484k399896n572835
11077a737425m637665j246193N1190k38207K490562P731227Q276127P47625p742853
$$ plain form
11068 3694388 -4429772 -5460946 -395943 4698036 6189219 4521556 1465153 -1036666
11060 -1036666 -1187057 608098 1591015 1061852 2708587 9118296 16079839 16996219 11994162
11051 11994162 7561863 6982193 6422413 2100176 -3516327 -5584978 -3518193 -614420
11043 -614420 584068 -233834 -2466082 -4743956 -5080368 -3136268 -1259814 -1416441 -2381650
11034 -2381650 -2013182 -1080235 -2314568 -6014004 -8885873 -7781526 -3196892 1643790
11026 1643790 4470548 5781703 6798983 6807176 4434341 1388936 1729502 5748995 7988514
11017 7988514 4759279 641086 2469033 8882514 12132212 9630567 6654220 6668323
11009 6668323 6457328 3666748 1995013 4202379 5912783 2260384 -3541495 -4380472
$$ packed form
11068C694388q124160j031174N065003N093979J491183j667663l056403k501819
11060a036666j50391J795155R82917n29163J646735O409709O961543R16380n002057
11051A1994162m432299n79670n59780m322237n616503k068651K066785K903773
11043f14420J198488q17902k232248k277874l36412J944100J876454j56627r65209
11034b381650L68468R32947j234333l699436k871869J104347M584634M840682
11026A643790K826758J311155J017280Q193k372835l045405L40566M019493K239519
11017G988514l229235m118193J827947O413481L249698k501645k976347J4103
11009F668323k10995k790580j671735K207366J710404l652399n801879q38977
$$ plain form
11001 -4380472 705145 6136975 7545107 5169264 1316112 -1156145 497461 5607283
10993 5607283 9122633 7698498 4532844 4165347 5260739 3592693 -263945 -2115018
10985 -2115018 -1486125 -1727758 -3475244 -3861447 -2174527 -819963 -457455 626845 2073616
10976 2073616 1561852 -259535 -147157 1865657 2185479 -24975 -1552744 -1038008 -586602
10967 -586602 -317066 2545870 7048245 7384286 1822803 -3122912 -1918377 1657025 635091
10958 635091 -4795175 -8924933 -9504064 -8749119 -7050151 -2355172 3866125 6050600 1936131
10949 1936131 -3826739 -5879598 -4679936 -4121311 -5228772 -5685594 -4429036 -3029235
10941 -3029235 -2245211 -629487 2023692 2993569 1045045 -265937 2088406 3962311
$$ packed form
11001d380472N085617N431830J408132k375843l853152k472257J653606N109822
10993E607283L515350j424135l165654l67497J095392j668046l856638j851073
10985b115018O28893k41633j747486l86203J686920J354564L62508J084300J446771
10976B073616n11764j821387J12378K012814L19822k210454j527769N14736M51406
10967e86602K69536K862936M502375L36041n561483m945715J204535L575402j021934
10958F35091n430266m129758n79131P54945J698968M694979O221297K184475m114469
10949A936131n762870k052859J199662N58625j107461m56822J256558J399801
10941c029235P84024J615724K653179R69877j948524j310982K354343J873905
$$ plain form
10933 3962311 -1117722 -10356092 -12413779 -2965471 7604635 8068229 2018555 1278749
10925 1278749 7527381 10932515 6555832 1293521 1654439 4276803 3864256 2660180
10917 2660180 5005285 8080776 5964799 -137542 -3226649 -917048 2080772 1926579
10909 1926579 350519 356697 1950424 3886686 6165229 8801930 10446227 9970926 7992534
10900 7992534 5598727 2713228 -1166865 -5234287 -7333201 -5929172 -2157423 484161
10892 484161 -509471 -3395814 -3515247 1459339 8636537 12874304 11578791 6196913 515952
10883 515952 -1870606 -199994 2382205 2088087 -436712 -678677 3005693 6367572 5313906
10874 5313906 1906645 739171 1613489 317174 -4202544 -7885993 -7017914 -2009983
$$ packed form
10933C962311n080033r238370k057687R448308J0570106M63594o049674p39806
10925A278749O248632L405134m376683n262311L60918K622364m12547j204076
10917B660180K345105L075491k115977o102341l089107K309601K997820j54193
10909A926579j576060O178J593727J936262K278543K636701J644297m75301j978392
10900G992534k393807k885499l880093m067422k098914J404029L771749K641584
10892D84161r93632k886343j19433M974586P177198M237767j295513n381878n680961
10883E15952k386558J670612K582199k94118k524799k41965L684370L361879j053666
10874E313906l407261j167474Q74318j296315m519718l683449Q68079N007931
$$ plain form
10866 -2009983 4525908 9924199 11337841 7455453 1581224 -694306 1372672 2372245
10858 2372245 -1256168 -5486586 -4298891 1788216 6934084 8174338 8041607 9338275
10850 9338275 11432134 12495691 11998239 9821155 5955031 2588184 3523550 9117339
10842 9117339 14034083 12994433 7522959 4016389 5677947 9460981 11251820 10867553
10834 10867553 10309670 9536697 6796702 2480412 -116111 1135228 3925465 3920065 79120
10825 79120 -3976417 -4370490 -1367102 1795210 3286579 3856589 4146259 3621427 2805333
10816 2805333 3596845 5539266 4448588 -2264125 -10612750 -13781780 -10060588 -3759761
10808 -3759761 1199590 4724279 7287638 7517964 5057800 2708205 3111402 5126129
$$ packed form
10866b009983O535891N398291J413642l882388n874229k275530K066978R99573
10858B372245l628413m230418J187695O087107N145868J240254j32731J296668
10850I338275K093859J063557m97452k177084l866124l366847R35366N593789
10842I117339M916744j039650n471474l506570J661558L783034J790839l84267
10834A0867553n57883p72973k739995m316290k596523J251339K790237n400l840945
10825G9120m055537l94073L003388L162312J491369N70010K89670n24832q16094
10816B805333P91512J942421j090678o712713q348625l169030L721192O300827
10808c759761M959351L524689K563359K30326k460164k349595M03197K014727
$$ plain form
10800 5126129 5747722 4297600 2566953 1560613 72929 -3355701 -8030611 -11007824
10792 -11007824 -9669371 -4773217 -259613 903043 -260640 -1140327 -1366108 -1815348
10784 -1815348 -1387681 1575978 5419558 6814950 6068488 6361186 7604102 6275378 2374032
10775 2374032 750339 3167322 4756112 2022314 -825765 1586016 6962257 8495414
10767 8495414 4302712 -1364223 -4576458 -4751108 -2461878 1538376 5700988 9147811
10759 9147811 12694562 16082737 16501286 12868408 8925703 8350996 9310954 7998116 5092732
10750 5092732 3916622 4215855 3109063 952516 781891 2316056 1765030 -1952750 -5309329
10741 -5309329 -5277157 -2744401 -255155 610471 -613033 -2943347 -3784798 -1590238 1695683
$$ packed form
10800E126129O21593j450122j730647j006340j487684l428630m674910k977213
10792a1007824J338453M896154M513604J162656j163683q79687k25781m49240
10784a815348M27667K963659L843580J395392p46462K92698J242916j328724l901346
10775B374032j623693K416983J588790k733798k848079K411781N376241J533157
10767H495414m192702n666935l212235j74650K289230M000254M162612L446823
10759I147811L546751L388175M18549l632878l942705n74707R59958j312838k905384
10750E092732j176110K99233j106792k156547j70625J534165n51026l717780l356579
10741e309329L2172K532756K489246Q65626j223504k330314q41451K194560L285921
$$ plain form
10732 1695683 3136921 2848416 3155278 4914516 7156605 9033599 9774884 8476102 6225004
10723 6225004 6043413 8249609 9004708 6442033 4396467 6057894 8004903 5709484
10715 5709484 1299628 -101969 1243368 1223155 -633137 -1384750 -402490 871193 2633512
10706 2633512 4739324 4049852 -453197 -3762920 -2575256 -2111283 -7128748 -11383797
10698 -11383797 -6421303 3596149 7917362 6582035 8028605 11469016 7492985 -2911793
10690 -2911793 -6477784 1149145 8023997 6005275 3328549 8336975 14097155 10571130
10682 10571130 1784260 -1290788 2316668 5301922 5536240 6908513 9885880 10759977
10674 10759977 8875106 7478090 8590071 11913347 16398901 18960698 15477990 7248968
$$ packed form
10732A695683J441238k88505L06862J759238K242089J876994P41285j298782k251098
10723F225004j81591K206196P55099k562675k045566J661427J947009k295419
10715E709484m409856j401597J345337k0213j856292p51613R82260J273683J762319
10706B633512K105812o89472m503049l309723J187664M63973n017465m255049
10698a1383797M962494J0017452M321213j335327J446570L440411l976031j0404778
10690b911793l565991P626929O874852k018722k676726N008426N760180l526025
10682A0571130q786870l075048L607456K985254K34318J372273K977367Q74097
10674A0759977j884871j397016J111981L323276M485554K561797l482708q229022
$$ plain form
10666 7248968 2005761 4094167 8395023 8522520 5743716 4530900 4586453 3365370 2101763
10657 2101763 3343172 6048206 7997870 9150175 8561662 3268717 -5162796 -9005743
10649 -9005743 -4837708 425123 80351 -2157723 195533 4701988 4789249 1603053 1756423
10640 1756423 6073186 9201976 8727689 7197089 6516102 6730839 8581372 11533228 11756211
10631 11756211 7617758 3909211 4704179 5992560 2345109 -3083965 -3312823 858036
10623 858036 2680406 865986 386896 2785317 4084310 2433819 257011 -1676995
10615 -1676995 -5274356 -9304068 -8998986 -3093507 3738310 6927159 6766611 6460459 8411771
10606 8411771 12366891 14935213 12261006 5490213 1179257 3393172 8294506 9863190
$$ packed form
10666G248968n243207K088406M300856J27497k778804j212816N5553j221083j263607
10657B101763J241409K705034J949664J152305n88513n292945q431513l842947
10649i005743M168035N262831l44772k238074K353256M506455Q7261l186196J53370
10640A756423M316763L128790m74287j530600o80987K14737J850533K951856K22983
10631A1756211m138453l708547P94968J288381l647451n429074k28858M170859
10623H58036J822370j814420m79090K398421J298993j650491k176808j934006
10615a676995l597361m029712L05082N905479O831817L188849j60548l06152J951312
10606H411771L955120K568322k674207o770793m310956K213915M901334J568684
$$ plain form
10598 9863190 7660865 5109953 3638228 3040500 4402658 7830720 9861906 7476985
10590 7476985 2342413 -2241992 -5397333 -6707888 -4525500 370618 4045782 5498233
10582 5498233 7893413 10647220 7779829 -1089499 -6356038 -1820724 5144370 4697161
10574 4697161 -1119526 -3668729 -1099115 2619652 6573156 11597758 14637772 13021314
10566 13021314 10208440 9777045 8838291 4819605 2412634 5488007 8962730 7803543
10558 7803543 6831055 11414182 15898589 12881713 7157631 7907350 12867450 12982441 7642492
10549 7642492 2847548 -607875 -4706442 -5569079 -48828 4912458 2744552 514232
10541 514232 7352023 16601092 15847879 8533094 7693892 13087185 13343842 7443234 4900286
$$ packed form
10598I863190k202325k550912j471725n97728J362158L428062K031186k384921
10590G476985n134572m584405l155341j310555K182388M896118L675164J452451
10582E498233K395180K753807k867391q869328n266539M535314O965094m47209
10574D697161n816687k549203K569614L718767L953504N024602L040014j616458
10566A3021314k812874m31395r38754m018686k406971L075373L474723j159187
10558G803543r72488M583127M484407l016876n724082P49719M960100J14991n339949
10549G642492m794944l455423m098567q62637N520251M961286k167906k230320
10541E14232O837791R249069p53213p314785q39202N393293K56657n900608k542948
$$ plain form
10532 4900286 6763877 5543808 2779603 7562168 17824135 21744693 18075802 17071835
10524 17071835 21055592 22017608 18653790 17807052 18907704 14929018 8560242 9373204
10516 9373204 15663368 17353499 15214675 18116115 23799943 22717310 17715033 18541933
10508 18541933 21354594 16792041 12091053 18977506 27269188 20872796 11547499 21126532
10500 21126532 38464026 36032900 22629695 30552532 53959169 56606578 41860675
10493 41860675 49860741 78367460 84029101 80620621 141374812 255572374 280277404
10486 280277404 122283845 -103521568 -202824390 -144572947 -65440198 -58150123 -77111114
10479 -77111114 -62038393 -36899056 -41365744 -53489995 -38701293 -15191559 -16390387
$$ packed form
10532D900286J863591j220069k764205M782565J0261967L920558l668891j003967
10524A7071835L983757R62016l363818q46738J100652l978686o368776Q12962
10516I373204O290164J690131k138824K901440N683828j082633n002277Q26900
10508A8541933K812661m562553m700988O886453Q291682o396392r325297R579033
10500B1126532J7337494k431126j3403205P922837K3406637K647409j4745903
10493D1860675Q000066K8506719N661641l408480O0754191J14197562K4705030
10486B80277404j57993559k25805413r9302822N8251443P9132749P290075j8960991
10479g7111114J5072721K5139337m466688j2124251J4788702K3509734j198828
$$ plain form
10472 -16390387 -32163551 -34861831 -29129033 -33124532 -38812730 -30040648 -16740085 -16117821
10464 -16117821 -20182976 -13770923 -5815220 -11935025 -22825179 -20094434 -9560372 -9901446
10456 -9901446 -19314483 -20714652 -11858188 -5574852 -6163054 -7148881 -7175901 -9247363 -9548116
10447 -9548116 -3770242 1325255 -2171721 -8639127 -8490810 -4737745 -5659252 -8922034
10439 -8922034 -7580239 -4210610 -4628010 -5096585 -267852 3531014 -2308575 -12568153
10431 -12568153 -15801661 -12011464 -9209091 -8699022 -7415636 -8497277 -15333405 -20755068
10423 -20755068 -16315732 -7304579 -4731566 -7390002 -6094571 -1307570 -1684923 -7777285
10415 -7777285 -11333764 -9547287 -7479378 -7308234 -6205342 -3594360 -857672 3591555
$$ packed form
10472a6390387j5773164k698280N732798l995499n688198Q772082J3300563O22264
10464a6117821m065155O412053P955703o119805j0890154K730745J0534062l41074
10456i901446r413037j400169Q856464O283336n88202r85827k7020k071462l00753
10447i548116N777874N095497l496976o467406J48317L753065r21507l262782
10439h922034J341795L369629m17400m68575M828733L798866n839589j0259578
10431a2568153l233508L790197K802373N10069J283386j081641o836128n421663
10423b0755068M439336R011153K573013k658436J295431M787001l77353o092362
10415g777285l556479J786477K067909J71144J102892K610982K736688M449227
$$ plain form
10407 3591555 9693463 10437853 1514464 -8393290 -8449712 -2416748 -2158814 -8254168 -10640552
10398 -10640552 -6369782 -2963307 -4409107 -6474825 -6562444 -6851500 -6861521 -3296428 2004141
10389 2004141 3491622 1483785 1288125 3262751 2938116 282980 -569348 -26512 -1917919
10380 -1917919 -4610495 -3130325 709721 649665 -2105690 -176999 6522150 9519463
10372 9519463 5178248 -915478 -4312872 -6457965 -7746540 -6036964 -3905787 -7178445
10364 -7178445 -13871201 -14712069 -7578240 -1408813 -2196897 -4938250 -3921061 -1530307
10356 -1530307 -1244311 -282829 4318696 8909694 8714427 5046905 1860055 -351666 -2651066
10347 -2651066 -3879253 -2980406 -1626837 -1327007 -1233843 -913905 -1362516 -1692901 493812
$$ packed form
10407C591555O101908P44390q923389r907754n6422O032964K57934o095354k386384
10398a0640552M270770L406475j445800k065718q7619k89056j0021L565093N300569
10389B004141J487481k007837j95660J974626l24635k655136q52328N42836j891407
10380a917919k692576J480170L840046o0056k755355J928691O699149K997313
10372I519463m341215o093726l397394k145093j288575J709576K131177l272658
10364g178445o692756q40868P133829O169427p88084k741353J017189K390754
10356a530307K85996R61482M601525M590998j95267l667522l186850k211721k299400
10347b651066j228187Q98847J353569K99830R3164L19938m48611l30385K186713
$$ plain form
10338 493812 3887480 3922863 273066 -1798186 241870 2494951 1909152 1040019 2075994
10329 2075994 2142446 -1087522 -4291589 -3553446 -96274 3195798 6504116 9925112 10037616
10320 10037616 4818940 -1377846 -2819315 207503 3371811 4919201 5682943 4972560
10312 4972560 1610306 -2241184 -2947473 -513659 1923008 2985132 3883138 5011612
10304 5011612 5332851 5025473 5443502 6158310 4998772 1761796 -616522 147468 2382485
10295 2382485 2465529 -516572 -3514058 -3271506 -358100 1795252 1606297 1045501 1700938
10286 1700938 1472669 -2267483 -7646508 -9752645 -7022427 -3203547 -2466500 -5030109
10278 -5030109 -8199494 -9443230 -7673201 -3427032 1319779 4707563 6515155 7113319
$$ packed form
10338D93812L393668L5383l649797k071252K040056K253081n85799q69133J035975
10329B075994O6452l229968l204067P38143L457172L292072L308318L420996J12504
10320A0037616n218676o196786j441469L026818L164308J547390P63742p10383
10312D972560l362254l851490p06289K433814K436667J062124Q98006J128474
10304E011612L21239l07378M18029P14808j159538l236976k378318P63990K235017
10295B382485Q3044k982101k997486K42552K913406K153352j88955n60796O55437
10286A700938k28269l740152n379025k106137K730218L818880P37047k563609
10278e030109l169385j243736J770029M246169M746811L387784J807592N98164
$$ plain form
10270 7113319 5853127 2552820 -393838 -346836 1474003 1337443 -1435512 -3439610 -2239494
10261 -2239494 658346 2771087 3597088 3350200 1496043 -1624576 -3626457 -2348120
10253 -2348120 1628312 5628721 7256619 5933708 3181127 1322606 892472 45690
10245 45690 -2159185 -3515337 -2231765 -1043922 -3747784 -8249741 -7836230 -355151 8186036
10236 8186036 11131770 8690847 5531194 3957640 2685768 616639 -1413198 -2303839
10228 -2303839 -1925039 -642989 1019249 2279607 2686527 2875737 3950420 5794078 6535619
10219 6535619 4521668 921647 -915164 180102 915660 -1975296 -6095157 -6053374 -1657491
10210 -1657491 1459913 709842 503811 4258022 7981939 6857430 3564365 3617043 5733562
$$ packed form
10270G113319j260192l300307k946658M7002J820839j36560k772955k004098J200116
10261b239494K897840K112741Q26001k46888j854157l120619k001881J278337
10253b348120L976432M000409J627898j322911k752581j858521m30134q46782
10245D5690k204875j356152J283572J187843k703862m501957M13511P481079Q541187
10236H186036K945734k440923l159653j573554j271872k069129k029837q90641
10228b303839L78800J282050J662238J260358M06920J89210J074683J843658P41541
10219F535619k013951l600021j836811J095266P35558k890956m119861M1783M395883
10210a657491L117404p50071k06031L754211L723917j124509l293065N2678K116519
$$ plain form
10201 5733562 4170645 -1099165 -4104349 -2574611 -843445 -2110996 -4037186 -3585938
10193 -3585938 -1022964 2266945 5162013 5090153 14964 -6767775 -9004906 -6036482
10185 -6036482 -3797981 -5723237 -8118861 -6929680 -3850532 -2560410 -3272457 -4336995
10177 -4336995 -5646136 -7324716 -8056650 -7424495 -7280400 -8680473 -10085016 -10208938 -9787363
10168 -9787363 -9219576 -7666082 -5630424 -4933555 -5126496 -3793325 -1196215 -62402 13603
10159 13603 2318431 5715535 4136667 -3670200 -10314325 -9858616 -5999509 -5445460 -8432735
10150 -8432735 -11008689 -11750179 -10505561 -5256456 3189835 7622156 3067560 -4067450
10142 -4067450 -3462619 4434405 9426602 6545818 1488024 82887 649758 22157 213150
$$ packed form
10201E733562j562917n269810l005184J529738J731166j267551j926190M51248
10193c585938K562974L289909K895068p1860n075189o782739k237131K968424
10185f036482K238501j925256k395624J189181L079148J290122p12047j064538
10177d336995j309141j678580p31934O32155J44095j400073j404543j23922M21575
10168i787363N67787J553494K035658O96869j92941J333171K597110J133813P6005
10159A3603K304828L397104j578868p806867o644125M55709L859107N54049k987275
10150h432735k575954p41490J244618N249105Q446291M432321m554596p135010
10142d067450O04831P897024M992197k880784n057794j405137N66871o27601J90993
$$ plain form
10133 213150 4061909 8686886 8755028 4451302 1543431 3491786 6955656 6607150 2513339
10124 2513339 178044 2925127 6902589 6305853 1904073 -83385 2315291 3724775
10116 3724775 274017 -3957111 -3760485 -1496245 -2885764 -7124087 -8273537 -5431577
10108 -5431577 -4195609 -7087961 -9221196 -6070826 -185346 3278242 3671868 3747036 4316239
10099 4316239 4004358 2769982 1954587 1274070 -1036027 -4698816 -6703233 -5351130 -3078857
10090 -3078857 -3316764 -5534103 -6003191 -3796180 -2943418 -6274472 -9553523 -6136838 2884409
10081 2884409 8267384 4364815 -3023571 -4220123 1872114 7540480 7245335 3803430
10073 3803430 2590724 3580900 2090598 -3957298 -10464820 -11922352 -8419899 -5669485
$$ packed form
10133B13150L848759M624977O8142m303726k907871J948355L463870l48506m093811
10124B513339k335295K747083L977462n96736m401780j987458K398676J409484
10116C724775l450758m231128J96626K264240j389519m238323j149450K841960
10108e431577J235968k892352k133235L150370N885480L463588L93626P5168N69203
10099D316239l11881j234376q15395o80517k310097l662789k004417J352103K272273
10090c078857k37907k217339m69088K207011Q52762l331054l279051L416685R021247
10081B884409N382975l902569p388386j196552O092237N668366k95145l441905
10073C803430j212706R90176j490302o047896o507522j457532L502453K750414
$$ plain form
10065 -5669485 -7509343 -10972297 -11211399 -9002544 -8946577 -11236733 -11049617 -7164346 -5008640
10056 -5008640 -7980408 -11230345 -8778662 -2609379 708631 -525837 -2535140 -2762826
10048 -2762826 -1848583 -443832 899225 13262 -3821034 -6669111 -5068352 -2625758
10040 -2625758 -5214326 -10782064 -11326223 -5201154 351300 652152 -215996 2033010 4439241
10031 4439241 3034373 656859 2161595 5671132 5266337 480575 -3188420 -2983243
10023 -2983243 -2636539 -6265842 -12588897 -17207443 -18237062 -17533968 -17137446 -16260443 -12680799
10014 -12680799 -6742587 -2224694 -1723612 -2621404 -574295 3690547 5153343 2602388
10006 2602388 1077319 3840719 6630191 4118917 -1552535 -4098101 -2639619 -1832163
$$ packed form
10065e669485j839858l462954k39102K208855N5967k290156J87116L885271K155706
10056e008640k971768l249937K451683O169283L318010j234468k009303k27686
10048b762826R14243J404751J343057q85963l834296k848077J600759K442594
10040b625758k588568n567738n44159O125069N552454L00852q68148K249006K406231
10031D439241j404868k377514J504736L509537m04795m785762l668995K05177
10023b983243L46704l629303o323055m618546j029619P03094L96522Q77003L579644
10014a2680799N938212M517893N01082q97792K047109M264842J462796k550955
10006B602388j525069K763400K789472k511274n671452k545566J458482Q07456
$$ plain form
9998 -1832163 -3263253 -3283608 -418821 1418706 -125571 -1302492 1155816 3559475 963376
9989 963376 -3912530 -4276014 -435318 187092 -4800108 -8278945 -4890994 86665 -788311
9980 -788311 -4963671 -4322573 921784 2173554 -3184150 -6699668 -1783411 6125448 8146005
9971 8146005 4846374 3426596 5722353 6789604 4202916 1516177 1775809 3396882
9963 3396882 3840208 2792095 505005 -2839515 -5045063 -3340244 956436 3531153
9955 3531153 4150089 7606795 14999487 19159988 13459008 1908474 -4803531 -2048185
9947 -2048185 4690536 8224452 7659552 6727066 7423481 7818926 5322135 408581 -3472194
9938 -3472194 -3627175 -1276767 -105164 -1692828 -3827951 -3947287 -2522801 -1483209 -600152
$$ packed form
9998a832163j431090k0355K864787J837527j544277j176921K458308K403659k596099
9989I63376m875906l63484L840696O22410m987200l478837L387951M977659q74976
9980g88311m175360O41098N244357J251770n357704l515518M916257P908859K020557
9971H146005l299631j419778K295757J067251k586688k686739K59632J621073
9963C396882M43326j048113k287090l344520k205548J704819M296680K574717
9955C531153O18936L456706P392692M160501n700980j1550534o712005K755346
9947b048185O738721L533916n64900r32486O96415L95445k496791m913554l880775
9938c472194j54981K350408J171603j587664k135123j19336J424486J039592Q83057
$$ plain form
9929 -600152 2160406 6788809 10031987 9126549 5342479 2217398 788816 -1392059 -5737844
9920 -5737844 -9057490 -6878175 249249 6543088 7581243 4433875 386610 -3136969
9912 -3136969 -5457430 -5079991 -2718112 -2845986 -7768645 -12491618 -10729374 -4295034 -465319
9903 -465319 -1039917 -1135942 939621 746973 -3108449 -5033609 -2072863 -106453 -4332559
9894 -4332559 -9673521 -8069351 -841167 4215363 4969277 5748885 7671791 6957828 3156226
9885 3156226 928060 2049205 2794418 1335566 896560 2794551 2992177 -652490 -3856588
9876 -3856588 -3292710 -2637099 -4965431 -3985800 8530980 28080788 38928020 32352782
9868 32352782 16948560 7293972 7182247 8819597 5800291 780850 -572541 1661057
$$ packed form
9929f00152K760558M628403L243178r05438l784070l125081j428582k180875m345785
9920e737844l319646K179315P127424O293839J038155l147368m047265l523579
9912c136969k320461L77439K361879j27874m922659m722973J762244O434340L829715
9903d65319n74598r6025K075563j92648l855422j925160K960746J966410m226106
9894d332559n340962J604170P228184N056530P53914P79608J922906p13963l801602
9885C156226k228166J121145P45213j458852m39006J897991J97626l644667l204098
9876c856588N63878O55611k328332R79631J2516780J9549808J0847232o575238
9868C2352782j5404222r654588j11725J637350l019306n019441j353391K233598
$$ plain form
9860 1661057 2721630 1054292 610609 4300699 8840389 9073024 5332748 2743219 3756980
9851 3756980 5285446 4005409 1005469 -625926 -147997 1075629 2258053 3423465
9843 3423465 4151821 3883789 2693585 778552 -1588149 -3019965 -2079050 -337772 -1594862
9834 -1594862 -6333142 -10061210 -9730768 -8483708 -10191175 -12271263 -9263017 -1959962
9826 -1959962 2894946 1931941 -1383962 -3203245 -3582539 -2909179 149652 4297842 4408305
9817 4408305 -1455617 -7955882 -9482853 -7474446 -6246075 -5271184 -1583324 2605803
9809 2605803 1641482 -4529562 -9381198 -8781889 -5424794 -2953649 -1117344 858651 1050454
9800 1050454 -1525695 -3769431 -2668853 183030 1724434 2458552 4392406 6022232
$$ packed form
9860A661057J060573j667338m43683L690090M539690K32635l740276k589529J013761
9851C756980J528466j280037k999940j631395M77929J223626J182424J165412
9843C423465P28356k68032j190204j915033k366701j431816R40915J741278j257090
9834a594862m738280l728068L30442J247060j707467k080088L008246P303055
9826a959962M854908r63005l315903j819283l79294O73360L058831M148190J10463
9817D408305n863922o500265j526971K008407J228371R74891L687860M189127
9809B605803r64321o171044m851636N99309L357095K471145J836305J975995J91803
9800A050454k576149k243736J100578K851883J541404P34118J933854J629826
$$ plain form
9792 6022232 4052442 -552175 -2709149 43894 4573336 6874937 6648031 5738049 4696486
9783 4696486 3029423 1310175 841934 1643045 2379895 2448748 3008198 5182715 7505071
9774 7505071 6349468 211074 -6828605 -8186255 -2449188 4176984 5321714 2579301
9766 2579301 2736898 7562773 10752288 6464313 -2855359 -9962660 -11527920 -9893808
9758 -9893808 -7604390 -4294691 519071 4961351 6849457 6295365 4671883 2432540
9750 2432540 -364871 -2527541 -2821004 -2141292 -2449126 -3432913 -2501392 1029259 3930150
9741 3930150 3072637 -60563 -1232385 936839 3802179 5046658 5406932 6269271 7211853
9732 7211853 7606549 8509171 10613240 11685474 8760633 2655048 -2019837 -1825167 2034116
$$ packed form
9792F022232j969790m604617k156974K753043M529442K301601k26906r09982j041563
9783D696486j667063j719248m68241Q01111P36850O8853N59450K174517K322356
9774G505071j155603o138394p039679j357650N737067O626172J144730k742413
9766B579301J57597M825875L189515m287975r319672p107301j565260J634112
9758i893808K289418L309699M813762M442280J888106n54092j623482k239343
9750B432540k797411k162670k93463O79712l07834r83787R31521L530651K900891
9741C930150q57513l133200j171822K169224K865340J244479L60274Q62339R42582
9732G211853L94696R02622K104069J072234k924841o105585m674885J94670L859283
$$ plain form
9723 2034116 5653830 6678772 6030984 6048847 7493954 8684662 7961249 6534140 7295173
9714 7295173 10433399 12283458 9871961 4726030 269896 -2733788 -5527788 -7676925
9706 -7676925 -7484506 -5536585 -4303845 -4083477 -2855099 -837046 -1432225 -5780168 -9493534
9697 -9493534 -7670565 -1534856 2594159 551759 -5203870 -8463848 -5838555 -257548
9689 -257548 2414562 372086 -2136514 -1173338 978241 -199426 -3457086 -3267734 877355
9680 877355 3219449 1641662 1884297 7550679 12259889 8657854 955159 11697 7344638
9671 7344638 12569270 8043371 -1312785 -5895459 -3389882 1201896 3501325 3127360
9663 3127360 1100294 -1949642 -5043158 -6820031 -6689633 -5181052 -3460104 -2829953 -3792133
$$ packed form
9723B034116L619714J024942o47788J7863J445107J190708p23413j427109P61033
9714G295173L138226J850059k411497n145931m456134l003684k794000k149137
9706g676925J92419J947921J232740K20368J228378K018053n95179m347943l713366
9697i493534J822969O135709M129015k042400n755629l259978K625293N581007
9689b57548K672110k042476k508600R63176K151579j177667l257660J89352M145089
9680H77355K342094j577787K42635N666382M709210l602035p702695r43462P332941
9671G344638N224632m525899r356156m582674K505577M591778K299429l73965
9663C127360k027066l049936l093516j776873J30398J508581J720948O30151r62180
$$ plain form
9654 -3792133 -5245326 -5660785 -5181102 -5165435 -5614113 -4953096 -2774717 -692808 314962
9645 314962 1281473 2760880 2985059 268314 -4159333 -7573972 -9130042 -10046365 -10848858
9636 -10848858 -10132338 -6470054 -659911 4573507 7083083 7102578 6144186 4637232 2155910
9627 2155910 12795 1023932 5135127 7878218 5993199 2457576 2263675 4912532
9619 4912532 5735557 3748010 2753591 4410095 5945027 6057679 7119464 8968989 6486421
9610 6486421 -2471358 -11618861 -13684600 -9544638 -4967370 -1860085 1277631 2850465
9602 2850465 -850388 -8495515 -13588149 -12400011 -7647670 -3745844 -2409095 -3359736
9594 -3359736 -5447457 -6344619 -4494875 -1795983 -1207112 -1829671 -141972 3735508 5206786
$$ packed form
9654c792133j453193m15459M79683J5667m48678O61017K178379K081909J007770
9645C14962R66511J479407K24179k716745m427647l414639j556070r16323q02493
9636a0848858P16520L662284N810143N233418K509576J9495r58392j506954k481322
9627B155910k143115J011137M111195K743091j885019l535623j93901K648857
9619D912532Q23025j987547r94419J656504J534932J12652J061785J849525k482568
9610F486421q957779r147503k065739M139962M577268L107285L137716J572834
9602B850465l700853p645127n092634J188138M752341L901826J336749r50641
9594c359736k087721q97162J849744K698892N88871o22559J687699L877480J471278
$$ plain form
9585 5206786 1594084 -4348148 -8470382 -9441298 -7855992 -4513035 -1059726 451355
9577 451355 14903 -536186 -680096 -1449031 -2292541 -1102612 1874207 3567765 2580238
9568 2580238 924891 256142 -327081 -1527096 -2100845 -1148172 636179 2658054 4378590
9559 4378590 3633760 -975700 -6015448 -6482219 -3464063 -2704703 -4769092 -3875185 1211545
9550 1211545 3259280 -1812067 -6955644 -4216006 3199737 6600191 4770276 3126701
9542 3126701 3366706 2472998 297610 112339 2041084 2763735 1517900 446810 -338237
9533 -338237 -2219470 -3672439 -2470117 -983915 -2718824 -4990482 -2564077 2474443
9525 2474443 3077937 -594981 -780026 4614667 7885258 3881296 -2458746 -5229630 -5873648
$$ packed form
9585E206786l612702n942232m122234r70916J585306L342957L453309J511081
9577D51355m36452n51089j43910p68935q43510J189929K976819J693558r87527
9568B580238j655347o68749n83223j200015n73749R52673J784351K021875J720536
9559D378590p44830m609460n039748m66771L018156P59360k064389Q93907N086730
9550A211545K047735n071347n143577K739638P415743L400454j829915j643575
9542C126701K40005q93708k175388j85271J928745P22651j245835j071090p85047
9533c38237j881233j452969J202322J486202j734909k271658K426405N038520
9525B474443O03494l672918j85045N394693L270591m003962o340042k770884o44018
$$ plain form
9516 -5873648 -7047391 -5907940 -170042 5361127 5361377 2252033 1217548 1413866 -848673
9507 -848673 -3986043 -3763468 -1398551 -1525088 -3681623 -3169474 280812 1784180 -447488
9498 -447488 -2595017 -1969836 -381312 779492 3315783 7517685 9173234 4793783 -2662184
9489 -2662184 -6369859 -3050931 3904818 8154862 6339032 719868 -3687312 -4467795
9481 -4467795 -3505085 -3349955 -3973388 -4256029 -4371605 -4611689 -3852280 -1619705 136715
9472 136715 -159357 -1158200 -1597820 -3358899 -7684174 -10710255 -7858968 -1429427 1703140
9463 1703140 -333904 -2835450 -3006039 -3793469 -7105797 -9121637 -6335943 -1828204 -628427
9454 -628427 -1721146 -9127 4875265 7034625 2538491 -4895858 -8690437 -7320091
$$ packed form
9516e873648j173743J139451N737898N531169K50l109344j034485J96318k262539
9507h48673l137370K22575K364917j26537k156535N12149L450286J503368k231668
9498d47488k147529O25181J588524J160804K536291M201902J655549m379451p455967
9489b662184l707675L318928O955749M250044j815830n619164m407180p80483
9481d467795R62710J55130o23433k82641j15576k40084P59409K232575J756420
9472A36715k96072r98843m39620j761079m325275l026081K851287O429541L132567
9463A703140k037044k501546j70589p87430l312328k015840K785694M507739J199777
9454f28427j092719J712019M884392K159360m496134p434349l794579J370346
$$ plain form
9446 -7320091 -4613962 -3346344 -2005333 1086160 3454998 1373945 -4090324 -7670368
9438 -7670368 -6963183 -5071791 -4561138 -2883251 2618266 8453017 8967037 5145305 3767837
9429 3767837 7481142 11163318 9965117 6133927 4686079 5884835 6013735 3704084
9421 3704084 1500565 1439095 2190614 1282244 -1665192 -4635005 -5271601 -2985557 424171
9412 424171 2269186 1497469 -530769 -2079645 -3073711 -4144234 -4233584 -988031 5601817
9403 5601817 11320367 11519402 6814609 2862389 3400216 5607371 4517625 166193 -3120671
9394 -3120671 -3628975 -4045333 -5881333 -6762989 -5088406 -3033048 -2260709 -829891 2133069
9385 2133069 2787665 -1632800 -6697452 -6095096 -887248 2512688 2246083 2517825 5406456
$$ packed form
9446g320091K706129J267618J341011L091493K368838k081053n464269l580044
9438g670368P07185J891392N10653J677887N501517N834751N14020l821732j377468
9429C767837L713305L682176j198201l831190j447848J198756J28900k309651
9421C704084k203519o1470P51519r08370k947436k969813o36596K286044L409728
9412D24171J845015p71717k028238j548876r94066j070523q9350L245553O589848
9403E601817N718550J99035m704793l952220N37827K207155j089746m351432l286864
9394c120671n08304m16358j836000q81656J674583K055358P72339J430818K962960
9385B133069O54596m420465n064652O02356N207848L399936k66605K71742K888631
$$ plain form
9376 5406456 7581098 6395581 3786896 2397342 2303201 2917401 3830602 2855630 -1929013
9367 -1929013 -7124600 -6442685 57313 4831514 3386700 28998 -249695 626033 -656136
9358 -656136 -1348596 2484792 7574777 7429062 2608199 -434468 -29313 -1266285 -6323398
9349 -6323398 -9932654 -7452747 -1914850 951950 760436 1039985 2244154 1168831 -2972176
9340 -2972176 -6336535 -5870997 -3868448 -4473195 -7216649 -7353600 -2861097 2104769 2605552
9331 2605552 -568297 -2586522 -1345812 856411 1908961 2351275 2638218 1616215 -697371
9322 -697371 -1923764 -889382 279699 -283804 -1138895 -519190 104157 -1487723 -4160488
9313 -4160488 -5237177 -5005349 -5710839 -6859333 -5622369 -2199879 -708877 -3143719 -5804288
$$ packed form
9376E406456K174642j185517k608685j389554r4141O14200R13201r74972m784643
9367a929013n195587O81915O499998M774201j444814l357702k78693Q75728j282169
9358f56136o92460L833388N089985j45715m820863l042667M05155j236972n057113
9349f323398l609256K479907N537897K866800j91514K79549J204169j075323m141007
9340b972176l364359M65538K002549o04747k743454j36951M492503M965866N00783
9331B605552l173849k018225J240710K202223J052550M42314K86943j022003k313586
9322f97371j226393J034382J169081n63503q55091O19705O23347j591880k672765
9313d160488j076689K31828p05490j148494J236964L422490J491002k434842k660569
$$ plain form
9304 -5804288 -4413892 -681206 -404535 -5412192 -10587813 -10263120 -5400236 -1964639 -2984640
9295 -2984640 -5273916 -4780665 -2185922 -895673 -1680348 -2590142 -3021915 -4070141 -4908033
9286 -4908033 -2747649 2481931 6770520 7057413 4967263 3729198 3753273 3376545 2156005
9277 2156005 1204635 1377489 2866741 5705243 9270187 11961337 12333440 10111689 6067572
9268 6067572 1893255 -252039 214670 1203808 926175 941938 3251336 5571459 3999936
9259 3999936 -57516 -1128784 1485019 2241280 -1280736 -3952244 -1606393 2000875
9251 2000875 1661324 -934846 -1158454 229154 -906584 -4425257 -6598239 -6689873 -6791083
9242 -6791083 -6205468 -2077884 4374384 7628789 4748298 -1297846 -5590185 -5515423 -1508661
$$ packed form
9304e804288J390396L732686K76671n007657n175621L24693M862884L435597j020001
9295b984640k289276M93251K594743J290249p84675r09794m31773j048226q37892
9286d908033K160384N229580M288589K86893k090150j238065K4075l76728j220540
9277B156005r51370J72854J489252K838502L564944K691150L72103k221751m044117
9268F067572m174317k145294M66709R89138k77633J5763K309398K320123j571523
9259C999936m057452j071268K613803P56261l522016k671508K345851L607268
9251B000875l39551k596170k23608J387608j135738l518673k172982r1634j01210
9242f791083N85615M127584O452268L254405k880491o046144m292339P4762M006762
$$ plain form
9233 -1508661 3391416 5348462 3739552 2087218 2633249 2684060 -250031 -3092965 -1924192
9224 -1924192 1001844 972652 -904563 -16166 2819429 2350357 -1569794 -3212329 -542070
9215 -542070 1905058 1397892 1224154 4059173 7438223 8672650 8622261 7769540 4049241
9206 4049241 -2241447 -6446577 -5850552 -3537378 -2938888 -3053957 -2246552 -2205610 -4425586
9197 -4425586 -6787639 -7337002 -7720876 -9273134 -9473876 -6238906 -2186797 -400093 867507
9188 867507 4651795 8992143 9015072 3919828 -2221562 -5714989 -5925009 -3681962 -211550
9179 -211550 2733982 3926373 3522786 2003339 -213851 -1497671 -89804 2409149 1982679
9170 1982679 -1667578 -3627140 -811722 3174845 3203820 -726638 -5102799 -7760972 -7762789
$$ packed form
9233a508661M900077J957046j608910j652334N46031N0811k934091k842934J168773
9224a924192K926036k9192j877215Q88397K835595m69072l920151j642535K670259
9215e42070K447128n07166j73738K835019L379050J234427n0389q52721l720299
9206D049241o290688m205130N96025K313174N98490j15069Q07405M0942k219976
9197d425586k362053n49363l83874j552258k00742L234970M052109J786704J267600
9188H67507L784288M340348K2929n095244o141390l493427k10020K243047L470412
9179b11550K945532J192391m03587j519447k217190j283820J407867K498953m26470
9170A982679l650257j959562K815418L986567K8975l930458m376161k658173j817
$$ plain form
9161 -7762789 -3891898 2678966 7081540 6074111 2124476 -1182121 -4302630 -8188817
9153 -8188817 -9571075 -5480001 455234 2351572 603621 -114553 405899 -1920469 -7068818
9144 -7068818 -9571528 -6555335 -1393180 1924728 3178738 3518505 3094892 2240825 1323315
9135 1323315 -920552 -5050901 -7366820 -3734073 2931307 4787732 -143480 -5053572
9127 -5053572 -4219462 -219410 1643743 982276 436232 202996 -1052142 -2403500 -1957201
9118 -1957201 -446679 -115174 -957371 -827938 1289921 4130100 5766322 5180868 2999716
9109 2999716 1348175 1808765 3298543 3788433 4087041 6971165 11892156 14118336 11092332
9100 11092332 6580259 5891508 9259293 12635722 13251454 11641768 9378324 7452917
$$ packed form
9161g762789L870891O570864M402574j007429l949635l306597l120509l886187
9153h188817j382258M091074N935235J896338j747951p18174N20452k326368n148349
9144g068818k502710L016193N162155L317908J254010L39767m23613q54067r17510
9135A323315k243867m130349k315919L632747O665380J856425m931212m910092
9127e053572Q34110M000052J863153o61467n46044k33236j255138j351358M46299
9118a957201J510522L31505q42197J29433K117859K840179J636222n85454k181152
9109B999716j651541M60590J489778M89890K98608K884124M920991K226180l026004
9100A1092332m512073o88751L367785L376429O15732j609686k263444j925407
$$ plain form
9092 7452917 6498634 6697992 7501598 8154957 7846589 5320555 239308 -4649957 -5327055
9083 -5327055 -1731611 1370787 419033 -2572614 -3704325 -2699508 -2030792 -2584717 -3216113
9074 -3216113 -3315005 -3096850 -2385622 -1465665 -1868593 -3846171 -4468617 -1116498 4255740
9065 4255740 7395230 7456854 7282882 8526355 9790198 9564572 7856903 4670005 -67812
9056 -67812 -4537369 -5967980 -4400057 -2843964 -2837770 -2642602 -1011018 288524 -250258
9047 -250258 -745910 996031 3070609 1726221 -2318854 -3463376 1406032 7643745 7552196
9038 7552196 -377851 -9510608 -12870913 -10520525 -7361560 -5568621 -2760647 2325041
9030 2325041 6333286 5748589 2300617 921325 3458454 7030694 7965255 5134719 139924
$$ packed form
9092G452917r54283J99358Q03606O53359l08368k526034n081247m889265o77098
9083e327055L595444L102398r51754k991647j131711J004817O68716n53925o31396
9074c216113r8892K18155P11228R19957m02928j977578o22446L352119N372238
9065D255740L139490O1624j73972J243473J263843k25626j707669l186898m737817
9056f7812m469557j430611J567923J556093O194J95168J631584J299542n38782
9047b50258m95652J741941K074578j344388m045075j144522M869408O237713r1549
9038G552196p930047r132757l360305K350388L158965J792939K807974N085688
9030B325041M008245n84697l447972j379292K537129L572240R34561k830536m994795
$$ plain form
9021 139924 -3513946 -2284673 3633331 8994206 8857081 4733640 2117970 2440250 1882820
9012 1882820 -1278736 -3242822 -966436 2451072 2203176 -1491068 -4821627 -6226268
9004 -6226268 -6921609 -7254059 -6442071 -4977234 -3595604 -588212 6037984 13867990 17235107
8995 17235107 13584700 5906442 -1056093 -4033167 -1430179 5180645 9367503 4759443
8987 4759443 -6209221 -12869514 -8593365 1203956 6709524 5788131 3793097 3880877 3466247
8978 3466247 362564 -2819164 -2465391 1008949 4125453 4687150 3528828 2818111 3715870
8969 3715870 5450656 6433977 6404947 6794600 8273547 9002553 6815372 2505582 -647289
8960 -647289 -292278 3277719 8069853 11571997 11876531 9423765 6945214 6154087 5767878
$$ packed form
9021A39924l653870J229273N918004N360875j37125m123441k615670L22280n57430
9012A882820l161556j964086K276386L417508k47896l694244l330559j404641
9004f226268o95341l32450Q11988J464837J381630L007392O626196P830006L367117
8995A7235107l650407p678258o962535k977074K602988O610824M186858m608060
8987D759443j0968664o660293M276149R797321N505568r21393j995034Q7780m14630
8978C466247l103683l181728L53773L474340L116504N61697j158322p10717Q97759
8969C715870J734786R83321k9030L89653J478947P29006k187181m309790l152871
8960f47289L55011L569997M792134L502144L04534k452766k478551p91127l86209
$$ plain form
8951 5767878 4618497 4555229 7006849 8625270 5032686 -1866690 -5475890 -3657065 -1052181
8942 -1052181 -1341684 -2778240 -3296995 -4204227 -5624689 -3964864 1671731 5667858 3867473
8933 3867473 731385 2028953 4469929 917534 -6369821 -7320073 583957 7842523
8925 7842523 6850544 2029608 1149700 3440726 3212665 738923 1477848 5886958 7663596
8916 7663596 3491401 -1501335 -1137270 3073010 4810868 2593216 1680961 5589141 9930898
8907 9930898 8109740 973414 -3913706 -2815433 -671534 -3024651 -7621547 -8505887
8899 -8505887 -5290322 -2610904 -1958921 -472225 2163843 2265741 -833225 -2611059 -924869
8890 -924869 150814 -2232119 -4046714 -1241738 2569058 1485169 -3145106 -5412888
$$ packed form
8951E767878j149381o3268K451620J618421l592584o899376l609200J818825K604884
8942a052181k89503j436556n18755r07232j420462J659825N636595L996127j800385
8933C867473l136088J297568K440976l552395p287355r50252P904030P258566
8925G842523r91979m820936q79908K291026k28061k473742P38925M409110J776638
8916G663596m172195m992736L64065M210280J737858k217652r12255L908180M341757
8907I930898j821158p136326m887120J098273K143899k353117m596896q84340
8899h505887L215565K679418O51983J486696K636068J01898l098966j777834J686190
8890i24869J075683k382933j814595K804976L810796j083889m630275k267782
$$ plain form
8882 -5412888 -4726550 -5555086 -8127509 -7152521 -1066034 4315240 3984063 116974 -2598190
8873 -2598190 -3237243 -3036620 -1722564 820336 2472712 2215638 2883175 6834844 11136377
8864 11136377 11075059 6931709 3240168 2260429 2184007 1476209 977482 1106055 471990
8855 471990 -1491685 -3164281 -3210028 -2190875 -616544 2299184 6285291 8348970 5767358
8846 5767358 -28467 -4586629 -5466677 -4704118 -5855000 -9454930 -12091809 -9992563 -3322231
8837 -3322231 3341409 5031418 834916 -5682136 -10000133 -10272112 -8113745 -6669240
8829 -6669240 -7687562 -9830983 -10083596 -7265086 -3434517 -1091220 -113071 1121654 2729816
8820 2729816 3596783 3819638 4151073 3466121 230571 -3215408 -1954858 4257418 8985202
$$ packed form
8882e412888O86338q28536k572423R74988O086487N381274l31177l867089k715164
8873b598190o39053K00623J314056K542900J652376k57074O67537L951669M301533
8864A1136377o1318m143350l691541r79739p6422p07798m98727J28573o34065
8855D71990j963675j672596m5747J019153J574331K915728L986107K063679k581612
8846E767358n795825m558162q80048P62559j150882l599930k636879K099246O670332
8837c322231O663640J690009m196502o517052m317997k71979K158367J444505
8829f669240j018322k143421k52613K818510L830569K343297R78149J234725J608162
8820B729816Q66967K22855L31435o84952l235550l445979J260550O212276M727784
$$ plain form
8811 8985202 7117724 1452399 -2134721 -2780841 -3352709 -3847616 -1998951 802348 654439
8802 654439 -1615802 -934673 2945185 3759944 -800645 -3725413 973189 8099112 8419639
8793 8419639 2368292 -1278638 1001364 3344296 931177 -2879618 -3012817 -691227
8785 -691227 -765780 -4412900 -8437410 -9992559 -8918844 -6576111 -4628622 -4050953 -3824229
8776 -3824229 -1781239 2191316 5406019 5794654 4068207 1529196 -1534310 -3748338
8768 -3748338 -2265878 2645653 5394999 1189610 -7324845 -13201844 -13651160 -11549480
8760 -11549480 -9575670 -7399252 -4942525 -4039552 -5233888 -6004450 -3956395 143745
8752 143745 3605782 4526523 2925649 966064 1922336 6631481 11216202 11146450 7239104
$$ packed form
8811H985202j867478n665325l587120o46120n71868m94907J848665K801299j47909
8802F54439k270241O81129L879858Q14759m560589k924768M698602P125923L20527
8793H419639o051347l646930K280002K342932k413119l810795j33199K321590
8785f91227p4553l647120m024510j555149J073715K342733J947489N77669K26724
8776c824229K042990L972555L214703L88635j726447k539011l063506k214028
8768c748338J482460M911531K749346m205389q514455n876999m49316K101680
8760a1549480J973810K176418K456727R02973j194336p70562K048055M100140
8752A43745L462037R20741j600874j959585R56272M709145M584721o9752l907346
$$ plain form
8743 7239104 4064872 2665493 -223626 -4833397 -6151846 -1993813 2245900 1487366
8735 1487366 -1049802 364428 3741542 2077490 -5269717 -11164139 -10796398 -6535777
8727 -6535777 -1771789 3328894 7659622 7259668 1529141 -3624967 -3269021 -160749 435167
8718 435167 -958259 -142154 2975058 4459487 2993344 951549 -773524 -3665429 -6836488
8709 -6836488 -6632730 -2632940 446920 -746557 -3393020 -3017069 -70868 1221700 -960681
8700 -960681 -4131224 -5444190 -5218240 -5968581 -8911758 -11968571 -11533249 -6610060 -556319
8691 -556319 2362632 1416046 -1100191 -3561405 -5390972 -4674705 306126 6516662 7752289
8682 7752289 2979797 -995186 1611942 7512809 9139161 4780540 -726614 -3802202
$$ packed form
8743G239104l174232j399379k889119m609771j318449M158033M239713p58534
8735A487366k537168J414230L377114j664052p347207n894422L67741M260621
8727f535777M763988N100683M330728l99954n730527n154108L55946L108272N95916
8718D35167j393426Q16105L117212J484429j466143k041795j725073k891905l171059
8709f836488K03758L999790L079860j193477k646463L75951K946201J292568k182381
8700i60681l170543j312966K25950p50341k943177l056813M35322M923189O053741
8691e56319K918951r46586k516237k461214j829567P16267M980831O210536J235627
8682G752289m772492l974983K607128N900867J626352m358621n507154l075588
$$ plain form
8674 -3802202 -5595512 -7859721 -9831609 -10074647 -8278779 -4713105 -498098 1815877
8666 1815877 1052025 444945 4070476 10096145 11919651 7160840 1312623 505865 4402565
8657 4402565 8641026 10798827 10863076 8692806 4652294 1078830 -7467 500221 762531
8648 762531 830081 1154938 495546 -1632047 -2665801 -1053533 -592575 -5653880 -12960608
8639 -12960608 -13973689 -6392598 2217006 4456893 1774146 -152986 -166428 -804554 -1617098
8630 -1617098 665593 5590557 7989513 5043775 440774 -607565 2360261 5990519
8622 5990519 7992305 8413929 7627495 6015290 5034435 5774670 6471688 4121468 -951690
8613 -951690 -4669250 -4269119 -1457358 729750 1760057 2437291 2297098 960431 335039
$$ packed form
8674c802202j793310k264209j971888k43038J795868L565674M215007K313975
8666A815877p63852o07080L625531O025669J823506m758811n848217q06758L896700
8657D402565M238461K157801O4249k170270m040512l573464j086297N07688K62310
8648G62531O7550L24857o59392k127593j033754J612268M60958n061305p306728
8639a2960608j013081P581091Q609604K239887k682747j927132j3442o38126q12544
8630a617098K282691M924964K398956k945738m603001j048339K967826L630258
8622E990519K001786M21624p86434j612205r80855P40235O97018k350220n073158
8613i51690l717560M00131K811761K187108J030307O77234j40193j336667o25392
$$ plain form
8604 335039 2172911 4567024 4527190 3359542 5126950 9429312 10535772 5552425 -979727
8595 -979727 -3648967 -3554379 -5158096 -8661655 -10360366 -9098555 -7364497 -6194495 -3802054
8586 -3802054 -177031 1291049 -1209979 -4505603 -4375049 -901738 2116903 1755797 -1492547
8577 -1492547 -4573762 -4261419 -2394 4829725 6024942 3502750 1231675 1455532 1716509
8568 1716509 -589660 -3406817 -2805599 1050881 4104120 3990042 2294307 1180598 777502
8559 777502 736512 1805410 4263044 6378317 6185637 4282132 3565597 5945132 9714762
8550 9714762 10634897 6212368 -1053564 -5806859 -5832858 -4459654 -5602167 -8110064 -7724071
8541 -7724071 -3690024 150452 1193414 1306999 2706135 3959578 2770219 239353
$$ packed form
8604C35039J837872K394113l9834j167648J767408M302362J106460m983347o532152
8595i79727k669240R4588j603717l503559j698711J261811J734058J170002K392441
8586c802054L625023J468080k501028l295624J30554L473311L018641l61106l248344
8577a492547l081215L12343M259025M832119J195217k522192k271075K23857K60977
8568A716509k306169k817157O01218L856480L053239j14078j695735j113709m03096
8559G77502m0990J068898K457634K115273j92680j903505p16535K379535L769630
8550I714762R20135m422529p265932m753295k5999J373204j142513k507897L85993
8541g724071M034047L840476J042962J13585J399136J253443j189359k530866
$$ plain form
8533 239353 -907305 -761863 -1383350 -2371951 -1232672 1524858 1622902 -2777919 -7095244
8524 -7095244 -5414420 1850308 8159448 8417316 3996138 -202715 -1650352 -1775531 -2789405
8515 -2789405 -4920766 -7078023 -8483801 -8221029 -4344872 3940596 12920690 16050466
8507 16050466 10995441 3157862 -265093 1577021 3803773 3445377 2544514 3323382 4301377
8498 4301377 3081147 68335 -2650755 -3861125 -2892485 734526 5217802 6610320
8490 6610320 3747931 774485 1779619 5128942 6603167 6053256 6578104 8493773 9020715
8481 9020715 7564470 6521315 6714821 6710664 6875034 8914148 10692651 7470623 189887
8472 189887 -3674170 -735868 2956401 1773464 -294872 3024058 8436074 7202781
$$ packed form
8533B39353j146658J45442o21487r88601J139279K757530R8044m400821m317325
8524g095244J680824P264728O309140K57868m421178m198853j447637j25179j013874
8515b789405k131361k157257j405778K62772L876157Q285468Q980094L129776
8507A6050466n055025p837579l422955J842114K226752l58396r00863P78868R77995
8498D301377j220230l012812k719090j210370R68640L627011M483276J392518
8490F610320k862389k973446J005134L349323J474225n49911N24848J915669N26942
8481I020715j456245j043155J93506m157J64370K039114J778503l222028p280736
8472A89887l864057K938302L692269j182937k068336L318930N412016j233293
$$ plain form
8464 7202781 -765130 -5797696 -2227458 4483185 6664311 3831823 -246057 -4244611
8456 -4244611 -8341411 -10283051 -7458368 -1446371 3330270 4841583 4666069 4768484 5496482
8447 5496482 6235905 5963560 3558728 -593671 -3593067 -2302217 3238732 9646189 13276520
8438 13276520 12803253 9344524 5145584 2074402 747505 928140 2416155 4821970
8430 4821970 6848466 7241764 6564399 6518640 7297491 7334111 6050208 4829029 4491946
8421 4491946 3889291 2151065 438525 176477 1251651 2998658 4940769 5582634 3229435
8412 3229435 -476129 -1163778 1693549 2510767 -2342336 -7807517 -6942950 -1816096 -578701
8403 -578701 -4544527 -6277915 -2263076 635026 -3968140 -11085119 -11042662 -3332031 3359396
$$ packed form
8464G202781p967911n032566L570238O710643K181126k832488m077880l998554
8456d244611m096800j941640K824683O011997M776641J511313j75514J02415P27998
8447E496482P39423k72345k404832m152399k999396J290850N540949O407457L630331
8438A3276520m73267l458729m198940l071182j326897J80635J488015K405815
8430D821970K026496L93298o77365m5759P78851L6620j283903j221179l37083
8421D491946o02655j738226j712540k62048J075174J747007J942111O41865k353199
8412C229435l705564o87649K857327Q17218m853103n465181Q64567N126854J237395
8403e78701l965826j733388M014839K898102m603166p116979M2457P710631O691427
$$ plain form
8394 3359396 3504469 281844 -1603801 -2316988 -3724103 -4578445 -2503398 1579343 4099991
8385 4099991 2947883 -959753 -5195626 -7304022 -5837008 -1772338 1541441 1334456
8377 1334456 -1835418 -5108239 -6398735 -5388388 -2438753 1585674 4694931 5084124
8369 5084124 3626683 3317491 5230549 6479818 3720055 -2169932 -6651387 -6636338 -3463783
8360 -3463783 -537783 414926 -104537 -1161532 -2103374 -1930252 351662 4216393 7393466
8351 7393466 7810997 5450179 2089679 -308504 -797977 293692 1806395 2790267 3452635
8342 3452635 4717235 6565455 7383984 5668996 2218023 -116218 745947 3695410 5255051
8333 5255051 3153560 -1109155 -4011951 -4392458 -4611833 -6276199 -6612131 -1947653 5939184
$$ packed form
8394C359396J45073l222625j885645p13187j407115q54342K075047M082741K520648
8385D099991j152108l907636m235873k108396J467014M064670L313779k06985
8377A334456l169874l272821j290496J010347K949635M024427L109257L89193
8369E084124j457441l09192J913058J249269k759763n889987m481455J5049L172555
8360c463783K926000R52709n19463j056995r41842J73122K281914L864731L177073
8351G393466M17531k360818l360500k398183m89473J091669J512703R83872O62368
8342C452635J264600J848220Q18529j714988l450973k334241Q62165K949463J559641
8333E255051k101491m262715k902796l80507k19375j664366l35932M664478P886837
$$ plain form
8324 5939184 10815079 10109799 7910251 7729951 6782488 1798197 -3129979 -1086193 6533776
8315 6533776 10542582 6568062 417572 -1491516 -426394 -70613 729485 3805509 5115714
8306 5115714 148355 -6701669 -6401693 1558332 8132799 7662250 4156547 2611650 1887903
8297 1887903 308586 1264995 7082408 12397165 10752330 4882037 3468753 8984906
8289 8984906 15196074 16408259 13078512 7680546 992468 -5436718 -7983406 -5134862
8281 -5134862 -57361 3235828 3894512 2867657 332740 -3362385 -6318325 -6804527 -5074055
8272 -5074055 -2269155 782593 2746935 2115064 -181141 -853025 1260814 3190715 2488363
8263 2488363 1390366 3323838 7236273 9046396 7602852 5357567 3586913 1152635
$$ packed form
8324E939184M875895p05280k199548j80300r47463m984291m928176K043786P619969
8315F533776M008806l974520o150490j909088J065122L55781Q00098L076024J310205
8306E115714m967359o850024K99976P960025O574467m70549l505703j544897p23747
8297A887903j579317R56409N817413N314757j644835n870293j413284N516153
8289H984906O211168J212185l329747n397966o688078o429186k546688K848544
8281e134862N077501L293189O58684j026855k534917l695125k955940m86202J730472
8272e074055K804900L051748J964342o31871k296205o71884K113839J929901p02352
8263B488363j097997J933472L912435J810123j443544k245285j770654k434278
$$ plain form
8255 1152635 -1394501 -852244 3264727 5913906 2668446 -3188831 -3824654 2871037 9960107
8246 9960107 10123229 4863581 2036449 5428483 10480320 11048973 7008333 2806303 939008
8237 939008 341141 185514 1317389 3394637 4028384 2117323 -606433 -2534957 -3803861
8228 -3803861 -3504859 1146384 9873350 16500230 15080645 7243886 -396284 -4668397
8220 -4668397 -7250529 -8790020 -7364358 -3640884 -1991687 -3998521 -5499158 -3329298
8212 -3329298 -829876 -2323120 -5410104 -4216614 1364932 5421110 4841898 2812764
8204 2812764 2376499 1928935 -210217 -1457278 693231 3359133 2282194 -736295 120433
8195 120433 5448937 8936973 6407813 1681959 485176 2355763 2639531 97932 -2018639
$$ packed form
8255A152635k547136N42257M116971K649179l245460n857277o35823O695691P089070
8246I960107J63122n259648k827132L392034N051837N68653m040640m202030j867295
8237I39008n97867j55627J131875K077248O33747j911061k723756j928524j268904
8228c803861K99002M651243Q726966O626880j419585p836759p640170m272113
8220d668397k582132j539491J425662L723474J649197k006834j500637K169860
8212c329298K499422j493244l086984J193490N581546M056178n79212k029134
8204B812764m36265m47564k139152j247061K150509K665902j076939l018489Q56728
8195A20433N328504L488036k529160m725854j196783J870587K83768k541599k116571
$$ plain form
8186 -2018639 -1566440 174732 1962356 4392579 7126247 7680378 4815869 730296 -1913481
8177 -1913481 -3231757 -4747779 -6562122 -7689078 -7787655 -6904833 -4858534 -2450679 -1776086
8168 -1776086 -3543405 -5644010 -6348377 -7082398 -9343337 -10672546 -7578321 -1740795 1082374
8159 1082374 -1019037 -3417222 -1857047 1670359 2670220 764677 -1110035 -2367876
8151 -2367876 -5294943 -9793128 -11544746 -7276041 551666 6530494 8421583 8174656
8143 8174656 7574385 5780888 2025673 -1758628 -3167045 -2875240 -3414817 -4793710 -4186696
8134 -4186696 -721098 2135323 881267 -3082432 -5140256 -3246730 185726 1937236
8126 1937236 1446273 201012 -770646 -1821210 -3497915 -4998556 -4321888 -717911 3175623
$$ packed form
8186b018639M52199J741172J787624K430223K733668N54131k864509m085573k643777
8177a913481j318276j516022j814343j126956r8577Q82822K046299K407855O74593
8168a776086j767319k100605p04367p34021k260939j329209L094225N837526K823169
8159A082374k101411k398185J560175L527406R99861j905543j874712j257841
8151b367876k927067m498185j751618M268705P827707N978828J891089k46927
8143H174656o00271j793497l755215l784301j408417K91805n39577j378893O07014
8134d186696L465598K856421j254056l963699k057824J893526L432456J751510
8126A937236m90963j245261r71658j050564j676705j500641O76668L603977L893534
$$ plain form
8117 3175623 3232860 -1354601 -6581658 -7982298 -5166141 -1028479 1792156 2181219 247157
8108 247157 -2061576 -1745368 1331534 2950503 -85455 -4675584 -5275277 -1995169 -368521
8099 -368521 -2899987 -5449512 -3584741 1239743 4290342 4012727 3478512 6143800 11358879
8090 11358879 14130932 10092090 1332941 -4799488 -4529216 -2183324 -2410961 -1780660 5276699
8081 5276699 14749217 16371592 9034403 3313511 5781721 10133661 8941702 5422164
8073 5422164 6073544 8792240 7481943 3682382 3919986 8050693 9500940 6105029 2218993
8064 2218993 251659 -1863483 -4250557 -3876682 -1083638 -251399 -2171099 -2411861 555637
8055 555637 2086953 -883505 -4700479 -5133258 -3687016 -3976713 -5807794 -6548059 -5265853
$$ packed form
8117C175623N7237m587461n227057j400640K816157M137662K820635L89063j934062
8108B47157k308733L16208L076902J618969l035958m590129n99693L280108J626648
8099c68521k531466k549525J864771M824484L050599k77615n34215K665288N215079
8090A1358879K772053m038842q759149o132429K70272K345892k27637O30301P057359
8081E276699R472518J622375p337189n720892K468210M351940j191959l519538
8073E422164O51380K718696j310297l799561K37604M130707J450247l395911l886036
8064B218993j967334k115142k387074L73875K793044Q32239j919700k40762K967498
8055E55637J531316k970458l816974m32779J446242k89697j831081p40265J282206
$$ plain form
8046 -5265853 -2467396 1350540 4319947 3563854 -352359 -2441983 294451 4234484
8038 4234484 3913352 -859536 -5578648 -6966446 -5724117 -4537238 -5128339 -6458453 -5487042
8029 -5487042 -1299685 2246543 1179428 -2128424 -2002283 1207334 1183586 -3688177 -6914832
8020 -6914832 -4312432 -609451 -797080 -1761225 850518 3391765 180566 -5429200 -5105970
8011 -5105970 1350261 5980593 5324323 4382738 6784924 9055215 7478207 4207205 3077815
8002 3077815 4158703 5638278 7167338 8347399 7282895 3702079 1025618 2488095
7994 2488095 6750009 9505906 8407540 4924884 2046494 1042647 386796 -1800251
7986 -1800251 -4232198 -3391486 937117 4085792 3041045 1257371 2885835 5407456
$$ packed form
8046e265853K798457L817936K969407p56093l916213k089624K736434L940033
8038D234484l21132m772888m719112j387798J242329J186879n91101j330114R71411
8029e487042M187357L546228j067115l307852J26141L209617k3748m871763l226655
8020f914832K602400L702981j87629r64145K611743K541247l211199n609766L23230
8011e105970O456231M630332o56270r41585K402186K270291j577008l271002j129390
8002C077815J080888J479575J529060J180061j064504l580816k676461J462477
7994B488095M261914K755897j098366l482656k878390j003847o55851k187047
7986a800251k431947Q40712M328603L148675j044747j783674J628464K521621
$$ plain form
7978 5407456 3723238 -776449 -2219744 -268532 -349135 -3390691 -3464813 2003819 7251957
7969 7251957 7076032 4106605 2831724 2271301 -209481 -2581968 -1219651 3053111 6740998
7960 6740998 8561941 8569951 5919994 1750423 524632 3683646 5658135 1612089 -4381896
7951 -4381896 -5135832 -1332323 308241 -2104863 -4070975 -3325188 -2576206 -2983512 -1758494
7942 -1758494 2072277 5297693 5771822 5117768 4788121 4388834 5217875 9918720 16450346
7933 16450346 17922164 11680965 3904248 1540821 3686310 4809924 3008092 645999
7925 645999 -741759 -1759668 -2591443 -2690571 -2307401 -1778147 -316407 2346892 4526146
7916 4526146 4906417 4695871 5267826 5432238 3470930 149968 -2783156 -5234881 -7201361
$$ packed form
7978E407456j684218m499687j443295J951212q0603l041556p4122N468632N248138
7969G251957j75925k969427j274881n60423k480782k372487J362317M272762L687887
7960F740998J820943Q010k649957m169571j225791L159014J974489m046046n993985
7951d381896p53936L803509J640564k413104j966112P45787P48982m07306J225018
7942a758494L830771L225416M74129o54054l29647l99287Q29041M700845O531626
7933A6450346J471818o241199p776717k363427K145489J123614j801832k362093
7925F45999j387758j017909q31775r9128L83170N29254J461740K663299K179254
7916D526146L80271k10546N71955J64412j961308l320962k933124k451725j966480
$$ plain form
7907 -7201361 -6704244 -2748243 1367343 1570887 -1282980 -3128236 -3100203 -3841088 -5803319
7898 -5803319 -6082335 -3719413 -1782628 -2619230 -4579672 -4969220 -3102125 783957 6204441
7889 6204441 10611561 10636172 7068072 4803541 5458075 4209003 -2461185 -9888460 -11135178
7880 -11135178 -6982742 -4216784 -5407889 -6668910 -5618439 -5109276 -7007662 -7866137
7872 -7866137 -4428205 427600 1324206 -2427747 -7161833 -10720079 -13751670 -15546511
7864 -15546511 -13027422 -5753204 942751 856822 -5547990 -11006050 -9706194 -3877381
$$ packed form
7907g201361M97117L956001M115586K03544k853867j845256K8033p40885j962231
7898e803319k79016K362922J936785q36602j960442l89548J867095L886082N420484
7889F204441M407120K4611l568100k264531O54534j249072o670188p427275j246718
7880a1135178M152436K765958j191105j261021J050471N09163j898386q58475
7872g866137L437932M855805Q96606l751953m734086l558246l031591j794841
7864a5546511K519089P274218O695955q5929o404812n458060J299856N828813
$$ [...]
##END NTUPLES=NMR SPECTRUM
##END=
