##TITLE=31Pdec_SR90_rm4
 , 124 sc
 1.10.2021
##JCAMPDX= 6.0         $$ Bruker NMR JCAMP-DX V2.0
##DATA TYPE= NMR SPECTRUM
##DATA CLASS= NTUPLES
##ORIGIN= UXNMR, Bruker Analytische Messtechnik GmbH
##OWNER= root
$$ XWIN-NMR		Version 3.5
$$ Fri Oct  1 10:05:10 2021 Russian Standard Time (UT+4h)  she@DPX200
##.OBSERVE FREQUENCY= 81.013821
##.OBSERVE NUCLEUS= ^31P
##.ACQUISITION MODE= SIMULTANEOUS
##.ACQUISITION SCHEME= undefined
##.AVERAGES= 124
##.DIGITISER RES= 16
##SPECTROMETER/DATA SYSTEM= spect
##.PULSE SEQUENCE= zgpg30
##.SOLVENT NAME= CDCl3
##.SHIFT REFERENCE= (INTERNAL, CDCl3, 0, 248.564)
##AUDIT TRAIL= $$ (NUMBER, WHEN, WHO, WHERE, WHAT)
$$ ##TITLE= Audit trail, XWIN-NMR		Version 3.5
$$ ##JCAMPDX= 5.01
$$ ##ORIGIN= Bruker BioSpin GmbH
$$ ##OWNER= she
$$ F:/spectra/data/she/nmr/P31/1/pdata/1/auditp.txt
$$ ##AUDIT TRAIL=  $$ (NUMBER, WHEN, WHO, WHERE, WHAT)
(   1,<2021-10-01 10:04:03.82 +0400>,<she>,<DPX200>,
      <continue with go, POWCHK disabled, PULCHK disabled
       configuration hash MD5:
       00 E9 B6 7A A2 85 ED C7 34 08 36 98 17 FE 4E 26
       data hash MD5: 32K
       8C D2 F8 E6 3E B7 7C C0 72 32 B3 F1 00 18 13 71>)
(   2,<2021-10-01 10:04:06.57 +0400>,<she>,<DPX200>,
      <Start of raw data processing
       efp BC_mod = 2 LB = 1 FT_mod = 6 PKNL = 1 PHC0 = -8857.349 PHC1 = 118.8693 SI = 64K 
       data hash MD5: 64K
       2C 41 32 56 19 3C 30 10 95 51 4D 05 77 81 A0 E7>)
(   3,<2021-10-01 10:04:28.95 +0400>,<she>,<DPX200>,
      <pk PHC0 = -166.4397 PHC1 = 445.5997 
       data hash MD5: 64K
       44 CA E7 A7 E5 B0 CB CF 19 32 FC FE 2A 06 EE 1E>)
(   4,<2021-10-01 10:04:37.67 +0400>,<she>,<DPX200>,
      <abs ABSG = 5 
       data hash MD5: 64K
       07 7A 04 F0 7E 65 10 3C BD AA 11 96 10 B6 8E AB>)
$$ ##END=
$$ 
$$ hash MD5
$$ B7 FE B3 81 29 F2 DD 33 CB 42 A3 E6 23 BB 52 1C
##$RELAX= 
##$RELAX= 
##$RELAX= 
##$RELAX= 
##$RELAX= 
##$RELAX= 
##$RELAX= 
##$RELAX= 
$$ Bruker specific parameters
$$ --------------------------
##$DU= <F:/spectra>
##$EXPNO= 1
##$NAME= <P31>
##$PROCNO= 1
##$TYPE= <nmr>
##$USER= <she>
##$AMP= (0..31)
100 100 100 100 100 100 100 100 100 100 100 100 100 100 100 100 100 100 
100 100 100 100 100 100 100 100 100 100 100 100 100 100 
##$AQSEQ= 0
##$AQ_mod= 1
##$AUNM= <au_zg>
##$AUTOPOS= <>
##$BF1= 81.014009
##$BF2= 200.13
##$BF3= 200.13
##$BF4= 200.13
##$BF5= 200.13
##$BF6= 200.13
##$BF7= 200.13
##$BF8= 200.13
##$BYTORDA= 1
##$CFDGTYP= 0
##$CFRGTYP= 5
##$CHEMSTR= <none>
##$CNST= (0..31)
1 1 145 1 1 1 1 1 1 1 1 1 1 1 1 1 1 1 1 1 1 1 1 1 1 1 1 1 1 1 1 1 
##$CPDPRG= <waltz16>
##$CPDPRG1= <>
##$CPDPRG2= <waltz16>
##$CPDPRG3= <>
##$CPDPRG4= <mlev>
##$CPDPRG5= <mlev>
##$CPDPRG6= <mlev>
##$CPDPRG7= <mlev>
##$CPDPRG8= <mlev>
##$CPDPRGB= <>
##$CPDPRGT= <>
##$D= (0..31)
0 1 0 0 0 0 0 0 0 0 0 0.03 2e-05 3e-06 0 0 0 0 0 0 0 0 0 0 0 0 0 0 0 0 
0 0 
##$DATE= 1633068062
##$DBL= (0..7)
120 120 120 11 120 120 24 19 
##$DBP= (0..7)
150 150 150 150 150 150 150 150 
##$DBP07= 0
##$DBPNAM0= <>
##$DBPNAM1= <>
##$DBPNAM2= <>
$$ [...]
##$SUBNAM3= <"">
##$SUBNAM4= <"">
##$SUBNAM5= <"">
##$SUBNAM6= <"">
##$SUBNAM7= <"">
##$SUBNAM8= <"">
##$SUBNAM9= <"">
##$SW= 501.771253377433
##$SWIBOX= (0..15)
0 1 3 0 0 0 0 0 0 0 0 0 0 0 0 0 
##$SW_h= 40650.406504065
##$TD= 32768
##$TD0= 1
##$TE= 0
##$TE2= 300
##$TE3= 300
##$TEG= 300
##$TL= (0..7)
0 120 53 12 22 120 120 120 
##$TP= (0..7)
150 150 150 150 150 150 150 150 
##$TP07= 0
##$TPNAME0= <>
##$TPNAME1= <>
##$TPNAME2= <>
##$TPNAME3= <>
##$TPNAME4= <>
##$TPNAME5= <>
##$TPNAME6= <>
##$TPNAME7= <>
##$TPOAL= (0..7)
0.5 0.5 0.5 0.5 0.5 0.5 0.5 0.5 
##$TPOFFS= (0..7)
0 0 0 0 0 0 0 0 
##$TUNHIN= 0
##$TUNHOUT= 0
##$TUNXOUT= 0
##$USERA1= <user>
##$USERA2= <user>
##$USERA3= <user>
##$USERA4= <user>
##$USERA5= <user>
##$V9= 5
##$VALIST= <valist>
##$VCLIST= <CCCCCCCCCCCCCCC>
##$VD= 0
##$VDLIST= <DDDDDDDDDDDDDDD>
##$VPLIST= <PPPPPPPPPPPPPPP>
##$VTLIST= <TTTTTTTTTTTTTTT>
##$WBST= 1024
##$WBSW= 4
##$XGAIN= (0..3)
0 0 0 0 
##$XL= 0
##$YL= 0
##$YMAX_a= 31044
##$YMIN_a= -47028
##$ZGOPTNS= <>
##$ZL1= 120
##$ZL2= 120
##$ZL3= 120
##$ZL4= 120
##$ABSF1= 248.5645
##$ABSF2= -253.2056
##$ABSG= 5
##$ABSL= 3
##$ALPHA= 0
##$AQORDER= 0
##$ASSFAC= 0
##$ASSFACI= 0
##$ASSFACX= 0
##$ASSWID= 0
##$AUNMP= <proc_1d>
##$AZFE= 0.1
##$AZFW= 0.5
##$BCFW= 0
##$BC_mod= 2
##$BYTORDP= 0
##$COROFFS= 0
##$CY= -3
##$DATMOD= 1
##$DC= 0
##$DFILT= <>
##$DTYPP= 0
##$F1P= 0
##$F2P= 0
##$FCOR= 1
##$FTSIZE= 65536
##$FT_mod= 6
##$GAMMA= 0
##$GB= 0
##$INTBC= 1
##$INTSCL= 5.30512e-09
##$ISEN= 30
##$LB= 1
##$LEV0= 0
##$LPBIN= 0
##$MAXI= 10000
##$MC2= 0
##$MEAN= 0
##$ME_mod= 0
##$MI= 50
##$NCOEF= 0
##$NC_proc= -7
##$NLEV= 6
##$NOISF1= 182.463
##$NOISF2= 159.3651
##$NSP= 0
##$NTH_PI= 0
##$NZP= 0
##$OFFSET= 248.5645
##$PC= 4
##$PHC0= -9023.788
##$PHC1= 564.469
##$PH_mod= 1
##$PKNL= yes
##$PPARMOD= 0
##$PSCAL= 0
##$PSIGN= 0
##$REVERSE= no
##$SF= 81.014009
##$SI= 65536
##$SIGF1= 159.3651
##$SIGF2= -187.1042
##$SINO= 113.3802
##$SIOLD= 16384
##$SREGLST= <1H.CDCl3>
##$SSB= 0
##$STSI= 65536
##$STSR= 0
##$SW_p= 40650.406504065
##$SYMM= 0
##$S_DEV= 0
##$TDeff= 32768
##$TDoff= 0
##$TI= <>
##$TILT= no
##$TM1= 0
##$TM2= 0
##$TOPLEV= 0
##$USERP1= <user>
##$USERP2= <user>
##$USERP3= <user>
##$USERP4= <user>
##$USERP5= <user>
##$WDW= 1
##$XDIM= 65536
##$YMAX_p= 237474341
##$YMIN_p= -243283108
$$ End of Bruker specific parameters
$$ ---------------------------------
##NTUPLES= NMR SPECTRUM
##VAR_NAME=  FREQUENCY,     SPECTRUM/REAL,   SPECTRUM/IMAG
##SYMBOL=    X,             R,               I
##VAR_TYPE=  INDEPENDENT,   DEPENDENT,       DEPENDENT
##VAR_FORM=  AFFN,          ASDF,            ASDF
##VAR_DIM=   65536,         65536,           65536
##UNITS=     HZ,            ARBITRARY UNITS, ARBITRARY UNITS
##FACTOR=    0.620285442955139, 1,           1
##FIRST=     20137.2065510759, 0,            0
##LAST=      -20513.1999529892, 0,           0
##MIN=       -20513.1999529892, -243283108,  0
##MAX=       20137.2065510759, 237474341,    0
$$ Real data points
##PAGE= N=1
##DATA TABLE= (X++(R..R)), XYDATA
$$ [...]
##PAGE= N=2
##DATA TABLE= (X++(I..I)), XYDATA
$$ plain form
13038 2779405 4721037 1511187 -2122220 -1444908 2195783 4501145 3774475 922720
13030 922720 -2709619 -5081928 -4089026 -735578 1129490 165897 -453458 1602074 3809451
13021 3809451 2784954 -566508 -2778119 -2558735 -1221170 -34146 788762 1779560 3985197
13012 3985197 7299313 8762598 5493970 -274616 -3046146 -1866423 -1438181 -3606880
13004 -3606880 -3563809 1548050 5745515 1981216 -6818348 -11286914 -8401633 -4009548
12996 -4009548 -3014122 -3762116 -3530670 -3528090 -5298731 -6523390 -4412602 -803885 220539
12987 220539 -1091451 -7309 5296638 9514420 6325156 -2670357 -8914634 -7438300
12979 -7438300 -2606498 -887620 -1567953 548567 5407486 7231582 4199928 1978212
$$ packed form
13038B779405J941632l209850l633407O77312L640691K305362p26670k851755
13030I22720l632339k372309R92902L353448J865068r63593o19355K055532K207377
13021C809451j024497l351462k211611K19384J337565J187024Q22908R90798K205637
13012C985197L314116J463285l268628n768586k771530J179723M28242k168699
13004c606880M3071N111859M197465l764299q799564m468566K885281M392085
12996d009548R95426p47994K31446K580j770641j224659K110788L608717J024424
12987B20539j311990J084142N303947M217782l189264q995513o244277J476334
12979g438300M831802J718878o80333K116520M858919J824096l031654k221716
$$ plain form
12971 1978212 4853332 8942656 8395383 4098714 1385995 2073591 3728673 4811575
12963 4811575 5608286 5242750 2468053 -1071177 -2554153 -2571197 -3933175 -6209766 -5867465
12954 -5867465 -2267280 813030 857696 -6823 969940 2936513 3245937 1143287 -2078299
12945 -2078299 -4607359 -4439210 -477825 4849694 6170557 837528 -7061854 -10601171
12937 -10601171 -7433724 -1544308 1948015 1751049 -155 -1146952 -1232378 -683270 169682
12928 169682 892665 751318 -400534 -1394830 -834023 1153856 3094316 4018436 4114196
12919 4114196 3646888 2671524 1947126 2357034 2936372 1525839 -1689157 -3565991 -2424485
12910 -2424485 -696037 -916982 -1353778 1166892 5616430 7776102 6444588 4911375
$$ packed form
12971A978212K875120M089324n47273m296669k712719O87596J655082J082902
12963D811575P96711l65536k774697l539230j482976j7044j361978k276591L42301
12954e867465L600185L080310M4666q64519R76763J966573L09424k102650l221586
12945b078299k529060J68149L961385N327519J320863n333029p899382l539317
12937a0601171L167447N889416L492323j96966j751204j146797q5426N49108Q52952
12928A69682P22983j41347j151852r94296N60807J987879J940460R24120R5760
12919D114196m67308r75364p24398M09908N79338j410533l214996j876834J141506
12910b424485J728448k20945m36796K520670M449538K159672j331514j533213
$$ plain form
12902 4911375 5841371 8005659 8964773 8075769 5687279 1957040 -2112611 -4622352 -5185524
12893 -5185524 -5574722 -6708641 -6822539 -4101740 344251 3508582 3351868 -170198 -5427544
12884 -5427544 -9693681 -11217969 -11507431 -13281912 -15252693 -12238508 -2855971 6071188
12876 6071188 6668251 -212701 -6376403 -6332030 -1751651 3433928 7342802 8670670 5839202
12867 5839202 163805 -3645999 -2951856 -532669 32828 -444307 612155 2104263 559089
12858 559089 -4109853 -8007616 -8361850 -6067722 -3174808 -924134 -447086 -2258054 -4442591
12849 -4442591 -4256965 -2209559 -1563664 -2935833 -2791733 971275 5134458 5356374 1829372
12840 1829372 -1926652 -3942919 -4634671 -4327774 -3085701 -2220965 -3002468 -3937858 -1822872
$$ packed form
12902D911375R29996K164288R59114q89004k388490l730239m069651k509741n63172
12893e185524l89198j133919j13898K720799M445991L164331j56714l522066n257346
12884e427544m266137j524288k89462j774481j970781L014185R382537Q927159
12876F071188N97063o880952o163702M4373M580379N185579L908874J327868k831468
12867E839202n675397l809804O94143K419187N65497m77135J056462J492108j545174
12858E59089m668942l897763l54234K294128K892914K250674M77048j810968k184537
12849d442591J85626K047406O45895j372169J44100L763008M163183K21916l527002
12840A829372l756024k016267o91752L06897J242073Q64736p81503r35390K114986
$$ plain form
12831 -1822872 4113263 10789509 14351200 13753302 11429302 10946532 13337518 15555153
12823 15555153 14099378 10371597 9647650 13581586 17159951 15514089 10315237 5949029
12815 5949029 2778303 -854029 -2611224 1427692 9011161 12680077 9411645 4029881
12807 4029881 1778656 2449549 3514280 4285195 4534937 2932049 -510716 -3369182 -4136068
12798 -4136068 -3871689 -3265148 -1311519 1761424 3739300 4001937 4313347 4875315 3724076
12789 3724076 1398218 1458520 4481383 6598595 6268992 6855131 9527640 9982632 6501947
12780 6501947 4616242 7731755 9429686 3013197 -6320451 -8156406 -2469659 1403536
12772 1403536 -46181 -700318 3055425 6362498 5076344 2622585 3482392 6192142
$$ packed form
12831a822872N936135O676246L561691n97898k324000m82770K390986K217635
12823A5555153j455775l727781p23947L933936L578365j645862n198852m366208
12815E949029l170726l632332j757195M038916P583469L668916l268432n381764
12807D029881k251225O70893J064731P70915K49742j602888l442765k858466p66886
12798d136068K64379O06541J953629L072943J977876K62637L11410N61968j151239
12789C724076k325858O0302L022863K117212l29603N86139K672509M54992l480685
12780F501947j885705L115513J697931o416489r333648j835955N686747L873195
12772A403536j449717o54137L755743L307073j286154k453759Q59807K709750
$$ plain form
12764 6192142 7064430 5904090 4249140 2188215 272779 667355 3320397 4690860
12756 4690860 3023749 1030777 671826 -336665 -3469780 -5350493 -3147145 -147156
12748 -147156 -733228 -2672181 -247638 6290283 10200390 7461800 1753105 -971015
12740 -971015 713527 3899305 5757773 5803641 4939362 3882505 2740556 1707608 1524072
12731 1524072 2491296 3458441 3246725 2905848 4451427 7074751 7265075 3849564 292855
12722 292855 135055 2388369 3708107 3308737 3179707 4509413 6125127 5886730 2314709
12713 2314709 -3929414 -9002442 -8386617 -2408184 2814342 2488121 -686023 -597053 3585730
12704 3585730 6729178 5275463 1392542 -1219029 -2151111 -3065547 -4042803 -3599556 -1637218
$$ packed form
12764F192142Q72288j160340j654950k060925j915436L94576K653042J370463
12756D690860j667111j992972l58951j008491l133115j880713K203348K999989
12748a47156n86072j938953K424543O537921L910107k738590n708695k724120
12740i71015J684542L185778J858468M5868q64279j056857j141949j032948j83536
12731A524072R67224R67145k11716l40877J545579K623324J90324l415511l556709
12722B92855j57800K253314J319738l99370j29030J329706J615714k38397l572021
12713B314709o244123n073028O15825N978433N222526l26221l174144Q8970M182783
12704C585730L143448j453715l882921k611571r32082r14436r77256M43247J962338
$$ plain form
12695 -1637218 -467373 -2345055 -6508546 -9280874 -7512257 -1783148 4190194 6811975
12687 6811975 4498653 -2338032 -10638657 -14641994 -10454880 -1982406 1419499 -4289996
12679 -4289996 -12366254 -13316823 -5645813 4472289 11255792 12936536 9837197 4086892
12671 4086892 346745 1865036 5746716 6200358 2270709 -1776722 -3430731 -4566098
12663 -4566098 -6742172 -8579716 -8865313 -8128228 -6184438 -2152173 2342242 4278019
12655 4278019 4209125 5357797 7211447 5926829 2326132 2349176 6631121 7248779 -107118
12646 -107118 -7823229 -7129766 -1210853 812246 -1552683 -1335831 2625852 3968861 415912
12637 415912 -2709753 -2503078 -3102224 -7006756 -9722949 -7618462 -4487356 -4970241 -6740593
$$ packed form
12695a637218J169845j877682m163491k772328J768617N729109N973342K621781
12687F811975k313322o836685q300625m003337M187114Q472474L401905n709495
12679d289996q076258r50569P671010J0118102O783503J680744l099339n750305
12671D086892l740147J518291L881680M53642l929649m047431j654009j135367
12663d566098k176074j837544k85597P37085J943790M032265M494415J935777
12655D278019o8894J148672J853650j284618l600697K3044M281945O17658p355897
12646a07118p716111O93463N918913K023099k364929K16852L961683J343009l552949
12637D15912l125665K06675n99146l904532k716193K104487L131106m82885j770352
$$ plain form
12628 -6740593 -5064609 -1280373 -779156 -4745714 -9052894 -10102064 -7747469 -3755132
12620 -3755132 -859217 -1738430 -5454782 -6698836 -2326134 3134431 2750597 -3391219
12612 -3391219 -8658290 -9053803 -7052912 -6068409 -5879677 -4881761 -2942505 -301346 3271967
12603 3271967 6661985 7585824 6171495 5690679 7941366 10358844 9792149 6982368 4807528
12594 4807528 3724225 1890459 -794429 -1728540 546771 3463170 2872575 -2064480
12586 -2064480 -7542486 -9072530 -6313181 -3260787 -3745096 -7724320 -12272969 -14809597
12578 -14809597 -14330985 -10856585 -5560538 -877115 1413498 2128862 3255222 4879193
12570 4879193 5211206 3505302 1178113 -115190 12455 1127418 2391755 2553953 1127417
$$ packed form
12628f740593J675984L784236N01217l966558m307180j049170K354595L992337
12620c755132K895915q79213l716352j244054M372702N460565l83834o141816
12612c391219n267071l95513K000891R84503J88732R97916J939256K641159L573313
12603C271967L390018R23839j414329m80816K250687K417478n66695k809781k174840
12594D807528j083303j833766k684888r34111K275311K916399n90595m937055
12586b064480n478006j530044K759349L052394m84309l979224m548649k536628
12578a4809597M78612L474400N296047M683423K290613P15364J126360J623971
12570D879193L32013j705904k327189j293303J27645J114963J264337J62198j426536
$$ plain form
12561 1127417 -431850 -335915 879253 1138224 169569 -50681 1559408 3666448 4607278
12552 4607278 4174989 2953239 1632521 1222701 2122887 2876107 1792880 -287865 -1160199
12543 -1160199 -1005270 -2130236 -4758171 -6230551 -5144038 -3314156 -2798973 -3845912
12535 -3845912 -6304962 -9604291 -10662869 -6109941 1844140 6085303 3349621 -1863523
12527 -1863523 -4433831 -4858130 -5128379 -3695349 383652 2708771 -788352 -6467753
12519 -6467753 -7724075 -4846386 -3366622 -4174846 -2850364 1299252 3318940 1317577
12511 1317577 -21296 2427652 4633793 1785777 -4373617 -8584467 -8973501 -7261989
12503 -7261989 -4952154 -2819232 -1947961 -2131868 -1155920 1680547 3509080 2158099 264249
$$ packed form
12561A127417j559267R5935J215168K58971r68655k20250J610089K107040R40830
12552D607278m32289j221750j320718m09820R00186P53220j083227k080745q72334
12543a160199J54929j124966k627935j472380J086513J829882N15183j046939
12535c845912k459050l299329j058578M552928P954081M241163k735682n213144
12527a863523k570308m24299k70249J433030M079001K325119l497123n679401
12519f467753j256322K877689J479764q08224J324482M149616K019688k001363
12511A317577j338873K448948K206141k848016o159394m210850l89034J711512
12503g261989K309835K132922Q71271j83907R75948K836467J828533j350981j893850
$$ plain form
12494 264249 1899375 6820138 11276440 13005165 12143047 8751634 3411778 -604024
12486 -604024 -117732 2876296 3103215 -261526 -2020607 1078117 4879312 3610895 -1737839
12477 -1737839 -4976064 -3357581 -408450 52702 -1223552 -1614411 -1211871 -2165695 -4829536
12468 -4829536 -6916088 -6275206 -3133405 308302 1806622 1094025 333993 1540644 3379575
12459 3379575 2604598 -572446 -1567809 1961969 5740174 4770375 1042767 430816 3437444
12450 3437444 4808391 2159582 -1038907 -2035632 -2380592 -3099996 -2202318 250589 301529
12441 301529 -3071690 -4664634 -925119 3862088 4292311 2217910 2693178 5355355 6036013
12432 6036013 4082265 2016503 363223 -1291802 -624636 3750783 7244885 4641235
$$ packed form
12494B64249J635126M920763M456302J728725q62118l391413n339856m015802
12486f04024M86292K994028K26919l364741j759081L098724L801195j268417n348734
12477a737839l238225J618483K949131M61152j276254l90859M02540r53824k663841
12468d829536k086552O40882L141801L441707J498320p12597p60032J206651J838931
12459C379575p74977l177044r95363L529778L778205r69799l727608o11951L006628
12450C437444J370947k648809l198489r96725l44960p19404Q97678K452907N0940
12441C01529l373219j592944L739515M787207M30223k074401M75268K662177O80658
12432F036013j953748k065762j653280j655025O67166M375419L494102k603650
$$ plain form
12424 4641235 -1362147 -3764345 -1698081 -118802 -698806 -896184 -1027006 -3830444 -7309125
12415 -7309125 -6702574 -3810345 -5222566 -10430154 -11470402 -6347673 -2682188 -4781490
12407 -4781490 -7255133 -6020095 -5553437 -9004799 -10427224 -4529707 3587231 6432545
12399 6432545 5158523 4663938 4149598 1267864 -137056 3853461 7832004 3895813
12391 3895813 -5074261 -8955945 -5539513 -2467769 -4446734 -7579047 -7315925 -4373738
12383 -4373738 -1444355 -201195 -2210658 -7267909 -11032042 -9930667 -7414000 -8827177
12375 -8827177 -11240119 -6435783 5704583 15250866 15595898 10997990 7835854 5660083
12367 5660083 1423913 -3175261 -4080605 -1417368 896102 502533 -1418532 -2433755
$$ packed form
12424D641235o003382k402198K066264J579279n80004j97378j30822k803438l478681
12415g309125O06551K892229j412221n207588j040248N122729L665485k099302
12407d781490k473643J235038M66658l451362j422425N897517Q116938K845314
12399F432545j274022m94585n14340k881734j404920L990517L978543l936191
12391C895813q970074l881684L416432L071744j978965l132313K63122K942187
12383d373738K929383J243160k009463n057251l764133J101375K516667j413177
12375h827177k412942M804336J2140366R546283L45032m597908l162136k175771
12367E660083m236170m599174r05344K663237K313470l93569j921065j015223
$$ plain form
12359 -2433755 -1276785 1233866 3087602 3656349 4594720 6793579 8359742 8084460 8286053
12350 8286053 10425485 10829165 6090901 148250 -664072 2250738 2297979 -572334 450835
12341 450835 6856417 11484016 9887476 6371874 5141743 3835222 685800 231825
12333 231825 5598543 11485159 11569395 7762285 5501030 4520971 1474016 -1968655 -1251577
12324 -1251577 2861621 5089522 3529385 871304 -1253650 -3559631 -5418009 -5089901
12316 -5089901 -3390504 -2653288 -2450095 -477669 2884939 4942495 4960527 4216690 2712428
12307 2712428 -78112 -2189671 -1434170 19916 -1777638 -5553616 -5508230 123830 5843588
12298 5843588 5802937 337936 -5792315 -8462064 -6200898 -319028 5276988 6714038
$$ packed form
12359b433755J156970K510651J853736N68747R38371K198859J566163k75282K01593
12350H286053K139432M03680m738264n942651q12322K914810M7241k870313J023169
12341D50835O405582M627599j596540l515602j230131j306521l149422m53975
12333B31825N366718N886616Q4236l807110k261255r80059l046955l442671P17078
12324a251577M113198K227901j560137k658081k124954k305981j858378L28108
12316e089901J699397P37216K03193J972426L362608K057556J8032p43837j504262
12307B712428k790540k111559P55501J454086j797554l775978M5386N632060N719758
12298E843588m0651n465001o130251k669749K261166N881870N596016J437050
$$ plain form
12290 6714038 4018754 696805 -987182 -2077476 -3835321 -5238764 -4719506 -2325516
12282 -2325516 997378 4636679 7786631 8901173 6581614 753470 -6601613 -11435621
12274 -11435621 -10109633 -3694115 1886601 2452127 556032 845608 2635550 1832451
12266 1832451 -1056709 -870780 3711784 7587798 7037988 4619331 3489311 2166906
12258 2166906 -973513 -2550828 1102618 6912090 8281469 3984739 -1110301 -3454698
12250 -3454698 -4154190 -4914570 -5266281 -4766613 -4135318 -2962103 369228 5025032 7086440
12241 7086440 4558850 690398 228136 3949823 8542101 10444622 8389057 3643794
12233 3643794 -761375 -2380672 -2103217 -2905622 -4880945 -4301110 239806 3980943 2184417
$$ packed form
12290F714038k695284l321949j683987j090294j757845j403443N19258K393990
12282b325516L322894L639301L149952J114542k319559n828144p355083m834008
12274a1435621J325988O415518N580716N65526j896095K89576J789942q03099
12266A832451k889160J85929M582564L876014n49810k418657j130020j322405
12258B166906l140419j577315L653446N809472J369379m296730n095040k344397
12250c454698o99492p60380l51711M99668O31295J173215L331331M655804K061408
12241G086440k527590l868452m62262L721687M592278J902521k055565m745263
12233C643794m405169j619297K77455q02405j975323N79835M540916L741137j796526
$$ plain form
12224 2184417 -2350171 -3256593 -761770 -1306070 -6353690 -8812751 -3985174 2400992
12216 2400992 2719638 -939282 -943539 3070496 4046635 -139680 -2822651 469574 4727106
12207 4727106 3738866 -250541 -1176608 583447 -374578 -4432060 -5505618 -658162 4881130
12198 4881130 5122139 1349153 -1103813 -1319712 -3217925 -7916938 -10463811 -6545458
12190 -6545458 459183 2826715 -1791638 -7615148 -8448040 -4702006 -689649 1879763
12182 1879763 4040414 5215907 3402759 -428116 -2352469 -742946 2006931 3834308
12174 3834308 5509400 7609321 8551154 7262402 4618435 855117 -4803164 -10360059
12166 -10360059 -11213893 -6640613 -1890066 -782884 -640055 1676186 3533359 1665807
$$ packed form
12224B184417m534588r06422K494823n44300n047620k459061M827577O386166
12216B400992L18646l658920m257M014035R76139m186315k682971L292225M257532
12207D727106r88240l989407r26067J760055r58025m057482j073558M847456N539292
12198D881130K41009l772986k452966k15899j898213m699013k546873L918353
12190f545458P004641K367532m618353n823510q32892L746034M012357K569412
12182A879763K160651J175493j813148l830875j924353J609523K749877J827377
12174C834308J675092K099921R41833j288752k643967l763318n658281n556895
12166a0360059q53834M573280M750547J107182J42829K316241J857173j867552
$$ plain form
12158 1665807 -770376 973422 4399001 3302122 -1465935 -2671929 1957184 6660564
12150 6660564 6926647 4744222 2877035 783664 -1176670 48697 4362918 6639401
12142 6639401 4566756 3148150 6982058 12733096 14314782 11801398 9850878 10046872
12134 10046872 10117405 8866695 6892104 3755420 -807813 -3798457 -1741091 3690712
12126 3690712 6996330 5870595 3207335 1965355 1715021 973700 -252742 -1389394
12118 -1389394 -2397837 -3036741 -2790382 -2027593 -1675250 -1635249 -1107208 -348958 -412075 -1302616
12108 -1302616 -2063059 -2302159 -1901796 83619 3912610 7019241 6132347 1716708 -2217497
12099 -2217497 -3166812 -2630290 -2995979 -4344127 -5408647 -5716822 -5445873 -4512153 -2909346
$$ packed form
12158A665807k436183J743798L425579j096879m768057j205994M629113M703380
12150F660564K66083k182425j867187k093371j960334J225367M314221K276483
12142F639401k072645j418606L833908N751038J581686k513384j950520J95994
12134A0046872P0533j250710j974591l136684m563233k990644K057366N431803
12126C690712L305618j125735k663260j241980k50334p41321j226442j136652
12118a389394j008443o38904K46359P62789L52343M0001N28041P58250o3117q90541
12108a302616p60443k39100M00363J985415L828991L106631q86894m415639l934205
12099b217497r49315N36522l65689j348148j064520l08175K70949R33720J602807
$$ plain form
12090 -2909346 -1015966 1010529 3094180 4211123 2941541 -427513 -3803013 -5936433
12082 -5936433 -7678882 -9744105 -10856189 -9686738 -7549975 -7122440 -8524828 -8607548 -5194881
12073 -5194881 -812728 -200396 -3987992 -7079702 -4952234 185315 2317608 -239105
12065 -239105 -3385510 -4098475 -4230930 -5678445 -6324630 -4258476 -2228731 -3489371 -6280959
12056 -6280959 -7390603 -8297997 -11652881 -14007723 -9886947 -2497467 -1597648 -8955829
12048 -8955829 -14607154 -11380390 -5040181 -4249707 -7526913 -7770044 -4476804 -2676036
12040 -2676036 -2809894 -868658 2398400 1425968 -4028263 -6846823 -3120722 2238063
12032 2238063 3698213 2723839 3114323 4106499 3141244 1409228 1155026 366626 -4022104
$$ packed form
12090b909346J893380K026495K083651J116943j269582l369054l375500k133420
12082e936433j742449k065223j112084J169451K136763M27535j402388q2720L412667
12073e194881M382153O12332l787596l091710K127468N137549K132293k556713
12065b39105l146405p12965j32455j447515o46185K066154K029745j260640k791588
12056f280959j109644r07394l354884k354842M120776P389480Q99819p358181
12048h955829n651325L226764O340209P90474l277206k43131L293240J800768
12040b676036j33858J941236L267058r72432n454231k818560L726101N358785
12032B238063J460150r74374L90484R92176r65255j732016k54202p88400m388730
$$ plain form
12023 -4022104 -9256182 -9086999 -3003338 2195782 1226772 -3659049 -7119315 -7295428 -5595812
12014 -5595812 -3074884 -78294 2374491 3654121 4750864 6099558 5652806 2104859
12006 2104859 -1088797 1133148 7920586 12041187 8647928 1441239 -2309630 -509264
11998 -509264 2861136 3838320 2090812 -876155 -3771906 -5387090 -4955997 -3282168 -1764815
11989 -1764815 -311711 1890361 3912630 3862139 1916624 -145504 -2203400 -5279769
11981 -5279769 -7895800 -7182819 -4328284 -4089773 -7132750 -7958245 -3388024 2011803 3225368
11972 3225368 2787337 5928517 11412549 13548574 10831845 6240703 1151134 -4126085
11964 -4126085 -5772753 -815200 4614672 775659 -10561351 -16072425 -9283586 344870
$$ packed form
12023d022104n234078J69183O083661N199120r69010m885821l460266j76113J699616
12014e595812K520928K996590K452785J279630J096743J348694m46752l547947
12006B104859l193656K221945O787438M120601l393259p206689l750869J800366
11998e09264L370400R77184j747508k966967k895751j615184M31093J673829J517353
11989a764815J453104K202072K022269n0491j945515k062128k057896l076369
11981e279769k616031P12981K854535K38511l042977q25495M570221N399827J213565
11972C225368m38031L141180N484032K136025k716729m591142n089569n277219
11964d126085j646668M957553N429872l839013j1337010n511074O788839R628456
$$ plain form
11956 344870 2051036 -1295043 -523509 4722574 7713257 6890759 6266431 5687851 781797
11947 781797 -7127695 -10229193 -5476249 954388 3182842 2807277 3108504 2444244 -1425924
11938 -1425924 -4973736 -2871667 3758092 8385814 7791113 5301571 4921977 6000187
11930 6000187 5406017 2654515 469633 716458 1811021 1223582 -532376 -453810 2199781
11921 2199781 4134045 2657180 15646 286737 3164203 4308752 1725036 -1808913
11913 -1808913 -3472310 -4155793 -5739936 -7302085 -6422073 -2943509 339016 91428 -4946809
11904 -4946809 -12252897 -16130162 -12528067 -4400171 263428 -2617442 -8690289 -11481291
11896 -11481291 -10346608 -9095630 -9223944 -8813571 -7031496 -5239378 -3635413 -1046323
$$ packed form
11956C44870J706166l346079P71534N246083K990683q22498o24328n78580m906054
11947G81797p909492l101498M752944O430637K228454l75565L01227o64260l870168
11938a425924l547812K102069O629759M627722n94701k489542l79594J078210
11930F000187n94170k751502k184882K46825J094563n87439j755958P8566K653591
11921B199781J934264j476865k641534K71091K877466J144549k583716l533949
11913a808913j663397o83483j584143j562149Q80012L478564L282525k47588n038237
11904d946809p306088l877265L602095Q127896M663599k880870o072847k791002
11896a1481291J134683J250978j28314M10373J782075J792118J603965K589090
$$ plain form
11888 -1046323 1286339 50184 -4382145 -6723320 -4079547 -847173 -2370209 -6412327
11880 -6412327 -6035312 31265 5361416 4985965 1483649 -419085 -908748 -2879787 -5718241
11871 -5718241 -6091320 -3731654 -1805204 -1544839 -789534 1432430 3014688 3011554 3883753
11862 3883753 7024994 9293754 7228032 2389669 -986248 -2094775 -3587735 -6162813
11854 -6162813 -6891575 -3646005 1480998 4358571 3132689 -192235 -1846052 -165408
11846 -165408 2389933 2405699 987038 3060424 9300991 12507547 6515455 -3714721
11838 -3714721 -6911866 -109701 7605313 7451628 1581495 -1667018 1032046 5489347
11830 5489347 6470209 3176085 -947766 -1744390 1778152 6180913 7247239 5051391
$$ packed form
11888a046323K332662j236155m432329k341175K643773L232374j523036m042118
11880f412327L77015O066577N330151l75451l502316j902734m89663j971039k838454
11871e718241l73079K359666J926450K60365P55305K221964J582258l134Q72199
11862C883753L141241K268760k065722m838363l375917j108527j492960k575078
11854f162813p28762L245570N127003K877573j225882l324924j653817J680644
11846a65408K555341J5766j418661K073386O240567L206556n992092j0230176
11838c714721l197145O802165P715014j53685n870133l248513K699064M457301
11830E489347R80862l294124m123851p96624L522542M402761J066326k195848
$$ plain form
11822 5051391 3395626 4239157 5801710 6687879 7923252 9382879 8468182 4934370 2874209
11813 2874209 4335095 4931911 632059 -4335568 -2524588 5237123 9941469 6509090
11805 6509090 -101185 -2829618 -1483282 -440449 -1057523 -853270 1014797 1839570 54630
11796 54630 -1133885 2407601 9019206 11662110 6625407 -869087 -3154693 -627027
11788 -627027 -823869 -6726454 -11753637 -9221637 -1745871 3294695 3892801 3589174 3980674
11779 3980674 2966424 -350853 -4226150 -7472331 -9595799 -8443235 -2743634 3419471
11771 3419471 4200107 307538 -1833139 247836 2322100 1578963 801299 1913342 1967077
11762 1967077 -626454 -1942179 632825 2926217 907237 -1887344 -426384 2494356
$$ packed form
11822E051391j655765Q43531J562553Q86169J235373J459627r14697l533812k060161
11813B874209J460886N96816m299852m967627J810980P761711M704346l432379
11805F509090o610275k728433J346336J042833o17074K04253J868067Q24773j784940
11796E4630j188515L541486O611605K642904n036703p494494k285606K527666
11788f27027j96842n902585n027183K532000P475766N040566N98106l03627L91500
11779C980674j014250l317277l875297l246181k123468J152564N699601O163105
11771C419471P80636l892569k140677K080975K074264p43137p77664J112043N3735
11762A967077k593531j315725K575004K293392k018980k794581J460960K920740
$$ plain form
11754 2494356 720299 -4175479 -4663378 685197 5072453 4163010 1396143 729890 842841
11745 842841 -520946 -2033589 -1910898 -1158376 -862312 -217021 529878 -392306 -1688429
11736 -1688429 600443 5091396 3811483 -5954669 -14510337 -11546456 -668273 6031044
11728 6031044 4808256 2396618 2663228 1590426 -2688604 -4689991 -838779 3897220
11720 3897220 4064473 2065721 2415789 3038340 -543097 -5893589 -6131127 -232951 5952205
11711 5952205 8676966 10079240 12379613 13918475 12797371 10304241 8597187 7642739
11703 7642739 5985324 2842301 -1131671 -3847948 -3156864 190351 2544955 2563396 3820752
11694 3820752 8559798 11874403 8024072 634382 -797888 5431268 10774774 9209584
$$ packed form
11754B494356j774057m895778m87899N348575M387256r09443k766867o66253J12951
11745H42841j363787j512643J22691P52522K96064O45291P46899r22184j296123
11736a688429K288872M490953j279913r766152q555668K963881J0878183O699317
11728F031044j222788k411638K66610j072802m279030k001387L851212M735999
11720C897220J67253j998752L50068O22551l581437n350492k37538N898176O185156
11711E952205K724761J402274K300373J538862j121104k493130j707054r54448
11703G642739j657415l143023l973972k716277O91084L347215K354604J8441J257356
11694C820752M739046L314605l850331p389690j432270O229156N343506j565190
$$ plain form
11686 9209584 4831637 3609108 4713463 4547296 3317063 2406970 266639 -3667246
11678 -3667246 -5262810 -1380298 4455027 7254797 7546316 7680045 5517713 -1241427
11670 -1241427 -7907383 -7894680 -2953752 -427545 -1554984 -782905 3352623 5159051 1315978
11661 1315978 -3872239 -5279872 -3049425 329512 3490712 4685174 2193637 -1677350
11653 -1677350 -2165765 640793 1601611 -718102 -1556384 1222847 2797386 -154598 -3346055
11644 -3346055 -2379968 -306077 -1559046 -3587518 -1599584 2299521 2216931 -1812307 -4416290
11635 -4416290 -3528126 -1586614 651250 4492476 7935031 6859107 2168114 -535195
11627 -535195 667160 1799437 142697 -2347513 -4091461 -6168217 -7560039 -4550496
$$ packed form
11686I209584m377947j222529J104355j66167j230233r10093k140331l933885
11678c667246j595564L882512N835325K799770K91519J33729k162332o759140
11670a241427o665956J2703M940928K526207j127439P72079M135528J806428l843073
11661A315978n188217j407633K230447L378937L161200J194462k491537l870987
11653a677350m88415K806558R60818k319713q38282K779231J574539k951984l191457
11644c346055R66087K073891j252969k028472J987934L899105q2590m029238k603983
11635d416290Q88164J941512K237864L841226L442555j075924m690993k703309
11627e35195J202355J132277j656740k490210j743948k076756j391822L009543
$$ plain form
11619 -4550496 1980889 4928681 1112609 -2475564 1766591 10670341 15016259 12487673
11611 12487673 8624262 6458378 3238065 -1653307 -3139946 1717462 7864311 8662090
11603 8662090 4547627 781567 -966229 -3756117 -8797142 -12460737 -11054007 -5485798
11595 -5485798 267494 3297408 3216469 1350117 -95755 618034 2870714 4047034 2892788
11586 2892788 1540546 2959312 7158392 11155393 12120001 9534925 5117871 1908031
11578 1908031 2509872 6465195 9843438 9164795 5364932 2189013 1315670 1423169 1674564
11569 1674564 2894611 4507529 3604161 -768728 -4686776 -3469964 2299715 7257963
11561 7257963 7312907 3253109 -1430073 -4352784 -5499874 -6090294 -6897468 -7284181 -5892258
$$ packed form
11619d550496O531385K947792l816072l588173M242155Q903750M345918k528586
11611A2487673l863411k165884l220313m891372j486639M857408O146849P97779
11603H662090m114463l766060j747796k789888n041025l663595J406730N568209
11595e485798N753292L029914q0939j866352j445872P13789K252680J176320j154246
11586B892788j352242J418766M199080L997001R64608k585076m417054l209840
11578A908031O01841L955323L378243o78643l799863l175919q73343J07499K51395
11569A674564J220047J612918r03368m372889l918048J216812N769679M958248
11561G257963N4944m059798m683182k922711j147090n90420q07174l86713J391923
$$ plain form
11552 -5892258 -2637939 487158 1447924 736158 970007 3738146 7309689 7733834 2493632
11543 2493632 -6371735 -12979639 -12668227 -6780139 -1161348 704284 1387084 4943568
11535 4943568 10331938 12114164 7559027 454880 -3168995 -1477516 2239537 4013743
11527 4013743 3130266 1833201 2256515 4099795 5025495 3101717 -1122125 -4982876 -6260341
11518 -6260341 -5320536 -4402249 -4650381 -4455777 -1571938 3395040 7029111 7150706 5353374
11509 5353374 4306264 3907841 2134181 -1098217 -3418075 -3339196 -1756418 139872 1923440
11500 1923440 2374608 -164852 -4470776 -6355126 -4049643 -1027200 -717009 -1087138 1479533
11491 1479533 4908555 3582043 -2241119 -5168082 -1245509 3497722 1659136 -3979233
$$ packed form
11552e892258L254319L125097R60766p11766K33849K768139L571543M24145n240202
11543B493632q865367o607904L11412N888088N618791J865632O82800L556484
11535D943568N388370J782226m555137p104147l623875J691479L717053J774206
11527D013743q83477j297065M23314J843280R25700j923778m223842l860751j277465
11518f260341R39805R18287k48132J94604K883839M966978L634071J21595j797332
11509E353374j047110l98423j773660l232398k319858P8879J582778J896290J783568
11500A923440M51168k539460m305924j884350K305483L022443L10191l70129K566671
11491A479533L429022j326512n823162k926963L922573M743231j838586n638369
$$ plain form
11483 -3979233 -3719869 5063827 13583736 13144888 5815099 18195 -732902 238789 137616
11474 137616 172647 1102750 452756 -3361125 -7644148 -9035193 -8109295 -7675650 -8501083
11465 -8501083 -9464343 -10123017 -10158359 -7951846 -3064232 1244796 1616233 -391666 -795909
11456 -795909 347052 -353269 -2977144 -3892254 -2650951 -3431761 -7580432 -10315640 -7997984
11447 -7997984 -3584323 -912636 1663717 6849437 11552104 10607859 5073343 707208
11439 707208 -517247 -1326279 -2222616 -255057 4300699 6333431 3644243 1176805 3745648
11430 3745648 8207801 7342147 -180375 -7785707 -8795275 -3221450 3756118 7813342
11422 7813342 8627103 8107998 7354065 6111570 4337685 2681343 1204421 -674827 -2062809
$$ packed form
11483c979233K59364Q783696Q519909m38848p329789n796904p51097R71691j01173
11474A37616L5031R30103o49994l813881m283023j391045R25898M33645q25433
11465h501083r63260o58674l5342K206513M887614M309028L71437k007899m04243
11456g95909J142961p00321k623875r15110J241303p80810m148671k735208K317656
11447g997984M413661K671687K576353N185720M702667r44245n534516m366135
11439G07208j224455q09032q96337J967559M555756K032732k689188k467438K568843
11430C745648M462153q65654p522522p605332j009568N573825O977568M057224
11422G813342Q13761n19105p53933j242495j773885j656342j476922j879248j387982
$$ plain form
11413 -2062809 -266305 5491120 11334784 12276994 8121619 3445729 1670150 1604357 566830
11404 566830 -1333882 -1690375 414834 2630073 1577073 -3494772 -9588044 -12802323
11396 -12802323 -12033480 -8978748 -4975209 -130100 3905874 3510702 -2131923 -8280194
11388 -8280194 -9999519 -8653472 -9219845 -12099676 -12128824 -6257910 1951577 7046113 7554496
11379 7554496 5274564 1646410 -2512275 -5475482 -5682182 -4040934 -3286946 -4740292
11371 -4740292 -6559389 -5632747 -1266778 3277420 3922213 756257 -1811262 -985219 594301
11362 594301 -665749 -3317736 -3261205 -720939 36884 -2130344 -3516768 -2075979 -500028
11353 -500028 -629936 215619 3923633 6994671 5809541 3138991 3987391 6901382 5426071
$$ packed form
11413b062809J796504N757425N843664R42210m155375m675890j775579o5793j037527
11404E66830j900712l56493K105209K215239j053000n071845o093272l214279
11396a2802323P68843L054732M003539M845109M035974l95172n642625o148271
11388h280194j719325J346047n66373k879831k9148N870914Q209487N094536N08383
11379G554496k279932l628154m158685k963207k06700J641248P53988j453346
11371d740292j819097R26642M365969M544198O44793l165956k567519Q26043J579520
11362E94301j260050k651987N6531K540266P57823k167228j386424J440789J575951
11353e00028j29908Q45555L708014L071038j185130k670550Q48400K913991j475311
$$ plain form
11344 5426071 -1736404 -7624803 -6060943 206170 3284290 -107029 -5481717 -6515746
11336 -6515746 -1986783 3517101 4618057 171198 -6305088 -10242575 -9507297 -5006074
11328 -5006074 691753 4932866 6307094 5268134 3195807 868942 -1481060 -3063788
11320 -3063788 -3067287 -2386473 -2994533 -5010069 -6065021 -4307537 -456785 3697304 6936433
11311 6936433 8079802 6182019 2573181 437472 749595 836706 -1270511 -3586364 -3657504
11302 -3657504 -2783764 -3566023 -5278943 -5430995 -4553849 -5401570 -8038555 -9710606 -9416894
11293 -9416894 -8716672 -7988085 -6075830 -4151987 -5388945 -9330538 -10931626 -7484101
11285 -7484101 -2611923 -564589 -176692 1835390 4592564 4685310 2491357 2114134 5040222
$$ packed form
11344E426071p162475n888399J563860O267113L078120l391319n374688j034029
11336f515746M528963N503884J100956m446859o476286l937487P35278M501223
11328e006074N697827M241113J374228j038960k072327k326865k350002j582728
11320c063788l499O80814o08060k015536j054952J757484L850752M154089L239129
11311F936433J143369j897783l608838k135709L12123Q7111k107217k315853p1140
11302c657504Q73740p82259j712920j52052Q77146q47721k636985j672051K93712
11293i416894P00222P28587J912255J923843j236958l941593j601088L447525
11285g484101M872178K047334L87897K012082K757174R2746k193953l77223K926088
$$ plain form
11276 5040222 7762369 6543671 1818788 -2917560 -4639949 -2862864 110853 940040
11268 940040 -1387566 -4510194 -6311016 -7799521 -9975427 -10298946 -6686595 -3154346
11260 -3154346 -5301701 -10541474 -10209366 -2970858 2057454 -393354 -2676093 3362190
11252 3362190 11983016 11690437 3409877 -1240023 1468462 3099280 -722522 -2521843
11244 -2521843 2856775 7460996 2597700 -6242134 -7539253 -1711520 443952 -4837632
11236 -4837632 -9687241 -8300970 -5130348 -5864801 -8087165 -6056232 20531 4500649
11228 4500649 3870478 318840 -1366259 1120392 4943092 4699314 -919411 -6366347
11220 -6366347 -5918870 -1479099 401825 -2140374 -5259347 -6891431 -8741810 -10301941
$$ packed form
11276E040222K722147j218698m724883m736348j722389J777085K973717Q29187
11268I40040k327606l122628j800822j488505k175906l23519L612351L532249
11260c154346k147355n239773L32108P238508N028312k450808k282739O038283
11252C362190Q620826k92579q280560m649900K708485J630818l821802j799321
11244b521843N378618M604221m863296q839834j297119N827733K155472n281584
11236d837632m849609J386271L170622p34453k222364K030933O076763M480118
11228D500649o30171l551638j685099K486651L822700k43778n618725n446936
11220f366347M47477M439771J880924k542199l118973j632084j850379j560131
$$ plain form
11212 -10301941 -8014245 -2444424 663780 -425429 -43602 4974293 8786582 5604654
11204 5604654 -743832 -3149032 -2132309 -2591358 -3483892 154076 6516191 7650488
11196 7650488 1651059 -3825886 -2571360 2192488 3837335 1092677 -2634197 -4846885
11188 -4846885 -5427709 -4887858 -3920152 -3481845 -3859129 -4581624 -5431435 -6079698 -5271477
11179 -5271477 -2544035 31842 509740 423269 2188335 4475800 4530769 3933311 6360095
11170 6360095 9864875 8210995 1365367 -2381751 1959421 8723896 10289228 7370383
11162 7370383 5040046 3434484 -527079 -5273081 -6004796 -2974264 -1468838 -3379842
11154 -3379842 -5026473 -4349072 -4340210 -7064475 -9193058 -6779996 -1314749 2123573 881160
$$ packed form
11212a0301941K287696N569821L108204j089209L81827N017895L812289l181928
11204E604654o348486k405200J016723m59049q92534L637968O362115J134297
11196G650488n999429n476945J254526M763848J644847k744658l726874k212688
11188d846885n80824N39851R67706M38307l77284p22495q49811o48263Q08221
11179e271477K727442K575877M77898q6471J765066K287465N4969n97458K426784
11170F360095L504780j653880o845628l747118M341172O764475J565332k918845
11162G370383k330337j605562l961563m746002p31715L030532J505426j911004
11154c379842j646631O77401Q862k724265k128583K413062N465247L438322j242413
$$ plain form
11145 881160 -3511184 -8183842 -11369133 -12641363 -12273576 -10487705 -7307047 -3602909
11137 -3602909 -1460520 -1906141 -2883416 -1606808 1514366 3841240 5010659 7078961
11129 7078961 9753307 9427469 4807155 49445 -501413 1800210 2407118 280945 -1231008
11120 -1231008 403439 3730595 5583398 4648876 2471818 1855880 4014879 6823267
11112 6823267 6915764 3989101 1193255 441014 -5061 -1555070 -2105381 -7024 1662553
11103 1662553 -660160 -4371738 -3657903 1510543 5081399 4270374 3323066 5795883 8593361
11094 8593361 7425286 3924986 2665409 3747678 3152030 -629704 -4435488 -4850979
11086 -4850979 -1912289 1557225 2279892 -1224439 -6728045 -9312279 -6181332 181215
$$ packed form
11145H81160m392344m672658l185291j272230L67787J785871L180658L704138
11137c602909K142389m45621r77275J276608L121174K326874J169419K068302
11129G078961K674346l25838m620314m757710n50858K301623O06908k126173j511953
11120a231008J634447L327156J852803r34522k177058o15938K158999K808388
11112F823267R2497k926663k795846p52241m46075j550009n50311K098357J669577
11103A662553k322713l711578P13835N168446L570856q11025r47308K472817K797478
11094H593361j168075l500300j259577J082269n95648l781734l805784m15491
11086d850979K938690L469514P22667l504331n503606k584234L130947O362547
$$ plain form
11078 181215 5053644 6342192 4862215 1789105 -1640798 -3518181 -3205028 -2755914 -3958319
11069 -3958319 -5547627 -6011997 -6919363 -9710611 -11294001 -7740833 -1211493 2137686
11061 2137686 834507 -814080 -553936 -1096632 -3681310 -4631074 -1322546 3129615 4536486
11052 4536486 3310716 2399324 2801180 3927577 5220260 4852784 453149 -5977788 -7825543
11043 -7825543 -2221693 5087946 7424748 6026555 6126872 7575548 5903558 1036030
11035 1036030 -1947578 -931742 421645 -767894 -2273772 -903599 2796772 5798927
11027 5798927 5865582 2554846 -2500975 -5735109 -4633759 -960437 1370474 1242041 198025
11018 198025 -1685849 -5347559 -8306109 -6105149 341612 4011896 953953 -4408057
$$ packed form
11078A81215M872429J288548j479977l073110l429903j877383L13153M49114j202405
11069c958319j589308m64370r07366k791248j583390L553168O529340L349179
11061B137686j303179j648587K60144n42696k584678r49764L308528M452161J406871
11052D536486j225770r11392M01856J126397J292683l67476m399635o430937j847755
11043g825543N603850P309639K336802j398193J00317J448676j671990m867528
11035A036030k983608J015836J353387j189539j505878J370173L700371L002155
11027E798927O6655l310736n055821l234134J101350L673322K330911j28433j044016
11018A98025j883874l661710k958550K200960O446761L670284l057943n362010
$$ plain form
11010 -4408057 -6396322 -6118316 -7850241 -10737679 -9852570 -4421956 405458 694543 -1600769
11001 -1600769 -2651200 -2161470 -2216627 -2486293 147982 6379395 11131760 8253134 -1232043
10992 -1232043 -8625276 -7650282 -2624392 -2482316 -7942538 -10418407 -4893812 2215692
10984 2215692 2006124 -4731594 -9734716 -8887477 -5489966 -2880692 -91902 3972052
10976 3972052 7288485 8165176 8299898 9773272 11636730 12020583 11585486 12295516 14040317
10967 14040317 14705863 12833589 8715291 3995811 1593774 4220346 10572890 14364405
10959 14364405 10311061 882842 -5839178 -5414787 -1446847 -19187 -2599828 -6133284
10951 -6133284 -7717676 -6612024 -3093392 1669535 4869107 3929984 -107452 -2903764
$$ packed form
11010d408057j988265K78006j731925k887438Q85109N430614M827414K89085k295312
11001a600769j050431M89730n5157k69666K634275O231413M752365k878626r485177
10992a232043p393233R74994N025890J42076n460222k475869N524595P109504
10984B215692k09568o737718n003122Q47239L397511K609274K788790M063954
10976C972052L316433Q76691J34722J473374J863458L83853m35097P10030J744801
10967A4040317O65546j872274m118298m719480k402037K626572O352544L791515
10959A4364405m053344r428219o722020M24391L967940J427660k580641l533456
10951f133284j584392J105652L518632M762927L199572r39123m037436k796312
$$ plain form
10943 -2903764 -1480725 2588080 5418403 5283137 3947316 4069182 6111116 7919095
10935 7919095 7139254 3850378 431714 -1152841 -1120946 -790739 -1198522 -3435468 -8167605
10926 -8167605 -13034752 -13039118 -6960376 -1470443 -3931182 -11620419 -13897503 -6234674 3858428
10917 3858428 7529217 5227589 2356838 -76391 -3934543 -6926036 -4881031 345658
10909 345658 2557674 725651 58309 3009717 5932631 6160880 5862139 6383834 4904889
10900 4904889 69597 -4422244 -5567875 -5534402 -6493334 -5881597 -1615768 2287190 955666
10891 955666 -3570466 -5428658 -3454485 -1242489 -743857 -1266679 -3129829 -6615151 -8531021
10882 -8531021 -5639264 -695344 769386 -1011300 -1077096 1026224 445860 -3409415 -4175388
$$ packed form
10943b903764J423039M068805K830323j35266j335821J21866K041934J807979
10935G919095p79841l288876l418664j584555L1895L30207m07783k236946m732137
10926h167605m867147m366O078742N489933k460739p689237k277084P662829J0093102
10917C858428L670789k301628k870751k433229l858152k991493K045005N226689
10909C45658K212016j832023o67342K951408K922914K28249k98741N21695j478945
10900D904889m835292m491841j145631L3473r58932O11737M265829L902958j331524
10891I55666m526132j858192J974173K211996M98632n22822j863150l485322j915870
10882h531021K891757M943920J464730j780686o5796K103320n80364l855275p65973
$$ plain form
10873 -4175388 1547492 8322634 10001983 7876170 5935541 3292504 -2481242 -8026939
10865 -8026939 -7115723 80824 6316346 6246924 2026472 -678079 694988 3719029 4120359
10856 4120359 675100 -2577743 -481617 6221172 10681072 8289168 2050202 -2803525
10848 -2803525 -5927265 -9613263 -12431854 -10483982 -4026339 1866876 3248374 494105
10840 494105 -3778344 -6616465 -5615340 -1617281 547160 -2115863 -5694920 -4786277
10832 -4786277 -1295290 -1620726 -5680757 -6169051 -260773 5188371 3595107 -2172302
10824 -2172302 -4997810 -3284775 -657308 805516 2050694 3470190 3984909 3069508
10816 3069508 1111716 -1346104 -3100902 -2692001 -757353 134533 -681439 -935265 520178
$$ packed form
10873d175388N722880O775142J679349k125813j940629k643037n773746n545697
10865h026939R11216P196547O235522o9422m220452k704551J373067L024041M01330
10856D120359l445259l252843K096126O702789M459900k391904o238966m853727
10848b803525l123740l685998k818591J947872O457643N893215J381498k754269
10840D94105m272449k838121J001125L998059K164441k663023l579057R08643
10832d786277L490987l25436m060031m88294N908278N449144j593264n767409
10824b172302k825508J713035K627467J462824J245178J419496N14719r15401
10816C069508j957792k457820j754798M08901J934648Q91886q15972k53826J455443
$$ plain form
10807 520178 2016924 3068487 5883734 10259602 11377649 6579862 536573 -836013
10799 -836013 1629657 3270736 3534313 5326683 8306061 8772319 5842628 2686400 1488981
10790 1488981 1312297 954388 324191 -769756 -1959322 -1206317 2391548 5870166 6002770
10781 6002770 4209988 4002709 5111584 4533973 1962093 -493937 -2515198 -4524426
10773 -4524426 -4216185 -128378 2810458 -1492050 -9802430 -12024515 -5304273 1863528
10765 1863528 1908231 -2560409 -5041178 -4225829 -2624272 -1405525 -1027165 -2860660 -6192219
10756 -6192219 -7239844 -4742792 -2953374 -5459565 -9375653 -9369067 -4621174 1540832 6103568
10747 6103568 7213129 3496980 -3705427 -9438773 -9716798 -5629204 -904281 2361994
$$ packed form
10807E20178J496746J051563K815247M375868J118047m797787o043289j372586
10799h36013K465670J641079K63577J792370K979378M66258k929691l156228j197419
10790A488981j76684l57909o30197j093947j189566P53005L597865L478618J32604
10781F002770j792782k07279J108875n77611k571880k456030k021261k009228
10773d524426L08241M087807K938836m302508q310380k222085O720242P167801
10765A863528M4703m468640k480769Q15349J601557J218747L78360j833495l331559
10756f192219j047625K497052J789418k506191l916088O586M747893O162006M562736
10747F103568J109561l716149p202407n733346k78025M087594M724923L266275
$$ plain form
10739 2361994 3642447 2610328 473098 163384 2581673 4723374 3586532 -256661
10731 -256661 -4441164 -7301630 -7312504 -3795630 51187 -864582 -6052622 -8472688 -4250285
10722 -4250285 1293832 1588604 -1505767 -1454645 2464504 4474470 1137630 -4230100 -6313078
10713 -6313078 -3550060 1265244 4058091 3088032 434081 -674224 242704 1549525
10705 1549525 3149360 5894986 7925384 6598287 4276949 6256214 11919897 14639054
10697 14639054 12284501 10344982 11578463 10677496 4007863 -3034292 -4317501 -1662514
10689 -1662514 972995 4814346 10450268 11697047 4155923 -5662392 -8787330 -6446125
10681 -6446125 -5252782 -4954026 -1429938 2358971 165612 -5083403 -4279665 3087378
$$ packed form
10739B361994J280453j032119k137230l09714K418289K141701j136842l843193
10731b56661m184503k860466j0874L516874L846817r15769n188040k420066M222403
10722d250285N544117K94772l094371N1122L919149K009966l336840n367730k082978
10713f313078K763018M815304K792847r70059k653951j108305R16928J306821
10705A549525J599835K745626K030398j327097k321338J979265N663683K719157
10697A4639054k354553j939519J233481r00967o669633p042155j283209K654987
10689a662514K635509L841351N635922J246779p541124r818315l124938K341205
10681f446125J193343K98756L524088L788909k193359n249015Q03738P367043
$$ plain form
10673 3087378 8065354 6308274 2626186 697360 -1641065 -4973396 -5378299 -1617317
10665 -1617317 2122431 2706922 1043806 -1931904 -5735057 -7195391 -4136232 -1350646
10657 -1350646 -4671261 -10074249 -8337583 -295912 3346052 -1437859 -6889505 -7531489
10649 -7531489 -7968182 -12079819 -14921730 -11675844 -6226899 -4284261 -4649062 -3259569
10641 -3259569 -313260 1761849 2505222 1656955 -1713305 -5252951 -4315049 263918 1929061
10632 1929061 -1023305 -1981990 2959324 8049167 6946957 1796568 -2279266 -5269188
10624 -5269188 -8729543 -9821971 -5561870 977439 4470992 4179752 2663075 1323332
10616 1323332 1046903 3195866 6338754 6325506 2840166 817020 2113932 1935528 -2190178
$$ packed form
10673C087378M977976j757080l682088j928826k338425l332331m04903L760982
10665a617317L739748N84491j663116k975710l803153j460334L059159K785586
10657a350646l320615n402988J736666Q041671L641964m783911n451646o41984
10649g531489m36693m111637k841911L245886N448945J942638l64801J389493
10641c259569K946309K075109P43373q48267l370260l539646R37902M578967J665143
10632A929061k952366r58685M941314N089843j102210n150389m075834k989922
10624e269188l460355j092428M260101O539309L493553k91240j516677j339743
10616A323332k76429K148963L142888j3248l485340k023146J296912j78404m125706
$$ plain form
10607 -2190178 -4475279 200274 7075232 7957175 2721346 -2047689 -2517383 321231
10599 321231 5061803 10311051 12680342 9759281 4112045 536027 672366 3010859
10591 3010859 5927716 8011246 7820052 5719434 3560205 1203013 -3118170 -7821989
10583 -7821989 -8073785 -2799499 3074119 5381687 4938940 3387923 492204 -2344327
10575 -2344327 -1930411 766815 612647 -3161921 -4968707 -2387046 -696633 -4042646
10567 -4042646 -8751040 -9779190 -7725313 -5241873 -2405790 332683 462033 -1571570
10559 -1571570 -1517668 1295336 2111163 -772743 -2817371 -1678229 -1139324 -3161343 -4050807
10550 -4050807 -2286728 -1816323 -3633238 -2763965 2237689 5770054 5260916 5291014 7537428
$$ packed form
10607b190178k285101M675553O874958Q81943n235829m769035m69694K838614
10599C21231M740572N249248K369291k921061n647236l576018J36339K338493
10591C010859K916857K083530j91194k100618k159229k357192m321183m703819
10583g821989k51796N274286N873618K307568m42747j551017k895719k836531
10575b344327M13916K697226j54168l774568j806786K581661J690413l346013
10567d042646m708394j028150K053877K483440K836083K738473J29350k033603
10559a571570N3902K813004Q15827k883906k044628J139142N38905k022019q89464
10550d050807J764079M70405j816915Q69273N001654L532365n09138L0098K246414
$$ plain form
10541 7537428 6873919 2007663 -871451 169682 -945811 -5330324 -5283777 663320 2759191
10532 2759191 -2620074 -5003480 2128014 9714130 9200579 5916559 6040669 4763474
10524 4763474 -1381445 -4957430 -1940620 -693207 -5128154 -5256905 3092941 7123059
10516 7123059 -338968 -6363362 -1946586 215802 -9355042 -15888575 -6302231 5217565
10508 5217565 2385898 -3486575 3683433 13143616 8599908 508598 4512074 8538139
10500 8538139 -2989618 -13996324 -5544475 3434056 -10376347 -25282507 -12564576
10493 -12564576 2200761 -17403611 -39062734 -13727196 5367667 -91494989 -282246065
10486 -282246065 -386154861 -287983464 -95594461 7389318 -8964366 -35443574 -12025129
$$ packed form
10541G537428o63509m866256k879114J041133j115493m384513M6547N947097K095871
10532B759191n379265k383406P131494P586116n13551l284020J24110j277195
10524D763474o144919l575985L016810J247413m434947j28751Q349846M030118
10516G123059p462027o024394M416776K162388r570844o533533R586344J1519796
10508E217565k831667n872473P170008R460183m543708q091310M003476M026065
10500H538139j1527757j1006706Q451849Q978531j3810403j4906160J2717931
10493a2564576J4765337j9604372k1659123K5335538J9094863r6862656j90751076
10486b82246065j03908796R8171397J92389003J02983779j6353684k6479208K3418445
$$ plain form
10479 -12025129 14039624 2643799 -15965210 -10927937 -1299063 -7798162 -14358431 -6171306
10471 -6171306 863583 -5568480 -8964729 3610478 16197415 12152818 507545 -4242589
10463 -4242589 -4739709 -7099099 -6523635 -1297464 -1533555 -10762776 -16403629 -9744316 1105677
10454 1105677 7248658 11185084 14842014 12496055 4021023 -791261 1351483 1815305
10446 1815305 -3060610 -5697072 -3194865 -2536981 -4629342 -1111718 7146923 7317079
10438 7317079 -2698870 -8184834 -2398615 2172400 -2915085 -7275584 -2300484 2165211
10430 2165211 -3804986 -11562705 -9281530 -2294711 -2178144 -6780328 -6577327 -1930341
10422 -1930341 310058 177874 2013455 4806141 5602191 6160890 7522093 5519056 -350286
$$ packed form
10479a2025129K6064753j1395825j8609009N037273R628874o499099o560269Q187125
10471f171306P034889o432063l396249J2575207J2586937m044597j1645273m750134
10463d242589m97120k359390N75464N226171k36091r229221n640853O659313J0849993
10454A105677O142981L936426L656930k345959q475032m812284K142744M63822
10446A815305m875915k636462K502207O57884k092361L517624Q258641J70156
10438G317079j0015949n485964N786219M571015n087485m360499M975100M465695
10430B165211n970197p757719K281175O986819J16567m602184K03001M646986
10422a930341K240399j32184J835581K792686P96050N58699J361203k003037n869342
$$ plain form
10413 -350286 -2618437 1408869 2818689 -3951681 -10361139 -8484862 -5221466 -9340590
10405 -9340590 -14840463 -11546489 -3628303 -2167357 -5683944 -3653639 4584257 9182641
10397 9182641 6025869 761700 -2049460 -2664389 -654082 4127437 7051868 4646445
10389 4646445 2114936 5358265 9387706 5782593 -1825237 -2357857 4537190 8218030
10381 8218030 5006584 3056053 6824830 9148706 3807630 -3914115 -5362900 -347621
10373 -347621 4667588 5435802 2695884 -352577 -251627 4079591 8930233 8859084 3369345
10364 3369345 -2425968 -4460234 -3611994 -2160491 -148856 2779428 4679766 3014185
10356 3014185 -1665531 -5366286 -4649524 -951595 266906 -3856999 -9161982 -9590118
$$ packed form
10413c50286k268151M027306J409820o770370o409458J876277L263396m119124
10405i340590n499873L293974P918186J460946l516587K030305Q237896M598384
10397I182641l156772n264169k811160o14929K010307M781519K924431k405423
10389D646445k531509L243329M029441l605113p607830n32620O895047L680840
10381H218030l211446j950531L768777K323876n341076p721745j448785N015279
10373c47621N015209P68214k739918l048461J00950M331218M850642p1149n489739
10364C369345n795313k034266Q48240J451503K011635K928284J900338j665581
10356C014185m679716l700755P16762L697929J218501m123905n304983m28136
$$ plain form
10348 -9590118 -5512968 -2411454 -1926020 -473494 2466417 2086815 -2974740 -6945129
10340 -6945129 -6147683 -4872916 -6918953 -8340671 -5072488 -1056578 -952552 -707266 5479966
10331 5479966 13445823 14298017 8397227 4183455 4851906 6028952 5774579 6761506 7976240
10322 7976240 4165205 -4255788 -9461891 -7430689 -3474015 -3333767 -5358105 -5115854
10314 -5115854 -2161737 1450397 4794568 7008861 6651359 4811106 4957051 7345027
10306 7345027 7791029 4639110 2471545 5150818 8894629 6983605 -627836 -7011487
10298 -7011487 -7265272 -4065439 -3183639 -5861212 -7684590 -4643363 1677636 6331892
10290 6331892 7243034 6605883 6260827 5235617 3119918 2069050 2922525 2820230 -116299
$$ packed form
10348i590118M077150L101514M85434J452526K939911l79602n061555l970389
10340f945129P97446J274767k046037j421718L268183M015910J04026K45286O187232
10331E479966P965857Q52194n900790m213772O68451J177046k54373R86927J214734
10322G976240l811035q420993n206103K031202L956674J40248k024338K42251
10314e115854K954117L612134L344171K214293l57502j840253J45945K387976
10306G345027M46002l151919k167565K679273L743811j911024p611441o383651
10298g011487k53785L199833Q81800k677573j823378L041227O320999M654256
10290F331892R11142o37151l45056j025210k115699j050868Q53475j02295k936529
$$ plain form
10281 -116299 -3159754 -3886417 -5067786 -9509542 -13225681 -10318005 -2780437 1670150
10273 1670150 903865 233646 2543129 4081235 2113984 -157774 480822 2320893 3349301
10264 3349301 5475308 9807012 12204690 8528567 1153404 -4473012 -7113374 -8711021
10256 -8711021 -8350418 -3172062 4931845 9078202 5534002 -1653319 -6092332 -6309948
10248 -6309948 -5440116 -5824133 -6697175 -6451743 -4622452 -1447163 2406737 5037043 4316977
10239 4316977 1056642 -787525 804535 2373615 -310013 -5261167 -6505720 -3317903
10231 -3317903 -1711568 -4655687 -6552817 -1980866 4759601 5274725 -549284 -5203808
10223 -5203808 -5642432 -6519360 -9832580 -9624162 -1772961 7331340 8716250 3606049 634764
$$ packed form
10281a16299l043455p26663j181369m441756l716139K907676P537568M450587
10273A670150p66285o70219K309483J538106j967251k271758O38596J840071J028408
10264C349301K126007M331704K397678l676123p375163n626416k640362j597647
10256h711021L60603N178356Q103907M146357l544200p187321m439013k17616
10248f309948Q69832l84017q73042K45432J829291L175289L853900K630306p20066
10239D316977l260335j844167J592060J569080k683628m951154j244553L187817
10231c317903J606335k944119j897130M571951O740467N15124n824009m654524
10223e203808m38624q76928l313220K08418P851201R104301J384910n110201k971285
$$ plain form
10214 634764 1798871 -360003 -9710469 -18427597 -17177925 -8370692 -2405651 -3007560
10206 -3007560 -3885757 -530510 2269404 -1493383 -9079819 -12691297 -10009496 -5536863
10198 -5536863 -3203026 -3061586 -4491352 -7268714 -9293485 -8057244 -4783198 -2745797
10190 -2745797 -1554058 1913160 6903546 8986488 7472454 6217149 5818133 2389770
10182 2389770 -3389661 -4193810 2248539 6989739 2060423 -7279108 -9940015 -3846547
10174 -3846547 4286705 9790196 12227465 10048753 2441371 -4837703 -4519494 1350090
10166 1350090 3916477 1044780 -256728 3831258 8011739 7327051 4631763 4236826
10158 4236826 4654559 2898835 954533 2272761 5113939 4814681 954353 -2309196
$$ packed form
10214F34764J164107k158874r350466q717128J249672Q807233N965041o01909
10206c007560q78197L355247K799914l762787p586436l611478K681801M472633
10198e536863K333837J41440j429766k777362k024771J236241L274046K037401
10190b745797J191739L467218M990386K082942j514034j255305l99016l428363
10182B389770n779431q04149O442349M741200m929316r339531k660907O093468
10174c846547Q133252N503491K437269k178712p607382p279074L18209N869584
10166A350090K566387k871697j301508M087986M180481o84688k695288l94937
10158D236826M17733j755724j944302J318228K841178k99258l860328l263549
$$ plain form
10150 -2309196 -2245881 -190475 1546812 2253793 1774497 -775300 -5724055 -10802456 -11877622
10141 -11877622 -7072918 71250 3544441 1723485 -981762 -699151 604970 -894198
10133 -894198 -4339757 -5602123 -3568823 -981186 -128037 -1573946 -5894680 -12308368
10125 -12308368 -16518940 -14612010 -8755754 -4686042 -4084722 -4022087 -3176404 -3171708 -3853538
10116 -3853538 -2918907 -799697 -481451 -1848768 -1765430 -396162 -1348115 -4495644 -5311565
10107 -5311565 -3112347 -2922529 -6325152 -7657005 -3500867 734478 -858351 -5358631
10099 -5358631 -6072080 -2541231 729012 2272108 4181842 6653595 7413720 5309644
10091 5309644 443146 -7177954 -15175644 -17806109 -12288260 -3858795 389111 479552
$$ packed form
10150b309196O3315K055406J737287P06981m79296k549797m948755n078401j075166
10141a1877622M804704P144168L473191j820956k705247K82611J304121j499168
10133h94198l445559j262366K033300K587637Q53149j445909m320734o413688
10125a2308368m210572J906930N856256M069712O01320O2635Q45683M696o81830
10116c853538R34631K119210L18246j367317Q3338J369268r51953l147529q15921
10107e311565K199218J89818l402623j331853M156138M235345j592829m500280
10099e358631p13449L530849L270243J543096J909734K471753P60125k104076
10091E309644m866498p621100p997690k630465N517849Q429465M247906R0441
$$ plain form
10083 479552 1120761 2625409 879479 -4291984 -7381452 -4938517 129087 3332921
10075 3332921 3420314 1259596 -2147922 -5150691 -6101715 -5574008 -5340322 -5088775 -3304033
10066 -3304033 -1139383 -1331894 -3051011 -2484825 459954 1086733 -2345620 -4802616 -1963842
10057 -1963842 2586192 2312785 -2808418 -6800368 -6323024 -3808034 -2072320 -681657
10049 -681657 909655 679533 -2787683 -6929800 -7907190 -5390951 -2019305 1104407 5252989
10040 5252989 9981514 11342581 6571336 -910480 -4127333 -626701 4233626 3455597
10032 3455597 -3319285 -9457850 -9087624 -3514165 901678 177689 -3441322 -4999844
10024 -4999844 -2702701 804564 2411308 2277517 2906590 5214231 6741954 4406630
$$ packed form
10083D79552O41209J504648j745930n171463l089468K442935N067604L203834
10075C332921Q7393k160718l407518l002769r51024N27707K33686K51547J784742
10066c304033K164650j92511j719117N66186K944779O26779l432353k456996K838774
10057a963842M550034k73407n121203l991950M77344K514990J735714J390663
10049f81657J591312k30122l467216m142117r77390K516239L371646L123712M148582
10040E252989M728525J361067m771245p481816l216853L500632M860327p78029
10032C455597o774882o138565L70226N573459M415843p23989l619011j558522
10024d999844K297143L507265J606744j33791O29073K307641J527723k335324
$$ plain form
10016 4406630 -1358960 -6330304 -7134893 -5378942 -5405486 -7956133 -8603547 -4013181 2560941
10007 2560941 4906701 1676229 -2738339 -4580671 -4345109 -3870878 -3609903 -3661868 -3998267
9998 -3998267 -2724519 2048402 7560087 8276479 4153046 1600045 3338858 3595978 -1625597
9989 -1625597 -5880577 -1624606 6603898 8091864 2597902 301956 4961038 8310058
9981 8310058 4475592 -440872 766487 4357046 2444825 -3840632 -6701572 -4193151
9973 -4193151 -1966156 -3183457 -4259850 -1974329 1113537 847819 -2844047 -6860284
9965 -6860284 -8852116 -8195800 -5113088 -920812 2135642 3221355 4345907 7700638
9957 7700638 12017341 13693240 11903656 10225327 11440245 12681429 8944043 787919
$$ packed form
10016D406630n765590m971344q04589J755951k6544k550647o47414M590366O574122
10007B560941K345760l230472m414568j842332K35562M74231K60975n1965l36399
9998c998267J273748M772921N511685P16392m123433k553001J738813K57120n221575
9989a625597m254980M255971Q228504J487966n493962k295946M659082L349020
9981H310058l834466m916464J207359L590559j912221o285457k860940K508421
9973d193151K226995j217301j076393K285521L087866k65718l691866m016237
9965f860284j991832O56316L082712M192276L056454J085713J124552L354731
9957G700638M316703J675899j789584j678329J214918J241184l737386q156124
$$ plain form
9949 787919 -5402600 -5806908 -3991905 -5194437 -9182492 -11850824 -11127639 -7791988 -2786214
9940 -2786214 2403286 4671398 2796334 524168 2060546 5965739 7695244 6372761
9932 6372761 4216476 1215258 -3679579 -7468694 -6030080 -1759788 -1293636 -5306842
9924 -5306842 -7837218 -6632676 -6294528 -9044138 -10430486 -7833989 -5760804 -7872475
9916 -7872475 -10228508 -8010355 -3653134 -2414044 -3987660 -4386366 -3235883 -3789302 -7375482
9907 -7375482 -11913228 -14581854 -13353499 -7980908 -1602837 1163175 -553443 -3327932
9899 -3327932 -4896178 -6259862 -7801578 -8314599 -8615669 -10348459 -10726879 -5721130 749503
9890 749503 -204222 -8354764 -13443497 -11434609 -10117610 -13709043 -14844419 -9436666 -6190146
$$ packed form
9949G87919o190519m04308J815003j202532l988055k668332P23185L335651N005774
9940b786214N189500K268112j875064k272166J536378L905193J729505j322483
9932F372761k156285l001218m894837l789115J438614M270292M66152m013206
9924e306842k530376J204542L38148k749610j386348K596497K073185k111671
9916g872475k356033K218153M357221J239090j573616l98706J150483n53419l586180
9907g375482m537746k668626J228355N372591O378071K766012j716618k774489
9899c327932j568246j363684j541716n13021l01070j732790l78420N005749O470633
9890G49503r53725q150542n088733K008888J316999l591433j135376N407753L246520
$$ plain form
9881 -6190146 -11095295 -15494800 -12119517 -9958922 -17803434 -26154188 -25196459 -28366246
9873 -28366246 -51411144 -74776680 -58981642 -1637659 50720128 59684915 39135244
9866 39135244 26539437 31504780 34790674 25173120 12875658 8951981 10532839 9616399
9858 9616399 4458570 -1326583 -4062693 -2396877 1792496 4939702 6156962 7506136
9850 7506136 8614242 6166104 1099705 -252293 3994573 7131429 4282898 -57920
9842 -57920 -533062 305632 -1398937 -2425439 1083199 4817325 2974043 -1134778 -451333
9833 -451333 3825978 5082220 2894004 2086163 2660925 772814 -1623435 1498897 8642786
9824 8642786 10851951 5082571 -1253824 -1610801 1489206 2614580 1340510 617365 2021698
$$ packed form
9881f190146m905149m399505L375283K160595p844512q350754R57729l169787
9873b8366246k3044898k3365536J5795038N7343983N2357787Q964787k0549671
9866C9135244j2595807M965343L285894r617554j2297462l923677J580858r16440
9858I616399n157829n785153k736110J665816M189373L147206J217260J349174
9850G506136J108106k448138n066399j351998M246866L136856k848531m340818
9842e7920m75142Q38694j704569j026502L508638L734126j843282m108821O83445
9833d51333M277311J256242k188216q07841N74762j888111k396249L122332P143889
9824H642786K209165n769380o336395l56977L100007J125374j274070p23145J404333
$$ plain form
9815 2021698 5370148 9398088 11260785 8773465 3777994 -89628 -2409588 -4564846
9807 -4564846 -4706088 -66762 6257623 7638925 3684438 985599 2793371 4683451
9799 4683451 2688681 -722994 -1802706 -931213 379327 2750147 5912407 7225366
9791 7225366 6531804 7810183 12405684 15109220 11060695 2821440 -3329216 -4798019
9783 -4798019 -2938301 317716 2241022 -477146 -6829398 -10167523 -6468326 -786921
9775 -786921 -373772 -4378811 -6431097 -5103690 -4580347 -5466425 -2588982 6025275 14183287
9766 14183287 14970885 9017513 2066107 -2331306 -4060614 -2966706 1320580 6487220
9758 6487220 8395407 6085388 3412899 3963775 5983906 4735207 -620454 -5230266
$$ packed form
9815B021698L348450M027940J862697k487320m995471l867622k319960k155258
9807d564846j41242M639326O324385J381302l954487k698839J807772J890080
9799D683451j994770l411675j079712Q71493J310540K370820L162260J312959
9791G225366o93562J278379M595501K703536m048525q239255o150656j468803
9783d798019J859718L256017J923306k718168o352252l338125L699197N681405
9775g86921M13149m005039k052286J327407N23343q86078K877443Q614257Q158012
9766A4183287P87598n953372o951406m397413j729308J093908M287286N166640
9758F487220J908187k310019k672489N50876K020131j248699n355661m609812
$$ plain form
9750 -5230266 -4572130 62494 4011090 5283987 5299874 4696444 2203917 -1786075 -4006136
9741 -4006136 -2359896 1159741 3216739 2970681 1841420 1170862 1311707 1483536 -103019
9732 -103019 -3949672 -6821206 -4663833 1305435 5272401 4986757 4616536 6886632 7661006
9723 7661006 3028793 -2807509 -3003775 1755690 5432395 6594147 8297612 9200428 4056272
9714 4056272 -5449224 -9453777 -3471245 4486024 5570228 2211650 1927728 4431095
9706 4431095 3322302 -2057367 -5251565 -3334379 -1235216 -3274925 -6531195 -6094092
9698 -6094092 -2530257 68965 916048 2970193 7028808 9185261 5672311 -1758592
9690 -1758592 -7352502 -7752900 -4930421 -2405033 -968652 -24647 -850217 -4622964 -8010181
$$ packed form
9750e230266O58136M634624L948596J272897J5887o03430k492527l989992k220061
9741d006136J646240L519637K056998k46058j129261o70558J40845J71829j586555
9732a03019l846653k871534K157373N969268L966966k85644l70221K270096P74374
9723G661006m632213n836302j96266M759465L676705J161752J703465R02816n144156
9714D056272r505496m004553N982532P957269J084204l358578k83922K503367
9706D431095j108793n379669l194198J917186K099163k039709l256270M37103
9698f094092L563835K599222Q47083K054145M058615K156453l512950p430903
9690a758592n593910m00398K822479K525388J436381R44005q25570l772747l387217
$$ plain form
9681 -8010181 -5721187 1351809 5506506 2500689 -2141205 -1292976 3189000 3779870 -1000697
9672 -1000697 -4512732 -1535755 5472970 10431656 9775228 4136841 -2162806 -3278655
9664 -3278655 2208550 7597291 5295556 -2169382 -4447432 2168932 9406053 9049909
9656 9049909 3604730 183121 -421035 -2146895 -5027505 -5034519 -895845 4667766 9459396
9647 9459396 12643962 12324492 7424145 1307128 -1382516 -1115902 -2068713 -4816814 -5582255
9638 -5582255 -2967105 -240883 149573 -298556 118906 686766 880062 1626861 2379234
9629 2379234 814939 -2727801 -4332817 -2180637 428146 106792 -1996534 -3363714
9621 -3363714 -4616815 -7393380 -10159505 -9902358 -6718266 -3586857 -2437550 -2964745 -4391314
$$ packed form
9681h010181K288994P072996M154697l005817m641894Q48229M481976N90870m780567
9672a000697l512035K976977P008725M958686o56428n638387o299647j115849
9664c278655N487205N388741k301735p464938k278050O616364P237121l56144
9656I049909n445179l421609o04156j725860k880610p014M138674N563611M791630
9647I459396L184566l19470m900347o117017k689644K66614r52811k748101p65441
9638e582255K615150K726222L90456m48129M17462N67860J93296P46799P52373
9629B379234j564295l542740j605016K152180K608783l21354k103326j367180
9621c363714j253101k776565k766125K57147L184092L131409J149307n27195j426569
$$ plain form
9612 -4391314 -5904782 -5997064 -3638709 122576 3130728 3988836 2034816 -2770505 -8184028
9603 -8184028 -9828251 -5758966 34016 1306043 -3543375 -10184125 -13431984 -11687344
9595 -11687344 -6901836 -2310605 -206603 -360142 -595717 315067 1363388 1891150 3407523
9586 3407523 6473075 7734990 3828291 -2558847 -4876897 -1616740 1238150 -1311867
9578 -1311867 -6037694 -6184186 -1227855 2319759 -216984 -5782885 -8204020 -6137867
9570 -6137867 -3629160 -3529294 -3563477 -382074 4669447 6865976 5052141 4044379 8127950
9561 8127950 14268466 15111288 8584995 1159557 -175411 3180762 3524105 -2888951 -11086397
9552 -11086397 -14048335 -11199847 -7508729 -5955170 -4911062 -2960008 -1855753 -2648573
$$ packed form
9612d391314j513468r2282K358355L761285L008152Q58108j954020m805321n413523
9603h184028j644223M069285N792982J272027m849418o640750l247859J744640
9595a1687344M785508M591231K104002j53539k35575R10784J048321N27762J516373
9586C407523L065552J261915l906699o387138k318050L260157K854890k550017
9578a311867m725827j46492M956331L547614k536743n565901k421135K066153
9570f137867K508707R9866l4183L181403N051521K196529j813835j007762M083571
9561H127950O140516Q42822o526293p425438j334968L356173L43343o413056q197446
9552a1086397k961938K848488L691118J553559J044108J951054J104255p92820
$$ plain form
9544 -2648573 -2612022 537014 3970403 3410674 -182385 -2091887 -1158057 -686011 -2019246
9535 -2019246 -2537947 -1261771 -1053431 -2841269 -2823779 962341 3951033 1713319 -2402186
9526 -2402186 -2037931 2180541 3752234 576272 -2226826 -621103 2815319 3757897 2148736
9517 2148736 678966 381342 393916 94633 -639940 -1885691 -3132038 -3901022 -5514316
9508 -5514316 -9606408 -13755347 -12113242 -3284721 5236896 4735770 -3747744 -10462812
9500 -10462812 -9145739 -3803564 -1633795 -3194910 -3316311 427278 4777020 6311753
9492 6311753 5667213 4744001 3316734 1065327 73428 1627313 2483772 -1208242 -7128239
9483 -7128239 -8975977 -5824277 -3767875 -6171893 -7788189 -2825402 5365370 8486521
$$ packed form
9544b648573L6551L149036L433389n59729l593059j909502R33830M72046j333235
9535b019246n18701J276176K08340j787838J7490L786120K988692k237714m115505
9526b402186L64255M218472J571693l175962k803098J605723L436422R42578j609161
9517B148736j469770k97624J2574k99283p34573j245751j246347p68984j613294
9508e514316m092092m148939J642105Q828521Q521617n01126q483514o715068
9500a0462812J317073N342175K169769j561115j21401L743589M349742J534733
9492F311753o44540r23212j427267k251407r91899J553885Q56459l692014n919997
9483g128239j847738L151700K056402k404018j616296M962787Q190772L121151
$$ plain form
9475 8486521 5082034 1937854 3618050 6256372 3903071 -2874957 -7821118 -6709327
9467 -6709327 -1703130 1760259 943778 -1926729 -3072955 -1791391 -419734 -325811 -478534
9458 -478534 -393314 -1236859 -2457520 -924813 3661667 5856037 1128331 -6929497 -10622472
9449 -10622472 -7691656 -2257060 2019635 4247341 2993886 -2812070 -9281446 -10225767
9441 -10225767 -5898033 -3240939 -5510682 -7576358 -4411456 1413847 4712333 5385647
9433 5385647 6492908 8194056 8375854 6844396 4599352 919988 -4763898 -9554000
9425 -9554000 -9366148 -3818039 3594784 8895270 9390993 4584923 -2080983 -4949081 -2442167
9416 -2442167 1022155 2106441 3653233 8475335 12151978 8568282 359541 -3562473
$$ packed form
9475H486521l404487l144180J680196K638322k353301o778028m946161J111791
9467f709327N006197L463389q16481k870507j146226J281564J371657R3923j52723
9458d78534Q5220q43545j220661J532707M586480K194370m727706q057828l692975
9449a0622472K930816N434596M276695K227706j253455n805956o469376r44321
9441a0225767M327734K657094k269743k065676L164902N825303L298486O73314
9433E385647J107261J701148J81798j531458k245044l679364n683886m790102
9425i554000J87852N548109P412823N300486M95723m806070o665906k868098K506914
9416b442167L464322J084286J546792M822102L676643l583696q208741l922014
$$ plain form
9408 -3562473 -639763 2381012 452916 -2602388 -1140346 3347794 4728444 776693
9400 776693 -4772510 -7477010 -6510354 -4147388 -2986689 -3915307 -5972503 -7818227 -8840645
9391 -8840645 -8629672 -6767007 -4342600 -4079058 -6943688 -10076959 -10434436 -8846073 -7509239
9382 -7509239 -5404901 -530612 4576013 4980402 1235192 -399016 2904965 6346818
9374 6346818 4921401 445956 -2161759 -1963529 -1560426 -2142190 -2748022 -2952559 -3111843
9365 -3111843 -2911238 -2111846 -1738131 -2454102 -2815739 -960349 2973275 7368723 10531280
9356 10531280 10491452 5825367 -1501264 -6552386 -6988741 -5888954 -6486882 -6777094 -3017649
9347 -3017649 3433884 7274013 6570407 4635871 4248100 3811523 614259 -4746130 -8815928
$$ packed form
9408c562473K922710L020775j928096l055304J462042M488140J380650l951751
9400G76693n549203k704500R66656K362966J160699r28618k057196j845724j022418
9391h840645K10973J862665K424407K63542k864630l133271l57477J588363J336834
9382g509239K104338M874289N106625M04389l745210j634208L303981L441853
9374F346818j425417m475445k607715J98230M03103n81764o05832k04537j59284
9365c111843K00605P99392L73715p15971l61637J855390L933624M395448L162557
9356A0531280l9828m666085p326631n051122m36355J099787n97928k90212L759445
9347c017649O451533L840129p03606j934536l87771m36577l197264n360389m069798
$$ plain form
9338 -8815928 -8920288 -5513666 -1578852 232734 218105 608811 1742292 1448412 -532786
9329 -532786 -542298 3722532 8565933 8941710 5847439 4335732 5322107 4968268 2361600
9320 2361600 1819779 5653648 9962088 10709193 9614250 10171139 11222211 9050592 4005808
9311 4005808 544464 936614 2364343 750132 -4668363 -10809547 -13337785 -10032862
9303 -10032862 -2945649 3044634 4720014 2925141 -20593 -3473452 -7453637 -10355838
9295 -10355838 -10353766 -8309892 -6792148 -6575454 -6404478 -5811653 -5526482 -5097878 -3069379
9286 -3069379 -290020 -95661 -3408090 -6043196 -3579697 2317080 5334461 2212579
9278 2212579 -3561488 -6463515 -5083416 -2094062 161427 1729457 3331581 4969864
$$ packed form
9338h815928j04360L406622L934814J811586j4629L90706J133481k93880j981198
9329e32786r512M264830M843401L75777l094271j511707R86375l53839k606668
9320B361600n41821L833869M308440P47105j094943N56889J051072k171619n044784
9311D005808l461344L92150J427729j614211n418495o141184k528238L304923
9303a0032862P087213N990283J675380j794873k945734l452859l980185k902201
9295a0355838K072K043874J517744K16694J70976N92825K85171M28604K028499
9286c069379K779359J94359l312429k635106K463499N896777L017381l121882
9278B212579n774067k902027J380099K989354K255489J568030J602124J638283
$$ plain form
9270 4969864 6546735 8025646 8560715 7255929 5257228 5060038 7053756 9094312 10369140
9261 10369140 12510612 15111955 14108692 8265008 3632648 6123974 12106230 12977602
9253 12977602 7973484 4896305 7575467 10702208 9708947 7838197 8810613 9539247 6279400
9244 6279400 2255176 2141731 3569894 1699926 -1532133 -1056458 1334436 -99563 -3636007
9235 -3636007 -1678230 5805533 9724566 6298800 3196523 6667390 11361926 9392755
9227 9392755 2509195 -2127571 -3037942 -3529242 -3458157 -28329 4882616 5727401 1578038
9218 1578038 -2628360 -3342331 -1614233 1125204 5102842 8903234 8880455 3877997 -2590544
9209 -2590544 -6261724 -5787794 -2055966 3237024 7723365 9835442 10683276 12001592 12460908
$$ packed form
9270D969864J576871J478911N35069j304786j998701j97190J993718K040556J274828
9261A0369140K141472K601343j003263n843684m632360K491326N982256Q71372
9253A2977602n004118l077179K679162L126741r93261j870750R72416P28634l259847
9244F279400m024224j13445J428163j869968l232059M75675K390894j433999l536444
9235c636007J957777P483763L919033l425766l102277L470867M694536j969171
9227I392755o883560m636766r10371m91300P1085L429828M910945Q44785m149363
9218A578038m206398p13971J728098K739437L977638L800392k2779n002458o468541
9209b590544l671180M73930L731828N292990M486341K112077Q47834J318316M59316
$$ plain form
9200 12460908 9429642 4444230 2634297 5450689 8055669 6048897 1252663 -1685199
9192 -1685199 -1313341 805631 3493122 5928030 6464252 4943326 4461823 7202593 9858562
9183 9858562 7329582 488908 -4070234 -2682973 1010711 1941259 367215 132566 2534159
9174 2534159 5092289 5615705 4800958 4577072 5586363 6759607 6501075 4111175 510610
9165 510610 -2559942 -4214113 -4718736 -4208526 -2580952 -975591 -1054795 -1649770 887097
9156 887097 6403339 8339654 2185177 -5838464 -5340783 3364060 8953243 5684271 1516839
9147 1516839 4457586 9221694 6407958 -1153943 -2722366 2541196 4738675 683501
9139 683501 -839602 4781369 8959142 4421571 -1730703 456283 7061835 6872946 -176865
$$ packed form
9200A2460908l031266m985412j809933K816392K604980k006772m796234k937862
9192a685199L71858K118972K687491K434908N36222j520926m81503K740770K655969
9183I858562k528980o840674m559142J387261L693684R30548j574044k34649K401593
9174B534159K558130N23416q14747k23886J009291J173244k58532k389900l600565
9165E10610l070552j654171n04623N10210J627574J605361p9204n94975K536867
9156H87097N516242J936315o154477q023641M97681Q704843N589183l268972m167432
9147A516839K940747M764108k813736p561901j568423N263562K197479m055174
9139F83501j523103N620971M177773m537571o152274K186986O605552j88889p049811
$$ plain form
9130 -176865 -3727879 -267522 2856981 1551127 1099560 4609479 5965180 301255 -6710192
9121 -6710192 -7083102 -2136194 1208954 1391974 2157584 4210798 4165518 1085329 -2021585
9112 -2021585 -3398849 -4220181 -4798010 -3854226 -2335444 -3410289 -7046154 -8502659 -4596725
9103 -4596725 1382777 3544955 263315 -5092535 -8803179 -9931104 -9790557 -10380969 -12782132
9094 -12782132 -15445098 -14941385 -10365713 -5927629 -6243120 -9543301 -9432354 -4154939 321617
9085 321617 -1012002 -4730922 -4591467 -1249148 -247457 -2103347 -1812301 1410981 1875102
9076 1875102 -2413945 -5070057 -1740654 1755305 -1242777 -6248568 -3864015 5101183
9068 5101183 10399969 7613891 3223058 3037146 4416998 3331497 1543208 2040065 3114956
$$ packed form
9130a76865l551014L460357L124503j305854m51567L509919J355701n663925p011447
9121f710192l72910M946908L345148J83020P65610K053214m5280l080189l106914
9112b021585j377264q21332n77829R43784J518782j074845l635865j456505L905934
9103d596725N979502K162178l281640n355850l710644j127925J40547n90412k401163
9094a2782132k662966N03713M575672M438084l15491l300181J10947N277415M476556
9085C21617j333619l718920J39455L342319J001691j855890K91046L223282M64121
9076A875102m289047k656112L329403L495959k998082n005791K384553Q965198
9068E101183N298786k786078m390833j85912J379852j085501j788289M96857J074891
$$ plain form
9059 3114956 2071960 533473 1230824 2871287 2731250 1615207 1872122 2634174 1277731
9050 1277731 -1720640 -3125268 -1514651 1169664 2126663 188051 -3069886 -3839290 241204
9041 241204 6236852 8717406 7143567 6360950 8431165 9314015 6520861 4262353 6162171
9032 6162171 7937606 3642392 -4428232 -8828496 -7562390 -4946039 -3615347 -2516387
9024 -2516387 -1990742 -3933218 -6607788 -5622159 -981060 2318353 1573466 -843844 -2545017
9015 -2545017 -3647321 -3555431 -787825 2812768 3093001 93555 -1854941 -1621111 -2593703
9006 -2593703 -4789603 -2872006 4386291 9640611 7245831 2048928 1446759 3389819
8998 3389819 54647 -9013253 -15325721 -12960129 -5181445 1343294 3553619 1686726
$$ packed form
9059C114956j042996j538487O97351J640463j40037j116043K56915P62052j356443
9050A277731k998371j404628J610617K684315R56999j938612l257937p69404M080494
9041B41204N995648K480554j573839p82617K070215Q82850k793154k258508J899818
9032F162171J775435m295214q070624m400264J266106K616351J330692J098960
9024b516387N25645j942476k674570R85629M641099L299413p44887k417310j701173
9015b545017j102304R1890K767606L600593K80233k999446j948496K33830r72592
9006b593703k195900J917597P258297N254320k394780n196903o02169J943060
8998C389819l335172r067900o312468K365592P778684O524739K210325j866893
$$ plain form
8990 1686726 -3373214 -9681552 -13733632 -12846263 -7403608 -215640 5387792 7096721
8982 7096721 5037774 1983497 958412 2563297 5356770 7961847 9460433 8800787
8974 8800787 5805758 2197331 -151500 -1332233 -2146860 -2040268 -736409 -655809 -4137178
8965 -4137178 -8543919 -8162072 -1915498 4627655 6789193 6641073 8236999 10101515 7339297
8956 7339297 279859 -4299600 -2079236 3038547 5154465 5102364 8235528 14696794 17540416
8947 17540416 12351711 4203519 1334148 4660454 8020462 7558849 5901999 6459790
8939 6459790 8249128 8609301 7607283 6812858 6011012 4203083 2334403 1847995 1329086
8930 1329086 -2187886 -8474852 -13498577 -14276983 -12152878 -10356201 -10220936 -10939587 -11400839
$$ packed form
8990A686726n059940o308338m052080Q87369N442655P187968N603432J708929
8982G096721k058947l054277j025085J604885K793473K605077J498586o59646
8974H800787k995029l608427k348831j180733q14627J06592J303859Q0600l481369
8965d137178m406741L81847O246574O543153K161538j48120J595926J864516k762218
8956G339297p059438m579459K220364N117783K115918n2101L133164O461266K843622
8947A7540416n188705q148192k869371L326306L360008m61613j656850N57791
8939F459790J789338L60173j002018p94425q01846j807929j868680m86408n18909
8930A329086l516972o286966n023725p78406K124105J796677J35265p18651m61252
$$ plain form
8921 -11400839 -10777283 -8515850 -5478202 -4307408 -6631894 -9992002 -9675418 -4447318
8913 -4447318 1193105 1787512 -3182231 -9555300 -13478366 -14077057 -11991533 -8232485 -4926570
8904 -4926570 -4250888 -5156387 -3565702 2204524 8195726 9283893 5420665 1023197 -687729
8895 -687729 -316544 -216605 -2158235 -6195842 -9651201 -8530521 -2605813 2488068 1710660
8886 1710660 -2244790 -2685095 1040007 2664494 -1211747 -6127180 -6815894 -4349087 -2864298
8877 -2864298 -3027378 -2870482 -2722050 -4975597 -9458756 -12180321 -9357205 -1679864 5579995
8868 5579995 7181042 3755335 1953963 6284886 12081074 10736008 1481968 -7220818
8860 -7220818 -8668143 -4687693 -94394 3281411 4337090 1065859 -4536351 -5846850
$$ packed form
8921a1400839O23556K261433L037648J170794k324486l360108L16584N228100
8913d447318N640423N94407m969743o373069l923066n98691K085524L759048L305915
8904d926570O75682r05499J590685N770226N991202J088167l863228m397468j710926
8895f87729L71185R9939j941630m037607l455359J120680N924708N093881p77408
8886A710660l955450m40305L725102J624487l876241m915433o88714K466807J484789
8877b864298j63080J56896J48432k253547m483159k721565K823116P677341P259859
8868E579995J601047l425707j801372M330923N796188j345066r254040q702786
8860g220818j447325L980450M593299L375805J055679l271231n602210j310499
$$ plain form
8852 -5846850 -880462 3433041 1757303 -807274 2619882 8887268 10477234 8454220
8844 8454220 9415333 12311186 9781751 2200611 -1283381 2357007 5032947 1019349
8836 1019349 -4719012 -6679535 -7842893 -11743032 -13582116 -7814211 890494 3150037
8828 3150037 -1738633 -6010409 -5266155 -2413836 -190861 2946911 7867209 11271588
8820 11271588 9912274 5241779 1735128 2087757 4976565 6463133 3481749 -3023957
8812 -3023957 -8692481 -10273095 -8751660 -7172513 -6789116 -6640016 -5439350 -2402213 2332501
8803 2332501 6661523 7672577 5535671 4279504 6552701 9546601 8818183 4667854
8795 4667854 1700989 2777285 6084455 7922127 6251926 1753009 -2975875 -5625943
$$ packed form
8852e846850M966388M313503j675738k564577L427156O267386J589966k023014
8844H454220R61113K895853k529435p581140l483992L640388K675940m013598
8836A019349n738361j960523j163358l900139j839084N767905Q704705K259543
8828C150037m888670m271776P44254K852319K222975L137772M920298L404379
8820A1271588j359314m670495l506651L52629K888808J486568k981384o505706
8812c023957n668524j580614J521435J579147L83397J49100J200666L037137M734714
8803B332501M329022J011054k136906j256167K273197K993900p28418m150329
8795D667854k966865J076296L307170J837672j670201m498917m728884k650068
$$ plain form
8787 -5625943 -6556845 -7792957 -8947784 -6811259 -955189 3327965 1205641 -4833604
8779 -4833604 -8421188 -7981515 -7327146 -8542125 -9545083 -9085864 -8936606 -9534106 -8118914
8770 -8118914 -3665024 303630 880126 502607 2872694 6487142 6411763 1579739 -3658767
8761 -3658767 -5566090 -5228436 -5526435 -6470358 -5652433 -2260778 1390996 2603683 1498032
8752 1498032 820845 2712021 6155451 8108389 7177169 5365698 5258768 5972412 3857150
8743 3857150 -1854369 -6129532 -3570588 3921867 8518520 6549317 3543426 6315982
8735 6315982 13017320 15654814 11204042 4846015 1614036 238400 -2306201 -4898048
8727 -4898048 -4998046 -4061003 -5320997 -7633002 -6465187 -1198488 2951144 1822663 -2132089
$$ packed form
8787e625943r30902j236112j154827K136525N856070M283154k122324o039245
8779d833604l587584M39673O54369j214979j002958M59219J49258n97500J415192
8770h118914M453890L968654N76496l77519K370087L614448p5379m832024n238506
8761c658767j907323L37654k97999r43923Q17925L391655L651774J212687j105651
8752A498032o77187J891176L443430J952938r31220j811471j06930P13644k115262
8743C857150n711519m275163K558944P492455M596653j969203l005891K772556
8735F315982O701338K637494m450772o358027l231979j375636k544601k591847
8727d898048r9998R37043j259994k312005J167815N266699M149632j128481l954752
$$ plain form
8718 -2132089 -3446808 -819210 1851241 962216 -2552554 -5042164 -4644854 -2651085 -1001537
8709 -1001537 -153027 206437 39013 -230906 846769 3816770 6816116 7747320 6913546
8700 6913546 5628286 3750512 1231908 268556 2055431 2982114 -830631 -6095846 -5775942
8691 -5775942 -201708 2586994 -356364 -1672661 4352729 11990509 12649231 7424222
8683 7424222 3577551 2847996 1428155 -1227954 -1958833 -1004816 -1719867 -3481353 -2121954
8674 -2121954 2365763 5369303 5426207 5974678 8584252 10648944 10658154 9653214 6743655
8665 6743655 -164570 -7936196 -9516373 -3952547 1324140 742227 -3121564 -6084655
8657 -6084655 -8521221 -11340658 -11977793 -8776808 -4313756 -542835 4110763 9064382
$$ packed form
8718b132089j314719K627598K670451q89025l514770k489610L97310J993769J649548
8709a001537Q48510L59464j67424k69919J077675K970001K999346R31204q33774
8700F913546j285260j877774k518604r63352J786875R26683l812745n265215L19904
8691e775942N574234K788702k943358j316297O025390P637780O58722n225009
8683G424222l846671p29555j419841k656109p30879R54017p15051j761486J359399
8674b121954M487717L003540N6904N48471K609574K064692R210j004940k909559
8665F743655o908225p771626j580177N563826N276687n81913l863791k963091
8657f084655k436566k819437o37135L200985M463052L770921M653598M953619
$$ plain form
8649 9064382 9040410 2267226 -4323413 -3915445 964523 4006370 5102052 7719786 10307515
8640 10307515 8521231 3983121 2843013 6087239 8277350 6158941 2352956 -58480
8632 -58480 -1003492 -706934 1203957 2545225 -793056 -8984418 -16259590 -16730267 -10579000
8623 -10579000 -3647250 -1743533 -4829852 -6311989 -248529 9939108 14035323 8531281
8615 8531281 2010304 2360083 4589270 -659287 -10808120 -13909904 -6314280 2690428
8607 2690428 5059877 3019246 1302242 -147181 -1258736 1946715 10174430 16365417
8599 16365417 14665479 8783992 5465026 4500579 1923144 -966813 442433 5101605
8591 5101605 6739469 3059937 -1617122 -3225302 -2206231 -342498 1896998 3873111
$$ packed form
8649I064382k3972o773184o590639M07968M879968L041847J095682K617734K587729
8640A0307515j786284m538110j140108L244226K190111k118409l805985k411436
8632e8480r45012K96558J910891J341268l338281q191362p275172m70677O151267
8623a0579000O931750J903717l086319j482137O063460J0187637M096215n504042
8615H531281o520977L49779K229187n248557j0148833l101784P595624R004708
8607B690428K369449k040631j717004j449423j111555L205451Q227715O190987
8599A6365417j699938n881487l318966r64447k577435k889957J409246M659172
8591E101605J637864l679532m677059j608180J019071J863733K239496J976113
$$ plain form
8583 3873111 4661234 5337794 7722745 10097279 8178687 1853939 -2885875 -1269912 3743447
8574 3743447 5173477 625791 -5600060 -8392706 -7299945 -5617023 -5610412 -5912465 -3684105
8565 -3684105 1317472 5743394 6193418 3161694 542679 1298896 4384924 6032382 3515818
8556 3515818 -2362486 -8012071 -10192876 -8632604 -5404045 -1985874 1782690 5349686
8548 5349686 6061713 2405580 -2320767 -2698753 1889455 5950216 5087561 1856840 1572412
8539 1572412 4155374 4307168 -231631 -4924311 -4744586 -806932 2021295 1471818 -1387004
8530 -1387004 -5427986 -9257975 -9227252 -2767575 6286768 10725515 9079758 6688948 6550142
8521 6550142 5188106 477547 -2812359 -463255 3394481 2495708 -1315661 -1448802 2263546
$$ packed form
8583C873111P88123O76560K384951K374534j918592o324748m739814J615963N013359
8574C743447J430030m547686o225851k792646J092761J682922O611l02053K228360
8565c684105N001577M425922M50024l031724k619015P56217L086028J647458k516564
8556C515818n878304n649585k180805J560272L228559L418171L768564L566996
8548E349686P12027l656133m726347l77986M588208M060761q62655l230721k84428
8539A572412K582962J51794m538799m692680J79725L937654K828227n49477k858822
8530a387004m040982l829989L0723O459677R054343M438747j645757k390810j38806
8521F550142j362036m710559l289906K349104L857736q98773l811369j33141L712348
$$ plain form
8512 2263546 3853675 1866377 1371799 4429820 6597678 5410261 4984949 8419199 11880027
8503 11880027 10818757 6930020 4050914 1519828 -2903810 -6718521 -5168732 1250623
8495 1250623 6599434 6452883 1719564 -3842213 -7143634 -7511158 -7001371 -7970095 -9225812
8486 -9225812 -7148655 -2168830 -273515 -4883144 -10916703 -11314771 -6503722 -2441504
8478 -2441504 -1687507 -2006406 -2289981 -3854252 -6120833 -6494681 -4810848 -3008837 -438376
8469 -438376 5001487 10607938 10074886 3097989 -2003011 1171057 8355040 10479808 5134042
8460 5134042 -1898437 -4507827 -1888496 2557573 4728503 2697179 -1567483 -3690077
8452 -3690077 -1645021 1808660 2845805 1367268 74117 -117463 -1122094 -4172073
$$ packed form
8512B263546J590129j987298m94578L058021K167858j187417m25312L434250L460828
8503A1880027j061270l888737k879106k531086m423638l814711J549789O419355
8495A250623N348811j46551m733319n561777l301421l67524N09787r68724j255717
8486i225812K077157M979825J895315m609629o033559l98068M811049M062218
8478b441504P53997l18899k83575j564271k266581l73848J683833J802011K570461
8469d38376N439863N606451n33052o976897n101000L174068P183983K124768n345766
8460E134042p032479k609390K619331M446069K170930k031324m264662k122594
8452c690077K045056L453681J037145j478537j293151j91580j004631l049979
$$ plain form
8444 -4172073 -7477264 -8255550 -6013203 -2995125 -1638328 -1998501 -1907283 322168 3835621
8435 3835621 6264614 6161285 3752772 281157 -2136676 -1159683 3138477 7049055 7184326
8426 7184326 5084626 4800139 6318721 5670385 2277332 1098195 4715140 7937833 4832445
8417 4832445 -2109058 -5276485 -2692489 414420 619187 877265 4294807 8417414 9037893
8408 9037893 6268161 3139850 341265 -3797679 -8969350 -12152587 -11605980 -9055986
8400 -9055986 -7191846 -6714228 -6458564 -5083014 -2129522 1548670 4209392 5055089 5388517
8391 5388517 6443155 6505914 2848406 -2918988 -4636874 962037 8896597 11140241 6002644
8382 6002644 -896953 -4475644 -5411864 -6905003 -9489129 -10868027 -9110050 -4695509
$$ packed form
8444d172073l305191p78286K242347L018078J356797l60173R1218K229451L513453
8435C835621K428993j03329k408513l471615k417833R76993M298160L910578J35271
8426G184326k099700k84487J518582o48336l393053j179137L616945L222693l105388
8417D832445o941503l167427K583996L106909K04767K58078L417542M122607O20479
8408I037893k769732l128311k798585m138944n171671l183237N46607K549994
8400i055986J864140M77618K55664J375550K953492L678192K660722Q45697L33428
8391E388517J054638O2759l657508n767394j717886N598911P934560K243644n137597
8382F002644o899597l578691r36220j493139k584126j378898J757977M414541
$$ plain form
8374 -4695509 -564072 -302070 -4210999 -7088438 -3076369 6317168 12618757 10733727
8366 10733727 5163726 2877136 3687254 2413569 -1929278 -4896104 -3940800 -1481169
8358 -1481169 49016 1444320 3677149 5647921 6538257 6895230 6005011 1883854 -4387152
8349 -4387152 -8022574 -6447842 -2483348 597918 3429540 7017177 8801747 6681512
8341 6681512 4064267 5713594 10081335 11004032 6659439 1883176 888693 1876136 193995
8332 193995 -6175380 -15101552 -21512126 -19997098 -9866092 1672634 5341728 356774
8324 356774 -4510905 -2226796 4263452 8016538 8169781 9037090 11381306 10449295 3306309
8315 3306309 -6137733 -11074077 -8494400 -1217307 4756417 4654750 -941406 -5860243
$$ packed form
8374d695509M131437K62002l908929k877439M012069R393537O301589j885030
8366A0733727n570001k286590Q10118j273685m342847k966826R55304K459631
8358a481169J530185J395304K232829J970772Q90336L56973q90219m121157o271006
8349d387152l635422J574732L964494L081266K831622L587637J784570k120235
8341F681512k617245J649327M367741R22697m344593m776263r94483R87443j682141
8332A93995o369375q926172o410574J515028J0131006J1538726L669094m984954
8324C56774m867679K284109O490248L753086J53243Q67309K344216r32011p142986
8315C306309r444042m936344K579677P277093N973724j01667n596156m918837
$$ plain form
8307 -5860243 -4462373 1523615 4792141 1808994 -2585151 -1641051 4838383 11078846
8299 11078846 12684246 10567743 8273841 8027273 9589686 11136875 10815942 8432652
8291 8432652 5601096 3628106 1996867 -123152 -1918541 -1863875 349765 4212431 9344487
8282 9344487 14099856 14893704 10085644 3664739 1458097 3815264 5791138 4707922
8274 4707922 2962549 2127317 -482538 -6044473 -9520429 -5803439 1947408 5557396
8266 5557396 2511559 -1809028 -2683712 -1583783 -1452862 -1156100 1813464 5793799 6243927
8257 6243927 2160452 -2023674 -1903301 1477138 3194911 695068 -3312483 -4762828
8249 -4762828 -3527204 -2963106 -4770730 -6918820 -7394550 -7296119 -8296717 -9346749 -8649890
$$ packed form
8307e860243J397870N985988L268526k983147m394145R44100O479434O240463
8299A1078846J605400k116503k293902k46568J562413J547189l20933k383290
8291H432652k831556j972990j631239k120019j795389N4666K213640L862666N132056
8282I344487M755369P93848m808060o420905k206642K357167J975874j083216
8274D707922j745373q35232k609855n561935l475956L716990P750847L609988
8266E557396l045837m320587q74684J099929J30921K96762K969564L980335M50128
8257F243927m083475m184126J20373L380439J717773k499843m007551j450345
8249d762828J235624N64098j807624k148090m75730R8431j000598j050032O96859
$$ plain form
8240 -8649890 -7160102 -6726761 -6010483 -2506054 1542362 202864 -7402909 -13730998 -11458173
8231 -11458173 -2714636 3848967 3414772 -1258216 -5386471 -7315278 -7684122 -7197512 -7024719
8222 -7024719 -8838615 -12214955 -13713333 -11052000 -7115709 -6771539 -9721558 -9969224 -4068893
8213 -4068893 3071754 3995684 -1178861 -4763204 -2165846 1790993 -33128 -6748214
8205 -6748214 -10440516 -6745217 -199922 2154303 -648126 -3744368 -3556643 -1538614
8197 -1538614 -580724 -546080 331680 1008266 -1812596 -7821037 -11412194 -8743586 -3616168
8188 -3616168 -1871897 -1928748 2821846 12251075 17555562 13700472 6707803 3921940 3634035
8179 3634035 1024053 -1419577 1518678 6460047 5175217 -1326400 -3186787 2452864
$$ packed form
8240h649890J489788M33341P16278L504429M048416j339498p605773o328089K272825
8231a1458173Q743537O563603m34195m672988m128255j928807l68844M86610J72793
8222g024719j813896l376340j498378K661333L936291L44170k950019k47666N900331
8213d068893P140647R23930n174545l584343K597358L956839j824121o715086
8205f748214l692302L695299O545295K354225k802429l096242J87725K018029
8197a538614R57890L4644Q77760O76586k820862o008441l591157K668608N127418
8188c616168J744271n6851M750594R429229N304487l855090o992669k785863k87905
8179C634035k609982k443630K938255M941369j284830o501617j860387N639651
$$ plain form
8171 2452864 6561620 2855486 -2556002 -2132477 923309 -621663 -5323397 -6070841 -2279640
8162 -2279640 -147579 -1923669 -3092781 -1053553 201221 -3548882 -10224946 -13940095
8154 -13940095 -11755672 -6259683 -2283737 -1467685 -202923 5442423 12734607 13915165
8146 13915165 6589050 -1907134 -3980375 -1354696 -372452 -1735783 -1371999 1194389
8138 1194389 2544308 2072752 1866466 736569 -4025294 -9084473 -7555307 -175057 4481265
8129 4481265 3122924 2224057 5819367 8133490 4362350 261934 2801942 8102266
8121 8102266 8236160 4913083 5656347 9531033 8459218 2264884 486198 6820230 12716991
8112 12716991 11058520 6556253 6115635 7097008 3531237 -1848156 -1264317 5307951 9955186
$$ packed form
8171B452864M108756l706134n411488M23525L055786j544972m701734p47444L791201
8162b279640K132061j776090j169112K039228J254774l750103o676064l715149
8154a3940095K184423N495989L975946Q16052J264762N645346P292184J180558
8146A3915165p326115q496184k073241K625679R82244j363331L63784K566388
8138A194389J349919m71556k06286j129897m761863n059179J529166P380250M656322
8129D481265j358341q98867L595310K314123l771140m100416K540008N300324
8121H102266J33894l323077P43264L874686j071815o194334j778686O334032N896761
8112A2716991j658471m502267m40618R81373l565771n379393N83839O572268M647235
$$ plain form
8103 9955186 8566254 4802818 2246264 257054 -991790 1308133 6437899 8285244
8095 8285244 3487762 -3284392 -5978428 -4752674 -2705752 752263 7493629 14212439
8087 14212439 14789459 8897553 3040050 2407383 5890558 9736608 11892390 11418277 7556591
8078 7556591 1741530 -2154563 -2015539 -367473 -1235930 -5194014 -8843750 -8366647 -2792073
8069 -2792073 5320906 11793459 14082077 12814993 9802764 5830930 1883109 574096
8061 574096 3048054 5590414 3580409 -1342002 -2798059 876388 3842373 1444923
8053 1444923 -3348559 -5417925 -4847651 -4517451 -4005582 -1034773 3245694 5523583 5777846
8044 5777846 7013208 10132975 12865461 13205147 10620014 5037915 -1617633 -4269590
$$ packed form
8103I955186j388932l763436k556554j989210j248844K299923N129766J847345
8095H285244m797482o772154k694036J225754K046922L458015O741366O718810
8087A4212439N77020n891906n857503o32667L483175L846050K155782m74113l861686
8078G556591n815061l896093J39024J648066q68457l958084l649736M77103N574574
8069b792073Q112979O472553K288618j267084l012229l971834l947821j309013
8061E74096K473958K542360k010005m922411j456057L674447K965985k397450
8053A444923m793482k069366N70274L30200N11869K970809M280467K277889K54263
8044E777846J235362L119767K732486L39686k585133n582099o655548k651957
$$ plain form
8036 -4269590 262594 7610878 9984876 5861414 780364 -1578321 -3440981 -6688256
8028 -6688256 -8441493 -6290153 -3385397 -3811556 -5583330 -2993444 4784207 11377369
8020 11377369 10352042 2510157 -5052693 -6435291 -2626032 541075 -539107 -3883436
8012 -3883436 -6042401 -6825144 -7486120 -6698591 -2583623 2314892 2917443 -1292504 -5645808
8003 -5645808 -7349453 -8121026 -8467523 -5177416 2226549 7739714 6309549 1242186 -858240
7994 -858240 531018 1238810 946215 3539296 8967422 11391647 7703865 2831408 3112334
7985 3112334 7522797 9130431 3898167 -4935104 -10867738 -10285326 -4514273 2333567
7977 2333567 6519550 6594260 3696167 502709 -911054 -1045235 -2245033 -4921398 -5490386
$$ packed form
8036d269590M532184P348284K373998m123462n081050k358685j862660l247275
8028f688256j753237K151340K904756m26159j771774K589886P777651O593162
8020A1377369j025327p841885p562850j382598L809259L167107j080182l344329
8012c883436k158965p82743o60976P87529M114968M898515O02551m209947m353304
8003e645808j703645p71573l46497L290107P403965N513165j430165n067363k100426
7994h58240J389258P07792k92595K593081N428126K424225l687782m872457K80926
7985C112334M410463J607634n232264q833271n932634N82412N771053O847840
7977B333567M185983P4710k898093l193458j413763j34181j199798k676365n68988
$$ plain form
7968 -5490386 -583927 6774458 8697387 1906849 -7296079 -10409202 -6857221 -3143868
7960 -3143868 -3351891 -5013682 -4668259 -3058356 -2739472 -3623953 -3694307 -2567036 -1728400
7951 -1728400 -1715585 -1186261 889045 3422853 4242960 2443150 -820422 -3868366 -6305693
7942 -6305693 -8633545 -10293587 -9528508 -5988038 -2154975 -663356 -1128811 -1526496 -1957846
7933 -1957846 -4357061 -8236362 -9652664 -5982102 282754 4415144 4806066 3480988
7925 3480988 2297646 1110637 -271559 -705352 513082 1850870 1028298 -2014735 -4767792
7916 -4767792 -4879608 -2450011 631647 2779413 3377219 1956407 -1827203 -6903664 -10602054
$$ packed form
7968e490386M906459P358385J922929o790538r202928l113123L551981L713353
7960c143868k08023j661791L45423J609903L18884q84481p0354J127271Q38636
7951a728400J2815N29324K075306K533808Q20107j799810l263572l047944k437327
7942f305693k327852j660042P65079L540470L833063J491619m65455l97685m31350
7933a957846k399215l879301j416302L670562O264856M132390L90922j325078
7925C480988j183342j187009j382196m33793J218434J337788q22572l043033k753057
7916d767792j11816K429597L081658K147766N97806j420812l783610n076461l698390
$$ [...]
##END NTUPLES=NMR SPECTRUM
##END=
