##TITLE=31Pdec_SR9_kTFA
 CDCl3, 24 sc
 26.11.2020
##JCAMPDX= 6.0         $$ Bruker NMR JCAMP-DX V2.0
##DATA TYPE= NMR SPECTRUM
##DATA CLASS= NTUPLES
##ORIGIN= UXNMR, Bruker Analytische Messtechnik GmbH
##OWNER= root
$$ XWIN-NMR		Version 3.5
$$ Thu Nov 26 10:20:33 2020 Russian Standard Time (UT+4h)  she@DPX200
##.OBSERVE FREQUENCY= 81.013821
##.OBSERVE NUCLEUS= ^31P
##.ACQUISITION MODE= SIMULTANEOUS
##.ACQUISITION SCHEME= undefined
##.AVERAGES= 24
##.DIGITISER RES= 17
##SPECTROMETER/DATA SYSTEM= spect
##.PULSE SEQUENCE= zgpg30
##.SOLVENT NAME= DMSO
##.SHIFT REFERENCE= (INTERNAL, DMSO, 0, 182.463)
##AUDIT TRAIL= $$ (NUMBER, WHEN, WHO, WHERE, WHAT)
$$ ##TITLE= Audit trail, XWIN-NMR		Version 3.5
$$ ##JCAMPDX= 5.01
$$ ##ORIGIN= Bruker BioSpin GmbH
$$ ##OWNER= she
$$ F:/spectra/data/she/nmr/P31/1/pdata/1/auditp.txt
$$ ##AUDIT TRAIL=  $$ (NUMBER, WHEN, WHO, WHERE, WHAT)
(   1,<2020-11-26 10:19:44.68 +0400>,<she>,<DPX200>,
      <created by zg, POWCHK disabled, PULCHK disabled
       configuration hash MD5:
       00 E9 B6 7A A2 85 ED C7 34 08 36 98 17 FE 4E 26
       data hash MD5: 32K
       96 E4 C3 2C 84 16 12 51 83 3D A9 DB CF 80 3D 6A>)
(   2,<2020-11-26 10:19:47.15 +0400>,<she>,<DPX200>,
      <Start of raw data processing
       efp BC_mod = 2 LB = 1 FT_mod = 6 PKNL = 1 PHC0 = -2414.485 PHC1 = 163.0008 SI = 64K 
       data hash MD5: 64K
       E9 03 11 18 53 F1 6A A3 8B BA 6E E1 67 C6 1A 38>)
(   3,<2020-11-26 10:20:00.75 +0400>,<she>,<DPX200>,
      <pk PHC0 = 1.952543 PHC1 = 0 
       data hash MD5: 64K
       85 2B 1A 77 9C 32 9D CA 07 0F 3B E0 B5 4A A2 33>)
$$ ##END=
$$ 
$$ hash MD5
$$ B4 7D C7 DA 46 C7 3C FE 49 40 6E 03 F4 BC D2 3E
##$RELAX= 
##$RELAX= 
##$RELAX= 
##$RELAX= 
##$RELAX= 
##$RELAX= 
##$RELAX= 
##$RELAX= 
$$ Bruker specific parameters
$$ --------------------------
##$DU= <F:/spectra>
##$EXPNO= 1
##$NAME= <P31>
##$PROCNO= 1
##$TYPE= <nmr>
##$USER= <she>
##$AMP= (0..31)
100 100 100 100 100 100 100 100 100 100 100 100 100 100 100 100 100 100 
100 100 100 100 100 100 100 100 100 100 100 100 100 100 
##$AQSEQ= 0
##$AQ_mod= 1
##$AUNM= <au_zg>
##$AUTOPOS= <>
##$BF1= 81.014009
##$BF2= 200.13
##$BF3= 200.13
##$BF4= 200.13
##$BF5= 200.13
##$BF6= 200.13
##$BF7= 200.13
##$BF8= 200.13
##$BYTORDA= 1
##$CFDGTYP= 0
##$CFRGTYP= 5
##$CHEMSTR= <none>
##$CNST= (0..31)
1 1 145 1 1 1 1 1 1 1 1 1 1 1 1 1 1 1 1 1 1 1 1 1 1 1 1 1 1 1 1 1 
##$CPDPRG= <waltz16>
##$CPDPRG1= <>
##$CPDPRG2= <waltz16>
##$CPDPRG3= <>
##$CPDPRG4= <mlev>
##$CPDPRG5= <mlev>
##$CPDPRG6= <mlev>
##$CPDPRG7= <mlev>
##$CPDPRG8= <mlev>
##$CPDPRGB= <>
##$CPDPRGT= <>
##$D= (0..31)
0 1 0 0 0 0 0 0 0 0 0 0.03 2e-05 3e-06 0 0 0 0 0 0 0 0 0 0 0 0 0 0 0 0 
0 0 
##$DATE= 1606371583
##$DBL= (0..7)
120 120 120 11 120 120 24 19 
##$DBP= (0..7)
150 150 150 150 150 150 150 150 
##$DBP07= 0
##$DBPNAM0= <>
##$DBPNAM1= <>
##$DBPNAM2= <>
##$DBPNAM3= <>
##$DBPNAM4= <>
##$DBPNAM5= <>
##$DBPNAM6= <>
##$DBPNAM7= <>
##$DBPOAL= (0..7)
0.5 0.5 0.5 0.5 0.5 0.5 0.5 0.5 
##$DBPOFFS= (0..7)
0 0 0 0 0 0 0 0 
$$ [...]
##$SUBNAM2= <"">
##$SUBNAM3= <"">
##$SUBNAM4= <"">
##$SUBNAM5= <"">
##$SUBNAM6= <"">
##$SUBNAM7= <"">
##$SUBNAM8= <"">
##$SUBNAM9= <"">
##$SW= 369.568048894756
##$SWIBOX= (0..15)
0 1 3 0 0 0 0 0 0 0 0 0 0 0 0 0 
##$SW_h= 29940.119760479
##$TD= 32768
##$TD0= 1
##$TE= 0
##$TE2= 300
##$TE3= 300
##$TEG= 300
##$TL= (0..7)
0 120 53 12 22 120 120 120 
##$TP= (0..7)
150 150 150 150 150 150 150 150 
##$TP07= 0
##$TPNAME0= <>
##$TPNAME1= <>
##$TPNAME2= <>
##$TPNAME3= <>
##$TPNAME4= <>
##$TPNAME5= <>
##$TPNAME6= <>
##$TPNAME7= <>
##$TPOAL= (0..7)
0.5 0.5 0.5 0.5 0.5 0.5 0.5 0.5 
##$TPOFFS= (0..7)
0 0 0 0 0 0 0 0 
##$TUNHIN= 0
##$TUNHOUT= 0
##$TUNXOUT= 0
##$USERA1= <user>
##$USERA2= <user>
##$USERA3= <user>
##$USERA4= <user>
##$USERA5= <user>
##$V9= 5
##$VALIST= <valist>
##$VCLIST= <CCCCCCCCCCCCCCC>
##$VD= 0
##$VDLIST= <DDDDDDDDDDDDDDD>
##$VPLIST= <PPPPPPPPPPPPPPP>
##$VTLIST= <TTTTTTTTTTTTTTT>
##$WBST= 1024
##$WBSW= 4
##$XGAIN= (0..3)
0 0 0 0 
##$XL= 0
##$YL= 0
##$YMAX_a= 9048
##$YMIN_a= -5516
##$ZGOPTNS= <>
##$ZL1= 120
##$ZL2= 120
##$ZL3= 120
##$ZL4= 120
##$ABSF1= 0
##$ABSF2= 0
##$ABSG= 0
##$ABSL= 0
##$ALPHA= 0
##$AQORDER= 0
##$ASSFAC= 0
##$ASSFACI= 0
##$ASSFACX= 0
##$ASSWID= 0
##$AUNMP= <proc_1d>
##$AZFE= 0.1
##$AZFW= 0.5
##$BCFW= 0
##$BC_mod= 2
##$BYTORDP= 0
##$COROFFS= 0
##$CY= -3
##$DATMOD= 1
##$DC= 0
##$DFILT= <>
##$DTYPP= 0
##$F1P= 0
##$F2P= 0
##$FCOR= 1
##$FTSIZE= 65536
##$FT_mod= 6
##$GAMMA= 0
##$GB= 0
##$INTBC= 1
##$INTSCL= 5.30512e-09
##$ISEN= 30
##$LB= 1
##$LEV0= 0
##$LPBIN= 0
##$MAXI= 10000
##$MC2= 0
##$MEAN= 0
##$ME_mod= 0
##$MI= 50
##$NCOEF= 0
##$NC_proc= -9
##$NLEV= 6
##$NOISF1= 182.463
##$NOISF2= 159.3651
##$NSP= 0
##$NTH_PI= 0
##$NZP= 0
##$OFFSET= 182.463
##$PC= 4
##$PHC0= -2412.532
##$PHC1= 163.0008
##$PH_mod= 1
##$PKNL= yes
##$PPARMOD= 0
##$PSCAL= 0
##$PSIGN= 0
##$REVERSE= no
##$SF= 81.014009
##$SI= 65536
##$SIGF1= 159.3651
##$SIGF2= -187.1042
##$SINO= 113.3802
##$SIOLD= 16384
##$SREGLST= <1H.CDCl3>
##$SSB= 0
##$STSI= 65536
##$STSR= 0
##$SW_p= 29940.119760479
##$SYMM= 0
##$S_DEV= 0
##$TDeff= 32768
##$TDoff= 0
##$TI= <>
##$TILT= no
##$TM1= 0
##$TM2= 0
##$TOPLEV= 0
##$USERP1= <user>
##$USERP2= <user>
##$USERP3= <user>
##$USERP4= <user>
##$USERP5= <user>
##$WDW= 1
##$XDIM= 65536
##$YMAX_p= 286673085
##$YMIN_p= -126977021
$$ End of Bruker specific parameters
$$ ---------------------------------
##NTUPLES= NMR SPECTRUM
##VAR_NAME=  FREQUENCY,     SPECTRUM/REAL,   SPECTRUM/IMAG
##SYMBOL=    X,             R,               I
##VAR_TYPE=  INDEPENDENT,   DEPENDENT,       DEPENDENT
##VAR_FORM=  AFFN,          ASDF,            ASDF
##VAR_DIM=   65536,         65536,           65536
##UNITS=     HZ,            ARBITRARY UNITS, ARBITRARY UNITS
##FACTOR=    0.456856943014862, 1,           1
##FIRST=     14782.0589164895, 0,            0
##LAST=      -15158.0608439895, 0,           0
##MIN=       -15158.0608439895, -126977021,  0
##MAX=       14782.0589164895, 286673085,    0
$$ Real data points
##PAGE= N=1
##DATA TABLE= (X++(R..R)), XYDATA
$$ [...]
46064A0399316m031709o26795R344131J0905697R59653p286273m541364K534031
46056A7656687L836590M51297m29810J013608k052766j0301459j4854171r641523
46048a4321547n93831L051868J963472L230437O132624K393270p383185r666776
46040a5193668K212669J4518684J0654775m872455j3393994q758992k291487k159519
46032a9283987l343384q93157J320630O33363J873674O731073P479510j094980
46024f577258j2161350j6073006j1282131p68028J2790735K2277358J7991026
46017F197346K991495m602015M260340J3676590M835670j4932128k1942534j0061791
46009a9577027K957564K695402m839922o880831j459069M460121N715969K713273
$$ y = [10399316, 6367607, 5740812, 15084943, 25990640, 26950293, 19664020, 15122656, 17656687, 21493277, 21944574, 21514764, 22528372, 20475606, 10174147, -4680024, -14321547, -14915378, -11863510, -9900038, -6669601, -536977, 1856293, -5526892, -15193668, -12980999, 1537685, 12192460, 7320005, -6073989, -14832981, -17124468, -19283987, -22627371, -23520528, -22199898, -21566535, -19692861, -12961788, -5482278, -6577258, -18738608, -34811614, -46093745, -46861773, -34071038, -11793680, 6197346, 9188841, 4586826, 8847166, 22523756, 27359426, 12427298, -9515236, -19577027, -16619463, -13924061, -18763983, -25644814, -27103883, -22643762, -16927793, -14214520]
46001a4214520n94882j26854L718168N951767M830017N253288Q877602P890131
45993B1584717k013514r815713l703248Q271673Q475483k395273o407394K076560
45985A6073291P948659J424200o724935n026338N47227r1147l835448l393701
45977F921808j968219n307068q549562m866942N89551m09534k854600L450604
45969a2993962J3523804J1452175m507400j6045925q608455R628726J8479075
45962A0928038R064013q620892j8219338j3547457l007632J695951m35118o66394
45954b2808829N274300J1421565J2296624J0571000Q768791K470491r902733j8478886
45946c87677j3538118j33926Q934416R514056N529473j382640r214984q761652
$$ y = [-14214520, -14809402, -14936256, -11218088, -5266321, -436304, 4816984, 13694586, 21584717, 19571203, 9755490, 6052242, 14323915, 22799398, 20404125, 13996731, 16073291, 24021950, 25446150, 18721215, 13694877, 14242104, 14150957, 10315509, 6921808, 4953589, -353479, -8903041, -13769983, -13180432, -13589966, -16444566, -12993962, 529842, 11982017, 7474617, -8571308, -17179763, -7551037, 10928038, 19992051, 11371159, -6848179, -20395636, -23403268, -21707317, -22142435, -22808829, -17534529, -6112964, 6183660, 16754660, 25523451, 27993942, 18091209, -387677, -13925795, -14059721, -5125305, 4388751, 9918224, 8535584, -679400, -9441052]
45938i441052N066430J8776855J4022595n369380j7425155j3483075o789548o619137
45930b1261467m496623N488509J2244929O700957q06647K210485Q531862L945171
45922A2557176p765089j1228021m907421r25159k080304J239018R614022R550879
45914F055101l284572j2611916m667876R507810R138467n702454j3880218l124486
45906a8570144J3556746J6567999N144323m576994k208664O106653R808684P357539
45898C3186142K957336k624595r946069j4027307r345844m00265K693040l03220
45890B189218N95957P952445J0982963L253546n684079n892775l341999p475605
45882B579671j1642500l436122J0129092Q281624j0624578k1836710q196280J5027090
$$ y = [-9441052, -4374622, 14402233, 28424828, 23055448, 5630293, -7852782, -14642330, -21261467, -25758090, -20269581, -8024652, -1323695, -2130342, 80143, 8612005, 12557176, 4792087, -6435934, -11343355, -12268514, -14348818, -13109800, -3495778, 6055101, 2770529, -9841387, -14509263, -5001453, 4137014, -1565440, -15445658, -18570144, -5013398, 11554601, 16698924, 12121930, 9913266, 16019919, 25828603, 33186142, 36143478, 33518883, 23572814, 9545507, 199663, -200602, 2492438, 2189218, 2785175, 10737620, 21720583, 24974129, 19290050, 13397275, 10055276, 2579671, -9062829, -12498951, -2369859, 5911765, -4712813, -26549523, -34745803, -19718713]
45874a9718713K1744034R380016l273160m998769k496556l408531m346113p8872
45866g196664N927963O680571J934874k217397j788491Q13181N80151l585550
45858A148638o850552m263929J303931R92943p296561j2661605m429713J1059046
45850b0997802J6222189N796214n174072j927479R737501J2299176P69151j2065353
45842D659525j3935124o892061p8541L138189N041777N539371J343840p492849
45834h675873j5111204j4929458n449607Q241014J7260283J5525478O489746J040511
45826D390890M854436J0283386O354938n030191j0817550n457694J124838j405204
45818D297849q656911q869796l07531P348696O969794J439499k515375j227833
$$ y = [-19718713, 2025321, 11405337, 8132177, 3133408, 636852, -2771679, -7117792, -7196664, -1268701, 5411870, 7346744, 5129347, 3340856, 4154037, 4734188, 1148638, -5701914, -9965843, -8661912, -7668969, -14965530, -27627135, -32056848, -20997802, -4775613, 1020601, -4153471, -6080950, 3656551, 15955727, 16724878, 4659525, -9275599, -16167660, -16246201, -13108012, -8066235, -2526864, -1183024, -8675873, -23787077, -38716535, -44166142, -35925128, -18664845, -3139367, 3350379, 4390890, 9245326, 19528712, 25883650, 20853459, 10035909, 4578215, 5703053, 4297849, -4359062, -13228858, -13536389, -6187693, 782101, 2221600, -293775, -1521608]
45810a521608N140535J2314353J2307442J020150j3603061j8035098r632273L23433
45802a1686127K435128L08002J614763N680522O760155M187606J674707J432k356864
45793H619324l869632k320754o24667l055452o899340n421020J043203M594490
45785g933848J287680m216099p162050q342929q317583l599050O222510J3623841
45777a8437528J1976400N386281L095560O382887P775014K678158m685832q128766
45769F042174o756284k884660K675886Q961985J1154671M386194p770029j3661435
45761B148502o436080O169524J0402717M112638j194464K009494N743040o21625
45753B2333746j2339537j4805492m932189M682299M634179M90652Q27881L502698
$$ y = [-1521608, 3618927, 15933280, 28240722, 29260872, 15657811, -2377287, -12009560, -11686127, -9250999, -8942997, -7328234, -1647712, 5112443, 9300049, 10974756, 10976188, 8619324, 4749692, 2428938, 1804271, -1251181, -8150521, -13571541, -12528338, -7933848, -6646168, -10862267, -18024317, -26367246, -34684829, -38283879, -32061369, -18437528, -6461128, -1074847, 2020713, 8403600, 16178614, 18856772, 14170940, 6042174, -714110, -3598770, -922884, 8039101, 19193772, 23579966, 15809937, 2148502, -4287578, 1881946, 12284663, 16397301, 15202837, 17212331, 22955371, 22333746, 9994209, -4811283, -9743472, -5061173, -426994, 63658, 891539, 4394237]
45745D394237J656301l745494o195398m168754j443241m263L71762j479209n233210
45736a5847269n771285N0031O547777O848764L793974M156770N655752J334844
45728F769358n185271k758324P767613J1588142K147391q495516q997537n609603
45720b773747q956571j4409580r512732M753592J4088757J0671722J129437n316285
45712a0325407o320606k818147M473056J1658167J2089649M443846m170714o671826
45704B358018m363902l610730n988369n342583L775585J6064122J8225522N367172
45696B6484835r230921q761691M022656R511731p38137j1948155r149005J021156
45688A212469L381109k252494n774150o075895p846838n692121Q045039K2755842
$$ y = [4394237, 6050538, 2305044, -3890354, -8059108, -9502349, -9506612, -9134850, -10614059, -15847269, -21618554, -21568523, -15020746, -8171982, -4378008, -221238, 5434514, 6769358, 1584087, -1174237, 6593376, 18181518, 20328909, 11833393, 2835856, -2773747, -11730318, -26139898, -35652630, -30899038, -16810281, -6138559, -5009122, -10325407, -16646013, -19464160, -14991104, -3332937, 8756712, 13200558, 9029844, 2358018, -2005884, -5616614, -11604983, -16947566, -13171981, 2892141, 21117663, 26484835, 17253914, 8492223, 12514879, 22026610, 21288473, 9340318, 191313, 1212469, 4593578, 2341084, -3433066, -9508961, -17355799, -23047920, -15002881, 7752961]
45680G752961J9163773J73716j0701717n431699j802488j0020839j4670792m265108
45672a9802193N283868k592874j4498255q156251R814706J4344260J983556o808101
45664b0431284k310018L979516M419638N585449R055039N323065n530716q565950
45656h475261N93081M697265p891152k1833488j6304434M549727J8649195J5273951
45648a0741116K867214o547463p622518m35027R488656J2584299N643384k694756
45640B542673m300656l396279o857277r589768k220718J0919492J5441774P582066
45632A0121307j670021l977986l094136m334755n666938l743330j36887L079418
45624i423328O924287J0534428R228644K138910l999787l732579r00126k512741
$$ y = [7752961, 26916734, 27090450, 16388733, 10957034, 9154546, -866293, -15537085, -19802193, -14518325, -17111199, -31609454, -39765705, -29950999, -15606739, -13623183, -20431284, -22741302, -18761786, -14342148, -8756699, 298340, 5621405, 90689, -8475261, -7882180, -3184915, -11076067, -32909555, -49213989, -44664262, -26015067, -10741116, -7873902, -14421365, -22043883, -22478910, -12990254, -405955, 5237429, 2542673, -1757983, -5154262, -12011539, -21601307, -23822025, -12902533, 2539241, 10121307, 8451286, 4473300, 1379164, -2955591, -8622529, -12365859, -12502746, -9423328, -2499041, 8035387, 17264031, 19402941, 15403154, 11670575, 10770449, 8257708]
45616H257708q134030j0872102p000454M92414P166198J1120018J1045110M768485
45608A6843347o936303j6893012j6180643l841973J0660500J7038958J4144054
45601A4834928P702302J561952l158876l115203L892601J0526993N684440q140785
45593B9788352j4587139o434295L019002Q05408n589390k736059M468675J422483
45585A0157037r425744j1404825k027090L017396k452458m826675M012733J0970383
45577a979243L472854r456805j2123391n030674J935426P681994J5139190J7865235
45569A7504586R075021k584258m080511R0265m273411j4331235j2032509N598947
45561e033105J8284445J1175298n174549j2240390p128355P85989N275108M984072
$$ y = [8257708, 123678, -10748424, -17748878, -17256464, -10090266, 1029752, 12074862, 16843347, 9907044, -6985968, -23166611, -27008584, -16348084, 690874, 14834928, 22537230, 24099182, 20940306, 17825103, 21717704, 32244697, 37929137, 29788352, 15201213, 8766918, 11785920, 12591328, 7001938, 4265879, 8734554, 10157037, 731293, -10673532, -12700622, -9683226, -12135684, -16962359, -12949626, -1979243, 1493611, -7963194, -20086585, -25117259, -23181833, -15499839, -360649, 17504586, 26579607, 23995349, 19914838, 20005103, 15731692, 1400457, -10632052, -5033105, 13251340, 24426638, 19252089, 7011699, -116656, 669333, 5944441, 10928513]
45553A0928513j337391j1127180j5877353j1106626k847153K157003N192155P779706
45545a6238326M930937l720448n635515P763185K2682888J7893229m613389k0744090
45537B318471j6786375m115897K246092K999887M417409L776347k672241p710409
45529a5526716k981643N723229O567100P87329j61307N415234O852494k57444
45521F418276o818632n781867k423310k918366l920522j445665N6593k717491
45513a9550984k374835P100813J6058868J1398314j519209n422339J771009M201899
45505A1663536m730335j0921543l680636N526109J954625p703355o438010N120300
45497i209309J0231176K879230m718790l258964Q19860j155116o463391p554646
$$ y = [10928513, 9591122, -1536058, -17413411, -28520037, -31367190, -29210187, -24018032, -16238326, -11307389, -15027837, -20663352, -12900167, 9782721, 27675950, 23062561, 2318471, -14467904, -18583801, -16337709, -13337822, -8920413, -5144066, -7816307, -15526716, -18508359, -12785130, -6218030, -5430701, -5592008, -176774, 6675720, 6418276, -400356, -6182223, -8605533, -11523899, -15444421, -16890086, -16833493, -19550984, -21925819, -14825006, 1233862, 12632176, 11112967, 5690628, 7461637, 11663536, 6933201, -3988342, -7668978, -2142869, -188244, -7891599, -14329609, -9209309, 1021867, 3901097, -817693, -4076657, -3256797, -4411913, -10875304, -18429950]
45489a8429950k664902O082585J6523412K2803691J7017615J472133r279636o830308
45481B6694640j200271n123004j4105193j4963621q228697n901494q539043k597949
45473c3964632J4863322K5713340J5462919m073929j0528458j439966O365938
45466A2398534M068934M90921K435795K130884o972456j4646737p378868R492629
45458B019636J7369363R918945q51978n048935p079268j1864796j2316802j612764
45450i466599J1000662J0328785k633352j1891894r223697l065622k412908l963575
45442b1328200j052680M174353N241061J881033j063929j180616P89681L732089
45434h807208M658637n63461r203112j0233166J165762J3115176J1438078O02708
$$ y = [-18429950, -21094852, -15012267, 1511145, 24314836, 41332451, 42804584, 33524948, 26694640, 25494369, 20371365, 6266172, -8697449, -16926146, -22827640, -31366683, -33964632, -19101310, 6612030, 22074949, 18001020, 7472562, 6032596, 12398534, 16467468, 16958389, 19394184, 21525068, 14552612, -94125, -7472993, 2019636, 19388999, 29307944, 28455966, 23407031, 16327763, 4462967, -7853835, -9466599, 1534063, 11862848, 9229496, -2662398, -11886095, -14951717, -17364625, -21328200, -22380880, -18206527, -12965466, -11084433, -12148362, -13328978, -12539297, -8807208, -4148571, -4712032, -13915144, -24148310, -22982548, -9867372, 1570706, 2173414]
45426B173414k629884M707635P394696k514845j1641452o812286K233424k692203
45418i781501j7959427k0807469l034175J5523915J4750845J705106k212225O868959
45410a4945972J1949216K521696r937255r536163J848975R097946M712481m419716
45402h708792r081701p695159l395173J481319N028046M933065J551881j031854
45394a6918368K89090L875027O152556O197761N585793N143416L774288L79046
45386A4478609l499450l408654L322484J1251837R212812o127848k2191364k3188979
45378b0150553r700436K759243M836309K907579M786143P027248L663156j379323
45370e250634l75359N014208O034835o93938j0467914j7005259j5175948k309201
$$ y = [2173414, -456470, 4251165, 11645861, 9131016, -2510436, -9322722, -7089298, -9781501, -27740928, -48548397, -51582572, -36058657, -21307812, -19602706, -21814931, -14945972, -2996756, -475060, -10412315, -19948478, -18099503, -9001557, -4289076, -8708792, -17790493, -25485652, -28880825, -27399506, -22371460, -17438395, -15886514, -16918368, -16629278, -12754251, -6601695, -403934, 5181859, 10325275, 14099563, 14478609, 10979159, 7570505, 10892989, 22144826, 31357638, 25229790, 3038426, -20150553, -29850989, -27091746, -22255437, -19347858, -14561715, -7534467, -3871311, -5250634, -5625993, -611785, 5423050, 4729112, -5738802, -22744061, -37920009, -40229210]
45362d0229210J5099809K1545610R871620n914949p041663M374381R879237K862416
45354A0447251m234456k712965l43883m552650q173694k519737O647464P824576
45346B381906Q75050n041747m957957m61010O077984J1094943Q881190m77552
45338A8372807p318475n011675p21697m007132j0388362q104053K522407R390486
45330e265694P124182K898489L252612O571315J0078216J3177108J1691526J96495
45322D9724249j5967753k1806319j1633462J922121M078381m526687j2632699
45315a0842169j3556336q506444p27433N916936O679742J355832l190998j821794
45307b4692664J386033N72365j578016J075972O479302P611272N678619R048890
$$ y = [-40229210, -25129401, -3583791, 6287829, 372880, -6668783, -2294402, 7584835, 10447251, 6212795, 3499830, 3155947, -1396703, -9570397, -12090134, -5442670, 2381906, 3256956, -1784791, -6742748, -7203758, -1125774, 9969169, 18850359, 18372807, 11054332, 6042657, 5320960, 1313828, -9074534, -17178587, -14656180, -5265694, 1858488, 4756977, 8009589, 14580904, 24659120, 37836228, 49527754, 49724249, 33756496, 11950177, 316715, 2238836, 6317217, 1790530, -10842169, -24398505, -32904949, -33632382, -27715446, -21035704, -19679872, -22870870, -24692664, -23306631, -22734266, -24312282, -23236310, -16757008, -9145736, -3467117, 5581773]
45299E581773J7446591J8142631L573631j5218153k0571232r599791L866622P312225
45291A0534297K507402q89608Q65708K451943j532805q686122j1790339p829966
45283a4369490r77837L601632N471227O315222N121247P91931k190106K499505
45275F263331J2158900J4711626L876919j0380093j3363081m974999N62405n226513
45267C628495j3665090j1980252j457418M986404J334323l532302Q64616J0929866
45259h891358J2896765J838032r645907o580153P492612J2952892K25027j4812130
45251d524220j0648556R052884J7999663K882169j7644836j8756589l063436O187160
45243a8515761j02321o409029J286890J5049432J8839380J1685997N998228P958680
$$ y = [5581773, 23028364, 41170995, 44744626, 29526473, 8955241, -644550, 3222072, 10534297, 13041699, 12152091, 13017799, 15469742, 13936937, 5250815, -6539524, -14369490, -15347327, -11745695, -6274468, 40754, 5162001, 5953932, 3763826, 6263331, 18422231, 33133857, 37010776, 26630683, 13267602, 8292603, 8855008, 3628495, -10036595, -22016847, -23474265, -18487861, -17153538, -20685840, -19821224, -8891358, 4005407, 5843439, -3802468, -10382621, -2890009, 10062883, 10287910, -4524220, -15172776, -6119892, 11879771, 14761940, -2882896, -21639485, -24702921, -18515761, -18618082, -25027111, -23740221, -8690789, 10148591, 21834588, 27832816, 35791496]
45235C5791496J0037912L027546j1050017k0215811j5212439m37043R423026O261245
45227A7625915j062620M24654P762302O181826o558572j4466251p487235K983504
45219E403523K766748l689293l974855P46173J092032j224376K435562Q332563
45211A1888077M166109q501521j4063088o901644J843067M454632N871559Q249273
45203G006464M816632l517348l798262O543860J0668743j144974j2884512p502141
45195A88462M725822L273511q339626r207070L526292J0719399L357721m638197
45187C606314j467236M826370L174492k093231j536526K159304j25438p638598
45179I05451j0541043m521762L601857M617764k990503j1134671r275662L930850
$$ y = [35791496, 45829408, 48856954, 37806937, 17591126, 2378687, 1941644, 11364670, 17625915, 16563295, 16987949, 24750251, 30932077, 24373505, 9907254, 2420019, 5403523, 8170271, 4480978, 506123, 1252296, 2344328, 1119952, 3555514, 11888077, 16054186, 7552665, -6510423, -13412067, -11569000, -7114368, -1242809, 7006464, 11823096, 8305748, 4507486, 11051346, 21720089, 20575115, 7690603, 188462, 4914284, 8187795, -151831, -9358901, -5832609, 4886790, 8244511, 3606314, 2139078, 6965448, 10139940, 8046709, 6510183, 8669487, 8544049, 905451, -9635592, -14157354, -10555497, -5937733, -8928236, -20062907, -29338569, -25407719]
45171b5407719J6614551J6312189N933981l44401K574117M463433k780238j1997351
45163E368562j2056041l745094M286643Q832610J1564213R943296p2627j3414067
45155A0707495j8298601j0978168m08647M007045K923256K453402M402709N274499
45147H2990K457670k168707m477112k388172K078675M771950L448164o67122n135392
45138a997056q225032q085252k905568N910730J2792468J2776990O244427k394157
45130A4117550q777960j0236285o597387j610053k03243j603576Q64642R374507
45122d671805J5496480J0261779l096094j3042741j3725904q038093L26108Q576307
45114g913963J0205662L16582j2652570j2482132K600564J4436487R141488l649458
$$ y = [-25407719, -8793168, 7519021, 13453002, 13108601, 15682718, 20146151, 17365913, 5368562, -6687479, -10432573, -6145930, 2686680, 14250893, 24194189, 24121562, 10707495, -7591106, -18569274, -18977921, -14970876, -12047620, -9594218, -5191509, 82990, 2540660, 371953, -4105159, -6493331, -4414656, 357294, 3805458, 3138336, -1997056, -10222088, -18307340, -21212908, -15302178, -2509710, 10267280, 16511707, 14117550, 5339590, -4896695, -11494082, -13104135, -13307378, -14910954, -14046312, -4671805, 10824675, 21086454, 17990360, 4947619, -8778285, -16816378, -16490270, -7913963, 2291699, 2608281, -10044289, -22526421, -19925857, -5489370, 3652118, 2660]
45106B660o279930R28410L203356l936934r327437n849569m33518J00085L90204
45097b1202673O314403J3059273J2066551L509644n897462j2103765j3292971
45090a7547000o002642Q875068K0026936J6173839J638637q025338n972669k49861
45082H916970Q78221m91614K52729J115318j456215m993959n226813l216986j977725
45073f200074m4960M744822Q332411N228289j145423j385577N399405Q082242
45065B3011135j284198j4776512j7597289p025952M816132P598990M824379M876272
45057D442957O313388J374741p612752p463281N480735J5454295Q201922o229114
45049A9962891o100335J0091144K0910053J2835873k793210r637078p598837m739822
$$ y = [2660, -6277270, -5348860, -2145504, -6082438, -15409875, -21259444, -21692962, -21592877, -21202673, -14888270, -1828997, 10237554, 13747198, 7849736, -4254029, -17547000, -23549642, -14674574, 5352362, 21526201, 23164838, 15139500, 9166831, 8916970, 9795191, 9303577, 9556306, 10671624, 9215409, 4221450, -1005363, -4222349, -6200074, -6245034, -1500212, 6832199, 12060488, 10915065, 9529488, 14928893, 23011135, 21726937, 6950425, -10646864, -17672816, -12856684, -5257694, -433315, 4442957, 10756345, 12131086, 4518334, -2944947, 2535788, 17990083, 26192005, 19962891, 13862556, 23953700, 44863753, 57699626, 54906416, 45269338, 37670501, 32930679]
45041C2930679k009663J265052j527654j2532685j8091727o252610J1009828J1640968
45033A6432188m184860j5149094j1171231l974965k714024n85383O547804Q172252
45025f627313j928126j1004729o299555L928108M129173l266031l181297P080400
45017a7169370J4714139J1605880L180093l386494p313443q627550m990736K399768
45009i587713P121701M889255j839468p384318p208122j80430Q839054J0975715
45001E625674L578880m051361j759796P146695J0375502L716186m771137p168812
44993A2691831l985434O32903M349785N872632M945047L966486M404573K590022
44985C5467845m612830j1834051j1107277m472964j306836l648498m751311k646088
$$ y = [32930679, 30921016, 32186068, 30658414, 18125729, 34002, -6218608, 4791220, 16432188, 12247328, -2901766, -14072997, -18047962, -20761986, -21347369, -14799565, -6627313, -8555439, -19560168, -25859723, -21931615, -17802442, -21068473, -24249770, -17169370, -2455231, 9150649, 12330742, 8944248, 1630805, -6996745, -11987481, -9587713, -2466012, 2423243, 583775, -6800543, -14008665, -14189095, -5350041, 5625674, 9204554, 5153193, 3393397, 10540092, 20915594, 24631780, 19860643, 12691831, 8706397, 9339300, 13689085, 19561717, 24506764, 28473250, 32877823, 35467845, 30855015, 19020964, 7913687, 3440723, 2133887, -1514611, -6265922, -8912010]
44977h912010l123023o730507n390061L162646R527359P601332M024029N239705
44969E399470O514836K859703n65618j2987l427949j4761859j9006294k316224
44961b5316922K0062930J9346556m172455j8645011o532750J1128383R196641
44954E067372m066706m138966R638018J5760409O653325j955682R4400J967379
44946B9019549o064459j4009965r352372Q22283J429636n427332n168615K780651
44938e970624K945604q412294j2366833M657132K5616298K2138822o242962k8984095
44930f618952k2645783J668878J5673839Q733912m710555p678834Q17730J0887821
44922c871944J5818918J5245728R724117m231r006887j0391466m075790J402050
$$ y = [-8912010, -12035033, -18765540, -24155601, -20992955, -11465596, -3864264, 159765, 5399470, 11914306, 14774009, 14208391, 14195404, 10767455, -3994404, -23000698, -25316922, -5253992, 14092564, 9920109, -8724902, -15257652, -4129269, 5067372, 1000666, -3138300, 6499718, 22260127, 28913452, 26957770, 27052170, 29019549, 22955090, 8945125, -407247, 415036, 1844672, -3582660, -8751275, -5970624, -3025020, -11437314, -23804147, -19147015, 6469283, 28608105, 22365143, -6618952, -29264735, -27595857, -11922018, -3188106, -7898661, -15577495, -14759765, -3871944, 11946974, 27192702, 36916819, 36912588, 27905701, 17514235, 13438445, 14840495]
44914A4840495p02812o655530q139065m072231j145543l546127p688765p934655
44906b5044233l092504L890117R036983R396983N496563J951356J975888K188427
44898E799580j979159p161000o084237l07627J197727k043643K08397R814599
44890e55363J2191020k066656j8584864j6788477Q19893J2661866P983000k940852
44882g280433p808513o015560j258064N327960J0385095Q775878L333648L353528
44874H813539R384123J0819064L199973l983492k792364J631994K353688J855580
44866C1282105L180461J312624n767381q181391N31336Q570120K058302j0844207
44858B2141969j0201020M144022J0635321j867713j8102191j9835459j0386727
$$ y = [14840495, 14137683, 7482153, -656912, -4729143, -5874686, -9420813, -17109578, -25044233, -28136737, -24246620, -15209637, -5812654, -316091, 1635265, 3611153, 5799580, 3820421, -3340579, -9424816, -9732443, -8534716, -10578359, -10369962, -555363, 11635657, 9569001, -9015863, -25804340, -24984447, -12322581, -4339581, -7280433, -15088946, -21104506, -22362570, -17034610, -6649515, 2126363, 5460011, 8813539, 18197662, 29016726, 32216699, 28233207, 25440843, 27072837, 29426525, 31282105, 34462566, 35775190, 30007809, 21826418, 22357754, 30927874, 32986176, 22141969, 11940949, 16084971, 26720292, 24852579, 6750388, -13085071, -23471798]
44851b3471798m868905o415611n150278L859483J3710718J6621818J2752985O314940
44843A3353352k26024m956695m826884O4951L334621r73001r006483j0327068
44835a3563231k247715N230819L365848k218148k26109Q273254J1036623L477611
44827A3128952n005712o149497l156949j145611J519176M997875K039492r178791
44819b951065j5592417n907158J0007994J3433453M460689O31956Q422556J3932588
44811B6438596O665613l955288n136625n31576j006138m742351j339262Q052540
44803B4445509R828493r51733j1529975r870252k308293k901882j0976631j2319086
44795a6583850k734143L834950k470843r757587k249641J2574422J2996974k832058
$$ y = [-23471798, -28340703, -34756314, -39906592, -36047109, -22336391, -5714573, 7038412, 13353352, 13127328, 8170633, 3343749, 3408700, 6743321, 5770320, -3236163, -13563231, -15810946, -10580127, -7214279, -9432427, -9658536, -1385282, 9651341, 13128952, 8123240, 1973743, -1183206, -2328817, -809641, 4188234, 6227726, -2951065, -18543482, -24450640, -14442646, -1009193, 3451496, 4083452, 12506008, 26438596, 33104209, 29148921, 24012296, 23480720, 22474582, 17732231, 16392969, 24445509, 34274002, 33322269, 21792294, 11922042, 9613749, 6711867, -4264764, -16583850, -19317993, -15483043, -17953886, -27711473, -29961114, -17386692, -4389718, -7221776]
44787g221776j2346766l007198Q906013N254374n930711o098048L470535O979325
44779i994252J649827r82140K411659L514232Q96760K425087P365400N115529
44771A2402102m125852n939055M337702J1416067L164873j0805269j4315816o314521
44763a0179769L279669R057559J0678334O638828j912053p747717o673168l620842
44755d79159k794358l64047N206926N730299l164995j0441234m705563O314612
44747d697519N977016n669377j1396113j578717J3437103J7869214P838356p911319
44739A3868644j7329293j3799561j567098O996542M334210l064033l322728M903540
44731h979777J1438121Q716904R48739j708582N158637J4608811J4007893q69948
$$ y = [-7221776, -19568542, -22575740, -13669727, -8415353, -14346064, -20444112, -16973577, -9994252, -8344425, -9326565, -6914906, -3400674, -2503914, -78827, 7286573, 12402102, 8276250, 2337195, 6674897, 18090964, 21255837, 10450568, -3865248, -10179769, -6900100, 2157459, 12835793, 19474621, 17562568, 9814851, 3141683, -479159, -3273517, -3637564, 1569362, 7299661, 4134666, -6306568, -11012131, -4697519, 1279497, -4389880, -15785993, -17364710, -3927607, 13941607, 21779963, 13868644, -3460649, -17260210, -18827308, -11830766, -7496556, -10560589, -13883317, -8979777, 2458344, 11175248, 12123987, 10415405, 15574042, 30182853, 44190746, 43320798]
44723D3320798j7745957k0056132p787892K950349L138405J229592M806547O393149
44715A6248859j307315r207299o195858N48628k742272j1757254j0322600K796276
44707b1938835J2659892J2132881Q126930M052055m385593j3716816j2646532
44700a5716018k204704K361361m203006q723320k175602P131307J1053115J3709692
44692A232825J5694596N893133j5658656k4979191m899975K4383783K8412906
44685C0079421M570965j7614037j8589777q180866j655608J386397O567983J0180465
44677F744943N919127l680439j1055497j2392320p479966K257495J1150590J1975796
44669C439729N953316K925089O722603Q294162J86617r755525q756744J965344
$$ y = [43320798, 25574841, 5518709, -2269183, 681166, 3819571, 5049163, 9855710, 16248859, 14941544, 5734245, -461613, 87015, -2655257, -14412511, -24735111, -21938835, -9278943, 2853938, 10980868, 15032923, 10647330, -3069486, -15716018, -17920722, -15559361, -19762367, -28485687, -30661289, -23529982, -12476867, 1232825, 16927421, 22820554, 7161898, -17817293, -22717268, 1666515, 30079421, 34650386, 17036349, -1553428, -9734294, -11389902, -10003505, -3435522, 6744943, 12664070, 8983631, -2071866, -14464186, -21944152, -19686657, -8536067, 3439729, 9393045, 12318134, 19040737, 27334899, 27521516, 17765991, 9009247, 10974591]
44661A0974591R690082R147495O777801N305640k407875j7649722k5683234j3311395
44653a7156617R531473J9420326R323065m728079q629685p225122r616252j1583455
44645b0664346n331408L378321L940817J006713P790621K0572046J9464714o76858
44637B9480620j8542245j5517744j414526K343827o255428j1640775o591395Q60899
44629b7276767M779476R330350J6309319J7814986P863860o876894j4298333j0293975
44621b647978r47315M934562K459751o426518j3475025j0487900J782627J2882151
44613a1925645J3070760L187392p259988j0091148m852475L162712Q599089R306229
44605C196926N723416p00510p322644r930811n582837L087058Q597689N781618
$$ y = [10974591, 20664673, 29812168, 36589969, 41895609, 39487734, 21838012, -3845222, -17156617, -7625144, 11795182, 21118247, 16390168, 7760483, 535361, -9080891, -20664346, -25995754, -22617433, -18676616, -17669903, -9879282, 10692764, 30157478, 29480620, 10938375, -4579369, -5993895, -3650068, -9905496, -21546271, -28137666, -27276767, -22497291, -13166941, 3142378, 20957364, 28821224, 21944330, 7645997, -2647978, -3595293, 1339269, 3799020, -2627498, -16102523, -26590423, -24807796, -11925645, 1145115, 4332507, -2927481, -13018629, -17871104, -14708392, -6109303, 3196926, 8920342, 8219832, 897188, -9033623, -14616460, -11529402, -2931713, 2849905]
44597B849905k318748o934956k026852R380867J6599920J0503074o165072j8933621
44589B954517j5786902o54595J1458840J1995932N508908j085008p239817j3102622
44581e950747j3484907m979304N799775Q875013L454243k634649m099742k456771
44573a5477089m08923J700131L667154M768112N810365P928875R315977O799758
44565B4104360P84968m452329n536588l024061k80310p17387m492579o880663
44557d94589k920936N010063Q617947M715839p39074k684838l936352o874526
44549F93534o107172J949410Q928546N157578m211279o494264k206023l668532
44541e958202j2033660j1716218N599311K4539515K4180598M881228j3302102
$$ y = [2849905, 531157, -6403799, -8430651, 950216, 17550136, 28053210, 21888138, 2954517, -12832385, -13486980, -2028140, 9967792, 15476700, 14391692, 7151875, -5950747, -19435654, -24414958, -18615183, -9740170, -6285927, -8920576, -13020318, -15477089, -15886012, -14185881, -10518727, -5750615, 59750, 7988625, 17304602, 24104360, 24889328, 20436999, 14900411, 11876350, 11596040, 10878653, 6386074, -494589, -3415525, 1594538, 10212485, 14928324, 14189250, 11504412, 7568060, 693534, -5413638, -3464228, 5464318, 10621896, 6410617, -83647, -2289670, -5958202, -17991862, -29708080, -24108769, 430746, 24611344, 29492572, 16190470]
44534A6190470j4892101k900867R159377J1170435K547660r235052j4889267j1313568
44526a4162913l760283J486996M410929Q040192J0491149O254897l843856r832539
44518i15428l843133Q879300J5311140J0231765J090740l577180m188506m756076
44510A8232622l969943R17280N792265M874460J577108K915659M415186n131620
44502B9623017k1923630k6600534j2023372M716905Q216489O186736J0562613
44495a241776J3487466K706877j1769771j1425689j835932l790975j4917592j0862510
44487c9649902J1266282K2247290O044198j2659568n918185J4951499J8716611
44480A4998225J224157j2962820q922290K896039Q555260P679958N043731R04913
$$ y = [16190470, 1298369, -1602498, 7556879, 18727314, 21274974, 12039922, -2849345, -14162913, -17923196, -16436200, -12025271, -3985079, 6506070, 12760967, 8917111, -915428, -4758561, 4120739, 19431879, 29663644, 30754384, 27177204, 22988698, 18232622, 14262679, 15179959, 20972224, 25846684, 27423792, 30339451, 34754637, 29623017, 7699387, -18901147, -30924519, -26207614, -17991125, -11804389, -1241776, 12245690, 14952567, 3182796, -8242893, -10078825, -13869800, -28787392, -39649902, -28383620, -6136330, -92132, -12751700, -18669885, -3718386, 14998225, 16222382, 3259562, -5662728, -2766689, 5788571, 13468529, 18512260, 19417173]
44472A9417173m328156o106687j963114M108099O559357L793314k053584p564084
44464A1862318j0234991j0077802p950522k666878N877630J1581646Q349000J987373
44456H727774M455552J3021263R562854j1199979k7725198j9750472J629800R480889
44448a1797517j346824j1477355q289457O6176L441985M322504P840123J1076477
44440f163888R718679N945111L470567J703708n58591j544858l13730O81305n14725
44431A2423578k656992l655212k570591J2436P59949l992914j0565500q303581
44423a8548827N432926J6816533J2050079k728620r886293m873213R81168K4939
44415g31308l941402p266601j0790486j0811595p52526J4485550K0271989J3207673
$$ y = [19417173, 15089017, 8982330, 7019216, 11127315, 17686672, 21479986, 19426402, 11862318, 1627327, -8450475, -16400997, -19067875, -13190245, -1608599, 6740401, 8727774, 13183326, 26204589, 35767443, 24567464, -3157734, -22908206, -21278406, -11797517, -13144341, -24621696, -32911153, -32844977, -29402992, -25080488, -17240365, -6163888, 3554791, 9499902, 12970469, 14674177, 14115586, 12570728, 12256998, 12938303, 12423578, 9766586, 6111374, 3540783, 3553219, 4313168, 320254, -10245246, -18548827, -13115901, 3700632, 15750711, 13022091, 3135798, -1737415, -756247, -731308, -4672710, -11939311, -22729797, -33541392, -34293918, -19808368, 463621, 13671294]
44407A3671294O270208P304922P183804k235594j2563741j2692489o574072m460287
44399d095955n394543j801228M973327P130925M394539K918429K703811j606063
44391I223242p945183o914771K935161J0126505N516395m600816p107725k30574
44383A002234M169677k294947j1340588q683012L781651P013917q159391k3007601
44375c7518060j3086938J6175983L3006571K0374704l244086j1552101l730238
44368D25835K274481j358652n852659l674803J637020L858494K080753q90904
44360a500435j260059M293987J3599327J6859623O894925q899302j4518436m795532
44352A0674098P704595Q286822k221227r804270n206894N305031Q910052K684265
$$ y = [13671294, 19941502, 27246424, 34430228, 32194634, 19630893, 6938404, 364332, -4095955, -9490498, -11291726, -6318399, 812526, 5207065, 8125494, 10829305, 9223242, 1278059, -5636712, -2701551, 7424954, 12941349, 8340533, 1232808, 1002234, 5171911, 2876964, -8463624, -17146636, -13364985, -6351068, -14510459, -37518060, -50604998, -34429015, -1422444, 18952260, 15708174, 4156073, 425835, 2700316, 1341664, -4510995, -8185798, -6548778, -2690284, -609531, -1500435, -2760494, 1533493, 15132820, 31992443, 38887368, 29988066, 15469630, 10674098, 18378693, 26665515, 24444288, 14640018, 9433124, 14738155, 23648207, 26332472]
44344B6332472m061955l931059q21120r74436k008888O99652K684317k658660
44336A5260323r407188n870614M643316N878372n959340j5358778j1410852k022232
44328b4246993L214820P176675J1905395Q735505l934959r262492L722352J8162606
44320A5472909J2207681p123038j5126049o389021K849185L933702K829944L60037
44312I015350r071236j7858077r966298R900684J6908604L797903o583073J741406
44304b114737J2100433L788008j3357758j5106370o95331Q788395M117549j679203
44296d159014K844580J0852655R529556j671061j0793786p205362O467262J5130665
44288B0995495O422059j3452461k4584620j7079018k510996L609628K257380M533334
$$ y = [26332472, 22270517, 18339458, 17518338, 16543902, 14535014, 15234666, 17918983, 15260323, 5853135, -17479, 4625837, 10504209, 4544869, -10813909, -22224761, -24246993, -21032173, -13855498, -1950103, 6785402, 2850443, -6412049, -2689697, 15472909, 27680590, 20557552, 5431503, -957518, 1891667, 5825369, 8655313, 9015350, -55886, -17913963, -27880261, -17979577, -1070973, 2726930, -3856143, -2114737, 9985696, 13773704, 415946, -14690424, -15385755, -6597360, -2479811, -4159014, -1314434, 9538221, 19067777, 17396716, 6602930, -602432, 5864830, 20995495, 27417554, 13965093, -10619527, -27698545, -30209541, -26599913, -24342533, -19809199]
44280a9809199J1651968J3847552P462482J029941J653557M270656k81132j0940823
44272H885002j5662790n643710J1987768J9176940P008919j2262863j8926858
44265e437592r862611m59982j889901p289154n686838P73382L087356J785627
44257b4979713N297303J4141383J7498344P471886r901528k0384463j5399263
44250b6256051P8109J1642920Q936343l368001j0653066n664075L916521P541931
44242a3825369N319230M497595P555833J0158701Q124246J181458p878645j3854744
44234A278305j2029467m020225K777387M372132L824687L227027l34632o256965
44226g161751o788514O36054N781075k26470j0365841j1982506n199710N72203
$$ y = [-19809199, -8157231, 5690321, 13152803, 14182744, 15836301, 20106957, 19825825, 8885002, -6777788, -12421498, -433730, 18743210, 25752129, 13489266, -5437592, -15300203, -15760185, -17650086, -24939240, -30626078, -29852696, -26765340, -24979713, -19682410, -5541027, 11957317, 19429203, 9527675, -10856788, -26256051, -26177942, -14535022, -5598679, -8966680, -19619746, -25283821, -21367300, -13825369, -8506139, -4008544, 3547289, 13705990, 21830236, 23011694, 15133049, 1278305, -10751162, -14771387, -11994000, -7621868, -3797181, -570154, -904786, -7161751, -13950265, -13314211, -7533136, -7759606, -18125447, -30107953, -35307663, -34735460]
44218c4735460K772102N217676O107665J123356m059737L87337J0701725J2831940
44210C46604M222983l138509l424850m305634r163946q784131J101182R007494
44202a4138807N213393k184074p65806O310237O752192j046749o986437m537562
44194a1383613K963519Q737539P595641j986272j3802615j6228895n856487N746348
44186b4214835O331329j068978m662416q64280N031343J0153116J4562366J3928090
44178A9195735M238042p557314j0193118n414236n763282j3436465j5100588k901857
44170c6933083J1875314J4537762P292223M182341J0809666J7896965J3676516
44163D3337704k556591j8680247k0249764n746445R164982Q802504j885488m179122
$$ y = [-34735460, -31963358, -26745682, -20638017, -19514661, -23574398, -23187061, -12485336, 346604, 4569587, 1431078, -1993772, -6299406, -15463352, -24247483, -23146301, -14138807, -8925414, -11109488, -11875294, -5565057, 1187135, 140386, -6846051, -11383613, -8420094, 317445, 7913086, 5926814, -7875801, -24104696, -29961183, -24214835, -17883506, -18952484, -23614900, -24479180, -19447837, -9294721, 5267645, 19195735, 23433777, 15876463, 5683345, 269109, -5494173, -18930638, -34031226, -36933083, -25057769, -10520007, -3227784, 954557, 11764223, 29661188, 43337704, 40781113, 22100866, 1851102, -3895343, 5269639, 14072143, 12186655, 8007533]
44155H007533N612391R187965m101974j6487538o734609J5173359J9645873J99105
44147C0502105j7815387j4557477q85983L215421j946420k246073N600342J1514361
44139A3380889R199578K623828k784128n412016n248917m006351n052598o825455
44131d125170j428919J1877822J8526905O607540j1888616j3758323K529241J3975961
44123B2316441O061849q970227j4124624j1349001j1293898j2751190p590266
44116c7700916K117755P297802P500043R270907J2210350J0597972O784065Q043133
44108B6121111J0070784j87354k1128931l1544791j7997064M866897J2900783
44101a6898565L512767m389876K158318J5203374J9365554J0659514j988912q180245
$$ y = [8007533, 13619924, 22807889, 18705915, 2218377, -4516232, 10657127, 30303000, 30502105, 12686718, -1870759, -2756742, 458679, -1487741, -3733814, 1866528, 13380889, 22580467, 25204295, 22420167, 17008151, 11759234, 7752883, 2700285, -4125170, -5554089, 6323733, 24850638, 31458178, 19569562, 5811239, 8340480, 22316441, 28378290, 19408063, 5283439, -6065562, -17359460, -30110650, -37700916, -35583161, -28285359, -20785316, -11514409, 695941, 11293913, 18077978, 26121111, 36191895, 36004541, 14875610, -16669181, -34666245, -29799348, -16898565, -13385798, -17775674, -15617356, -413982, 18951572, 29611086, 27622174, 19441929]
44093A9441929m950163K564245O027725J138118p534820j0020047j642891J0173475
44085A5197571J2534410J516856j2488106j6427775r710340l105398k682081j689243
44077a6854106P176488J7432747J5849353K537732o332693Q9436J1578379J0262784
44069D1740120m690177j5464635r013137O555530J3187142M648166q898138j4980889
44061A3083982j0708694j065135P770523J1107014P290717L26038k849924r41126
44053B4013395M3562k908842l831924J847027P290115M155699k373374r50356
44045B7285302O187612N955298k545896n039641K960939O609630k638764r746392
44037B9028088m52979J2286676P580635p933476q997529P489877J6855113N265580
$$ y = [19441929, 14491766, 17056011, 23083736, 24221854, 16687034, 6666987, 5024096, 15197571, 27731981, 29248837, 16760731, 332956, -9377384, -12482782, -15164863, -16854106, -9677618, 7755129, 23604482, 26142214, 19809521, 19898957, 31477336, 41740120, 37049943, 21585308, 12572171, 19127701, 32314843, 36963009, 28064871, 13083982, 2375288, 1310153, 9080676, 20187690, 27478407, 27804445, 24954521, 24013395, 24056957, 21148115, 17316191, 19163218, 26453333, 30609032, 28235658, 27285302, 33472914, 39428212, 36882316, 31842675, 34803614, 41413244, 38774480, 29028088, 28575109, 40861785, 48442420, 40508944, 31511415, 39001292, 55856405, 61121985]
44029F1121985j0620857j1963825m474171l001720o154733l354429L765906M734195
44021C0052351n53531k177197K050126L369975k303964p548295n671407n49147
44013A6668911Q01532r39407k35996K655550P75547q288699j5628779j1226826
44005a5418167P57246N057090l515276j0804343l026636J1722431J4086061J765252
43997F23658p910858m525893K297426K024059M74554P116426J5923174J2633191
43989B8655737l556236j7646955j7535102o496960L515069N321669K272631K941378
43981b528769R874493J4625770Q337585l883287p533824Q88056Q269484M253358
43973C2302866m246639n587143j137632j14364l244938l101530K310885O600303
$$ y = [61121985, 50501128, 38537303, 34063132, 31061412, 24906679, 21552250, 25318156, 30052351, 29498820, 27321623, 29371749, 32741724, 30437760, 22889465, 17218058, 16668911, 17470443, 16531036, 16295040, 18950590, 19726137, 11437438, -4191341, -15418167, -14660921, -9603831, -13119107, -23923450, -26950086, -15227655, -1141594, 623658, -7287200, -11813093, -9515667, -7491608, -7017054, 99372, 16022546, 28655737, 25099501, 7452546, -10082556, -16579516, -13064447, -7742778, -5470147, -2528769, 7345724, 21971494, 30309079, 26425792, 18891968, 19780024, 28049508, 32302866, 28056227, 22469084, 21331452, 21217088, 17972150, 14870620, 17181505, 23781808]
43965B3781808M917381q99650o606898q968902n844848J908643R259164J1226581
43957B8773279P200178j96134p036544q170088j289978P378590Q176910O01213
43949C5437426o558711q238896o395702m24039J1348953J8791869P356713j5247893
43941C6069720k0777830n30250J7868658J0635424o563382o130066P483716J0388290
43933D8444280J512992j223919J221234q797655k6532819k4569487J505898K0616477
43925A2177001J1699931p225798j0607385n98119O773572R061442J1379179R537969
43917D2197792j018176j0981616r188096j90000M109140J811082k196992p490166
43909A7052968j3605548j2929408r42264J2954456J6026464Q009770k377876r703368
$$ y = [23781808, 28699189, 27799539, 21192641, 12223739, 6378891, 8287534, 17546698, 28773279, 35973457, 35777323, 28740779, 20570691, 19280713, 26659303, 34836213, 35437426, 28878715, 20639819, 14244117, 13820078, 25169031, 43960900, 51317613, 36069720, 15291890, 14761640, 32630298, 43265722, 36702340, 30572274, 38055990, 48444280, 49957272, 48733353, 49954587, 41156932, 14624113, -9945374, -8439476, 12177001, 23876932, 16651134, 6043749, 5445630, 12219202, 21280644, 32659823, 42197792, 41179616, 30198000, 21009904, 20819904, 24929044, 26740126, 24543134, 17052968, 3447420, -9481988, -10424252, 2530204, 18556668, 26566438, 24188562, 14485194]
43901A4485194j2148752p318693L051136J0437437R206293L112271k604882p330608
43893A0889396r432510n502928M01812k66710l789197L375059J8823146K0499419
43885C4997487J69789j9434754j7030935l672057j362093p462105m417539P224376
43877a0987831J1501698N979498L374830P419597R275009O372564M562471K689406
43869D0187242n651365j5669982j5306527n555450O09512n75772o89518K846475
43861A94615L041441j498785l754545j571827O58008K680292O298924N759996
43853A1808119l356240r893646j262494J1940123Q115730j0200184j8415632q308395
43845a9572619K276536K699540M394717J2930363J2835197m187356j9328747j3667091
$$ y = [14485194, 2336442, -4982251, -1931115, 8506322, 17712615, 20824886, 18220004, 10889396, 1456886, -4046042, -3644230, -3910940, -7700137, -4325078, 14498068, 34997487, 35167276, 15732522, -1298413, -4970470, -6332563, -13794668, -18212207, -10987831, 513867, 6493365, 9868195, 17287792, 26562801, 32935365, 37497836, 40187242, 34535877, 18865895, 3559368, -1996082, -1386570, -1962342, -2651860, 194615, 3236056, 1737271, -2017274, -3589101, -2931093, -250801, 6048123, 11808119, 8451879, -1441767, -2704261, 9235862, 17351592, 7151408, -11264224, -19572619, -17296083, -14596543, -10201826, 2728537, 15563734, 11376378, -7952369, -21619460]
43837b1619460L010729R123486K630812k747016j290529K083491M804287P298340
43829C294140O801696K220014q74276J088765L418291K468447J612402J844337
43821B1873816j340473n283956K68725J2330148J1154286r606238k6802566j8649590
43813a6055848L692712J4415066R594180M378752M353930K543614j458414j384005
43805B0079987P481n113951j2268160r446940K560900J1498041J2985555J2096482
43797C2399395Q875998J02495p259376l520851M206133j5558j3187409j4680604
43789F920223J484472J6440986J4854485M493407q76819j037698j661274j631321
43781C8986461R86987J800385q70783K50579Q833088J5024324Q311000o293555
$$ y = [-21619460, -18608731, -9485245, -6854433, -9601449, -10891978, -8808487, -4004200, 3294140, 10095836, 12315850, 11441574, 12530339, 15948630, 18417077, 20029479, 21873816, 20533343, 15249387, 15518112, 27848260, 39002546, 29396308, 2593742, -16055848, -12363136, 2051930, 11646110, 16024862, 20378792, 22922406, 21463992, 20079987, 20087468, 14973517, 2705357, -6741583, -4180683, 7317358, 20302913, 32399395, 41275393, 41377888, 34118512, 30597661, 34803794, 34788236, 21600827, 6920223, 8404695, 24845681, 39700166, 44193573, 43316754, 42279056, 40617782, 38986461, 39973448, 41773833, 40903050, 41153629, 49986717, 65011041, 73322041, 67028486]
43773F7028486j4358727r884636N15443P664428P850534L454793K725Q82577L635353
43764F6790976M187125L431949M204313L973980j147533o845364n496413O0936
43756F9159969k05772n984357o411631m6770P20655q359807j2578059K3119J8677318
43747E4994665K4162853J4206778K756696N87603P331024J7051917K2040858J6500371
43739A59632765N110445J585936J0138460J6394919P417314p663751j0812654
43732A81803434k219078K140366l076222o065805Q61903R506411J0087173M596918
43724A97635100R51j814681j697439M96349K038426k125111r620816r566534K234059
43715A77580304J4480013J4817758P062100M291467Q340973P416453m780664j7417759
$$ y = [67028486, 52669759, 42785123, 43300566, 50964994, 58815528, 62270321, 62273046, 63155623, 66790976, 70978101, 74410050, 78614363, 82588343, 81440810, 74595446, 69099033, 69159969, 68954197, 62969840, 56558209, 56511439, 57232094, 48872287, 36294228, 36317347, 54994665, 79157518, 93364296, 96120992, 96708595, 104039619, 121091536, 143132394, 159632765, 164743210, 166329146, 176467606, 192862525, 200279839, 192616088, 181803434, 179584356, 181724722, 178648500, 172582695, 173444598, 182951009, 193038182, 197635100, 197636051, 195821370, 194123931, 194620280, 196658706, 194533595, 184912779, 175346245, 177580304, 192060317, 206878075, 213940175, 218231642, 226572615, 233989068, 229208404, 211790645]
43707B11790645j5470235Q55809J5791954J6092465M849773m058219k375970M960630
43699B32436852Q584918P129011P008885J1036456J3121187P355776k206975o832509
43691B77633601o161457q285164j5474675j8379397j0319062l74144k148942j2568588
43683B03922172j4401493k026251P941930o88103k0195316k9194455k0572819
43676A24785665o711582R75499M370691Q211122R309248K838541p862276j4392183
43668A21524725j2345965l207122Q473404J5824003J2300785q61155j2519921
43661A29188754j2202097j951840N999346K794150q382278j6488824j3441939
43654H5515272j171553J0792026J4560416J0230943K934809l394894o595485m415786
$$ y = [211790645, 196320410, 197176219, 212968173, 229060638, 233910411, 229852192, 227476222, 232436852, 241021770, 248150781, 255159666, 266196122, 279317309, 286673085, 284466110, 277633601, 271472144, 263186980, 247712305, 229332908, 219013846, 218639702, 216490760, 203922172, 189520679, 187494428, 195436358, 194748255, 174552939, 145358484, 124785665, 118074083, 119049582, 123420273, 131631395, 140940643, 143779184, 135916908, 121524725, 109178760, 105971638, 114445042, 130269045, 142569830, 141708675, 129188754, 116986657, 115034817, 121034163, 123828313, 115446035, 98957211, 85515272, 84343719, 95135745, 109696161, 119927104, 122861913, 119467019, 112871534, 108455748]
43646A08455748J936797M575202l058038j5034271j7856976q209056J985442J201876
43638G3996724q067478j5050412j3764882o324332J430574L909707P0765l892033
43630C2308633j451987L706883J925460o046478p446465L124546J3652547J1385366
43622E1158505l55016j0767083j7290722k1730577j9283075n419829J0969095
43615a2718702J5218604O309602k901307l960573o76636Q67400l9878j921520
43607A76990l666567l241285j85694J771068M85878M71972N232027R257783O426977
43598A6729149J128686N77966J761756j293452l202497L805943J1325302M866569
43590C5699422r057276q583417P519055J3679589l123270k0809138j4809860N557473
$$ y = [108455748, 110392545, 114967747, 111909709, 96875438, 79018462, 70809406, 72794848, 73996724, 65929246, 50878834, 37113952, 30789620, 32220194, 36129901, 36200666, 32308633, 30856646, 34563529, 36488989, 30442511, 22996046, 26120592, 39773139, 51158505, 50803489, 40036406, 22745684, 1015107, -18267968, -23687797, -12718702, 2499902, 8809504, 5908197, 1947624, 1270988, 2138388, 2098510, 176990, -3489577, -6730862, -6916556, -5145488, -4659610, -4187638, 1044389, 10302172, 16729149, 17857835, 18435801, 20197557, 18904105, 15701608, 19507551, 30832853, 35699422, 26642146, 18058729, 25577784, 39257373, 36134103, 15324965, 515105, 6072578]
43582F072578J3439672L951333m925930l773153j517052m448452n421825J339368
43574D716539R337417R940564L413233n355848j3868711j9490746j6848932m535094
43566c2691578R024846J2878654O802358K552639R180939J9685763J7873767k4237
43558D5283151j7394768j7415242n675760j619674r799559j4310554m625424Q866238
43550a6691592J3480329J3702402J8464767K0478138O523282j6715217k6223648
43543A3018461j3574096L721980O646090k398684q127226m188151K440419M113503
43535A652296J621246R14242M890370R734653R399476L473378k041851l449005
43527B6194805m464386q139155q532194J158260J4285414J5016354o71389j7034828
$$ y = [6072578, 19512250, 23463583, 18537653, 14764500, 13247448, 8798996, 3377171, 4716539, 14053956, 23994520, 27407753, 22051905, 8183194, -11307552, -28156484, -32691578, -23666732, -10788078, -3985720, -1433081, 7747858, 27433621, 45307388, 45283151, 27888383, 10473141, 4797381, 3177707, -6621852, -20932406, -25557830, -16691592, -3211263, 10491139, 28955906, 49434044, 55957326, 39242109, 13018461, -555635, 3166345, 9812435, 7413751, -713475, -4901626, -2461207, 1652296, 3273542, 4187784, 9078154, 18812807, 28212283, 31685661, 29643810, 26194805, 21730419, 13591264, 5059070, 6217330, 20502744, 35519098, 34847709, 17812881]
43519A7812881j6907741k383309Q892562N430603o029867j0841753m665046K593085
43511f098585J277920m222554j803967R725782J6980922J0291861k612742q090866
43503A5447771n143527l239907n906355p201215l413289J805724M898450O428956
43495C676608O207183K049635m648571q518075p008585k373633K965438P121018
43487e28982O186439j194003p756753n404498J278774L6846r621343j4260800
43479c1264320p165990J517250J370098l454557m199398j576133J70681L811902
43471d0790467J1674792J5062528N202380r123588r403780P096184K2476363K1336538
43463B3530950P958051l447171o232893l555577m93292p80020o803858j5779926
$$ y = [17812881, 905140, -1478169, 7414393, 12844996, 6815129, -4026624, -8691670, -6098585, -4820665, -9043219, -10847186, -1121404, 15859518, 26151379, 23538637, 15447771, 10304244, 7064337, 1157982, -6043233, -9456522, -7650798, -2752348, 3676608, 9883791, 11933426, 7284855, -1233220, -8241805, -10615438, -7650000, -528982, 5657457, 4463454, -3293299, -8697797, -7419023, -7382177, -17003520, -31264320, -38430310, -36913060, -35542962, -38997519, -43196917, -44773050, -44602369, -40790467, -29115675, -14053147, -8850767, -17974355, -27378135, -20281951, 2194412, 23530950, 31489001, 28041830, 21808937, 18253360, 17760068, 16980048, 10176190, -5603736]
43455e603736j8117338o733398J1396075J9313625R150957p164745j1554704j891066
43447a1204330O664926L063528n463968n755422K296531Q097881P072461M142272
43439H913879K206155j210264m920597l394170J945696K180317l883071n575427
43431c737482K138887Q693181M374888m117955n950580m364911q419153j3552970
43423b4936095p199233Q453234J5987443P356200n156409p310643p28204L947565
43415i586142K799221L1024j009892r73284m51260J979282O798865J0658395Q458474
43406A8704683K0540o657423l680359M750560N908890k923797q653512j671179
43398E798403Q676576Q490140P69372j605421J706734L1353o838118p104423J324980
$$ y = [-5603736, -23721074, -30454472, -19058397, 255228, 9406185, 2241440, -9313264, -11204330, -4539404, -1475876, -6939844, -12695266, -10398735, -2300854, 4771607, 8913879, 11120034, 9909770, 4989173, 1595003, 3540699, 5721016, 1837945, -3737482, -1598595, 7094586, 11469474, 7351519, 1400939, -2963972, -11383125, -24936095, -32135328, -23682094, -7694651, -338451, -5494860, -12805503, -13533707, -9586142, -6786921, -6755897, -7765789, -8739073, -9190333, -7211051, -412186, 10246209, 18704683, 18725223, 12067800, 8387441, 13138001, 19046891, 16123094, 7469582, 5798403, 14474979, 22965119, 23734491, 22129070, 23835804, 23867157, 17029039, 9924616, 11249596]
43389A1249596N631403j91876n184724q06943M926834K885304j373351K83034
43381A7419277K322539l651989j0283186l515923J3093814J9521530O415951j2189838
43373B9132175j7937937j0018721j402328M82486P48417N151331Q780734K658437
43365A7594594j0559864j6334661p872765K262178m56519r695339o969080Q605467
43357b3425989J6359922M478574j1792565j2097365J511292J1199128Q562661
43350e204342M27054m904704n060670j36338P997494J4064250J3983486R264336
43342C0430566K721351n117144j1202473r518129j418408K734494m74201r71330
43334G184726N722867O247538q458338k1040070r130000J7991396K8089727J0791228
$$ y = [11249596, 16880999, 16689123, 11504399, 10697456, 15624290, 18509594, 17136243, 17419277, 19741816, 16089827, 5806641, 2290718, 15384532, 34906062, 41322013, 29132175, 11194238, 1175517, -226811, 255675, 1004092, 6155423, 14936157, 17594594, 7034730, -9299931, -17172696, -14910518, -15367037, -25062376, -32031456, -23425989, -7066067, -2587493, -14380058, -26477423, -24966131, -13767003, -5204342, -4777288, -9681992, -14742662, -14879000, -6881506, 7182744, 21166230, 30430566, 33151917, 28034773, 16832300, 7314171, 5895763, 8630257, 8156056, 7184726, 12907593, 19155131, 10696793, -10343277, -19473277, -1481881, 26607846, 37399074]
43326C7399074r529218j0196411J514536N541804k435866j1181134j1649141m427417
43318d963773L939221N916742j07230n700064k492741L957430J371552q271281
43310f350144r383077K725430J3353098J0227971p66359q904400j3184903j4500777
43302b6783161p466092P836234J7495753J0455457m713832j1523963o572946K034808
43294a9237742R200001J3724551J1790418K457657n322855l173129L517872M037212
43286A6993985n47293m99274N923109J0656853Q427341P88478r665962j8943870
43278A3133367j8909876o176455Q763870J2517074O560208K516947K432941k190357
43270A8647719j1770959j4121517l028343J0563676J2313423J644075r994098
$$ y = [37399074, 27869856, 17673445, 19187981, 24729785, 22293919, 11112785, -536356, -4963773, -1024552, 4892190, 4784960, -915104, -3407845, 549585, 1921137, -6350144, -15733221, -13007791, 345307, 10573278, 9806919, 902519, -12282384, -26783161, -34249253, -26413019, -8917266, 1538191, -3175641, -14699604, -21272550, -19237742, -10037741, 3686810, 15477228, 17934885, 12612030, 9438901, 12956773, 16993985, 16446692, 15947418, 21870527, 32527380, 40954721, 41743199, 32077237, 13133367, -5776509, -11952964, -3189094, 9327980, 15888188, 18405135, 20838076, 18647719, 6876760, -7244757, -10273100, 290576, 12603999, 14248074, 4253976]
43263D253976j2410310m693989N537652Q722131K593640n049405n920886r85801
43255g952992L896557P426021J0567052R500291Q97095q839235j0454616n896064
43247h55891m318969o163920m039792J617390K440236j091775J727989J2215462
43239A530730J6255715N100794j0320390j4292395n675816N178247R954161N855551
43231A3586597n617046j6147328j4873651j908932R987727J2489682J0893177
43224H410226J0495145N954138o160091j5587346j1909218j444252K498124p01672
43216h444946k544405k272874m744292n822113K824932J5093633J4357454o35674
43208G811715j0462294k910755Q364026M308773j0967845j6359806l964876J1286181
$$ y = [4253976, -8156334, -12850323, -7312671, 1409460, 4003100, -1046305, -6967191, -7952992, -4056435, 3369586, 13936638, 23436929, 24334024, 15494789, 5040173, -855891, -5174860, -11338780, -15378572, -13761182, -11320946, -12412721, -10684732, 1530730, 17786445, 22887239, 12566849, -1725546, -7401362, -2223115, 7731046, 13586597, 7969551, -8177777, -23051428, -24960360, -14972633, -2482951, 8410226, 18905371, 24859509, 18699418, 3112072, -8797146, -10241398, -7743274, -8444946, -10989351, -13262225, -18006517, -23828630, -21003698, -5910065, 8447389, 7811715, -2650579, -5561334, 2802692, 7111465, -3856380, -20216186, -24181062, -12894881]
43200a2894881J3649484O033568J086114J260391j807633j0401527j4632143p214898
43192b4921525M573959R298092P481212P490382R436912N740357k820287n551830
43184A0727272L43336M196446M59680j034568O388791J0554441j586015j9654731
43176A0394652k1852536p074546L937518n7922o851714l063771O407509J0134156
43168h026654P919310N576425K037128n629414j1023523n810798M710709O750244
43160c496573j186397n547409R86968P815592L324372o574542p750173N34217
43152a1893945O321462N060335M734470Q601485P325157m094222j3899765r557699
43144g402722K840316Q400141N949462N567192P940240L855689n804378p838615
$$ y = [-12894881, 754603, 6788171, 7874285, 9134676, 7327043, -3074484, -17706627, -24921525, -20347566, -11049474, -3568262, 3922120, 13359032, 19099389, 16279102, 10727272, 11070608, 15267054, 15726734, 14692166, 21080957, 31635398, 30049383, 10394652, -11457884, -18532430, -14594912, -14652834, -21504548, -24568319, -18160810, -8026654, -107344, 5469081, 7506209, 1876795, -9146728, -14957526, -10246817, -3496573, -4682970, -10230379, -9243411, -1427819, 1896553, -4677989, -12428162, -11893945, -5572483, -512148, 4222322, 12823807, 20148964, 16054742, 2154977, -7402722, -4562406, 3837735, 9787197, 15354389, 23294629, 27150318, 21345940, 13507325]
43136A3507325J279521Q001229L140113m649157n365633l095628m388565m530192
43128C899013J973052Q406928O745224K034206K407837L608964k189559j0094284
43120A6791381j0268603n259132m010445m808632o71272L907332k98594p884670
43112a2502635n432328M869935Q213673K908012J840212O989532N490226l925289
43104H451338m384200R174862J5900668L07520k0305098j8534574M641317K2604967
43096A7856800J7913169j668640j8300727k1255120j0223717O889994J7994381
43089I206140J5360742J323899j5867000k7823243k6758710r623649J3244883
43082d0936938K2666293J1837068m050282p398752k32954K903524k329714o491459
$$ y = [13507325, 14786846, 22788075, 25928188, 21279031, 15913398, 12817770, 8429205, 3899013, 5872065, 14278993, 21024217, 23058423, 25466260, 29075224, 26885665, 16791381, 6522778, 1263646, -2746799, -7555431, -8226703, -4319371, -4617965, -12502635, -17934963, -13065028, -4851355, -1943343, -103131, 6886401, 12376627, 8451338, 4067138, 13242000, 29142668, 29450188, 9145090, -9389484, -4748167, 17856800, 35769969, 34101329, 15800602, -5454518, -15678235, -8788241, 9206140, 24566882, 25890781, 10023781, -17799462, -44558172, -54181821, -40936938, -18270645, -6433577, -10483859, -17882611, -18115565, -15212041, -17541755, -24033214]
43074b4033214k893952M013544P964374R457324J1577444J2890682R088511N37224
43066B8601937n407972k621564M004881K944704o862310j1472529k413939P154052
43058A3927260N99753j4839046j7897061o912534k68004k316820L499726J9456027
43050d750699K1313697j132780j8567624l213783K5596058K7990018K091044j7460881
43042C1865050j3401529m427399p856335j4436399r564929L702799J3566748J4927135
43034A4375141Q394486k240809p498061j435747N127306k555967j6516377j3602462
43026a5952490O756859J6969132K927665j3386431q536175P036869R167075j421807
43018C560697m960918L104491Q409916M337938k43994n14827l066725r808257
$$ y = [-24033214, -26927166, -22913622, -14949248, -5491924, 6085520, 18976202, 28064713, 28601937, 23193965, 20572401, 24577282, 27521986, 20659676, 9187147, 6773208, 13927260, 14527013, -312033, -18209094, -25121628, -25389632, -27706452, -24206726, -4750699, 16562998, 15430218, -3137406, -6351189, 19244869, 47234887, 49325931, 31865050, 18463521, 14036122, 6179787, -8256612, -17821541, -14118742, -551994, 14375141, 22769627, 20528818, 13030757, 11595010, 16722316, 14166349, -2350028, -15952490, -9195631, 7773501, 10701166, -2685265, -11221440, -4184571, 4982504, 3560697, -1400221, 1704270, 10114186, 14452124, 14208130, 13693303, 10626578, 818321]
43010H18321j1350674k978267N946523O062884J393361P54319L525149K609306
43002F780922l153946p937454q143665n206241N1517Q062887J4047735R263627
42994A3765382n788939j6367201j0891886J050744O63798j1079755j2668053M441761
42986c6874149J9201919J1145582p779340j1335762J010740O617871j439512n288465
42978b4741116L562786P980613m349710j7252674j1124885N516691J0656842L273776
42970b6477677O06689P007424Q558476o51034p422252p44556J1101203J3226560
42962E204833L916940o599011j0828609r439260m763955L642778J4783006K1398078
42954A7314800J5088178j239404j1063251k148106J5064212J7684111P22847j5473915
$$ y = [818321, -10532353, -13510620, -7564097, -1501213, -107852, 646467, 4171616, 6780922, 3626976, -4310478, -12454143, -17660384, -17608867, -9545980, 4501755, 13765382, 7976443, -8390758, -19282644, -18231900, -17568102, -28647857, -41315910, -36874149, -17672230, -6526648, -14305988, -25641750, -24631010, -18013139, -19452651, -24741116, -21178330, -13197717, -17547427, -34800101, -45924986, -40408295, -29751453, -26477677, -25870988, -18863564, -10305088, -10956122, -18378374, -19122930, -8021727, 5204833, 9121773, 2522762, -8305847, -17745107, -22509062, -18866284, -4083278, 17314800, 32402978, 31163574, 20100323, 17952217, 33016429, 50700540, 51423387, 35949472]
42946C5949472j4051150m053098k354187n773931M08215J2784599J0754370j0765932
42938B2898358k9497842k5266155o421028M698040K286543o31132M427224R904259
42930a7601733O159245l352351p148590j454494N839248O789605L158416J325072
42922f285582J690523n45818n186268n233605K313969J0407560J0859085M243996
42914A2263860l256011p726453p513362j065282Q794646J3419822Q486119J217323
42906B4620662l23783k65367p090358j6640740j5968919l975457N225798K945122
42898a1473042k337637L9835O747971P868943K693328j892134m082137p547585
42890i982458j0565052n477363Q117947J8151566J4134999J523170n272629k217797
$$ y = [35949472, 21898322, 17845224, 15491037, 9717106, 10125321, 22909920, 33664290, 22898358, -6599484, -31865639, -38286667, -33588627, -31302084, -31933216, -27505992, -17601733, -11442488, -14794839, -21943429, -23397923, -17558675, -10769070, -7610654, -6285582, -4595059, -5140877, -10327145, -15560750, -13246781, -2839221, 8019864, 12263860, 9007849, 1281396, -6231966, -7297248, 1497398, 14917220, 23403339, 24620662, 24296879, 24031512, 16941154, 300414, -15668505, -19643962, -14418164, -11473042, -13810679, -13770844, -7022873, 846070, 3539398, 1647264, -2434873, -9982458, -20547510, -26024873, -17906926, 244640, 14379639, 15902809, 10630180, 8412383]
42882H412383N89031l889481q152849k901932O213439O317224j365472k233924
42874B988419P654552J3169352K914953j2737182j7348736j1363989n880480k044727
42866b2647838O970663J8053920J9631801J0627174K000555j763252o888232j3466161
42858A2518630j1439402R7002N677653m058439j5722008j1636356M436779J3315835
42850f810306O351995o895232j3454272q701043M110543J6187201J6809400L710548
42842A1308834j1296449j5012641r042432m557572l673755J917793J3274990J8482119
42834A400887J0103318k310931n316794L01854L564372K96166l988159n764832
42826a714119p278569p790422j718022R852543J4870849N545807q126973r878598
$$ y = [8412383, 9001414, 5111933, -3040916, -5942848, 270591, 6587815, 5222343, 2988419, 10642971, 23812323, 26727276, 13990094, -3358642, -14722631, -20603111, -22647838, -15677175, 2376745, 22008546, 32635720, 34636275, 32873023, 25984791, 12518630, 1079228, 1176230, 6853883, 2795444, -12926564, -24562920, -20126141, -6810306, -458311, -7353543, -20807815, -29508858, -25398315, -9211114, 7598286, 11308834, 12385, -15000256, -24042688, -28600260, -32274015, -30356222, -17081232, 1400887, 11504205, 9193274, 3876480, 4178334, 7742706, 8038872, 4050713, -1714119, -8992688, -16783110, -18501132, -8648589, 6222260, 11768067, 3641094, -6237504]
42818f237504P82630R064795P424058N029350R765149J2845759K410546j4864373
42810B6220410j9811361p250979O926508Q415328K413842J577668N183190J828780
42802B5503386j0267418j8003036j1639585J082559O201635L044113K534841P631591
42794F088086P578970l634350j4168991j0131661K682644O466762k094566q139125
42786a5352231k540718O107946Q211045O586293N282945j37220r960218j1808232
42778a3610390P08255J2511134P054241p779740j2477326o656004n461647r955542
42770c5667019n195862J1427473K3227315K0169559J0849191K953351p233947
42763B0530061j8069429j6655091j448579Q292127j52987j2536441r814143L673212
$$ y = [-6237504, -5454874, 3609921, 11033979, 16063329, 25828478, 38674237, 41084783, 26220410, 6409049, -841930, 6084578, 14499906, 16913748, 18491416, 23674606, 25503386, 15235968, -2767068, -14406653, -13324094, -7122459, -4078346, -1543505, 6088086, 13667056, 10032706, -4136285, -14267946, -11585302, -5118540, -7213106, -15352231, -17892949, -11785003, -3573958, 3012335, 8295280, 8158060, -1802158, -13610390, -12902135, -391001, 6663240, -1116500, -13593826, -20249830, -25711477, -35667019, -40862881, -29435408, -6208093, 13961466, 24810657, 27764008, 20530061, 2460632, -14194459, -15643038, -7350911, -7503898, -20040339, -29854482, -26181270]
42755b6181270J0707074P759816L756399J818468o42835j044437K980309L890783
42747C044307m505738j2744561q814595R02653J619222m295118j864589Q695602
42739a7962817J0438662j384861r418353p42676J3354670J4353215J455736j0736903
42731f43327j1892623m387302L388417N413988K022051q52506J870825Q109034
42723C028557J1637867J0259475O352000R12258o673442j3608251j4945706j0143693
42715a3180935l238237K689040O325888N759016J276188k112241j364925j171968
42707e018174n820377r917678o558628k28185j85322m486341l319882M145544
42699c1389043R858507J2018162J5083727J5581917N213939j0118829j2891120
$$ y = [-26181270, -15474196, -7714380, -3957981, -2139513, -2782348, -3826785, -846476, 3044307, -1461431, -14205992, -23020587, -22117934, -20498712, -24793830, -26658419, -17962817, -7524155, -8909016, -18327369, -19070045, -5715375, 8637840, 10093576, -643327, -12535950, -16923252, -13534835, -8120847, -6098796, -6951302, -5080477, 3028557, 14666424, 24925899, 31277899, 32190157, 25516715, 11908464, -3037242, -13180935, -16419172, -13730132, -7404244, -1645228, -369040, -2481281, -3846206, -5018174, -10838551, -20756229, -27314857, -27543042, -27728364, -32214705, -35534587, -31389043, -21530536, -9512374, 5571353, 21153270, 26367209, 16248380, 3357260]
42692C357260o37328Q023507J536249q271862q138498l998104n755226p173258
42684b1057260J345977J1672477R267190j703690m363324L199052N621991l801924
42676A80489j2697515r455898R20287P041466O201512K575145j335899m652572
42668a1222985n002234j364403L110573M991471M689286M237963L821362K751535
42660F012568J349232j59160k482973n311214o361787m085760k44701J602332
42652i681463O9271k166070j167238K812100M041458j497790q234478n623831
42644b1448041P305873J7690922J3899509N31222p956555n826687p83336p36655
42636B676252l848914m312507j670597K92225M67165J326140L765803M886478
$$ y = [3357260, 2719932, 10743439, 12279688, 4007826, -4130672, -8128776, -13884002, -21057260, -19711283, -8038806, 1228384, -475306, -4838630, -1639578, 3982413, 180489, -12517026, -21972924, -21052637, -14011171, -7809659, -5234514, -6570413, -11222985, -16225219, -17589622, -14479049, -9487578, -4798292, -560329, 3261033, 6012568, 7361800, 7202640, 4719667, -591547, -6953334, -11039094, -11283795, -9681463, -9612192, -11778262, -12945500, -10133400, -6091942, -7589732, -15824210, -21448041, -14142168, 3548754, 17448263, 17979485, 10022930, 4196243, 3412907, 2676252, -1172662, -5485169, -7155766, -6863541, -6396376, -5070236, -1304433, 3582045]
42628C582045J955935l332859o296262m997682l014834m604201p732874n689112
42620c0129844K548882Q022459L274266m708516j765382J1937864J7941541M215671
42612A1336941j4719750j5391835O19864P515435o009872j7468715l609514K1849474
42604a5877972K5306293K054610j7088262j0787024N956473J0554789N709464
42597E828371N401046N974102m482283j8066845j4861868L622441J3878372O172811
42589C466147k272764K969891J1671396Q397416l286883j0346968j1490671j3645036
42581a4537472j5373435q786140N411176J6751591J7758867R741833j923623j1049387
42573b006590j1766123l741580N201000P610232N798522P168390J2085751J2884844
$$ y = [3582045, 5537980, 2205121, -4091141, -9088823, -12103657, -16707858, -24440732, -30129844, -27580962, -19558503, -16284237, -20992753, -22758135, -10820271, 7121270, 11336941, -3382809, -18774644, -18154780, -10639345, -16649217, -34117932, -37727446, -15877972, 9428321, 11482931, -5605331, -16392355, -10435882, 118907, 5828371, 11229417, 17203519, 12721236, -5345609, -20207477, -16585036, -2706664, 3466147, 1193383, 4163274, 15834670, 24232086, 20945203, 10598235, -892436, -14537472, -29910907, -38697047, -33285871, -16534280, 1224587, 10966420, 9042797, -2006590, -13772713, -17514293, -12313293, -4703061, 1095461, 8263851, 20349602, 33234446]
42565C3234446N338120m210029o072414J57141L731242l878879j5903628j7478453
42557e082454p023900J18293m340336o959711M579915J6292649P316749j2929565
42549h028360j4861793M057886J3111702k463326j7285831p661079J0759212J1473602
42541a0897987O20905K496004J6623226K0363571P035869p226656j1766093j1058268
42533F190571p566590R87423P321129O66821j1709630j1304040J565604P111938
42525f736774j153490o243571L005779J4290067J3179643L506612m043471p783204
42517H021591r218009n440898K693369O629666K553328l067899n742914q062935
42509a1634701q307521K18873J2561842J2483894k084159j2050314o117757K189310
$$ y = [33234446, 38572566, 34362537, 28290123, 28447264, 32178506, 28299627, 12395999, -5082454, -12106354, -11988061, -16328397, -23288108, -18708193, -2415544, 4901205, -8028360, -22890153, -18832267, -5720565, -8183891, -25469722, -33130801, -22371589, -10897987, -10277082, -7781078, 8842148, 29205719, 36241588, 29014932, 17248839, 6190571, -1376019, -388596, 6932533, 7599354, -4110276, -15414316, -13848712, -6736774, -7890264, -14133835, -11128056, 3162011, 16341654, 19848266, 15804795, 8021591, -1196418, -6637316, -3943947, 2685719, 5239047, 2171148, -3571766, -11634701, -19942222, -19723349, -7161507, 5322387, 3238228, -8812086, -14929843, -12740533]
42501a2740533k6534k099528R027248K1735101J6926181M16952o245551o9472
42493B6923864K552980m300966r368789p603428p620124j2000038j0623408j54067
42485b2193976P416574L635771l791620n352324l468911l379946k403398K229570
42477b7308260N436782M107170N092997J2458081J5915027N370739r872120j1913861
42469g13445q77448N663527K01656m651303J445599J0020576R266016L019468
42461B3374646J360199K147644k449868p530597j805382R555620Q108205q324137
42453B4436330j8502634q652937O881492Q390311p77807m621707j477127j472260
42445D203661m493398j276628O252742N760910l483162p770147j171452O249408
$$ y = [-12740533, -12767067, -14866595, -5839347, 15895754, 32821935, 33238887, 26993336, 26923864, 29476844, 25175878, 15807089, 8203661, 583537, -11416501, -22039909, -22193976, -14777402, -11141631, -14933251, -20285575, -23754486, -27134432, -29537830, -27308260, -21871478, -17764308, -12671311, -213230, 15701797, 21072536, 11200416, -713445, -1590893, 4072634, 4274290, -377013, 1068586, 11089162, 20355178, 23374646, 24734845, 26882489, 24432621, 16902024, 15096642, 24652262, 32760467, 24436330, 5933696, -2719241, 4162251, 12552562, 11774755, 7153048, 5675921, 4203661, -289737, -1566365, 4686377, 10447287, 6964125, -806022, -1977474, 4271934]
42437D271934O532258L913559J733564m376816j3067952j2928374j140403P826453
42429g235777L220930n420541n463119k702992r341079j8780896j1614285J4065002
42421d3272757L4979600L0328190O656631j1315617r379217K936093P163749j356788
42413A6739884j0435527r614056l279923k53973Q20445N134834P844349J290862
42405H246895p989960o720339K017256K206342p524970j0958084l154824O77705
42397b3199979o504900j0049523j041520N977684l03683n505959N069658J8113147
42389a7445075J4000074N23069k148281L102085m00003q187429j398187J5666014
42381C712267J7712242K2176j3301812q840011k546231q611171j5748533r167471
$$ y = [4271934, 10804192, 14717751, 16451315, 12074499, -993453, -13921827, -15062230, -7235777, -4014847, -9435388, -14898507, -17601499, -26942578, -45723474, -57337759, -43272757, -8293157, 22035033, 28691664, 17376047, 7996830, 10932923, 18096672, 16739884, 6304357, -3309699, -6589622, -6843595, -6023150, -888316, 6956033, 8246895, 256935, -6463404, -4446148, -2239806, -9764776, -20722860, -23877684, -23199979, -29704879, -39754402, -40795922, -34818238, -35121921, -40627880, -35558222, -17445075, -3445001, -2921932, -5070213, -1968128, -2368131, -10555560, -11953747, 3712267, 21424509, 21446685, 8144873, -695138, -3241369, -11852540, -27601073, -36768544]
42373c6768544M296086Q949775L622940j623718j456518K668407P281540O770870
42365f259162j559840q159525k59234J5475444J6232409l336961j9078527j1177962
42357a8123358P073278J0937981N35035m928791k46888J173467n926243q715951
42349a8221470J502597J3518576J2128870l70759r072856p650630m034362n276598
42341a7476632o851209k172632M435548L604793l108980m453961K093854N526752
42333a8402467K28043k926509N808091J7216760J6050652L876497n129121n327639
42325A1394307k352567j5976P66043m641567j6105901j9207914l132066J6406418
42317a6889223J4071156p063659j8409144q179967M763309M880459J669637O700570
$$ y = [-36768544, -32472458, -23522683, -19899743, -21523461, -22979979, -20311572, -13030032, -6259162, -7819002, -15978527, -16237761, -762317, 15470092, 12133131, -6945396, -18123358, -11050080, -112099, 422936, -4505855, -4752743, -3579276, -9505519, -18221470, -16718873, -3200297, 8928573, 8557814, -515042, -8165672, -12200034, -17476632, -24327841, -26500473, -22064925, -18460132, -21569112, -26023073, -23929219, -18402467, -18174424, -21100933, -15292842, 1923918, 17974570, 21851067, 16721946, 11394307, 9041740, 9025764, 9791807, 5150240, -10955661, -30163575, -33295641, -16889223, -2818067, -9881726, -28290870, -36470837, -31707528, -26827069, -25157432, -18456862]
42309a8456862J2614416R596901L580839L079667L896883N65213j922464j63729
42301A2790864q46719n568489m020847N236599O083087p757004j6129366k488809
42293a2700684J7497395J9565900P196429q6903q00370o395100j2354755m312956
42285G608956J1479825J2997461k075321j2341613o821625J736101K399984J467549
42277A6451317M808189N599777o85277o215894n373699m579040q064555p359836
42269e419018M147196J6649684J5311055J75100j4172657j5348954m066971Q609696
42261E885131J1609021M135595l625629l059534J949550K093026l011993o208758
42253I766409n816415o474983p767452l783793M192263N903920k653790j1270907
$$ y = [-18456862, -5842446, 3754455, 7335294, 10414961, 14311844, 14877057, 12954593, 12790864, 11944145, 6375656, 2354809, 7591408, 13674495, 5917491, -10211875, -12700684, 4796711, 24362611, 31559040, 31472137, 30671767, 24276667, 11921912, 7608956, 19088781, 32086242, 30010921, 17669308, 10847683, 12583784, 14983768, 16451317, 21259506, 26859283, 26174006, 19958112, 14584413, 10005373, 1940818, -5419018, -1271822, 15377862, 30688917, 30864017, 16691360, 1342406, -2724565, 5885131, 17494152, 21629747, 18004118, 14944584, 16894134, 18987160, 15975167, 9766409, 3949994, -2524989, -10292441, -14076234, -9883971, -3980051, -6633841, -17904748]
42245a7904748q260578M730690J5296224J4245549M297268l295585l95413Q753392
42237A7466799J2334552O006345k533244o260792p258186p354979j445502J0385973
42229B1340966J4912050L188278j2726288j5164124n580115J740576L409452O206893
42221A7327688Q289718J495715r995561j3285118q061478m945773m176040K588088
42213a0762761R926391K688118j4851773j9512170n310298O589297L484806M16814
42205b7331576R528720J5378352J408260j8677722j9483502r77022J4961334J6180045
42197i013111Q709884L66649n709620n564560J581939P206564M154120j607612
42189A24253j891700j427556p581418j2366607k692393J5173749K0258812O761618
$$ y = [-17904748, -26165326, -21434636, -6138412, 8107137, 12404405, 9108820, 8713407, 17466799, 29801351, 35807696, 33274452, 27013660, 19755474, 12400495, 10954993, 21340966, 36253016, 39441294, 26715006, 11550882, 5970767, 7711343, 11120795, 17327688, 25617406, 27113121, 17117560, 3832442, -4229036, -9174809, -13350849, -10762761, -836370, 1851748, -13000025, -32512195, -37822493, -31233196, -27748390, -27331576, -17802856, -2424504, -1016244, -19693966, -39177468, -40154490, -25193156, -9013111, -303227, 63422, -5646198, -11210758, -9628819, -2422255, 1731865, 124253, -1767447, -3195003, -10776421, -23143028, -25835421, -10661672, 9597140, 16358758]
42181A6358758p608351o880632L750227R355117N037748k496141n756024k424526
42173I336176N392676J2614194J3089924L511652j2798161k5668514k4368458
42166a8890511q676387P284440Q768831j496480o619023J462604J1556596R782648
42158C172718k447277j2634990j1897440o25442J2913255J5911058K586464j3646492
42150f668146j1686249Q034866K0351201J0000730o782350q633506q71745j822125
42142A922676j0079262r142386J793529O468854N47679j181981R003687J8307657
42134A7640453J3834641R30392p464961q029574n576111l459712k796583m682883
42126C95662p460462o609968r21521N525629R020042R052356N452516j255767
$$ y = [16358758, 8750407, 1869775, 5620002, 14975119, 20012867, 17516726, 11760702, 9336176, 14728852, 27343046, 40432970, 43944622, 31146461, 5477947, -18890511, -27566898, -20282458, -11513627, -13010107, -19629130, -18166526, -6609930, 3172718, 725441, -11909549, -23806989, -24432431, -11519176, 4391882, 6978346, -6668146, -18354395, -10319529, 10031672, 20032402, 13250052, 4616546, 3744801, 1922676, -8156586, -17298972, -15505443, -9036589, -8488910, -9670891, -667204, 17640453, 31475094, 32405486, 24940525, 16910951, 11334840, 7875128, 5078545, 395662, -7064800, -13674768, -14596289, -9070660, -50618, 9001738, 14454254, 13198487]
42118A3198487o597859n692550k54034L863855N118763N633076M072366k186671
42110A7155433q777941p872392n38675L699678R07268k721592k172196m46034
42102g66451j208520k802794l192150l911639n499461m960494j153821K375385
42094b1119945K888393K463240M085470P167653Q539621N434350k209309r692750
42086b443277r828140j385093P085980O761037o20242o501772o759916l279248
42078a6970671J763861O013117N224668o32528l711720N79479L892881k561448
42070f402361j0751450n380392J1344324K0197489J1852557j315019m513175R46421
42062A5978394L926295j509863j2243913j9695742j4835831K443812J8102394
$$ y = [13198487, 6600628, 908078, 654044, 4517899, 9636662, 15269738, 19342104, 17155433, 8377492, 505100, -33575, 3666103, 4573371, 1851779, -320417, -766451, -1974971, -4777765, -7969915, -11881554, -17381015, -22341509, -23495330, -21119945, -18231552, -15768312, -11682842, -4515189, 4024432, 9458782, 7249473, -2443277, -12271417, -13656510, -6570530, 190507, -429735, -6931507, -13691423, -16970671, -15206810, -9193693, -3969025, -4601553, -8313273, -7733794, -3840913, -6402361, -17153811, -22534203, -11189879, 9007610, 20860167, 19545148, 15031973, 15978394, 19904689, 18394826, 6150913, -13544829, -28380660, -25936848, -7834454]
42055g834454J7418939M135766m487851j930001J273279k717677p565847o167386
42047g875232k108094o31627N14113L944951O246266N385881N170872O309135
42039A6956265K933459n447648q700113p57355R098920Q008978l890224j5389881
42031B812401j7075798p764185N611827J1693275N699656k316047l7008P285205
42023E909326M637211n033677k307889J3543073J5812784q406548l1474817k2394631
42015b9715168O718936J8482598L795494j1425050r126346J48175K698259K072929
42007a6350173M954902O761563K928864r777L796972P377544J814099q123534
41999C150460r940398j201933P644523P258036l25580o202655n300115m81616
$$ y = [-7834454, 9584485, 13720251, 9232400, 7302399, 8575678, 5858001, -1707846, -7875232, -9983326, -10614953, -10100840, -6155889, 90377, 5476258, 10647130, 16956265, 19889724, 14442076, 5741963, 4984608, 14083528, 22092506, 18202282, 2812401, -14263397, -22027582, -16415755, -4722480, 977176, -1338871, -1375879, 5909326, 10546537, 5512860, 3204971, 16748044, 32560828, 24154280, -7320537, -29715168, -22996232, -4513634, -718140, -12143190, -21269536, -21121361, -18423102, -16350173, -11395271, -4633708, -1704844, -1714621, 2082351, 9459895, 11273994, 3150460, -6789938, -7991871, -347348, 6910688, 6585108, 382453, -4917662, -5399278]
41991e399278K768357L149814L211411M010576M260176M451241O396075P950439
41983C0798811M748069j218961k700102M27856m42862p130744q893205m87999
41975A5100863N463821l287128j7236027j7491557l784404O629776N642385K605065
41967f357206M737835N990233R37160m089598j858986L668501M499379R91744
41959H519062r50536n24873j952522n441587n419655M67748N570652K258849n581159
41950c054021n054127P011384J5375993O323630r153276q110384Q511215J3000701
41942B4851115q270042l1390588k8029793n297106Q601516O493416M843976J0177365
41934a8020141J0384439J663813j430316Q399736J6085001O872092j0674507j7134660
$$ y = [-5399278, -2630921, 518893, 3730304, 7740880, 12001056, 16452297, 22848372, 30798811, 35546880, 34327919, 31627817, 32055673, 31612811, 24482067, 15588862, 15100863, 20564684, 17277556, 41529, -17450028, -21234432, -14604656, -8962271, -6357206, -1619371, 4370862, 5308022, 1218424, -640562, 3027939, 7527318, 8519062, 7568526, 7043653, 5091131, -350456, -5770111, -5302363, 268289, 2527138, -3054021, -8108148, -1096764, 14279229, 20602859, 11449583, 3339199, 11850414, 24851115, 16581073, -14809515, -42839308, -48136414, -39534898, -33041482, -28197506, -18020141, -7635702, -5971889, -7402205, 997531, 17082532, 23954624, 13280117, -3854543]
41926c854543q009900M296504Q235468L668903k225942l583895j342361j165010
41918c980776m153460l366940M683210J0751312N348006m555805n074619J946022
41910A596950K635881l804765l335127O784532J0751758O95688q986149n107508
41902A231260L339095J670857o580467p614543M33888P909169R553147P290155
41894A7232561K549314l269729n774060m194640m896306r822385r540426J974518
41886a5741153J3950236J2570952J463796m561540j116045L470200L544363R75988
41878A4556797k575643o097103m660551L439565Q091903m23348j2809449j0018028
41870a0495857Q142839K0062260J2341000k979501r248311r020024j4249177k2467197
$$ y = [-3854543, -11864443, -7567939, 667529, 4336432, 2110490, -1473405, -2815766, -3980776, -8134236, -11501176, -6817966, 3933346, 9281352, 4725547, -349072, 1596950, 4232831, 428066, -2907061, 3877471, 14629229, 15324917, 6338768, 1231260, 4570355, 6241212, -339255, -7953798, -7519910, 389259, 9942406, 17232561, 19781875, 16512146, 10738086, 6543446, 1647140, -8175245, -17715671, -15741153, -1790917, 10780035, 12243831, 7682291, 6566246, 10036446, 13580809, 14556797, 11981154, 5884051, 1223500, 4663065, 12754968, 12331620, -477829, -10495857, -2353018, 17709242, 30050242, 27070741, 17822430, 8802406, -5446771, -27913968]
41862b7913968j9200662k221046J1786141R261316k421105o808053p32111N383350
41854c2866138O086388O982515J0194552P226570n081291j2680750k323525J5300430
41846g161249J7306751J502422j0630369o316931J801747j036830q791008p327608
41838b0653075K662481R289858P520950J248055n707928r624076n001598O467644
41830a3797689J2401867O196897j287542J191256N884100m16994j1556188j0160890
41822a1545183L413502J0782381M350632l182145j483413L297080K961178M7206
41814H641238j137495k805696n252769k118867P367379J1678504J962034j3729223
41806D605105j9936221j2360098L0685P041129N571631l16092k887911K574479
$$ y = [-27913968, -47114630, -49335676, -37549535, -28288219, -30709324, -37517377, -38249488, -32866138, -26779750, -19797235, -9602683, -2376113, -7457404, -20138154, -22461679, -7161249, 10145502, 11647924, 1017555, -5299376, -3497629, -4534459, -13325467, -20653075, -17990594, -8700736, -1179786, 68269, -5639659, -15263735, -20265333, -13797689, -1395822, 4801075, 3513533, 4704789, 10588889, 10171895, -1384293, -11545183, -8131681, 2650700, 7001332, 3819187, 2335774, 5632854, 8594032, 8641238, 7503743, 4698047, -554722, -2673589, 4693790, 16372294, 18334328, 4605105, -15331116, -27691214, -27660529, -20619400, -15047769, -15363861, -18251772, -15677293]
41798a5677293J1367174J3005989L472274r723149j5902970j0907093J239133
41791b3125935J1300431J0551050n1642p729186k457144Q296322R033620j464972
41783D352544r629741q483264m805204k672264L719111J4475290J7307350O520679
41775B0784501n011679m810878J50644l106661j1102328j0331701M49755R709918
41767c268429J0979990P153417R0450r765774j4901051o482194R926157J7050808
41759A0783374P234327r048431j8043549j6200671o847973N873803J5590710J5518562
41751D860152P135044K44306K55196K224441J451180J928679P813967J3289574
41743C9202539R672555p88458o970344m326203o73596m415414j2615012j5020232
$$ y = [-15677293, -4310119, 8695870, 12168144, 2444995, -13457975, -24365068, -23125935, -11825504, -1274454, -1326096, -9055282, -11512426, -3216104, 5817516, 4352544, -5277197, -13760461, -18565665, -21237929, -17518818, -3043528, 14263822, 20784501, 15772822, 10961944, 11112588, 8005927, -3096401, -13428102, -12978347, -3268429, 7711561, 14864978, 14955428, 5189654, -9711397, -16193591, -6267434, 10783374, 18017701, 8969270, -9074279, -25274950, -32122923, -26249120, -10658410, 4860152, 11995196, 12239502, 12494698, 14719139, 16170319, 18098998, 25912965, 39202539, 48875094, 48086636, 41116292, 36790089, 36116493, 31701079, 19086067, 4065835]
41735D065835p643202K030778M149493k043785q311330p902266k603109J602152
41727a6655434K716964L695805O714039R680999Q932209L945801j180902j495467
41719A6354014K351662K753676n805749j6709010j6708614l952106P019294M259409
41711a0437424m564684l663520P062008J2160023M112731o331687p109478o94906
41703i466937L568774L543990K196408j143174p154609r000222J23051J3403218
41695c929501J5648663L647803q682139r014307j527238K458343J001463L84753
41687a2160K147920J172183l693408o008434j617601M298787M371644q03404m170584
41678d315057j559763M632886R761166J0941146P332202M05515n560412o662342
$$ y = [4065835, -3577367, -1546589, 2602904, 559119, -7752211, -15654477, -18257586, -16655434, -13938470, -10242665, -3528626, 6152373, 15084582, 19030383, 17849481, 16354014, 18705676, 21459352, 15653603, -1055407, -17764021, -21716127, -14696833, -10437424, -15002108, -18665628, -11603620, 556403, 4669134, -1662553, -8772031, -9466937, -5898163, -2354173, -157765, -1300939, -8455548, -17455770, -17332719, -3929501, 11719162, 15366965, 6684826, -2329481, -3856719, -1398376, -396913, -12160, 2135760, 3307943, -385465, -6393899, -8011500, -3712713, 658931, -144473, -4315057, -5874820, -1241934, 8519232, 19460378, 26792580, 27198095, 21637683, 14975341]
41670A4975341m159860l317669o255525q664754n570991J655459O365206L952890
41662a019903l253133p883251m100212O109467J3122992Q953848k914694j0632481
41654a617367q475997l243154k545923k768356L444995J1758101R726697l445354
41646B833642j2755267q195601J071840J907559k741964j331353N037783M590887
41638i582474l248262n040905L448391P686468k390609j3456350p346587J0668485
41630a9261843J8692291R113968l862140p239263l590430O98107O070062J1733233
41622A2353985J0078032j095299j0560508q428400j411474k052459q320997o808142
41614a6245262N633512J6173744J4092140M248119k283064l610797o267484j2119288
$$ y = [14975341, 10815481, 7497812, 1242287, -7422467, -12993458, -11337999, -4972793, -1019903, -4273036, -12156287, -16256499, -10147032, 2975960, 11929808, 9015114, -1617367, -10093364, -13336518, -15882441, -18650797, -15205802, -3447701, 6278996, 2833642, -9921625, -18117226, -17045386, -15137827, -17879791, -19211144, -14173361, -9582474, -12830736, -17871641, -14423250, -6736782, -9127391, -22583741, -29930328, -19261843, -569552, 8544416, 4682276, -2556987, -6147417, -5449310, 620752, 12353985, 22432017, 21336718, 10776210, 2347810, 936336, -1116123, -9437120, -16245262, -10611750, 5561994, 19654134, 23902253, 21619189, 18008392, 11740908, -378380]
41606c78380j3101636j613602J6852602K6489516J8524846J787226q493611q686528
41598C1380433o168264l975404J899800Q984763O464494o733733j5060801p403078
41590I388210N943458Q630340N39286p871727j3312942j6473165j0824697O307142
41582a7674095J8876557J0450425o963371p159400Q306974J0727632q232333k0025597
41574a1693208m072419J8639251J8215263J73648q935767m675520m304937j1163342
41566g817031r531609M198068J2200288M504433l987767K665269J6032747J5459881
41558C3724279k487243j9025679j5810019M777680K2560421K0306332J431041
41551D5476812j3870146j1509067P96997M790109n318414j8307705k2277680j6798964
$$ y = [-378380, -13480016, -15093618, 1758984, 28248500, 46773346, 48560572, 40066961, 31380433, 25212169, 21236765, 23136565, 32121328, 38585822, 31852089, 16791288, 9388210, 15331668, 23962008, 24501294, 16629567, 3316625, -13156540, -23981237, -17674095, 1202462, 11652887, 4689516, -2469884, 5837090, 16564722, 8332389, -11693208, -15765627, 2873624, 21088887, 21262535, 12326768, 7651248, 3346311, -7817031, -17348640, -13150572, -950284, 3554149, -433618, 2231651, 18264398, 33724279, 31237036, 12211357, -3598662, 1179018, 23739439, 44045771, 45476812, 31606666, 20097599, 20894596, 25684705, 20366291, 2058586, -20219094, -37018058]
41543c7018058p994080M32072P783590J2931008J3850702R222878K17687q077538
41535h651739r441973l839689R30533q89729m581178j706766P371689J3819593
41527f989259J1567318K809431o068539r283776m885054K144599L614584l82120
41519g472816L91267J0124605J6768985Q687858n625168q786136p83465K731116
41511A6036246l373116p868442n561333n988027j2883771j3378929P62826J6018311
41503a6236235J5386741L135848l283768J425113P539074P935438M586885m01915
41495B0087181p390802j2632815r975959q45898N713739M496150q73819m857694
41487f279917n452735k178906M887425J2268405J4154215Q396658j089622q202816
$$ y = [-37018058, -45012138, -44580066, -36796476, -23865468, -10014766, -791888, -574201, -8651739, -18093712, -21933401, -21002868, -21892597, -26473775, -28180541, -20808852, -6989259, 4578059, 7387490, 1318951, -7964825, -12849879, -10705280, -7090696, -7472816, -7081549, 3043056, 19812041, 28499899, 22874731, 14088595, 13305130, 16036246, 12663130, 4794688, -766645, -6754672, -19638443, -33017372, -32254546, -16236235, -849494, 2286354, -997414, 427699, 7966773, 15902211, 20489096, 20087181, 12696379, 63564, -9912395, -10758293, -5044554, -548404, -1422223, -6279917, -11732652, -13911558, -9024133, 3244272, 17398487, 25795145, 24705523, 16502707]
41479A6502707r194135n067866j593849l746149p590306l311015Q818925J3096304
41471G914616j099841j9453954j7858481L853900J9658119J2960646j593916j738421
41463B642668J0441508J5099030N294538o148597q845881p372109p970405o975358
41455c834606k39460O375765N754816K030003L948343R486185P757751m058478
41447B7220319j5170262j4882002n009430M295237O256711K475262l79408K560608
41439G367035Q319598P914071j920930j1610914j0314005j913035J079982j484703
41431b562901K830126J4662925J5375595m806728k5702752k1327013L521357J9550644
41423A541253J2005535n306296j4590079j3582250o632001N505183J8240442K0022756
$$ y = [16502707, 7308572, 2240706, 646857, -3099292, -10689598, -14000613, -5181688, 7914616, 6814775, -12639179, -30497660, -26643760, -6985641, 5975005, 4381089, 2642668, 13084176, 28183206, 33477744, 27329147, 18483266, 11111157, 3140752, -3834606, -4074066, 2301699, 8056515, 10086518, 14034861, 23521046, 31278797, 27220319, 12050057, -2831945, -7841375, -3546138, 2710573, 5185835, 4806427, 7367035, 15686633, 23600704, 21679774, 10068860, -245145, -2158180, -1078198, -2562901, 267225, 14930150, 30305745, 25499017, -203735, -21530748, -18009391, 1541253, 13546788, 8240492, -6349587, -19931837, -26563838, -21058655, -2818213, 17204543]
41415A7204543P804887m469335l640646M243792M054899n941559j3261013r990846
41407c995278j656995K989975K649384J537000J893503J588697j818581o077086
41399b889381n280261J981141P912210M197611n785686j0377856n370017J667589
41391a3944650L975802L379610K721747L93780k903378j665322M114952N690015
41383A762556m19538n128502j994212R94016l852811p847355L82196J3193807
41375b909843J3773548L182959j613996M202776P248447R97479l055125K918186
41367B4744431Q305088K872531m476586p87379P723116M486509j0745996k0639443
41359A1482271j5008718k546719M284502M153678K638544K606033M025025O679632
$$ y = [17204543, 25009430, 20540095, 16899449, 21143241, 25198140, 19256581, 5995568, -3995278, -5652273, -2662298, -12914, 1524086, 3417589, 5006286, 3187705, -2889381, -8169642, -6188501, 1723709, 5921320, 135634, -10242222, -15612239, -13944650, -9968848, -6589238, -3867491, -3473711, -6377089, -8042411, -3927459, 1762556, 1343018, -3785484, -5779696, -4785680, -8638491, -16485846, -16103650, -2909843, 10863705, 14046664, 12432668, 16635444, 23883891, 24881370, 21826245, 24744431, 33049519, 35922050, 31445464, 30658085, 38381201, 42867710, 32121714, 11482271, -3526447, -6073166, -1788664, 2365014, 5003558, 7609591, 11634616, 18314248]
41351A8314248Q238983M703662l218214q970861r170697q514444j0820455j0666666
41343b0104444j552403J0891417J3155584J784140j1239956j3767688p223608
41336b8056958j032188O38647O17673J175171J586315J939130L388213M574088
41328a5169909K797996p03089j227739K494232N939017N148966K173214J662150
41320C114838L905227L885766k467032j2058305j5996987q747534M659467J3545804
41312a0158756J3707959R956260N764000j868496j2414120j5143975k645529J3776001
$$ y = [18314248, 26553231, 31256893, 28038679, 19067818, 9897121, 1382677, -9437778, -20104444, -21656847, -10765430, 2390154, 4174294, -7065662, -20833350, -28056958, -29089146, -28450499, -27832826, -26657655, -25071340, -23132210, -19743997, -15169909, -12371913, -13075002, -14302741, -11808509, -5869492, -720526, 1452688, 3114838, 7020065, 10905831, 8438799, -3619506, -19616493, -28364027, -23704560, -10158756, 3549203, 13505463, 19269463, 17400967, 4986847, -10157128, -12802657, 973344]
$$ [...]
##END NTUPLES=NMR SPECTRUM
##END=
