##TITLE=31Pdec_SR9-1
 CDCl3, 24 sc
 23.11.2020
##JCAMPDX= 6.0         $$ Bruker NMR JCAMP-DX V2.0
##DATA TYPE= NMR SPECTRUM
##DATA CLASS= NTUPLES
##ORIGIN= UXNMR, Bruker Analytische Messtechnik GmbH
##OWNER= root
$$ XWIN-NMR		Version 3.5
$$ Mon Nov 23 12:39:40 2020 Russian Standard Time (UT+4h)  she@DPX200
##.OBSERVE FREQUENCY= 81.013821
##.OBSERVE NUCLEUS= ^31P
##.ACQUISITION MODE= SIMULTANEOUS
##.ACQUISITION SCHEME= undefined
##.AVERAGES= 24
##.DIGITISER RES= 17
##SPECTROMETER/DATA SYSTEM= spect
##.PULSE SEQUENCE= zgpg30
##.SOLVENT NAME= D2O
##.SHIFT REFERENCE= (INTERNAL, D2O, 0, 182.463)
##AUDIT TRAIL= $$ (NUMBER, WHEN, WHO, WHERE, WHAT)
$$ ##TITLE= Audit trail, XWIN-NMR		Version 3.5
$$ ##JCAMPDX= 5.01
$$ ##ORIGIN= Bruker BioSpin GmbH
$$ ##OWNER= she
$$ F:/spectra/data/she/nmr/P31/1/pdata/1/auditp.txt
$$ ##AUDIT TRAIL=  $$ (NUMBER, WHEN, WHO, WHERE, WHAT)
(   1,<2020-11-23 12:36:57.78 +0400>,<she>,<DPX200>,
      <created by zg, POWCHK disabled, PULCHK disabled
       configuration hash MD5:
       00 E9 B6 7A A2 85 ED C7 34 08 36 98 17 FE 4E 26
       data hash MD5: 32K
       AE 42 69 A3 21 20 F2 3E F5 F7 A4 3D 90 D8 97 B0>)
(   2,<2020-11-23 12:37:00.14 +0400>,<she>,<DPX200>,
      <Start of raw data processing
       efp BC_mod = 2 LB = 1 FT_mod = 6 PKNL = 1 PHC0 = -2407.877 PHC1 = 139.2008 SI = 64K 
       data hash MD5: 64K
       0E 8C B7 79 FF DD 8D BC 58 30 49 21 FD D0 84 F1>)
(   3,<2020-11-23 12:37:13.37 +0400>,<she>,<DPX200>,
      <pk PHC0 = 6.346651 PHC1 = 0 
       data hash MD5: 64K
       26 67 4A 14 5E C2 AD 84 6F 2D E4 89 2D 88 9B D6>)
(   4,<2020-11-23 12:37:29.03 +0400>,<she>,<DPX200>,
      <abs ABSG = 5 
       data hash MD5: 64K
       D5 C8 54 DB 7A 79 7E B1 D4 FB D6 1E F6 A3 F8 E7>)
$$ ##END=
$$ 
$$ hash MD5
$$ C0 AC 8D B9 CE FD 6A 5E 5D 0C 86 B1 00 73 05 73
##$RELAX= 
##$RELAX= 
##$RELAX= 
##$RELAX= 
##$RELAX= 
##$RELAX= 
##$RELAX= 
##$RELAX= 
$$ Bruker specific parameters
$$ --------------------------
##$DU= <F:/spectra>
##$EXPNO= 1
##$NAME= <P31>
##$PROCNO= 1
##$TYPE= <nmr>
##$USER= <she>
##$AMP= (0..31)
100 100 100 100 100 100 100 100 100 100 100 100 100 100 100 100 100 100 
100 100 100 100 100 100 100 100 100 100 100 100 100 100 
##$AQSEQ= 0
##$AQ_mod= 1
##$AUNM= <au_zg>
##$AUTOPOS= <>
##$BF1= 81.014009
##$BF2= 200.13
##$BF3= 200.13
##$BF4= 200.13
##$BF5= 200.13
##$BF6= 200.13
##$BF7= 200.13
##$BF8= 200.13
##$BYTORDA= 1
##$CFDGTYP= 0
##$CFRGTYP= 5
##$CHEMSTR= <none>
##$CNST= (0..31)
1 1 145 1 1 1 1 1 1 1 1 1 1 1 1 1 1 1 1 1 1 1 1 1 1 1 1 1 1 1 1 1 
##$CPDPRG= <waltz16>
##$CPDPRG1= <>
##$CPDPRG2= <waltz16>
##$CPDPRG3= <>
##$CPDPRG4= <mlev>
##$CPDPRG5= <mlev>
##$CPDPRG6= <mlev>
##$CPDPRG7= <mlev>
##$CPDPRG8= <mlev>
##$CPDPRGB= <>
##$CPDPRGT= <>
##$D= (0..31)
0 1 0 0 0 0 0 0 0 0 0 0.03 2e-05 3e-06 0 0 0 0 0 0 0 0 0 0 0 0 0 0 0 0 
0 0 
##$DATE= 1606120617
##$DBL= (0..7)
120 120 120 11 120 120 24 19 
##$DBP= (0..7)
150 150 150 150 150 150 150 150 
##$DBP07= 0
##$DBPNAM0= <>
##$DBPNAM1= <>
##$DBPNAM2= <>
$$ [...]
##$SUBNAM3= <"">
##$SUBNAM4= <"">
##$SUBNAM5= <"">
##$SUBNAM6= <"">
##$SUBNAM7= <"">
##$SUBNAM8= <"">
##$SUBNAM9= <"">
##$SW= 369.568048894756
##$SWIBOX= (0..15)
0 1 3 0 0 0 0 0 0 0 0 0 0 0 0 0 
##$SW_h= 29940.119760479
##$TD= 32768
##$TD0= 1
##$TE= 0
##$TE2= 300
##$TE3= 300
##$TEG= 300
##$TL= (0..7)
0 120 53 12 22 120 120 120 
##$TP= (0..7)
150 150 150 150 150 150 150 150 
##$TP07= 0
##$TPNAME0= <>
##$TPNAME1= <>
##$TPNAME2= <>
##$TPNAME3= <>
##$TPNAME4= <>
##$TPNAME5= <>
##$TPNAME6= <>
##$TPNAME7= <>
##$TPOAL= (0..7)
0.5 0.5 0.5 0.5 0.5 0.5 0.5 0.5 
##$TPOFFS= (0..7)
0 0 0 0 0 0 0 0 
##$TUNHIN= 0
##$TUNHOUT= 0
##$TUNXOUT= 0
##$USERA1= <user>
##$USERA2= <user>
##$USERA3= <user>
##$USERA4= <user>
##$USERA5= <user>
##$V9= 5
##$VALIST= <valist>
##$VCLIST= <CCCCCCCCCCCCCCC>
##$VD= 0
##$VDLIST= <DDDDDDDDDDDDDDD>
##$VPLIST= <PPPPPPPPPPPPPPP>
##$VTLIST= <TTTTTTTTTTTTTTT>
##$WBST= 1024
##$WBSW= 4
##$XGAIN= (0..3)
0 0 0 0 
##$XL= 0
##$YL= 0
##$YMAX_a= 9180
##$YMIN_a= -10873
##$ZGOPTNS= <>
##$ZL1= 120
##$ZL2= 120
##$ZL3= 120
##$ZL4= 120
##$ABSF1= 182.463
##$ABSF2= -187.1042
##$ABSG= 5
##$ABSL= 3
##$ALPHA= 0
##$AQORDER= 0
##$ASSFAC= 0
##$ASSFACI= 0
##$ASSFACX= 0
##$ASSWID= 0
##$AUNMP= <proc_1d>
##$AZFE= 0.1
##$AZFW= 0.5
##$BCFW= 0
##$BC_mod= 2
##$BYTORDP= 0
##$COROFFS= 0
##$CY= -3
##$DATMOD= 1
##$DC= 0
##$DFILT= <>
##$DTYPP= 0
##$F1P= 0
##$F2P= 0
##$FCOR= 1
##$FTSIZE= 65536
##$FT_mod= 6
##$GAMMA= 0
##$GB= 0
##$INTBC= 1
##$INTSCL= 5.30512e-09
##$ISEN= 30
##$LB= 1
##$LEV0= 0
##$LPBIN= 0
##$MAXI= 10000
##$MC2= 0
##$MEAN= 0
##$ME_mod= 0
##$MI= 50
##$NCOEF= 0
##$NC_proc= -7
##$NLEV= 6
##$NOISF1= 182.463
##$NOISF2= 159.3651
##$NSP= 0
##$NTH_PI= 0
##$NZP= 0
##$OFFSET= 182.463
##$PC= 4
##$PHC0= -2401.53
##$PHC1= 139.2008
##$PH_mod= 1
##$PKNL= yes
##$PPARMOD= 0
##$PSCAL= 0
##$PSIGN= 0
##$REVERSE= no
##$SF= 81.014009
##$SI= 65536
##$SIGF1= 159.3651
##$SIGF2= -187.1042
##$SINO= 113.3802
##$SIOLD= 16384
##$SREGLST= <1H.CDCl3>
##$SSB= 0
##$STSI= 65536
##$STSR= 0
##$SW_p= 29940.119760479
##$SYMM= 0
##$S_DEV= 0
##$TDeff= 32768
##$TDoff= 0
##$TI= <>
##$TILT= no
##$TM1= 0
##$TM2= 0
##$TOPLEV= 0
##$USERP1= <user>
##$USERP2= <user>
##$USERP3= <user>
##$USERP4= <user>
##$USERP5= <user>
##$WDW= 1
##$XDIM= 65536
##$YMAX_p= 308664092
##$YMIN_p= -32634507
$$ End of Bruker specific parameters
$$ ---------------------------------
##NTUPLES= NMR SPECTRUM
##VAR_NAME=  FREQUENCY,     SPECTRUM/REAL,   SPECTRUM/IMAG
##SYMBOL=    X,             R,               I
##VAR_TYPE=  INDEPENDENT,   DEPENDENT,       DEPENDENT
##VAR_FORM=  AFFN,          ASDF,            ASDF
##VAR_DIM=   65536,         65536,           65536
##UNITS=     HZ,            ARBITRARY UNITS, ARBITRARY UNITS
##FACTOR=    0.456856943014862, 1,           1
##FIRST=     14782.0589164895, 0,            0
##LAST=      -15158.0608439895, 0,           0
##MIN=       -15158.0608439895, -32634507,   0
##MAX=       14782.0589164895, 308664092,    0
$$ Real data points
##PAGE= N=1
##DATA TABLE= (X++(R..R)), XYDATA
$$ [...]
44531g397052J737921J326872P92132J258685J634643N58504o02412J93715J643263
$$ -7397052 -5659131 -4332259 -3540127 -2281442 -646799 -88295 -690707 -496992 1146271
44522A146271Q24730j462470j241629K165853M351445K108180k131396m303145
$$ 1146271 1971001 508531 -733098 1432755 5784200 7892380 5760984 1457839
44514A457839l927864k738974j087623J005023J618765m13667k271906o70954
$$ 1457839 -2470025 -5208999 -6296622 -5291599 -3672834 -4086501 -6358407 -7029361
44506g029361K377490J829500k427974m630605j388858L504243M868771L058015
$$ -7029361 -4651871 -2822371 -5250345 -9880950 -11269808 -7765565 -2896794 161221
44498A61221J856075K195816J873916J43446j287909j603599j827805k030164
$$ 161221 2017296 4213112 6087028 6230474 4942565 3338966 1511161 -519003
44490e19003o35383K381272M120901K293700j451568l463637k466224m27923M96222
$$ -519003 -1154386 1226886 5347787 7641487 6189919 2726282 260058 -167865 328357
44481C28357L16402K27386M83082K29944q28015j667355j395230o91399p00543
$$ 328357 644759 872145 1355227 1585171 757156 -910199 -2305429 -2996828 -3697371
44472c697371r40935l439J581542J412100q02760j663895J330560N377484N478620
$$ -3697371 -4638306 -4641745 -3060203 -1648103 -2450863 -4114758 -2784198 2593286 8071906
44463H071906J110004l266729m148574k401474m35615R57329J903297K095431
$$ 8071906 9181910 5915181 1766607 -634867 -1070482 -113153 1790144 3885575
44455C885575J450098L89973j134449k992342l178059L19251N355262O752936
$$ 3885575 5335673 5725646 4591197 1598855 -1579204 -1259953 4095309 10848245
44447A0848245K992345j569596k982077k641591l403523m360050l154853o76192
$$ 10848245 13840590 12270994 9288917 6647326 3243803 -1116247 -4271100 -4947292
44439d947292O69204J254547K654827L619509K115568m7193M82469K532709J824482
$$ -4947292 -4278088 -3023541 -368714 3250795 5366363 5319170 5801639 8334348 10158830
44430A0158830j745666l668312k302883j260538k649718l288914m81724L026880
$$ 10158830 8413164 4744852 2441969 1181431 -1468287 -4757201 -5238925 -2212045
44422b212045L486231J924537J528148K000876Q57541j371110j682247Q5813N40907
$$ -2212045 1274186 3198723 4726871 6727747 7585288 6214178 4531931 4617744 5158651
44413E158651j889661m026757k089634K934623O002231L918883q12962k946478
$$ 5158651 3268990 -757767 -2847401 87222 6089453 10008336 9195374 6248896
44405F248896q22214J871486J346735j222943k021076n22869J87967j198559k139487
$$ 6248896 5426682 7298168 8644903 7421960 5400884 4878015 5065982 3867423 1727936
44396A727936n75632J723599J838049m78652l155533m231873k919340q9751J628727
$$ 1727936 1152304 2875903 4713952 4235300 1079767 -3152106 -6071446 -6161197 -4532470
44387d532470M29079j566834n82135K962201M520555K397115L05689R07804J457906
$$ -4532470 -4103391 -5670225 -6252360 -3290159 1230396 3627511 3933200 4841004 6298910
44378F298910p75796l179555k396861n08232j223878k842635j162311K462136
$$ 6298910 5523114 2343559 -53302 -561534 -1785412 -4628047 -5790358 -3328222
44370c328222K682207p46084k226874M61779K730860J134758j096199Q9729K852484
$$ -3328222 -646015 -1392099 -3618973 -3157194 -426334 708424 -387775 -298046 2554438
44361B554438K873232L52782q72440L40278J042085j032907m247924n220556k663487
$$ 2554438 5427670 5780452 4908012 5248290 6290375 5257468 1009544 -4211012 -6874499
44352f874499J361174L462298K313484R4035j81221J413979J993333K11469j765543
$$ -6874499 -5513325 -2051027 262457 356492 175271 1589250 3582583 3794052 2028509
44343B028509j626727k36711J32337n69593m72518Q78384J636488M48948j407692
$$ 2028509 401782 165071 297408 -272185 -744703 133681 1770169 2219117 811425
44334H11425j611334J61245J793918J448380j29624q40866l24076l76838j933343
$$ 811425 -799909 -638664 1155254 2603634 2474010 1633144 1309068 932230 -1001113
44325a001113l194734j971088J197245L666995L712795J646767j241299l360523
$$ -1001113 -4195847 -6166935 -4969690 -1302695 2410100 4056867 2815568 -544955
44317e44955l204401q08333J614946K054041J187983R60477J466392J237332K5533
$$ -544955 -3749356 -4557689 -2942743 -888702 299281 1259758 2726150 3963482 3989015
44308C989015r20388j110890j236396j465515j274883p60929k65351P56767K391532
$$ 3989015 3068627 1957737 721341 -744174 -2019057 -2779986 -3045337 -2288570 102962
44299A02962K652008j7147l275245l221941j2192K365714K057020J267130J609388
$$ 102962 2754970 2737823 -537422 -3759363 -3771555 -1405841 651179 1918309 3527697
44290C527697J664242O45670M89475K008963K475371j79937l623695m545880l425933
$$ 3527697 5191939 5837609 6327084 8336047 10811418 10631481 7007786 2461906 -964027
44281i64027k738939k357187k48334L209860M931775L242110Q447j702941p98098
$$ -964027 -3702966 -6060153 -6308487 -3098627 1833148 5075258 5083705 3380764 2582666
44272B582666J116727J510795l21770k210036j694646N51594J597517M81109p78555
$$ 2582666 3699393 5210188 4888418 2678382 983736 1535330 3132847 3613956 2835401
44263B835401p11076j95348O742N22467J026810j57379k481876k566276N46868
$$ 2835401 2124325 1928977 1935719 2458186 3484996 3327617 845741 -1720535 -1173667
44254a173667K822711R00258k570117k788959K34866K391634J695091J19160j32531
$$ -1173667 1649044 2549302 -20815 -2809774 -2574908 -183274 1511817 1630977 1498446
44245A498446Q73091J787437J339830p61370k817603k251177R31727L541313L328804
$$ 1498446 2371537 4158974 5498804 4737434 1919831 -331346 600381 4141694 7470498
44236G470498J360425r03435l481222n078017k822568K216544L948399j38122
$$ 7470498 8830923 7927488 4446266 -631751 -3454319 -1237775 2710624 2572502
44228B572502l999213j948088K182980J629836j712709q59120L644524M199800
$$ 2572502 -1426711 -3374799 -1191819 438017 -1274692 -2133812 1510712 5710512
44220E710512j165128n848000n425697k780086p92882J735056M427788L691828
$$ 5710512 4545384 -1302616 -6728313 -9508399 -10301281 -8566225 -4138437 -446609
44212d46609p4500j239587J602154K561879j145270l703075q25168K445176P40523
$$ -446609 -521109 -1760696 -158542 2403337 1258067 -2445008 -3270176 -825000 -84477
44203h4477j948066L68740M521152L445808j597588l447014j006105M54692n00796
$$ -84477 -2032543 -1663803 2857349 6303157 4705569 1258555 252450 707142 206346
44194B06346n7481K336292K694716M42533m20247O71297m49608m041074m414272
$$ 206346 148865 2485157 5179873 5622406 5202159 5873456 5423848 1382774 -3031498
44185c031498K65719L539190N86668l679142k141673L548393N764794J967719
$$ -3031498 -2765779 773411 1360079 -2319063 -4460736 -912343 4852451 6820170
44177F820170k927262m186071k279315k11598L70290k72951r05577l19589J204657
$$ 6820170 3892908 -293163 -2572478 -2784076 -2413786 -2686737 -3592314 -3911903 -2707246
44168b707246J727469J96609j597138j186914J081395K433461J309188q52790
$$ -2707246 -979777 -783168 -2380306 -3567220 -2485825 -52364 1256824 404034
44160D04034j571253o5337K132580K796906J184818j280847k584437k060960m04503
$$ 404034 -1167219 -1232556 900024 3696930 4881748 3600901 1016464 -1044496 -1448999
44151a448999J460403K486680J424273j584919l945918l290356q40453K98679
$$ -1448999 11404 2498084 3922357 2337438 -1608480 -4898836 -5739289 -5440610
44143e440610j86979Q1279J467090J604098K92381P88644L991072N479732J883233
$$ -5440610 -5627589 -5546310 -4079220 -2475122 -2182741 -1394097 2596975 8076707 9959940
44134I959940l144766l729537k90602J623355j24182j950838r36051J225752J921469
$$ 9959940 6815174 3085637 2795035 4418390 4294208 2343370 1407319 2633071 4554540
44125D554540J362131P85851p565j269917j822031r94850k07880p30876j477021
$$ 4554540 5916671 6702522 6694957 5425040 3603009 2608159 2400279 1669403 192382
44116A92382q87191M28830R15560P25127R90702J327276M30615j165078j353912
$$ 192382 -694809 -265979 649581 1374708 2365410 3692686 4123301 2958223 1604311
44107A604311K23694J397866Q96340N28098K295374M700927M214859K10252l767077
$$ 1604311 1828005 3225871 4122211 4650309 6945683 11646610 15861469 16071721 12304644
44098A2304644m405547k513138j071917q17533p7764J425857J501084p59031k641094
$$ 12304644 7899097 5385959 4314042 3496509 3418745 4844602 6345686 5586655 2945561
44089B945561j380046J562042K456895P26080o18361Q44M75279r79033k346934
$$ 2945561 1565515 3127557 5584452 6310532 5692171 5693015 6168294 5189261 2842327
44080B842327o35400L462659O143140N047057J299809k511795m540830m116031
$$ 2842327 2206927 5669586 11812726 16859783 18159592 15647797 11106967 6990936
44072F990936j873655K44327M84949r01052k221321k520982k079304j129171K78884
$$ 6990936 5117281 5361608 5846557 4945505 2724184 203202 -1876102 -3005273 -2726389
44063b726389J209601N46276q19577l91941K441816M988088M550992J820431m86616
$$ -2726389 -1516788 -970512 -1790089 -2182030 259786 5247874 9798866 11619297 11132681
44054A1132681j304761j778729k645969k963073j861366k56461J40760q49224
$$ 11132681 9827920 8049191 5403222 2440149 578783 322322 463082 -386142
44046c86142j382303J22573K536983K894768K29341k602868k343378K40869J447278
$$ -386142 -1768445 -1645872 891111 3785879 4015220 1412352 -931026 -690157 757121
44037G57121q6335j758585j197533N80642J477805J314133P58868m51067j992133
$$ 757121 670786 -1087799 -2285332 -1704690 -226885 1087248 1846116 1395049 -597084
44028e97084j711284J369506M394603L971404R41986j141912j263750j325464
$$ -597084 -2308368 -938862 3455741 7427145 8369131 7227219 5963469 4638005
44020D638005j972537j701872j87244R17823Q96663O54216K59083j056936k262649
$$ 4638005 2665468 963596 776352 1694175 2590838 3245054 3504137 2447201 184552
44011A84552j352359Q13994J185087m20194r54879L64974P59790n87869p22238
$$ 184552 -1167807 -353813 831274 411080 -543799 -178825 580965 -6904 -729142
44002g29142J225182J681714p32038j698966J293408L316924k35546m888520l436488
$$ -729142 496040 2177754 1445716 -253250 1040158 4357082 4121536 -766984 -4203472
43993d203472K209859L883298K83167j677490R92856K817143o2447l321791k225453
$$ -4203472 -1993613 1889685 2172852 495362 1488218 4305361 4242914 921123 -1304330
43984a304330O32437O06850j064776m27115J694584J448404q45486j197012R46222
$$ -1304330 -671893 -65043 -1129819 -1556934 137650 1586054 740568 -456444 489778
43975D89778J549873j297910m111244l300016l88507O29877p66799j258726R59022
$$ 489778 2039651 741741 -3369503 -6669519 -7058026 -6428149 -7194948 -8453674 -7494652
43966g494652L077945J498970k605418m191357j155919K559817K544538R9825
$$ -7494652 -4416707 -2917737 -5523155 -9714512 -10870431 -8310614 -5766076 -5666251
43958e666251l63919J602553K306109L37433j517182j541662j598744k611303
$$ -5666251 -6030170 -4427617 -2121508 -1784075 -3301257 -4842919 -6441663 -9052966
43950i052966k030446J374111M121170K999410K94270L6285J507843R51967j774118
$$ -9052966 -11083412 -9709301 -5588131 -2588721 -2294451 -2258166 -750323 201644 -1572474
43941a572474k898800p65211J936254K416278R89505o44648j644496j736950p30577
$$ -1572474 -4471274 -5236485 -3300231 -883953 105552 -539096 -2183592 -3920542 -4651119
43932d651119R01194K214990K741532K276297L88038k464447m218538l425732
$$ -4651119 -3749925 -1534935 1206597 3482894 3870932 1406485 -2812053 -6237785
43924f237785j417969l97380k61649N36040J864941K167376J280874N05044K18844
$$ -6237785 -7655754 -8053134 -8314783 -7778743 -5913802 -3746426 -2465552 -1960508 -1741664
43915a741664j53903k23444P69435J806150J232994k41777n57229o9187j054831
$$ -1741664 -1895567 -2119011 -1349576 456574 1689568 1447791 890562 821375 -233456
43906b33456l296318l694818j129169J682546K501305K598259L682767M582582
$$ -233456 -3529774 -7224592 -8353761 -6671215 -4169910 -1571651 2111116 6693698
43898F693698L274079K64866k236920l195938l034298k206818j064107k75963
$$ 6693698 9967777 10232643 7995723 4799785 1765487 -441331 -1505438 -1781401
43890a781401j90334m20267o18244p14970k64194R38118J520306p2149k484610
$$ -1781401 -1971735 -2392002 -3010246 -3725216 -3989410 -3051292 -1530986 -1603135 -4087745
43881d087745k258479J339891M738391M574145J536143j587883l314164l375377
$$ -4087745 -6346224 -5006333 -267942 4306203 5842346 4254463 940299 -2435078
43873b435078j696448N62766J083940m82862j491634k82817J153919O87172l99153
$$ -2435078 -4131526 -3568760 -2484820 -2967682 -4459316 -4742133 -3588214 -2901042 -3300195
43864c300195j78310J61676j139320k359318r58113J396881J149952q25791l64899
$$ -3300195 -3478505 -3316829 -4456149 -6815467 -7773580 -6376699 -5226747 -6052538 -6417437
43855f417437K686175L741676J064052j244074r411K073788J473936k26691N44976
$$ -6417437 -3731262 10414 1074466 -169608 -179019 1894769 3368705 3142014 3686990
43846C686990L101098L731819J622893n60935j242330j346313j428168q98377
$$ 3686990 6788088 10519907 12142800 11581865 10339535 8993222 7565054 6666677
43838F666677k90409j018748k366455j918137J08109K59162k733801m975426k493372
$$ 6666677 6376268 5357520 2991065 1072928 1181037 1440199 -1293602 -6269028 -8762400
43829h762400K828536N467719L271499o87271k678999j859367O26184L122866
$$ -8762400 -5933864 -466145 2805354 2118083 -560916 -2420283 -1794099 1328767
43821A328767L537139P40811k967494l271109P42048M637713L917739n00848m049540
$$ 1328767 4865906 5606717 2639223 -631886 110162 4747875 8665614 8164766 4115226
43812D115226m184717k035961L36118J681881J226771p73577k277645j532290
$$ 4115226 -69491 -2105452 -1769334 -87453 1139318 365741 -1911904 -3444194
43804c444194K21283L37880j136053j508947K77606K110764K049765O72939p57231
$$ -3444194 -3222911 -2885031 -4021084 -5530031 -5252425 -3141661 -1091896 -418957 -1176188
43795a176188k032399k818893k055169J24656J835447K056536J921546K315641
$$ -1176188 -3208587 -6027480 -8082649 -7957993 -6122546 -4066010 -2144464 171177
43787A71177K317624J295374L03526p7281r64706k579457k955819j334010k36436
$$ 171177 2488801 3784175 4087701 4010420 3045714 466257 -2489562 -3823572 -4060008
43778d060008j477158k538575k54902L802355N323882L400192R46248k15672r43163
$$ -4060008 -5537166 -8075741 -8330643 -4528288 795594 4195786 5142034 4926362 3983199
43769C983199j706675j549795m10627N30118J020044J539201J171459j180213
$$ 3983199 2276524 726729 316102 846220 1866264 3405465 4576924 3396711
43761C396711l562691k536410J539089M255194L048119Q3471j724232k268028
$$ 3396711 -165980 -2702390 -1163301 3091893 6140012 6223483 4499251 2231223
43753B231223k481668k157168j238276o67892m25899P75605K603254K767479R52966
$$ 2231223 -250445 -2407613 -3645889 -4313781 -4739680 -3964075 -1360821 1406658 2359624
43744B359624q2412R37271J569802K31381n95869J142568K741207R03905k431351
$$ 2359624 2277212 3214483 4784285 5015666 4419797 5562365 8303572 9207477 6776126
43735F776126k992980j022540l53863j721513k079836m95070L47637n56016m41378
$$ 6776126 3783146 2760606 2406743 685230 -1394606 -1889676 -1542039 -2098055 -2539433
43726b539433K110252L987367K177647j383792k616620j044136K39569o02740
$$ -2539433 -429181 3558186 5735833 4352041 1735421 691285 930854 328114
43718C28114k085741k158933r53809p4837k11171l41529O89954K327722K769886
$$ 328114 -1757627 -3916560 -4870369 -4945206 -5156377 -5497906 -4807952 -2480230 289656
43709B89656J411790k27578p18288n89466o96344j91218J660574K859765R87263
$$ 289656 1701446 1473868 755580 166114 -530230 -721448 939126 3798891 4786154
43700D786154k350844l013112n40684J057490j96031j255176K48767J644133J09092
$$ 4786154 2435310 -577802 -1118486 -60996 -257027 -1512203 -1263436 380697 489789
43691D89789j900903q97878R45043p42747m099083k934012K805122N610451J645412
$$ 489789 -1411114 -2308992 -1363949 -2106696 -6205779 -9139791 -6334669 -724218 921194
43682I21194l164185k212189K086855K998444p8606k031473p90990N38369j70720
$$ 921194 -2242991 -4455180 -2368325 630119 551513 -1479960 -2270950 -1732581 -1903301
43673a903301j335376j555037j450670q07977J671409M642125M423201O03420
$$ -1903301 -3238677 -4793714 -6244384 -7052361 -5380952 -738827 3684374 4287794
43665D287794k624412k481768j034429o29878j29062J519242K100231K80855p23784
$$ 4287794 1663382 -818386 -1852815 -2482693 -2611755 -1092513 1007718 1288573 564789
43656E64789J839136M595572K663176k134245l483570j75549K435463R81122j549235
$$ 564789 2403925 6999497 9662673 7528428 4044858 3869309 6304772 7285894 5736659
43647E736659j607847l51453n26770j795853k034659q22954P72235K040611K412790
$$ 5736659 4128812 3777359 3250589 1454736 -579923 -1402877 -630642 1409969 3822759
43638C822759J145467j208423k649308k320682j570011j431749j067841J79156
$$ 3822759 4968226 3759803 1110495 -1210187 -2780198 -4211947 -5279788 -5100632
43630e100632J356247J778421K063708J950172k63990m125154n546118j828015
$$ -5100632 -3744385 -1965964 97744 2047916 1783926 -2341228 -7887346 -9715361
43622i715361L710328N344109K178013j350573j847957p32649r00591k094682
$$ -9715361 -6005033 -660924 1517089 166516 -1681441 -2414090 -3314681 -5409363
43614e409363j490207J767263M419760K686811k402766n215298k228146L241024
$$ -5409363 -6899570 -5132307 -712547 1974264 -428502 -5643800 -7871946 -4630922
43606d630922N287099K927885J24275p27634j059790j773272j318477N12255J247419
$$ -4630922 656177 3584062 3708337 2980703 1920913 147641 -1170836 -658581 588838
43597E88838J47120j43694J461108K112401K33346j254305j84856P17019j100709
$$ 588838 735958 592264 2053372 4165773 4399119 3144814 2959958 3676977 2576268
43588B576268l025423j926877K03047L93199N33791L084706M665009J118314l858910
$$ 2576268 -449155 -2376032 -2172985 -1779786 -1245995 1838711 6503720 7622034 3763124
43579C763124l263970J623480K772855j741864n119892l151115K81647J267842
$$ 3763124 499154 2122634 4895489 3153625 -1966267 -5117382 -4835735 -3567893
43571c567893J481234K471739J648451j881080l764830j244289J842944J409848
$$ -3567893 -2086659 385080 2033531 152451 -3612379 -4856668 -3013724 -1603876
43563a603876m41221J9575J608226J162147o81349j365488r22553l97879R99851
$$ -1603876 -2045097 -2025522 -417296 744851 63502 -1301986 -2224539 -2622418 -1622567
43554a622567L135611K863251r60037l937728k280017J070844J530383M49134
$$ -1622567 1513044 4376295 3416258 -521470 -2801487 -1730643 -200260 248874
43546B48874J658953L630394J916732k594991m796483l569247k201094j416294
$$ 248874 1907827 5538221 7454953 4859962 63479 -3505768 -5706862 -7123156
43538g123156J052858M062608L426286l79770j794617P87634K156812r11115m096983
$$ -7123156 -6070298 -2007690 1418596 1038826 -755791 31843 2188655 1277540 -2819443
43529b819443k406585K358055M956936L760615P90020k091044l562737k174846
$$ -2819443 -5226028 -2867973 2088963 5849578 6639598 4548554 985817 -1189029
43521a189029J381710L515977K080539o14405j520767j065126r79967o11333J259329
$$ -1189029 192681 3708658 5789197 5174792 3654025 2588899 1608932 997599 2256928
43512B256928L049982K460095M60203k60161K75259j50609j780904k665145k306972
$$ 2256928 5306910 7767005 8227208 7967047 8242306 8091697 6310793 3645648 1338676
43503A338676k221359k641018j752891R75839L239652K865683O74423o96643J53216
$$ 1338676 -882683 -3523701 -5276592 -4300753 -1061101 1804582 2479005 1782362 1935578
43494A935578K104899K670724M66823k825547l645219q14600K387672K248063
$$ 1935578 4040477 6711201 7178024 4352477 707258 -107342 2280330 4528393
43486D528393k85133j260550o026o2038k886177m492178j148396M337393N826092
$$ 4528393 4243260 2982710 2976684 2914646 28469 -4463709 -5612105 -1274712 4551380
43477D551380K057442k295716l581173l074458k887014j999116R20960L675849
$$ 4551380 6608822 4313106 731933 -2342525 -5229539 -7228655 -6307695 -2631846
43469b631846L204009O10444k54439J229469J713190m41222k525068k058176o97596
$$ -2631846 572163 1182607 928168 2157637 3870827 3429605 904537 -1153639 -1851235
43460a851235j152237k674589k561195o25957Q04718O62413K02641M47654Q55327
$$ -1851235 -3003472 -5678061 -8239256 -8865213 -8060495 -7398082 -7195441 -6747787 -5892460
43451e892460P52035L42016L5642J2652M30859J113735J452274J446144J835273
$$ -5892460 -5140425 -4798409 -4762767 -4750115 -4319256 -3205521 -1753247 -307103 1528170
43442A528170K174993N01225l209214n147054k202863K904268M537983J583048
$$ 1528170 3703163 4204388 995174 -4151880 -6354743 -3450475 1087508 2670556
43434B670556j700344k112428q42221J41052R04840J406222L75467j668974j715894
$$ 2670556 970212 -1142216 -1984437 -1843385 -938545 467677 843144 -825830 -2541724
43425b541724J068105L069047J358080j691764k085245j70368O77636k94849p46937
$$ -2541724 -1473619 1595428 2953508 1261744 -823501 -993869 -316233 -611082 -1358019
43416a358019K91458J163481Q86891N44840Q30216Q27968J3455o84022o19891
$$ -1358019 -1066561 96920 983811 1528651 2358867 3186835 3200290 2516268 1896377
43407A896377m15119m16703J16241J313486J701371K40282j659858j657353L70721
$$ 1896377 1481258 1064555 1180796 2494282 4195653 4435935 2776077 1118724 1489445
43398A489445K090758J774360L65186k14408J49899K7869q71580j116877j55365
$$ 1489445 3580203 5354563 5719749 5505341 5655240 5683109 4811529 3694652 3539287
43389C539287M37486l70659r91145Q8155J149450k30136k579062k250298M23478
$$ 3539287 3976773 3606114 2614969 2703124 3852574 3622438 1043376 -1206922 -783444
43380g83444J032116j817049l775703j513605J852863J715186p80036r86667J534686
$$ -783444 248672 -1568377 -5344080 -6857685 -5004822 -3289636 -4069672 -5056339 -3521653
43371c521653K529024J00568k306975j231807J952433L470079K249521M87185
$$ -3521653 -992629 -892061 -3199036 -4430843 -2478410 991669 3241190 3728375
43363C728375R0057L82345m80871k735983m378294l536201r57108P99579N18247
$$ 3728375 3818432 4200777 3719906 983923 -3394371 -6930572 -7887680 -7088101 -6569854
43354f569854n35887o90524M22609K429083M604152N216634K693017j612337m042686
$$ -6569854 -7105741 -7796265 -7373656 -4944573 -340421 4876213 7569230 5956893 1914207
43345A914207l169441j330720m90896L98158K064134K390575J58174j822742r32523
$$ 1914207 -1255234 -2585954 -3076850 -2678692 -614558 1776017 1934191 111449 -821074
43336h21074O99415j8659j415784n1995K642876K394609m41952j467006O1004
$$ -821074 -121659 -140318 -1556102 -1608097 1034779 3429388 2987436 1520430 1581434
43327A581434L98217j303133j331978J230552K005878r45885k953776l96477K733129
$$ 1581434 1979651 676518 -655460 575092 2580970 1635085 -1318691 -1715168 1017961
43318A017961J129908k944510l052822J379999M365805K205227k061592l763887
$$ 1017961 2147869 -796641 -3849463 -2469464 1896341 4101568 2039976 -1723911
43310a723911k266752k24085K29647q30141j852776j366752O16538K612805L295658
$$ -1723911 -3990663 -4214748 -3985101 -4815242 -6668018 -8034770 -7418232 -4805427 -1509769
43301a509769K556534Q53712j173796k117389p30905J719170K168740N0544j465294
$$ -1509769 1046765 1900477 726681 -1390708 -2121613 -402443 1766297 1816841 351547
43292C51547k21006J495753P70892j044399o18125J810331K965005J884893Q69854
$$ 351547 130541 1626294 2397186 1352787 734662 2544993 5509998 7394891 8264745
43283H264745R83947L83566j841183l434871k416042l88105k43896j957793k812090
$$ 8264745 9248692 9632258 7791075 4356204 1940162 1552057 1308161 -649632 -3461722
43274c461722j290313J122744K215395J703472Q68547M33602M6309k65612L24951
$$ -3461722 -4752035 -3629291 -1413896 289576 1158123 1591725 1638034 1372422 1697373
43265A697373J623469J639785o91485l046098k297035Q28310K366356O32869j727671
$$ 1697373 3320842 4960627 4269142 1223044 -1073991 -245681 2120675 2753544 1025873
43256A025873k019083q83399l892O57479J243655L22089k424125l992684j779071
$$ 1025873 -993210 -1876609 -1880501 -1223022 20633 342722 -2081403 -6074087 -7853158
43247g853158J911205K409366q94802l796220k942530L80756K599928K093921
$$ -7853158 -5941953 -3532587 -4427389 -8223609 -11166139 -10785383 -8185455 -6091534
43239f091534M65213M47404K637501M283414K491539j316051k581632m5450K254414
$$ -6091534 -5626321 -5178917 -2541416 1741998 4233537 2917486 335854 290404 2544818
43230B544818J274011m62497K28644J402533k26785k686477j763656J194235J015552
$$ 2544818 3818829 3356332 3584976 4987509 4760724 2074247 310591 1504826 2520378
43221B520378k283245l061691M92705L219905J552780r75711k34141J813844J260315
$$ 2520378 237133 -2824558 -2331853 888052 2440832 1465121 1230980 3044824 4305139
43212D305139j029330j610564m65273j04306o17460j46299Q11426j83411l038457
$$ 4305139 3275809 1665245 1199972 1095666 478206 331907 1143333 959922 -2078535
43203b078535m644090l119316J97704L162496M761125M420495J843040j606054
$$ -2078535 -6722625 -9841941 -9644237 -6481741 -1720616 2699879 4542919 2936865
43195B936865l144355j443995J508223K369749J64945k531561k572973j71175
$$ 2936865 -207490 -1651485 -143262 2226487 2391432 -140129 -2713102 -2884277
43187b884277J293145q7989j996439j508071K17942p6544k026793j875785J366791
$$ -2884277 -1591132 -1679121 -3675560 -5183631 -4965689 -5042233 -7069026 -8944811 -7578020
43178g578020M160554L956617K391058J214993p21608l697382m371710o69203
$$ -7578020 -3417466 539151 2930209 4145202 3423594 -273788 -4645498 -5314701
43170e314701L654333L640909K47655j431842L19058K256739J454674j456329
$$ -5314701 -1660368 1980541 2228196 796354 1115412 3372151 4826825 3370496
43162C370496m026774m106310q98217L468197M598285R72463l005040k435124
$$ 3370496 -656278 -4762588 -5660805 -2192608 2405677 3378140 373100 -2062024
43154b062024J139378K238585l58273k583552j776720L96797J976208L043535
$$ -2062024 -922646 1315939 957666 -1625886 -3402606 -3005809 -1029601 2013934
43146B013934L326030J831899j67017K765J550672N85689l324773n551508l359242
$$ 2013934 5339964 7171863 7004846 7007611 8558283 9143972 5819199 267691 -3091551
43137c091551r920O96976j66508J56915J255988J496120J674474K877692L259553
$$ -3091551 -3101471 -2404495 -2571003 -2414088 -1158100 338020 2012494 4890186 8149739
43128H149739R33559j938228j934963K54717J139575n826o98288K41598J282066
$$ 8149739 9083298 7145070 5210107 5464824 6604399 6598573 5900285 6141883 7423949
43119G423949J090596j07128j750773k912515j886902J243244K754080k80976
$$ 7423949 8514545 8407417 6656644 3744129 1857227 3100471 5854551 5573575
43111E573575m519316l875464J353769L926819k23652o070738o625955k161395
$$ 5573575 1054259 -2821205 -1467436 2459383 2235731 -3835007 -10460962 -12622357
43103a2622357J587392J832000Q40488O90798M89065m46621l46267K022976M355750
$$ -12622357 -11034965 -9202965 -8362477 -7671679 -7182614 -7629235 -7975502 -5952526 -1596776
43094a596776L269009r74969m311119l637816k22708K303570K230564R41340L90936
$$ -1596776 1672233 697264 -3613855 -7251671 -7474379 -5170809 -2940245 -1998905 -1607969
43085a607969Q28846J251139R74409Q9630r96264j830694k087309j841084j304676
$$ -1607969 -779123 472016 1446425 1536055 539791 -1290903 -3378212 -5219296 -6523972
43076f523972k34802J598714L219700K983324R19052q28890r36441q24651k007814
$$ -6523972 -6758774 -5160060 -1940360 1042964 1962016 1133126 196685 -627966 -2635780
43067b635780k881410p74693L215852M517848J157858l059848l399907m57108
$$ -2635780 -5517190 -6291883 -3076031 1441817 2599675 -460173 -3860080 -4317188
43059d317188J072045p41295k439485m50727L446223M329660Q24853l193255l904612
$$ -4317188 -3245143 -3986438 -6425923 -6876650 -3430427 899233 1724086 -1469169 -5373781
43050e373781j893255J39676J563158L224195M311253L063359J85024j534116
$$ -5373781 -7267036 -7127360 -5564202 -2340007 1971246 5034605 5219629 3685513
43042C685513j138627j51511Q43678K866244N078210M456614O07102k659510k793753
$$ 3685513 2546886 2395375 3239053 6105297 11183507 15640121 16247223 13587713 10793960
43033A0793960k094181l092069l919110k041103M93651J91113j720067j321973
$$ 10793960 8699779 5607710 1688600 -352503 141148 332261 -1387806 -2709779
43025b709779J150390J766238k92414j596805m65539P88898M75855o1170K08501
$$ -2709779 -1559389 206849 -85565 -1682370 -2147909 -1359011 -883156 -944326 -735825
43016g35825L14631J41969J091885K688849K376079n8596j737855j584465j758439
$$ -735825 -421194 -279225 812660 3501509 5877588 5818992 4081137 2496672 738233
43007G38233k797970j990006J293012L333963J930327N0474M83675J271440J51534
$$ 738233 -2059737 -4049743 -2756731 577232 2507559 2558033 3041708 4313148 4464682
42998D464682q57344K47050P23002k036997m435062j618974L908638N129433Q23574
$$ 4464682 3607338 3854388 4577390 2540393 -1894669 -3513643 394995 5524428 6348002
42989F348002l197764k979703p10566M51691N42952M93699j255q68892j219318
$$ 6348002 3150238 170535 -540031 -88340 454612 948311 947056 78164 -1141154
42980a141154j322402j994797j950962O27453L790534L289531q58082l433654
$$ -1141154 -2463556 -4458353 -6409315 -5781862 -1991328 1298203 440121 -2993533
42972b993533j145620K939768L946465J230036j955055k562418j07185L219727
$$ -2993533 -4139153 -1199385 2747080 3977116 2022061 -540357 -647542 2572185
42964B572185L957412P00214l696042n125862l075009j08434K409944M552630
$$ 2572185 6529597 7229811 3533769 -1592093 -4667102 -4775536 -2365592 2187038
42956B187038M751168J266504l219042l696663m95844M74478l053131n679248
$$ 2187038 6938206 8204710 4985668 1289005 793161 1267639 -1785492 -7464740
42948g464740k538688L304223N589343L300141K82021q58661n89566n5626o8273
$$ -7464740 -10003428 -6699205 -1109862 2190279 2472300 1613639 1024073 968447 900174
42939I00174j055650j810951j93651L172306M574740K520215J70757J31072L99014
$$ 900174 -155476 -1966427 -2160078 1012228 5586968 8107183 8277940 8409012 8808026
42930H808026j386578l257668k409423l39740j70083j230273o94236J266402K199153
$$ 8808026 7421448 4163780 1754357 1414617 1244534 14261 -679975 586427 2785580
42921B785580J706489J141894M71381q28054j376176j39688P35637p65869k414216
$$ 2785580 4492069 5633963 6105344 5277290 3901114 3761426 4497063 3731194 1316978
42912A316978j240450R13221K92306k046256j853206J068338K831296K152446
$$ 1316978 76528 989749 1282055 -764201 -2617407 -1549069 1282227 3434673
42904C434673J531634J847643J225791m24189r72825n63302j397553k685454j228972
$$ 3434673 4966307 6813950 8039741 7615552 6642727 6079425 4681872 1996418 767446
42895G67446K344708L607808J596863K23931J018569O12650k304855l718796j259986
$$ 767446 3112154 6719962 8316825 8540756 9559325 10171975 7867120 4148324 2888338
42886B888338J178347j63974k688625k023623J067599K814255K377531J469181
$$ 2888338 4066685 3902711 1214086 -809537 258062 3072317 5449848 6919029
42878F919029N59754p09085j430212j005918p77146j426430j253105M28619J197488
$$ 6919029 7478783 6769698 5339486 4333568 3556422 2129992 876887 1305506 2502994
42869B502994l28711j557484l90319Q32894l17145j501971L54810L201428L061313
$$ 2502994 2174283 616799 226480 1059374 742229 -759742 -404932 2796496 5857809
42860E857809O46007m95397l45574j293657k257188j25917L548356L641006k90768
$$ 5857809 6503816 6008419 5662845 4369188 2112000 1986083 5534439 9175445 8884677
42851H884677k836303j119385J221992N21050j495997j652585n57286n37231j359646
$$ 8884677 6048374 4928989 6150981 6672031 5176034 3523449 2966163 2428932 1069286
42842A069286j361049p15529m70306J12284K201334M292491L455791k35500k980913
$$ 1069286 -291763 -1007292 -1477598 -1365314 836020 5128511 8584302 8348802 5367889
42833E367889j841294J525841L014930J232889j080742j076887M29644P32587
$$ 5367889 3526595 5052436 8067366 9300255 8219513 7142626 7572270 8304857
42825H304857m05209p75826Q2468n4547j862320k643992q39724P51495o75556
$$ 8304857 7899648 7123822 7206290 7151743 5289423 2645431 1805707 2557202 1881646
42816A881646k958282k198729Q71679K106660N36650q01021m31303k19975r36193
$$ 1881646 -1076636 -3275365 -2403686 -297026 239624 -561397 -992700 -1212675 -2148868
42807b148868n57035J433618K158846J30285j521269L71361L701450L810590K27219
$$ -2148868 -2705903 -1272285 886561 1016846 -504423 -133062 3568388 7378978 7606197
42798G606197k690560j765186J143914K157155L52776j757638j978859r92758
$$ 7606197 4915637 3150451 4294365 6451520 6804296 5046658 3067799 2075041
42790B075041o91868j221025j111331J03693J196581J335362R92162L05257j266831
$$ 2075041 1383173 162148 -949183 -845490 351091 1686453 2678615 2983872 1717041
42781A717041k741318j618022K199305M916875L537935j37949k613252l395437
$$ 1717041 -1024277 -2642299 -442994 4473881 8011816 7873867 5260615 1865178
42773A865178l621250k522055P20207L529612K935829P37164Q48927K451729J246689
$$ 1865178 -1756072 -4278127 -3557920 -28308 2907521 3644685 4493612 6945341 8192030
42764H192030k634546l995801r91171J680667L37810k148495j620008Q71459J650078
$$ 8192030 5557484 1561683 570512 2251179 2588989 440494 -1179514 -308055 1342023
42755A342023L56040n56447k24405J23220j50700n04847m59209K02033J343710
$$ 1342023 1698063 1141616 917211 1040431 889731 384884 -74325 127708 1471418
42746A471418J685318p3803k581242k817074p41004J49520j550524k413161M87110
$$ 1471418 3156736 3082933 501691 -2315383 -3056387 -2906867 -4457391 -6870552 -6383442
42737f383442M638431N600188L030223O2566j341817j296486M2800K169411L042149
$$ -6383442 -1745011 3855177 6885400 6947966 5606149 4309663 4352463 6521874 9564023
42728I564023J194217j718090k904260k142116j337531j401819j730305j862535
$$ 9564023 10758240 9040150 6135890 3993774 2656243 1254424 -475881 -2338416
42720b338416j688208r19966K4188j19263j254180j380625P9269P20826p97504
$$ -2338416 -4026624 -4946590 -4922402 -5041665 -6295845 -7676470 -7597201 -6876375 -7673879
42711g673879j623961J220841N587925O584350L091487j354021l336802k284581
$$ -7673879 -9297840 -8076999 -2489074 4095276 7186763 5832742 2495940 211359
42703B11359O18464L256267L190119L28322j947855j109423M75570q04962l579569
$$ 211359 829823 4086090 7276209 7604531 5656676 4547253 5022823 4217861 638292
42694F38292l251771O27704L405527K187577o29005j768937j230361n20911M1570
$$ 638292 -2613479 -1985775 1419752 3607329 2978324 1209387 -20974 -541885 -500315
42685e00315N48413N53932M00865J281876K746956K387448o30667l735748m087975
$$ -500315 48098 602030 1002895 2284771 5031727 7419175 6788508 3052760 -1035215
42676a035215j893112O69803K262020K815740K445614J298814j44525j371281
$$ -1035215 -2928327 -2258524 3496 2819236 5264850 6563664 6419139 5047858
42668E047858j957230j388955K57670J601361J266804j25778p57299l46329l47311
$$ 5047858 3090628 1701673 1959343 3560704 4827508 4701730 3944431 3598102 3250791
42659C250791j240235j536997j77040J654324K002286M34149j743225k759474
$$ 3250791 2010556 473559 296519 1950843 3953129 4387278 2644053 -115421
42651a15421j600086J167650L488922L429850R44719k181690l840220k932870
$$ -115421 -1715507 -547857 2941065 6370915 7315634 5133944 1293724 -1639146
42643a639146j94090J895847J331557p14400j173093K22864J73795k622239m305638
$$ -1639146 -1833236 62611 1394168 679768 -493325 -270461 -96666 -2718905 -7024543
42634g024543j403879L072120L327774q52199l922493k382942J398414L483371
$$ -7024543 -8428422 -5356302 -2028528 -2880727 -6803220 -9186162 -7787748 -4304377
42626d304377K892482J168993K05211R57749K308445J737845q75304j913508N52142
$$ -4304377 -1411895 -242902 -37691 920058 3228503 4966348 4091044 2177536 2729678
42617B729678K525013j42282m099986k864579K463271M195556K4796l742405k691162
$$ 2729678 5254691 5112409 1012423 -1852156 611115 4806671 4831467 1089062 -1602100
42608a602100l90012p98208j736572l33414J263927O82632L83720K508753L601864
$$ -1602100 -1992112 -2790320 -4526892 -4860306 -3596379 -2913747 -2530027 -21274 3580590
42599C580590M17660l351043k637416L78585K60245j930953o28037L936842N423748
$$ 3580590 3998250 647207 -1990209 -1611624 -1351379 -3282332 -3910369 26473 5450221
42590E450221J694177j944692j444638M36957j35583k099904k510329j630045
$$ 5450221 7144398 5199706 3755068 4192025 4056442 1956538 -553791 -2183836
42582b183836j577738k335900k087750k29013J998815L076649K325611L32818
$$ -2183836 -3761574 -6097474 -8185224 -8414237 -6415422 -3338773 -1013162 -680344
42574f80344j194033r27067O42649K216911L459955M151723K687399j753017o004708
$$ -680344 -1874377 -2801444 -2158795 58116 3518071 7669794 10357193 8604176 2599468
42565B599468n405754j81758L954438L028256l32386j344616K23026Q90585m16361
$$ 2599468 -2806286 -2988044 966394 3994650 3662264 2317648 2540674 3431259 3014898
42556C014898q03243J535031L757344J990740k907231n769425l489290J230409
$$ 3014898 2211655 3746686 7504030 9494770 6587539 818114 -2671176 -1440767
42548a440767L664341K769138J038381n2999j425237l233502l491005j146630
$$ -1440767 2223574 4992712 6031093 5978094 4552857 1319355 -2171650 -3318280
42540c318280J696986K200667Q0722k439428k729582L68536M894082O181951J808128
$$ -3318280 -1621294 579373 660095 -1779333 -4508915 -4140379 753703 6935654 8743782
42531H743782l850738l938656J255869L898277j12222m907949l619977J448046
$$ 8743782 4893044 954388 2210257 6108534 5996312 1088363 -2531614 -1083568
42523a083568L257572Q79931p99827n3612J09629j159923q57115J745655L122273
$$ -1083568 2174004 3053935 2254108 2200496 2310125 1150202 293087 2038742 5161015
42514E161015J343256r34165j206384p30767j442005k744124l249763k845698
$$ 5161015 6504271 5570106 4363722 3632955 2190950 -553174 -3802937 -6648635
42506f648635j574383Q32961L122047K914396J13669k472511k733515j212625
$$ -6648635 -8223018 -7390057 -4268010 -1353614 -1239945 -3712456 -6445971 -7658596
42498g658596P75627K311218K121129j88592k046530n05856K939651L928066J786193
$$ -7658596 -6882969 -4571751 -2450622 -2639214 -4685744 -5191600 -2251949 1676117 3462310
42489C462310J32438M54118J60616j645097j865408P09179K319902K58124k553862
$$ 3462310 3594748 4048866 4209482 2564385 698977 1408156 3728058 3986182 1432320
42480A432320k553101r37749k28335N40548K704447L634981O87525l203489l248677
$$ 1432320 -1120781 -2058530 -2286865 -1746317 958130 4593111 5280636 2077147 -1171530
42471a171530k56935R90167m38289r46813P67929J677709Q1587j407337l13501
$$ -1171530 -1428465 -438298 -876587 -1823400 -1055471 622238 703825 -703512 -1017013
42462a017013J775492J806482m74676k633190k643674p38452J202374J732930
$$ -1017013 758479 2564961 2090285 -542905 -3186579 -3925031 -2722657 -989727
42454i89727J494869K055802K847027J288144k741808n137939k903092R90197
$$ -989727 505142 2560944 5407971 6696115 3954307 -1183632 -4086724 -3096527
42446c096527J602537p52107j469050J009085L379260L157439J703662N98682
$$ -3096527 -1493990 -2246097 -3715147 -2706062 673198 3830637 5534299 6132981
42438F132981q11685k562150k499742J16851K441944J956136J40274k55858M98258
$$ 6132981 5321296 2759146 259404 376255 2818199 4774335 4914609 4658751 5157009
42429E157009K99440r11503j339074m86076N16452J160072J671058J275980j011351
$$ 5157009 5456449 4544946 3205872 2719796 3236248 4396320 6067378 7343358 6332007
42420F332007l759808l934834j167238J109212J64211k271525k641732o52574
$$ 6332007 2572199 -1362635 -2529873 -1420661 -1256450 -3527975 -6169707 -6822281
42412f822281O56673m00642j823804j001829J715219L830786L974560K915615
$$ -6822281 -6165608 -6566250 -8390054 -9391883 -7676664 -3845878 128682 3044297
42404C044297J839608J010293J50824q58477j859469k448983k205668j310463
$$ 3044297 4883905 5894198 6045022 5186545 3327076 878093 -1327575 -2638038
42396b638038n73270l12587K11974J505921K661408K469806J085827m75424j723214
$$ -2638038 -3211308 -3523895 -3311921 -1806000 855408 3325214 4411041 3935617 2212403
42387B212403k329820j446074P92082K034954L76324k360900k688065m99465R90690
$$ 2212403 -117417 -1563491 -771409 1263545 1639869 -721031 -3409096 -3908561 -2917871
42378b917871M58495J31438J331844J896243o6650k726559l125731j100880J418969
$$ -2917871 -2459376 -2327938 -996094 900149 833499 -1893060 -5018791 -6119671 -4700702
42369d700702L098582L276424J335897j902613l838571l084904j211425J09237
$$ -4700702 -1602120 1674304 3010201 1107588 -2730983 -5815887 -7027312 -6918075
42361f918075J537375L595066M126224J137274l414215n526492l797744O5883
$$ -6918075 -5380700 -1785634 2340590 3477864 63649 -5462843 -9260587 -9194704
42353i194704L910818N961342M742821J032135j554955p50168J078380O93184
$$ -9194704 -5283886 677456 5420277 6452412 4897457 4147289 5225669 5918853
42345E918853q64328n62338R09778K93332k202881k924481j001395K38468q72674
$$ 5918853 5054525 4492187 5401965 5695297 3492416 567935 -433460 -194992 -1067666
42336a067666j522071O52497L490826L571861R30220j723606k597168j771118
$$ -1067666 -2589737 -1937240 1553586 5125447 6055667 4332061 1734893 -36225
42328c6225q8230J302579J356323J75490j171002k180753l049873l267961j832498
$$ -36225 -124455 1178124 2534447 2709937 1538935 -641818 -3691691 -6959652 -8792150
42319h792150Q52319K997300L636882L242886K196611N68885o37784k60377Q37378
$$ -8792150 -7939831 -4942531 -1305649 1937237 4133848 4702733 4064949 3804572 4641950
42310D641950O08806q96296j458890k91397P23303N1142j486174k444773k469937
$$ 4641950 5250756 4354460 2895570 2604173 3327476 3378618 1892444 -552329 -3022266
42301c022266j712344m91163J39065m72551q43741Q23274L185419L057753L03172
$$ -3022266 -4734610 -5225773 -5086708 -5559259 -6403000 -5579726 -2394307 663446 966618
42292I66618j880209j977178j799937k280914j632782O95384K144994J345716
$$ 966618 -913591 -2890769 -4690706 -6971620 -8604402 -7909018 -5764024 -4418308
42284d418308O75568J948550K979005J522576m45398M8132J959560K213382Q17320
$$ -4418308 -3742740 -1794190 1184815 2707391 2261993 2310125 4269685 6483067 7300387
42275G300387J33086L16379o29433k734194l520732j797853O99784J799478J057475
$$ 7300387 7433473 7749852 7120419 4386225 865493 -932360 -232576 1566902 2624377
42266B624377o15144j872710j626428j39744R50877P15639J47380L09685O84789
$$ 2624377 2009233 136523 -1489905 -1629649 -678772 36867 184247 493932 1178721
42257A178721O85250J088607K167682K168193m6854k402878k330133q21452q21749
$$ 1178721 1863971 2952578 5120260 7288453 7241599 4838721 2508588 1687136 865387
42248H65387k372998k544056j47884K391058K480699M99338j206239r98832P48508
$$ 865387 -1507611 -4051667 -4199551 -1808493 672206 1171544 -34695 -1033527 -285019
42239b85019K012978R57621j655168k666152m75782K260284J875618j190116l009314
$$ -285019 1727959 2685580 1030412 -1635740 -2111522 148762 2024380 834264 -2175050
42230b175050j701310L24200L60521o59224J53673L149859N199082L590284k72511
$$ -2175050 -3876360 -3552160 -3191639 -3850863 -3697190 -547331 4651751 8242035 7969524
42221G969524k411267j437381k40513j279686k399232l70253K907488K295345
$$ 7969524 5558257 4120876 3880363 2600677 201445 -168808 2738680 5034025
42213E034025k439172n445083l307622K61575R53509K31791J264414K767040J839260
$$ 5034025 2594853 -2850230 -6157852 -5896277 -4942768 -4710977 -3446563 -679523 1159737
42204A159737l12435p33543k41567j227755k187130k54002K536481J819828j246596
$$ 1159737 847302 113759 -127808 -1355563 -3542693 -3796695 -1260214 559614 -686982
42195f86982j291790K251685M151837K167151K14963J053722K023262N95334j338417
$$ -686982 -1978772 272913 4424750 6591901 6806864 7860586 9883848 10479182 9140765
42186I140765j596228j296707j516052r10338N61066J37927k518298l280071k06301
$$ 9140765 7544537 6247830 4731778 3821440 4382506 4520433 2002135 -1277936 -1484237
42177a484237K401666P50091k007924j039736K142077K543231M374j115810Q17480
$$ -1484237 917429 1667520 -340404 -1380140 761937 3305168 3309542 2193732 3011212
42168C011212L078115L487866K312583k01180l774773n915083m033050K50677
$$ 3011212 6089327 9577193 11889776 11688596 7913823 1998740 -2034310 -1783633
42160a783633K724046K353282J629102J485402L11088j654833j643643O33861
$$ -1783633 940413 3293695 4922797 6408199 6719287 5064454 3420811 4054672
42152D054672J632017m04595k335495j179911J117030J167944k55321P1236J994698
$$ 4054672 5686689 5282094 2946599 1766688 2883718 4051662 3796341 3867577 5862275
42143E862275J989384r61209l229213j790167J116615J136946j680204k682996
$$ 5862275 7851659 6890450 3661237 1871070 2987685 4124631 2444427 -238569
42135b38569N09480L898820K334539k857827n138698j739154K528810K300416
$$ -238569 270911 4169731 6504270 3646443 -1492255 -3231409 -702599 1597817
42127A597817r34361j838366O13514K374373J186222k72690P08347K411747J459622
$$ 1597817 663456 -1174910 -561396 1812977 2999199 2726509 3434856 5846603 7306225
42118G306225k062635m682124l921504q13881J742849K010163P49805K6305P35904
$$ 7306225 5243590 561466 -3360038 -4173919 -2431070 -420907 328898 355203 1091107
42109A091107J613470J172402j7974k45264N99183R96148N64628P40783K000923
$$ 1091107 2704577 3876979 3859005 3613741 4212924 5209072 5773700 6514483 8515406
42100H515406K497196Q19942j573241k382805j608002p72223q3249J287957K544014
$$ 8515406 11012602 11832544 10259303 7876498 6268496 5496273 5413024 6700981 9244995
42091I244995J534176j707241l946257k625822P34813K590991J891166P81715
$$ 9244995 10779171 9071930 5125673 2499851 3234664 5825655 7716821 8498536
42083H498536J062118J732135P38576j912256l786160k634298J034115M038092
$$ 8498536 9560654 11292789 12031365 10119109 6332949 3698651 4732766 8770858
42075H770858L365033o80471m349069m136139n48259K627347K813092J251713
$$ 8770858 12135891 11455420 7106351 2970212 2421953 5049300 7862392 9114105
42067I114105P33783J945203L030999K102363o21043k746170j610998K729485
$$ 9114105 9847888 11793091 14824090 16926453 16305410 13559240 11948242 14677727
42059A4677727O389304N421630J187841p34814J627143L352868J61438m236419
$$ 14677727 21067031 26488661 27676502 26941688 28568831 31921699 32083137 27846718
42051B7846718l460053J069480J758648k986695n482376k88293P359784R130880
$$ 27846718 24386665 25456145 27214793 24228098 18745722 18457429 25817213 34948093
42043C4948093M869479R74897P68959K214529L600226N940676R727039J3575340
$$ 34948093 39817572 40792469 41561428 43775957 47376183 53316859 63043898 76619238
42035G6619238J6530912J8554234J8636534J5155330P984693j798104j3067256
$$ 76619238 93150150 111704384 130340918 145496248 153480941 151682837 138615581
42028A38615581k3014944k6561088k1558716j3229293q776215q421660o789769
$$ 138615581 115600637 89039549 67480833 54251540 45475325 37053665 30263896
42021C0263896k531577l46789k534567m930054l835046j478989j183134j788368
$$ 30263896 27732319 27385530 24850963 19920909 16085863 14606874 13423740 11635372
42013A1635372p83185R49036J562675J995992L114976K385661j822104n380191
$$ 11635372 10852187 11801223 13363898 15359890 18474866 20860527 19038423 13658232
42005A3658232l361983J860637L258228p28962m440585l800442j292401m94052
$$ 13658232 10296249 12156886 15415114 14686152 10245567 6445125 5152724 4658672
41997D658672o38753M99266K025236J676530j02289j038176o71041k88165K1310
$$ 4658672 4019919 4519185 6544421 8220951 8118662 7080486 6409445 6121280 6142590
41988F142590J477669L679153M006122J084826k599973l162200q8340K967678
$$ 6142590 7620259 11299412 15305534 16390360 13790387 10628187 10539847 13507525
41980A3507525K761222N34942M6342K291074M421085M035869K013543J28179j449858
$$ 13507525 16268747 16803689 16850031 19141105 23562190 27598059 29611602 29739781 28289923
41971B8289923k426302q60911L593729O974953N450537J500157J403348O523526
$$ 28289923 25863621 25002710 28596439 35571392 41021929 42522086 43925434 50448960
41963E0448960J1489590J2198208J1302331J3059448J5918489J3985985M907106
$$ 50448960 61938550 74136758 85439089 98498537 114417026 128403011 133310117
41956A33310117o560415j3021863j1213358m427316J195531L023762M248713Q922958
$$ 133310117 126749702 113727839 102514481 98087165 99282696 102306458 106555171 115478129
41948A15478129J6100112K1973966K6888468L4569303M2293992L7972463J3387659
$$ 115478129 131578241 153552207 180440675 215009978 257303970 295276433 308664092
41941C08664092k2037502m7407076n0935784l9593157k7619566k1016437j6432559
$$ 308664092 286626590 239219514 188283730 148690573 121071007 100054570 83622011
41934H3622011j0823716o317516n664620p303159p241216m245364r95494j65035
$$ 83622011 72798295 66480779 60816159 53513000 46271784 42026420 41030926 40865891
41926D0865891j165307j818880j894017k803348m189881l706443j092742M95608
$$ 40865891 39700584 37881704 35987687 33184339 28994458 25288015 24195273 24690881
41918B4690881p16270j694541R21742M981820N459575J912655r76431k46785K208560
$$ 24690881 23974611 22280070 23201812 28183632 33643207 35555862 34579431 34332646 36541206
41909C6541206M012619N578771P476870Q267666P039362N043123K850192j052282
$$ 36541206 40553825 46132596 53609466 61877132 68916494 73959617 76809809 75757527
41901G5757527o626184j0316089r480747o246980m160976l392722k199891p99809
$$ 75757527 69131343 58815254 49334507 43087527 38926551 35533829 33333938 32534129
41893C2534129m18171m30486J01366k01121k544292m516968l099270J96200J400489
$$ 32534129 32115958 31685472 31786838 31585717 29041425 24524457 21425187 21621387 23021876
41884B3021876L68466N52552K981872N056062N412293N397114N083068K338596
$$ 23021876 23390342 23942894 26924766 31980828 37393121 42790235 47873303 50211899
41876E0211899k841565o973705p453281n080051j587775J693451K354160j315841
$$ 50211899 47370334 40396629 32943348 27863297 26275522 27968973 30323133 29007292
41868B9007292o054618o074752j390056J499814n84565k762946n97596K439828
$$ 29007292 22952674 16877922 15487866 16987680 16403115 13640169 13042573 15482401
41860A5482401J095454k795622l651046j082806P10937L37642L0871N13173O42918
$$ 15482401 16577855 13782233 10131187 9048381 9759318 10096960 10127831 10641004 11283922
41851A1283922J093145L010888M107850J706552j291068K76537M891794N575799
$$ 11283922 12377067 15387955 19495805 21202357 19911289 20187826 25079620 30655419
41843C0655419Q85331k263901R29513O189371P175266M361874K915303N456707
$$ 30655419 31540750 29276849 30206362 36395733 43570999 47932873 50848176 56304883
41835E6304883J0654082J6130766J9638995J9826939J8192967J7463821J6220717
$$ 56304883 66958965 83089731 102728726 122555665 140748632 158212453 174433170
41828A74433170R202367m257400j6527380k0492845j8213062j6046158j4825395
$$ 174433170 183635537 179378137 162850757 142357912 124144850 108098692 93273297
41821I3273297j1061813n496142l174991n070001o259010l888750j284486j767832
$$ 93273297 82211484 76715342 73540351 68470350 62211340 58322590 57038104 55270272
41813E5270272l138300j588482K213627M459104L706701J999026J405914J834402
$$ 55270272 52131972 50543490 52757117 57216221 60922922 62921948 64327862 66162264
41805F6162264J939619O22412k174905n203564o765167o376818n048337l712007
$$ 66162264 68101883 68724295 66549390 61345826 54580659 48203841 43155504 39443497
41797C9443497k429399j474875j725624l040599l528586j782261R19268K018857
$$ 39443497 37014098 35539223 33813599 30773000 27244414 25462153 26381421 28400278
41789B8400278R44250l64879k65039N15102L62054m07012L72437L355871N662767
$$ 28400278 29344528 28979649 28714610 29229712 29591766 29184754 29557191 32913062 38575829
41780C8575829L806060j665893o393928p435630o085002m545789k572485K70855
$$ 38575829 42381889 40715996 34322068 26886438 20801436 16255647 13683162 13954017
41772A3954017J669103k75081k565801p97178L298585L211462k367902o592840
$$ 13954017 15623120 15348039 12782238 11985060 15283645 18495107 16127205 9534365
41764I534365m261062O92523J796546l87628j018870Q6558o85836k566594q90043
$$ 9534365 5273303 5965826 7762372 7374744 6355874 6442432 5756596 3190002 2299959
41755B299959L678058M143792j898836p190281m886625J815699N196943L658207
$$ 2299959 5978017 10121809 8222973 1032692 -3853933 -2038234 3158709 6816916
41747F816916J120532o28695k433274k881053P4707L408503J870968l112595m228479
$$ 6816916 7937448 7308753 4875479 1994426 2069133 5477636 7348604 4236009 7530
41738G530N95244M581714K426066k001186k430488M67873J652677j7659j442523
$$ 7530 602774 5184488 7610554 5609368 3178880 3646753 5299430 5281771 3839248
41729C839248r96157K81169J786292L384495L521154J232777j058220n28391J428340
$$ 3839248 2843091 3124260 4910552 8295047 11816201 13048978 11990758 11462367 12890707
41720A2890707J429245k81686p70064k8474q08575k975371k987930J51871K865744
$$ 12890707 14319952 14038266 13268202 13239728 12431153 9455782 6467852 6619723 9485467
41711I485467K257549k87465j998893j878019p738K837587L957188Q04858m449043
$$ 9485467 11743016 11455551 9456658 7578639 7570901 10408488 14365676 15170534 10721491
41702A0721491o190553k781110R99868Q35271j494186j839445K05097J854340
$$ 10721491 4530938 1749828 2749696 3584967 2090781 251336 456433 2310773
41694B310773J464870k81084j774440j277871J719150M658898L927188o8952k815493
$$ 2310773 3775643 3494559 1720119 442248 2161398 6820296 10747484 10678532 7863039
41685G863039j978703k02039M6504K05482J605767K049985J5128j592454j42296
$$ 7863039 5884336 5682297 5728801 5934283 7540050 9590035 9605163 8012709 7870413
41676G870413J553730n07693m654175n753841k561861J486042L286840K051416
$$ 7870413 9424143 8916450 4262275 -1491566 -4053427 -2567385 719455 2770871
41668B770871j734260n367067m342210J715098N939665K344033m995727o779897
$$ 2770871 1036611 -4330456 -8672666 -6957568 -1017903 1326130 -3669597 -10449494
41660a0449494j105934N004534N962159L025623o21832l631830m405936j437671
$$ -10449494 -11555428 -6550894 -588735 2436888 1815056 -1816774 -6222710 -7660381
41652g660381K671011K969265n49397k581562p32683J423944J153115O57148J969908
$$ -7660381 -4989370 -2020105 -2569502 -5151064 -5883747 -4459803 -3306688 -2649540 -679632
41643f79632L166459K492238J374899O18831j476065m482701m619314j316434
$$ -679632 2486827 4979065 6353964 6972795 5496730 1014029 -3605285 -4921719
41635d921719N02904j502067k501703J171177M805922K741402j832788k038880
$$ -4921719 -4418815 -5920882 -8422585 -7251408 -2445486 295916 -1536872 -3575752
41627c575752J158639R63529l259266m606338N573M743252L658419j223384l852589
$$ -3575752 -2417113 -1453584 -4712850 -9319188 -9313615 -4570363 -911944 -2135328 -5987917
41618e987917k205025P62890J749742K11139j839865j816192O46753K740501J872412
$$ -5987917 -8192942 -7430052 -5680310 -5469171 -7309036 -9125228 -8478475 -5737974 -3865562
41609c865562m09260k98549K565556M231293K007762j816721l258513j642968
$$ -3865562 -4274822 -4573371 -2007815 2223478 4231240 2414519 -843994 -2486962
41601b486962L58993N66775m04832n06417R46524K306085J707240k31316j082641
$$ -2486962 -2127969 -1561194 -1966026 -2472443 -1525919 780166 2487406 2256090 1173449
41592A173449j49922N52135k66417r78296n3292Q82903l40993k325897j746101
$$ 1173449 1023527 1575662 1309245 330949 277657 1160560 819567 -1506330 -3252431
41583c252431J577826M254821L847021J221746j608016l546388m086585l060076
$$ -3252431 -1674605 2580216 6427237 7648983 6040967 2494579 -1592006 -4652082
41575d652082j174629N62584J817693K206513O91090k416794m060264j672505
$$ -4652082 -5826711 -5264127 -3446434 -1239921 -548831 -2965625 -7025889 -8698394
41567h698394K867222N169535L759005R40749j185280k511814k876269j474922
$$ -8698394 -5831172 -661637 3097368 4038117 2852837 341023 -2535246 -4010168
41559d010168J079297K720700K515382J195797p59273l078704m053356k087867
$$ -4010168 -2930871 -210171 2305211 3501008 2741735 -336969 -4390325 -6478192
41551f478192R68358J379888j024861k305579k27500K686879L275716J848817
$$ -6478192 -5509834 -4129946 -5154807 -7460386 -7687886 -5001007 -1725291 123526
41543A23526N06084j7650o2601K29827L68037m13948j461891j151933J95672L73051
$$ 123526 629610 611960 549359 779186 1147223 733275 -728616 -1880549 -1684877 -1311826
41533a311826r28378j354093m5711P25919k60038p51398R86521K983134L017267
$$ -1311826 -2240204 -3594297 -3640008 -2914089 -3174127 -3925525 -2939004 44130 3061397
41524C061397K201133K075487J101760k207945n108191l852703M17168L203005
$$ 3061397 5262530 7338017 8439777 6231832 1123641 -2729062 -2311894 891111
41516H91111L053733K300735K055721R03329j189009j910438o78284r2457j744987
$$ 891111 3944844 6245579 8301300 9204629 8015620 6105182 5426898 5334441 3589454
41507C589454l497552k784775l60376J233032J333956J335864K061415K664169
$$ 3589454 91902 -2692873 -3053249 -1820217 -486261 849603 2911018 5575187
41499E575187K026660L04615j043654o66857R94423J742854J23194k397343k933857
$$ 5575187 7601847 7906462 6862808 6195951 7190374 8933228 9056422 6659079 3725222
41490C725222q85767J245972J227277l4526o7675J470752K167802K25573k690081
$$ 3725222 2839455 4085427 5312704 5278178 5210503 6681255 8849057 9074630 6384549
41481F384549l212114p10629J582145P53746j862137k690437r25508R02116J117183
$$ 6384549 3172435 2461806 4043951 4797697 2935560 245123 -680385 221731 1338914
41472A338914P49722O32631k18256j824070j831117P45247K823554J224588k457803
$$ 1338914 2088636 2721267 2503011 678941 -1152176 -406929 2416625 3641213 1183410
41463A183410m025760k385681J7295J371309J783652J175715n26552j383173O82948
$$ 1183410 -2842350 -5228031 -5210736 -3839427 -2055775 -880060 -1406612 -2789785 -2106837
41454b106837L781075L582966k50727k918293j246595J902171K256823J97182
$$ -2106837 1674238 5257204 5006477 2088184 841589 2743760 5000583 5197765
41446E197765q02998J84655Q09178k84747j403980n81417J456369K136197K75429
$$ 5197765 4394767 4579422 5388600 5103853 3699873 3118456 4574825 6711022 6986451
41437F986451k296257k718083n98457J322892O50341j537896k361611j014708
$$ 6986451 4690194 1972111 1373654 2696546 3346887 1808991 -552620 -1567328
41429a567328R46426K468940L661649L877501K087023m51001r12896P85825J366313
$$ -1567328 -620902 1848038 5509687 9387188 11474211 11023210 10110314 10896139 12262452
41420A2262452q63008l413456l663209k500261j725708p94316R41916J402331
$$ 12262452 11399444 7985988 4322779 1822518 96810 -697506 244410 1646741
41412A646741j148073m105026l626273o09129N44160j276413k486544o58585K094939
$$ 1646741 498668 -3606358 -7232631 -7841760 -7297600 -8574013 -11060557 -11719142 -9624203
41403i624203K880604K038542J700376K581233L769287M073124K479471j117823
$$ -9624203 -6743599 -4705057 -3004681 -423448 3345839 7418963 9898434 8780611
41395H780611m691950n250966k318645J139159K155309P68546j086063k023390
$$ 8780611 4088661 -1162305 -3480950 -2341791 -186482 582064 -503999 -2527389
41387b527389j601035N8597J776081J792847l9039j719520j785561j185840j300266
$$ -2527389 -4128424 -4069827 -2293746 -500899 -539938 -2259458 -4045019 -5230859 -6531125
41378f531125j538238n00683J561167L128595L526695L164140K312042J090518
$$ -6531125 -8069363 -8570046 -7008879 -3880284 -353589 2810551 5122593 6213111
41370F213111J57456L6206J15878n24957j688434k431856k336641j514062j20759
$$ 6213111 6370567 6406773 6522651 5997694 4309260 1877404 -459237 -1973299 -2094058
41361b094058J172504J251620K75530J03791J494081K263101L84986k299937k296647
$$ -2094058 -921554 330066 605596 709387 2203468 4466569 4851555 2551618 254971
41352B54971K32802J559950j6222j865611j302764O96250J652406J191667O32843
$$ 254971 487773 2047723 2031501 165890 -1136874 -440624 1211782 2403449 3036292
41343C036292O13432Q66990J058285L67551k271824n832991o684535k771218K733805
$$ 3036292 3649724 4516714 5574999 5942550 3670726 -2162265 -8846800 -11618018 -8884213
41334h884213M635556K254639O4877J448351M444251M979329K271358r44728k482257
$$ -8884213 -4248657 -1994018 -1929141 -480790 3963461 8942790 11214148 10269420 7787163
41325G787163k812187l129340l172351j887033O48497K964803L664481K580480
$$ 7787163 4974976 1845636 -1326715 -3213748 -2565251 399552 4064033 6644513
41317F644513O96860n92500m77298L56316J44571j774069l612649l231481j241819
$$ 6644513 7341373 6748873 6271575 6627891 6772462 4998393 1385744 -1845737 -3087556
41308c087556k15065q46032j297811q21182r56581j754634m09444L534921N244720
$$ -3087556 -3302621 -4148653 -5446464 -6267646 -7224227 -8978861 -9388305 -5853384 -608664
41299f08664J337035l385859j969967L582783M532154j056174m963998j572999
$$ -608664 728371 -2657488 -4627455 -1044672 3487482 2431308 -2532690 -4105689
41291d105689L733945L667005q4829j456710l57003q47794k384451j090674J768814
$$ -4105689 -371744 3295261 3210432 1753722 1396719 548925 -1835526 -2926200 -1157386
41282a157386R13446l152435l474717K305060P382634N550007k94074l392943
$$ -1157386 -243940 -3396375 -6871092 -4566032 2816602 8366609 8072535 4679592
41274D679592k356462p24859m78654m43524L99216J534683K123634J417877j014746
$$ 4679592 2323130 1598271 1119617 676093 1075309 2609992 4733626 6151503 5136757
41265E136757l935663m796254k911766n98863J60779J31777M58984L40201q80353
$$ 5136757 1201094 -3595160 -6506926 -7105789 -6945010 -6813233 -6354249 -6014048 -6894401
41256f894401j534192j0596K381017L251996K361978R42142n50139j823340j648156
$$ -6894401 -8428593 -8439189 -6058172 -2806176 -444198 497944 -52195 -1875535 -3523691
41247c523691J68749J303109K6826j694323j047150J085324J643449M01431j26388
$$ -3523691 -3354942 -2051833 -2025007 -3719330 -4766480 -3681156 -2037707 -1636276 -1762664
41238a762664O26736M24434j481413k609357j014256J795972L084916K156921
$$ -1762664 -1135928 -711494 -2192907 -4802264 -5816520 -4020548 -935632 1221289
41230A221289K99522r24795m03918J911423M099877L434260l55886m128685m792172
$$ 1221289 1520811 596016 192098 2103521 6203398 9637658 9281772 5153087 360915
41221C60915k726427n58861M37863R85217J375050O55742j155356k045451p25986
$$ 360915 -2365512 -2924373 -2486510 -1501293 -126243 529499 -625857 -2671308 -3397294
41212c397294J028780Q64607k94656K94847K185941J871998j189035k862277r35634
$$ -3397294 -2368514 -1503907 -1798563 -1503716 682225 2554223 1365188 -1497089 -2432723
41203b432723R17569l92857j233257K618263P105913M866279k524201n975734
$$ -2432723 -1515154 -1908011 -3141268 -523005 6582908 11449187 8924986 2949252
41195B949252k826142r8869j760086k492537J355478M083666P76521l104592r13444
$$ 2949252 123110 24241 -1735845 -4228382 -2872904 1210762 1987283 -1117309 -2030753
41186b030753L112065R98207m723602m998654M25065L135881O57440n50767K174474
$$ -2030753 1081312 2079519 -2644083 -7642737 -7217672 -4081791 -3424351 -3975118 -1800644
41177a800644K965036j415094n334799l664693O40036L011995M222658N863006
$$ -1800644 1164392 -250702 -5585501 -9250194 -8610158 -5598163 -1375505 4487501
41169D487501N291765P59463l547595l228132l99701M09626n58109k69694J114606
$$ 4487501 9779266 10538729 6991134 3763002 3363301 3772927 3214818 2945124 4059730
41160D059730J289283M37042K48667K98247o10769j432241q31515j03410p47104
$$ 4059730 5349013 5786055 6034722 6332969 5722200 4289959 3458444 3355034 2607930
41151B607930j385516m76303M05436l97498r25245J017582L211466K205284q27669
$$ 2607930 1222414 746111 1151547 754049 -171196 846386 4057852 6263136 5435467
41142E435467k029492j101340q80995j740347j222193J002117K227291J100058
$$ 5435467 3405975 2304635 1423640 -316707 -1538900 -536783 1690508 2790566
41134B790566o71055j323694q51299J67372R95714N03185j042027j058959J637246
$$ 2790566 2119511 795817 -55482 111890 1107604 1610789 568762 -490197 1147049
41125A147049L741476J703814k300324l063054l30838P96255k126593n230319
$$ 1147049 4888525 6592339 4292015 1228961 898123 1694378 -432215 -5662534
41117e662534m224062q5939L161261L498052J767007l61040j450725p57609R67925
$$ -5662534 -9886596 -9972535 -6811274 -3313222 -1546215 -1907255 -3357980 -4115589 -3147664
41108c147664J956480J359444M224q26693n22945O25272J411667O00048j216671
$$ -3147664 -1191184 168260 172484 -654209 -1177154 -551882 859785 1459833 243162
41099B43162j781160l38690J007394O52566Q8629Q94512J427021l50891k688670
$$ 243162 -1537998 -1876688 -869294 -216728 -128099 766413 2193434 1842543 -846127
41090h46127k381762J41566J855693K025303K098368J887133K23792j457711q63182
$$ -846127 -3227889 -3086323 -1230630 794673 2893041 4780174 5003966 3546255 2683073
41081B683073M77830p17763l158496k412001J072326J690951k016816m111353
$$ 2683073 3160903 2443140 -715356 -3127357 -2055031 -364080 -2380896 -6492249
41073f492249k70829N419443O560141K963085r79426k886438l148055j883174
$$ -6492249 -6763078 -1343635 5216506 8179591 7200165 4313727 1165672 -717502
41065g17502N94006K046804P62320j527432k113845j234442p13119l30805J218582
$$ -717502 -123496 1923308 2685628 1158196 -955649 -2190091 -2903210 -3234015 -2015433
41056b015433K946333K573995N19432k78099J152087K099002k9673l793391m992869
$$ -2015433 930900 3504895 4024327 3746228 4898315 6997317 6967644 3174253 -1818616
41047a818616j693672K921815L698293l46443m490409m116519m33703J843426
$$ -1818616 -3512288 -590473 3107820 2761377 -1729032 -5845551 -6279254 -4435828
41039d435828J109956n2819L21733J388263K075852K281173J326223j149372k785683
$$ -4435828 -3325872 -3378691 -3056958 -1668695 407157 2688330 4014553 2865181 79498
41030G9498j136439J392287K95861l117023k815052J687019L391892p88200m144483
$$ 79498 -1056941 335346 631207 -2485816 -5300868 -3613849 -221957 -1010157 -5154640
41021e154640p41222M862518N153899J407932K8448J222092P4217l227904l195704
$$ -5154640 -5895862 -1033344 4120555 5528487 5556935 6779027 6853244 3625340 429636
41012D29636J008996L516530J044863k478558k616490k58421J409620J356727
$$ 429636 1438632 4955162 6000025 3521467 904977 646556 2056176 3412903
41004C412903J69554j413211k064944r84665O9410r69826k431284j039907K213010
$$ 3412903 3582457 2169246 104302 -880363 -810953 -1780779 -4212063 -5251970 -3038960
40995c038960L066099J004918J4745J442464J666462j203323l597438k273194
$$ -3038960 27139 1032057 1046802 2489266 4155728 2952405 -645033 -2918227
40987b918227O63319J619572N83108p07722k102200l368525k470977J024766L577713
$$ -2918227 -2254908 -635336 -52228 -759950 -2862150 -6230675 -8701652 -7676886 -4099173
40978d099173K213496p98816j194256J236274L107382K455737K64047j820585
$$ -4099173 -1885677 -2684493 -3878749 -2642475 464907 2920644 3184691 1364106
40970A364106k608647j354030R92392J770504P6097j309211J30600K495300K232785
$$ 1364106 -1244541 -2598571 -1606179 164325 240422 -1068789 -938189 1557111 3789896
40961C789896l52401j734204n97120P43682L66095q01806j093446l74041M58022
$$ 3789896 3437495 1703291 1106171 1849853 2215948 1414142 320696 -53345 404677
40952D04677O29818j73442j339333j290933O84452K802927K546598l0099k277851
$$ 404677 1034495 861053 -478280 -1769213 -1084761 1718166 4264764 4234665 1956814
40943A956814k271434p54922L65116K52496l94368l22842Q82942J973732J144873
$$ 1956814 -314620 -1069542 -704426 -451930 -846298 -1169140 -286198 1687534 2832407
40934B832407j427134l095452j867399Q41015J922304L97558j885996k838508
$$ 2832407 1405273 -1690179 -3557578 -2716563 -794259 -396701 -2282697 -5121205
40926e121205j928936J99156K328037K933846J277991j487559l184156k695431
$$ -5121205 -7050141 -6850985 -4522948 -1589102 -311111 -1798670 -4982826 -7678257
40918g678257p16582J201221J781214Q22065m07235k52174J195808K034027J344355
$$ -7678257 -8394839 -7193618 -5412404 -4590339 -4997574 -5249748 -4053940 -2019913 -675558
40909f75558N96735J007229J168771o24496l011045l129972q73289J149323J664462
$$ -675558 -78823 928406 2097177 1472681 -1538364 -4668336 -5541625 -4392302 -2727840
40900b727840J909025K479433K003834J13209q98897O56696K724486J951301j512966
$$ -2727840 -818815 1660618 3664452 3777661 2878764 3535460 6259946 8211247 6698281
40891F698281l922312k812998r2723Q28283j63186P2160K781020M418652J154468
$$ 6698281 2775969 -37029 -129752 698531 535345 607505 3388525 7807177 8961645
40882H961645m760858o598245j964717L429794L236327j110685l059663k87158
$$ 8961645 4200787 -2397458 -4362175 -932381 2303946 1193261 -1866402 -2153560
40874b153560L041548L083057R45468n75591j064661j316159j003163J93417J148170
$$ -2153560 887988 3971045 4916513 4340922 3276261 1960102 956939 1150356 2298526
40865B298526J027635P98586J208445J015140p21796k204201j208714J231573
$$ 2298526 3326161 4124747 5333192 6348332 5626536 3422335 2213621 3445194
40857C445194K003590K71022j730553k151890j535380r96804l74812Q54616J998570
$$ 3445194 5448784 5719806 3989253 1837363 301983 -694821 -1069633 -215017 1783553
40848A783553J557367r47252l896355m537840j643725K557480M111607J774941
$$ 1783553 3340920 2393668 -1502687 -6040527 -7684252 -5126772 -1015165 759776
40840G59776j311715j538734O28354J731082K33110j841846k237524j254611l94518
$$ 759776 -551939 -2090673 -1462319 268763 501873 -1339973 -3577497 -4832108 -5226626
40831e226626J04247J066112K546182L386066K518417K45935j745895j765884
$$ -5226626 -5122379 -4056267 -1510085 1875981 4394398 4640333 2894438 1128554
40823A128554P1432J647416J146403p09543j700234j146742n60445j127829k054279
$$ 1128554 1199986 2847402 3993805 3284262 1584028 437286 -123159 -1250988 -3305267
40814c305267k044634j132012j10007Q35411J827167K291371J397799o26914k355532
$$ -3305267 -5349901 -6481913 -6591920 -5756509 -3929342 -1637971 -240172 -867086 -3222618
40805c222618k396614o63272J317455J549123k02046j518454J1561L195222M116197
$$ -3222618 -5619232 -6282504 -4965049 -3415926 -3617972 -5136426 -5124865 -1929643 2186554
40796B186554J266710k222831k840152j241468m74410j169563j166192P45714
$$ 2186554 3453264 1230433 -1609719 -2851187 -3325597 -4495160 -5661352 -4915638
40788d915638L300697M798134M415331J777566k267329m586926k430967K335933
$$ -4915638 -1614941 3183193 7598524 9376090 7108761 2521835 90868 2426801
40780B426801M556031K208619j330858k535743k007792j688032j134882M21949
$$ 2426801 6982832 9191451 7860593 5324850 3317058 1629026 494144 916093
40772I16093J003493j330893m235326l602540L59296L388654L374549K502096
$$ 916093 1919586 588693 -3646633 -7249173 -6889877 -3501223 -126674 2375422
40764B375422K642339K305711j94084l314119m053299j634502J944295L943640
$$ 2375422 5017761 7323472 7129388 3815269 -238030 -1872532 71763 4015403
40756D015403K864513k58120k256606j132192J052465P25104j849857k799322
$$ 4015403 6879916 6621796 4365190 3232998 4285463 5010567 3160710 361388
40748C61388p00722J238075N77439n17710N41957K097207J295706p34822q60514
$$ 361388 -339334 898741 1476180 958470 1500427 3597634 4893340 4158518 3298004
40739C298004N76641N54099j176845j735928k03108R79109L15404o55350n79030
$$ 3298004 3874645 4428744 3251899 1515971 1312863 2291972 2607376 1952026 1372996
40730A372996l39159o51585n46798L20767M94394o41014j472138r51705l74037
$$ 1372996 1033837 382252 -164546 156221 650615 9601 -1462537 -2414242 -2788279
40721b788279o65194l67937J502607K837242J352604j484158k268518l98577J636798
$$ -2788279 -3453473 -3821410 -2318803 518439 1871043 386885 -1881633 -2280210 -643412
40712f43412K049044J306756K60474q70232j611109j400050p74330o68475o07931
$$ -643412 1405632 2712388 2972862 2102630 491521 -908529 -1682859 -2351334 -2959265
40703b959265N76351K296895K508691P62595r49109r55523J62024J036329J349591
$$ -2959265 -2382914 -86019 2422672 3185267 2236158 1280635 1442659 2478988 3828579
40694C828579J398389J138763N38295r8145p91191j897091k931407k524342l17241
$$ 3828579 5226968 6365731 6904026 6805881 6014690 4117599 1186192 -1338150 -1655391
40685a655391K043809K629648J267473p19172k059382k245177j431328k78725
$$ -1655391 388418 3018066 4285539 3566367 1506985 -738192 -2169520 -2448245
40677b448245N56921J069496J499880J405899K39519j144019j133791L1254Q2014
$$ -2448245 -1891324 -821828 678052 2083951 2323470 1179451 45660 76914 158928
40668A58928j842042l269343j543369K244812M313667K736881n71629k292709
$$ 158928 -1683114 -4952457 -6495826 -4251014 62653 2799534 2227905 -64804
40660f4804j070101J459552K398816O36995j724762j928002m50491l59967k291258
$$ -64804 -1134905 324647 2723463 3360458 1635696 -292306 -742797 -1102764 -3394022
40651c394022k942054l87009K064278N36680l097940l677098l20983K900207L540920
$$ -3394022 -6336076 -6723085 -4658807 -4122127 -7220067 -10897165 -11218148 -8317941 -4777021
40642d777021L328975L530817K536145j66109j845830q65533M06288k35209j015338
$$ -4777021 -1448046 2082771 4618916 4452807 2606977 1741444 2147732 1912523 897185
40633H97185K83536J905761J031677j128060j261715M72572R99771k67646p22988
$$ 897185 1180721 3086482 4118159 2990099 1728384 2200956 3200727 2933081 2210093
40624B210093O64462J658193N68031j331897k130935j599817m52437O09052O52081
$$ 2210093 2874555 4532748 5100779 3768882 1637947 38130 -414307 194745 846826
40615H46826o75602j879573j234952L61668N48709n81864o32043P90259J229679
$$ 846826 171224 -1708349 -2943301 -2581633 -2032924 -2614788 -3246831 -2456572 -1226893
40606a226893k26588j095068L05640J865737J152386o14486o36204J176929K500302
$$ -1226893 -1453481 -2548549 -2242909 -377172 775214 160728 -475476 701453 3201755
40597C201755J985757K03088j796078k900052j858831J237937L954793L637968
$$ 3201755 5187512 5390600 3594522 694470 -1164361 73576 4028369 7666337
40589G666337K81649l666707n665538m580597j145859K079961K599138Q59080
$$ 7666337 7947986 4281279 -1384259 -5964856 -7110715 -5030754 -2431616 -1572536
40581a572536k47698L75104N06715j286746k748541j562146N82938P59455l11974
$$ -1572536 -1820234 -1445130 -938415 -2225161 -4973702 -6535848 -5952910 -5193455 -5505429
40572e505429J45435J858425K093387O99755K87545J283358J098421r34533j916362
$$ -5505429 -5359994 -3501569 -1408182 -708427 -420882 862476 1960897 1026364 -889998
40563h89998k32362J666646J412348L44007M60443O82573o95056k069021p14675
$$ -889998 -1122360 544286 1956634 2300641 2761084 3443657 2748601 679580 -35095
40554c5095K271244K939262K93101k255750k021376p52270j518860l806521m021929
$$ -35095 2236149 5175411 5468512 3212762 1191386 439116 -1079744 -4886265 -8908194
40545h908194m88468L999653N321904K747697n25849j323123J40732J319403Q30756
$$ -8908194 -9396662 -5397009 -75105 2672592 2146743 823620 964352 2283755 3114511
40536C114511k48137l18801O87810J461311P18158j736047m581899n469745k913216
$$ 3114511 2866374 2547573 3235383 4696694 5414852 3678805 -903094 -6372839 -9286055
40527i286055J753300N047052M651890J670091q94234j384301n44310K93352R48676
$$ -9286055 -7532755 -2485703 2166187 3836278 2942044 1557743 1013433 1306785 2255461
40518B255461J781178K079591M67823k564555l855070j027269L658074N195450
$$ 2255461 4036639 6116230 6584053 4019498 164428 -862841 2795233 7990683
40510G990683K160507j274211j166564P71988L46676k275115k788810L74909L411567
$$ 7990683 10151190 8876979 7710415 8482403 8829079 6553964 3765154 4140063 7551630
40501G551630K680873l68428j936041j178945k77997o49036j629523k338445k626821
$$ 7551630 10232503 9864075 7928034 6749089 6471092 5822056 4192533 1854088 -772733
40492g72733k244520q90319O37450Q15641n07684j434726k44857K177773L032865
$$ -772733 -3017253 -3907572 -3270122 -2454481 -2962165 -4396891 -4641748 -2463975 568890
40483E68890R41263k042837k595029k13458K043326J501136p48505j750994q73546
$$ 568890 1510153 -532684 -3127713 -3341171 -1297845 203291 -545214 -2296208 -3169754
40474c169754l5539k62731m39016K61813J039655J275225J502847J595226J46804
$$ -3169754 -3205293 -3468024 -3907040 -3645227 -2605572 -1330347 172500 1767726 1914530
40465A914530k850571m616486k807972J091246L429449K593400M6486j966706
$$ 1914530 -936041 -5552527 -8360499 -7269253 -3839804 -1246404 -1199918 -3166624
40457c166624k233942q41730R01972J350890M01298l13010N2409L18506j78711
$$ -3166624 -5400566 -6242296 -5340324 -3989434 -3588136 -3901146 -3848737 -3530231 -3708942
40448c708942J45788K101387K966956J12805l868800l767356O05893L693409K119503
$$ -3708942 -3563154 -1461767 1505189 1617994 -2250806 -6018162 -5412269 -1718860 400643
40439D00643r00313j224295P3809l00604j677491p27025K411519L939731K370627
$$ 400643 -499670 -1723965 -1650156 -1950760 -3628251 -4355276 -1943757 1995974 4366601
40430D366601M45367J72041o5380j633010k550932j125400K71507j234950l664376
$$ 4366601 4811968 4984009 4918629 3285619 734687 -390713 -119206 -1354156 -5018532
40421e018532k715661J181268L028758R54465q94496R99770M070577L898175Q52821
$$ -5018532 -7734193 -6552925 -3524167 -2569702 -3464198 -2464428 1606149 5504324 6357145
40412F357145j194307r47066o34100j650664k777433k785711j940011o42754J004642
$$ 6357145 5162838 4215772 3581672 1931008 -846425 -3632136 -5572147 -6214901 -5210259
40403e210259K082742J540961J96863p5319P36841Q54042j98611q88039l77031
$$ -5210259 -3127517 -1586556 -1389693 -1465012 -728171 125871 -72740 -960779 -1337810
40394a337810L32620L68536m7588q84798k274397k968380j401600J282763K034349
$$ -1337810 -1005190 -636654 -684242 -1569040 -3843437 -6811817 -8213417 -6930654 -4896305
40385d896305L98715o64572N66380K061472J529339l70496j855550k436536j949237
$$ -4896305 -4497590 -5162162 -4595782 -2534310 -1004971 -1375467 -3231017 -5667553 -7616790
40376g616790J36131K713708L076213Q85635n92002O99278K385043J708301k1631
$$ -7616790 -7480659 -4766951 -1690738 -805103 -1397105 -697827 1687216 3395517 3373886
40367C373886k1491J337534J741234Q70179J068o73558j397675j189431L17500
$$ 3373886 3352395 4689929 6431163 7301342 7302410 6628852 5231177 4041746 4359246
40358D359246J145473k5105j110267O49J529220R11029l83750N52964K483005
$$ 4359246 5504719 5479614 4369347 4369996 5899216 6810245 6426495 6979459 9462464
40349I462464J935719m69084q81258R06531P78362k770750n797060m521042j23519
$$ 9462464 11398183 10929099 10047841 10954372 11732734 8961984 3164924 -1356118 -1479637
40340a479637L460197L717968Q22641k598673k785419J239002N309349M787408
$$ -1479637 1980560 5698528 6521169 3922496 1137077 2376079 7685428 12472836
40332A2472836Q96625j424108j124594j528599l400527l345669l44414J757634
$$ 12472836 13369461 11945353 10820759 9292160 5891633 2545964 2201550 3959184
40324C959184N32593j240231p22466N44942K70069n98440n65799n56626j149161
$$ 3959184 4491777 3251546 2529080 3074022 3344091 2745651 2179852 1623226 474065
40315D74065m99334J766645K253528r36564m042893k877903P24227K140534J153496
$$ 474065 -25269 1741376 3994904 3058340 -984553 -3862456 -3138229 -997695 155801
40306A55801J004553J939189R68315k216824l862866j585662K303739M062543
$$ 155801 1160354 3099543 4067858 1851034 -2011832 -3597494 -1293755 2768788
40298B768788K722606J08495j642507j796732j169897q88444q68201k32151O69897
$$ 2768788 5491394 5599889 3957382 2160650 990753 102309 -765892 -998043 -328146
40289c28146L00082j384333k239973j000022Q97271J696361J500192Q78085l92627
$$ -328146 -28064 -1412397 -3652370 -4652392 -3755121 -2058760 -558568 319517 -73110
40280g3110j825341j916886p75340l63736p38711N42821L409178L826137L58881
$$ -73110 -1898451 -3815337 -4590677 -4954413 -5693124 -5150303 -1741125 2085012 2443893
40271B443893k112221M82557M390924L537929q95194k594680j80884J357615q14774
$$ 2443893 331672 814229 5205153 8743082 7847888 5253208 5072324 6429939 5615165
40262E615165l467795l076247o22662J030574R60714l3306q02788l11241J074398
$$ 5615165 2147370 -928877 -1551539 -520965 439749 406443 -396345 -707586 366812
40253C66812J054585j401569l414490j963227J029102J409387n81430j155787
$$ 366812 1421397 19828 -3394662 -5357889 -4328787 -2919400 -3500830 -4656617
40245d656617L32139R42072K45347J003522L069216K696571m37677j539848J471308
$$ -4656617 -4324478 -3382406 -3137059 -2133537 935679 3632250 3194573 1654725 3126033
40236C126033M141287K732437N518j83947P12009m53304k521257k699403k083592
$$ 3126033 7267320 9999757 10005275 9821328 10533337 10080033 7558776 4859373 2775781
40227B775781l263478m759169l186971N39340K410193J913707K308755M367863
$$ 2775781 -487697 -5246866 -8433837 -7894497 -5484304 -3570597 -1261842 3106021
40219C106021M818517J992004j252684j921006q85250o19102j459738k092806
$$ 3106021 7924538 9916542 8663858 6742852 5857602 5238500 3778762 1685956
40211A685956k008386j621237j002943j5840Q61118R32942J90403q43710j744921
$$ 1685956 -322430 -1943667 -2946610 -2962450 -2101332 -1168390 -977987 -1821697 -3566618
40202c566618k054549r93451J703720M554262M945004J961889j796558k662271
$$ -3566618 -5621167 -6614618 -4910898 -356636 4588368 6550257 4753699 2091428
40194B091428m55025J057186p42314l595394l715885j236604O28822Q59762J327323
$$ 2091428 1636403 2693589 1951275 -1644119 -5360004 -6596608 -5967786 -5108024 -3780701
40185c780701K252380J170156k253448m256760k179544J427672K548026J093531
$$ -3780701 -1528321 -358165 -2611613 -6868373 -9047917 -7620245 -5072219 -3978688
40177c978688j77668l7188P66803J712067K348552J456187r26918k181822o36610
$$ -3978688 -4156356 -4193544 -3426741 -1714674 633878 2090065 1163147 -1018675 -1655285
40168a655285J285026P13631o24446P91226L578871K651855k564863o196065m002419
$$ -1655285 -370259 343372 -281074 510152 4089023 6740878 4176015 -2020050 -6022469
40159f022469Q26443K614905O60587j384079j289083P541J274413K365362K828676
$$ -6022469 -5196026 -2581121 -1920534 -3304613 -4593696 -4586155 -3311742 -946380 1882296
40150A882296J778387k46711j138539J76874K095209K202316K70525j458202j035330
$$ 1882296 3660683 3413972 2275433 2452307 4547516 6749832 7020357 5562155 4526825
40141D526825P84519J513641J80285j347486q85845J054818J989706Q04641j103853
$$ 4526825 5311344 6824985 7005270 5657784 4771939 5826757 7816463 8621104 7517251
40132G517251k153545k486605k874255l045227k262656p92309L77671Q98083J133672
$$ 7517251 5363706 2877101 2846 -3042381 -5305037 -6097346 -5719675 -4821592 -3687920
40123c687920J138276N52905n21696j427390j767039j574711p56984O71609J808115
$$ -3687920 -2549644 -1996739 -2518435 -3945825 -5712864 -7287575 -8044559 -7372950 -5564835
40114e564835J614036P82119J270918L059991L145131l29697m364192m368829
$$ -5564835 -3950799 -3168680 -1897762 1162229 4307360 3977663 -386529 -4755358
40106d755358n62914K322498K117703J995086M279003N487353J484498n005446
$$ -4755358 -5318272 -2995774 -878071 1117015 5396018 10883371 12367869 7362423
40098G362423p039862k943488J652473J834979r17493k568086k074385p29019
$$ 7362423 322561 -2620927 -968454 866525 -50968 -2619054 -4693439 -5422458
40090e422458R01466K466683K469361L93131j276148k2164K642050K858552j96645
$$ -5422458 -4520992 -2054309 415052 808183 -467965 -490129 2151921 5010473 4813828
40081D813828l177494l042285n88397J146802O14542r68312j510121n91954J22219
$$ 4813828 1636334 -1405951 -1994348 -847546 -233004 -1201316 -2711437 -3303391 -3181172
40072c181172q10021k390081k279785P0437K831530M388906M718831L847532J257656
$$ -3181172 -3991193 -6381274 -8661059 -8590622 -5759092 -1370186 3348645 7196177 8453833
40063H453833k072945l366868j612713M42829p826j719294j440645J043814K697647
$$ 8453833 6380888 3014020 1401307 1844136 1836310 117016 -1323629 -279815 2417832
40054B417832J772754L115k33363R30517J459370K81469j314793j327296P6241
$$ 2417832 4190586 4193701 3960338 4890855 6350225 6631694 5316901 3989605 4065846
40045D065846K87201k040724m106806k284763K063257L597791O03406k302400
$$ 4065846 4353047 2312323 -1794483 -4079246 -2015989 1581802 2185208 -117192
40037a17192j057855K007857K350816O7963j320490p21906l6715k53859o69244
$$ -117192 -1175047 832810 3183626 3251589 1931099 1209193 1172478 918619 249375
40028B49375r66402r65887K82911K210073J734429j893545m061301j281365K268018
$$ 249375 -717027 -1682914 -1400003 810070 2544499 650954 -3410347 -4691712 -2423694
40019b423694Q50773k804549j574817L291388L140711l236846o069488j6109O556397
$$ -2423694 -1572921 -4377470 -5952287 -2660899 479812 -2757034 -8826522 -8842631 -2286234
40010b286234M521089j773739k131025L212960N169213J055119k155409k74301
$$ -2286234 2234855 461116 -1669909 1543051 6712264 7767383 5611974 5337673
40002E337673J844670n22188m032164l147996J044134K949121P27670k059632
$$ 5337673 7182343 6660155 2627991 -520005 524129 3473250 4200920 2141288
39994B141288k051238K31487K295917K708061J588022l73204k448053l836928
$$ 2141288 90050 321537 2617454 5325515 6913537 6540333 4092280 255352
39986B55352l771070k079503K77570J723927J531472M12888o39519j371324j584240
$$ 255352 -3515718 -5595221 -5317651 -3593724 -2062252 -1649364 -2288883 -3660207 -5244447
39977e244447n38883J717015L273437K307847k34044j670141j274542j019869
$$ -5244447 -5783330 -4066315 -792878 1514969 1280925 -389216 -1663758 -2683627
39969b683627k111743k732708o81140K946578M606556K714872m08770j592317
$$ -2683627 -4795370 -7528078 -8209218 -5262640 -656084 2058788 1650018 57701
39961E7701o19856J63178n46037j414687q38417O28087J402578J412657J789610
$$ 57701 -562155 -398977 -945014 -2359701 -3198118 -2570031 -1167453 245204 2034814
39952B034814K382271J505325j340583m024827m009833j211147K049248L400960
$$ 2034814 4417085 5922410 4581827 557000 -3452833 -4663980 -2614732 786228
39944G86228K386940O50518L05635J494826J817033o78826m202672m757424j348623
$$ 786228 3173168 3823686 4129321 5624147 7441180 6762354 2559682 -2197742 -3546365
39935c546365K327657K531244J51299r24055R08092L177156K713806n84235l790308
$$ -3546365 -1218708 1312536 1463835 539780 1447872 4625028 7338834 6754599 2964291
39926B964291m165297j897577M94082J297235J287100J757987K163772J356227
$$ 2964291 -1201006 -3098583 -2604501 -1307266 -20166 1737821 3901593 5257820
39918E257820K04049M80896J386354J37280l316719n194648l091399L12082R89147
$$ 5257820 5461869 5942765 7329119 7466399 4149680 -1044968 -4136367 -3824285 -2835138
39909b835138r03305j805438N5760K755662L592639J965756o20828k078515j378593
$$ -2835138 -3738443 -5543881 -5488121 -2732459 860180 2825936 2205108 126593 -1252000
39900a252000L80923Q86685p22070k732600l022852j416139Q23592K657668L426353
$$ -1252000 -871077 15608 -706462 -3439062 -6461914 -7878053 -7054461 -4396793 -970440
39891i70440K495990Q9019k176655k607358r50916J633243L273467K263945j033746
$$ -970440 1525550 1614569 -562086 -3169444 -4120360 -2487117 786350 3050295 2016549
39882B016549l224712j277849K738657L422300l68625l288829j134398K851664
$$ 2016549 -1208163 -2486012 252645 3674945 3306320 17491 -1116907 1734757
39874A734757K874072r13739l231503j623825R25684J231847j98123j276349j290070
$$ 1734757 4608829 3695090 463587 -1160238 -234554 997293 799170 -477179 -1767249
39865a767249o26677L78377J329612J753882J637244J183217L06521p90002j238302
$$ -1767249 -2393926 -2015549 -685937 1067945 2705189 3888406 4194927 3404925 2166623
39856B166623o87425K2165K31505K18969k02767j825789l597571k646603J263079
$$ 2166623 1479198 1501363 1732868 1951837 1749070 -76719 -3674290 -6320893 -5057814
39847e057814L992467K363956j283632k807989j956865r97376l01420P49920R50378
$$ -5057814 -1065347 1298609 14977 -2793012 -4749877 -5747253 -6048673 -5298753 -4348375
39838d348375k41723J20432L789496O313804K811586l169896l716575J300351
$$ -4348375 -4590098 -4469666 -680170 5633634 8445220 5275324 1558749 2859100
39830B859100L873684L00311l867825l468849j020211r04120k404256k618412
$$ 2859100 6732784 7033095 3165270 -303579 -1323790 -2227910 -4632166 -7250578
39822g250578j550016n22586N42316J233642j3659k132451j364234K428994M250915
$$ -7250578 -8800594 -9323180 -8780864 -7547222 -7560881 -9693332 -11057566 -8628572 -4377657
39813d377657J723918q60614J85337K048939J224418p9100J294716K996327J474089
$$ -4377657 -2653739 -3514353 -3329016 -1280077 -55659 -134759 1159957 4156284 5630373
39804E630373j283457j542020p51618k084851l318667m76173L878332L763102
$$ 5630373 4346916 2804896 2053278 -31573 -3350240 -3826413 51919 3815021
39796C815021k22559j895802K9804M44051k545996m248798j558633K240707L303444
$$ 3815021 3592462 1696660 1726464 2170515 -375481 -4624279 -6182912 -3942205 -638761
39787f38761K134798L71791j960456l645374k023923J814743K663419j058379
$$ -638761 1496037 1867828 -92628 -3738002 -5761925 -3947182 -1283763 -2342142
39779b342142m097136k223683J449745J977350R9875m19856M56509Q5198j335162
$$ -2342142 -6439278 -8662961 -7213216 -5235866 -5135991 -5555847 -5099338 -5014140 -6349302
39770f349302j284611K92260J203776J249716K078053L152371J921263j565390
$$ -6349302 -7633913 -7341653 -6137877 -4888161 -2810108 342263 2263526 698136
39762F98136l769560k467904K79300J244679R0630j092673r55505r9808M34200
$$ 698136 -3071424 -5539328 -5260028 -4015349 -3924719 -5017392 -5972897 -6072705 -5638505
39753e638505O97903J426424K506098K676231J280110l58174m22385Q71748J605249
$$ -5638505 -4940602 -3514178 -1008080 1668151 2948261 2590087 2167702 3039450 4644699
39744D644699Q45059n59164j771882k671303k651718r44934J381894K029908P38960
$$ 4644699 5489758 4930594 3158712 487409 -2164309 -3109243 -1727349 302559 1041519
39735A041519m08292n83409j192982k256964j405796J458426K246176j306121
$$ 1041519 633227 49818 -1143164 -3400128 -4805924 -3347498 -1101322 -2407443
39727b407443m991216l735850P00612K604813J173994P93183K892032L634618
$$ -2407443 -7398659 -11134509 -10433897 -7829084 -6655090 -5861907 -2969875 664743
39719F64743R94411j524663q49364P38903R8366j237607k04217J955016J709873
$$ 664743 1659154 134491 -714873 24030 122396 -1115211 -1319428 635588 2345461
39710B345461m73322p20482J703193L078588J275844j088416j367063j159623
$$ 2345461 1872139 1151657 2854850 5933438 7209282 6120866 4753803 3594180
39702C594180k973379n118516l668423J278217M857890L606271l60773k665327
$$ 3594180 620801 -4497715 -8166138 -6887921 -2030031 1576240 1215467 -1449860
39694a449860k105286q15581k50170M67729K077236L307366K696212R77655R6014
$$ -1449860 -3555146 -4370727 -4620897 -4153168 -2075932 1231434 3927646 4905301 5001315
39685E001315L75532K75477r44704j876332j081761N51193Q41406p38621k430399
$$ 5001315 5376847 5652324 4707620 2831288 1749527 2300720 3142126 2403505 -26894
39676b6894k574586j494469n44425j83167K06633J006591J674659J413005J66822
$$ -26894 -2601480 -4095949 -4640374 -4823541 -4616908 -3610317 -1935658 -522653 -355831
39667c55831j053245q62792J014442K819750K156300j008768l496395k225917
$$ -355831 -1409076 -2271868 -1257426 1562324 3718624 2709856 -786539 -3012456
39659c012456J944526M933194M028286O17871j860632j549596O39647K356022
$$ -3012456 -1067930 3865264 7893550 8511421 6650789 5101193 5740840 8096862
39651H096862J690779j368148m628043n460413l426963n42658J362246K483151
$$ 8096862 9787641 8419493 3791450 -1668963 -5095926 -5638584 -4276338 -1793187
39643a793187L613006M116574K708416k81078k782069l237569k199392j484545
$$ -1793187 1819819 5936393 8644809 8363731 5581662 2344093 144701 -1339844
39635a339844k018583k606075j172064K307786M826189L719645N54771o22525
$$ -1339844 -3358427 -5964502 -7136566 -4828780 -2591 3717054 4271825 3649300
39627C649300R42294J626879p65713l359598k739574k53021N89023j90031L0960
$$ 3649300 4591594 6218473 5452760 2093162 -646412 -899433 -310410 -500441 -469481
39618d69481J267551J159795j56116q0338J341710J115549r66641j207102J494915
$$ -469481 798070 1957865 1801749 1721411 3063121 4178670 3212029 2004927 3499842
39609C499842K877316O5287l287474k655118J21016J50121k381601k883698k05697
$$ 3499842 6377158 6442445 3154971 499853 620869 770990 -1610611 -4494309 -4700006
39600d700006J664780L03854j531955o52115J879730K933488J620191o02996k241280
$$ -4700006 -3035226 -2731372 -4263327 -4915442 -3035712 -102224 1517967 914971 -1326309
39591a326309k356675l74460K848280M668262K999214j247117m910802n473650
$$ -1326309 -3682984 -4057444 -1209164 3459098 6458312 5211195 300393 -5173257
39583e173257k918022N55301K357045J843379R29564J465477K411882J488544
$$ -5173257 -8091279 -7535978 -5178933 -3335554 -2405990 -940513 1471369 2959913
39575B959913n53455k72583K804571M180668O82409m001256m069335k95401J009127
$$ 2959913 2406458 2133875 4938446 9119114 9801523 5800267 1730932 1435531 2444658
39566B444658k243304m626433j796213K584896K633818o34679j492668R31364
$$ 2444658 201354 -4425079 -6221292 -3636396 -1002578 -1637257 -3129925 -2198561
39558b198561J569645j587412l624864o40516L513164K882372j493901l347638
$$ -2198561 -628916 -2216328 -5841192 -6481708 -2968544 -86172 -1580073 -4927711
39550d927711n40739K564171K176354j67101j180868l68150R24512K118088K976586
$$ -4927711 -5468450 -2904279 -727925 -895026 -2075894 -2444044 -1519532 598556 3575142
39541C575142K652973J087276k18005l66687m44598j314804j802352p81812N88270
$$ 3575142 6228115 7315391 7097386 6730699 6286101 4971297 3168945 2387133 2975403
39532B975403O71673m7826k53909l64680j457057k624762j977721J99950J715153
$$ 2975403 3647076 3599250 3345341 2980661 1523604 -1101158 -3078879 -2878929 -1163776
39523a163776J686572J249796J180803J111072J130096J760530K057510K77409
$$ -1163776 522796 1772592 2953395 4064467 5194563 6955093 9012603 9290012
39515I290012k842526m019128j881260Q28716J147766j72079p63246o97555j414260
$$ 9290012 6447486 2428358 547098 1375814 2523580 2351501 1588255 890700 -523560
39506e23560j824513O31608M747592N361140M32080m863594m421966L73131K681596
$$ -523560 -2348073 -1716465 3031127 8392267 8824347 3960753 -461213 -88082 2593514
39497B593514Q0341k409422n31334K671274K008501j646148l170373j384472P6800
$$ 2593514 2673855 264433 -266901 2404373 4412874 2766726 -403647 -1788119 -1711319
39488a711319j98911O75771L505614M184354L63620l771712l570386r39156l61740
$$ -1711319 -1910230 -1234459 2271155 6455509 6819129 3047417 -522969 -1462125 -1823865
39479a823865j039719Q74548M025683K967634k195339m454342n61572L422213
$$ -1823865 -2863584 -1989036 2036647 5004281 2808942 -1645400 -2206972 1215241
39471A215241J446928k974019k451475K406156L915587m93999m067348r64919
$$ 1215241 2662169 -311850 -2763325 -357169 3558418 3064419 -1002929 -1967848
39463a967848M835240N237321m83113n053007l520376O26436J328659j671489
$$ -1967848 2867392 8104713 7621600 2568593 -951783 -325347 1003312 -668177
39455f68177l594953k027701K76618K39055j251835j549071m46158J53122m05596
$$ -668177 -4263130 -6290831 -6014213 -5775158 -7026993 -8576064 -9022222 -8869100 -9274696
39446i274696q07269j06466J059799J647836J270721J88525o12566K73982K882873
$$ -9274696 -10081965 -10188431 -9128632 -7480796 -6210075 -6021550 -6634116 -6360134 -3477261
39437c477261M781241L482301j51013k711449k568698j473474j380627j642930
$$ -3477261 1303980 4786281 4635268 1923819 -644879 -2118353 -3498980 -5141910
39429e141910n07742J967508L817805L371311P54755k293796l689375k686946
$$ -5141910 -5649652 -3682144 135661 3506972 4261727 1967931 -1721444 -4408390
39421d408390n85647Q17082J303148J735187J808719J91060k634902l712633j245165
$$ -4408390 -4994037 -4176955 -2873807 -1138620 670099 861159 -1773743 -5486376 -6731541
39412f731541K434944L298929N37837k514102k468022K96499K491179K021737
$$ -6731541 -4296597 -997668 -459831 -2973933 -5441955 -5145456 -2654277 -632540
39404f32540K67285j78048P33260N51050j619941l152245j567976J472702K413098
$$ -632540 -365255 -543303 189957 741007 -878934 -4031179 -5599155 -4126453 -1713355
39395a713355J145125R62607L043203M270042J858883k504823n020205m363106
$$ -1713355 -568230 394377 3437580 7707622 9566505 7061682 2041477 -2321629
39387b321629k045249K89787J885691K171782J057069l79956r06259n88346k48646
$$ -2321629 -4366878 -4077091 -2191400 -19618 1037451 657495 -248764 -837110 -1085756
39378a085756j7540M50462P67233P9071j429370k236881j091949J317239K616030
$$ -1085756 -1103296 -652834 114399 193470 -1235900 -3472781 -4564730 -3247491 -631461
39369f31461J113366j912874l111369r85484J968722K285728j69704k538391k761363
$$ -631461 481905 -1430969 -4542338 -5527822 -3559100 -1273372 -1443076 -3981467 -6742830
39360f742830j054145J555353L674668L273916j9066k833866j705854J514928
$$ -6742830 -7796975 -6241622 -2566954 706962 687896 -2145970 -3851824 -2336896
39352b336896J971992n29780j214139J398097K651724m02199l913052l567298
$$ -2336896 -364904 -894684 -2108823 -710726 1940998 1538799 -2374253 -5941551
39344e941551r41523P33850K240385M638648M582462j77443m456672k264675K945981
$$ -5941551 -6883074 -6149224 -3908839 729809 5312271 5134828 678156 -1586519 1359462
$$ [...]
##END NTUPLES=NMR SPECTRUM
##END=
