##TITLE=31Pdec_SR8_r2_TFA
 CDCl3, 24 sc
 28.10.2020
##JCAMPDX= 6.0         $$ Bruker NMR JCAMP-DX V2.0
##DATA TYPE= NMR SPECTRUM
##DATA CLASS= NTUPLES
##ORIGIN= UXNMR, Bruker Analytische Messtechnik GmbH
##OWNER= root
$$ XWIN-NMR		Version 3.5
$$ Wed Oct 28 13:36:21 2020 Russian Standard Time (UT+4h)  she@DPX200
##.OBSERVE FREQUENCY= 81.013821
##.OBSERVE NUCLEUS= ^31P
##.ACQUISITION MODE= SIMULTANEOUS
##.ACQUISITION SCHEME= undefined
##.AVERAGES= 24
##.DIGITISER RES= 17
##SPECTROMETER/DATA SYSTEM= spect
##.PULSE SEQUENCE= zgpg30
##.SOLVENT NAME= CDCl3
##.SHIFT REFERENCE= (INTERNAL, CDCl3, 0, 182.463)
##AUDIT TRAIL= $$ (NUMBER, WHEN, WHO, WHERE, WHAT)
$$ ##TITLE= Audit trail, XWIN-NMR		Version 3.5
$$ ##JCAMPDX= 5.01
$$ ##ORIGIN= Bruker BioSpin GmbH
$$ ##OWNER= she
$$ F:/spectra/data/she/nmr/P31/1/pdata/1/auditp.txt
$$ ##AUDIT TRAIL=  $$ (NUMBER, WHEN, WHO, WHERE, WHAT)
(   1,<2020-10-28 13:35:03.70 +0400>,<she>,<DPX200>,
      <created by zg, POWCHK disabled, PULCHK disabled
       configuration hash MD5:
       00 E9 B6 7A A2 85 ED C7 34 08 36 98 17 FE 4E 26
       data hash MD5: 32K
       43 F5 15 B4 6B AF 08 78 18 E2 C2 E4 09 D6 9E 1A>)
(   2,<2020-10-28 13:35:06.57 +0400>,<she>,<DPX200>,
      <Start of raw data processing
       efp BC_mod = 2 LB = 1 FT_mod = 6 PKNL = 1 PHC0 = -2407.172 PHC1 = 132.0008 SI = 64K 
       data hash MD5: 64K
       69 76 41 57 EF 9D 86 71 72 5C 93 4C 2F 1B 45 1B>)
(   3,<2020-10-28 13:35:26.23 +0400>,<she>,<DPX200>,
      <pk PHC0 = 10.38384 PHC1 = 0 
       data hash MD5: 64K
       14 5E CD 61 0C B2 1C F1 C6 F1 6B 46 83 86 20 FE>)
(   4,<2020-10-28 13:35:30.95 +0400>,<she>,<DPX200>,
      <abs ABSG = 5 
       data hash MD5: 64K
       AC 30 CA 5D 94 52 51 F9 09 07 DE E3 38 97 E1 38>)
$$ ##END=
$$ 
$$ hash MD5
$$ 0C 46 7A 0E 50 E1 9F 7B 28 C9 06 93 BB 39 C3 A4
##$RELAX= 
##$RELAX= 
##$RELAX= 
##$RELAX= 
##$RELAX= 
##$RELAX= 
##$RELAX= 
##$RELAX= 
$$ Bruker specific parameters
$$ --------------------------
##$DU= <F:/spectra>
##$EXPNO= 1
##$NAME= <P31>
##$PROCNO= 1
##$TYPE= <nmr>
##$USER= <she>
##$AMP= (0..31)
100 100 100 100 100 100 100 100 100 100 100 100 100 100 100 100 100 100 
100 100 100 100 100 100 100 100 100 100 100 100 100 100 
##$AQSEQ= 0
##$AQ_mod= 1
##$AUNM= <au_zg>
##$AUTOPOS= <>
##$BF1= 81.014009
##$BF2= 200.13
##$BF3= 200.13
##$BF4= 200.13
##$BF5= 200.13
##$BF6= 200.13
##$BF7= 200.13
##$BF8= 200.13
##$BYTORDA= 1
##$CFDGTYP= 0
##$CFRGTYP= 5
##$CHEMSTR= <none>
##$CNST= (0..31)
1 1 145 1 1 1 1 1 1 1 1 1 1 1 1 1 1 1 1 1 1 1 1 1 1 1 1 1 1 1 1 1 
##$CPDPRG= <waltz16>
##$CPDPRG1= <>
##$CPDPRG2= <waltz16>
##$CPDPRG3= <>
##$CPDPRG4= <mlev>
##$CPDPRG5= <mlev>
##$CPDPRG6= <mlev>
##$CPDPRG7= <mlev>
##$CPDPRG8= <mlev>
##$CPDPRGB= <>
##$CPDPRGT= <>
##$D= (0..31)
0 1 0 0 0 0 0 0 0 0 0 0.03 2e-05 3e-06 0 0 0 0 0 0 0 0 0 0 0 0 0 0 0 0 
0 0 
##$DATE= 1603877703
##$DBL= (0..7)
120 120 120 11 120 120 24 19 
##$DBP= (0..7)
150 150 150 150 150 150 150 150 
##$DBP07= 0
##$DBPNAM0= <>
##$DBPNAM1= <>
##$DBPNAM2= <>
$$ [...]
##$SUBNAM3= <"">
##$SUBNAM4= <"">
##$SUBNAM5= <"">
##$SUBNAM6= <"">
##$SUBNAM7= <"">
##$SUBNAM8= <"">
##$SUBNAM9= <"">
##$SW= 369.568048894756
##$SWIBOX= (0..15)
0 1 3 0 0 0 0 0 0 0 0 0 0 0 0 0 
##$SW_h= 29940.119760479
##$TD= 32768
##$TD0= 1
##$TE= 0
##$TE2= 300
##$TE3= 300
##$TEG= 300
##$TL= (0..7)
0 120 53 12 22 120 120 120 
##$TP= (0..7)
150 150 150 150 150 150 150 150 
##$TP07= 0
##$TPNAME0= <>
##$TPNAME1= <>
##$TPNAME2= <>
##$TPNAME3= <>
##$TPNAME4= <>
##$TPNAME5= <>
##$TPNAME6= <>
##$TPNAME7= <>
##$TPOAL= (0..7)
0.5 0.5 0.5 0.5 0.5 0.5 0.5 0.5 
##$TPOFFS= (0..7)
0 0 0 0 0 0 0 0 
##$TUNHIN= 0
##$TUNHOUT= 0
##$TUNXOUT= 0
##$USERA1= <user>
##$USERA2= <user>
##$USERA3= <user>
##$USERA4= <user>
##$USERA5= <user>
##$V9= 5
##$VALIST= <valist>
##$VCLIST= <CCCCCCCCCCCCCCC>
##$VD= 0
##$VDLIST= <DDDDDDDDDDDDDDD>
##$VPLIST= <PPPPPPPPPPPPPPP>
##$VTLIST= <TTTTTTTTTTTTTTT>
##$WBST= 1024
##$WBSW= 4
##$XGAIN= (0..3)
0 0 0 0 
##$XL= 0
##$YL= 0
##$YMAX_a= 20215
##$YMIN_a= -10727
##$ZGOPTNS= <>
##$ZL1= 120
##$ZL2= 120
##$ZL3= 120
##$ZL4= 120
##$ABSF1= 182.463
##$ABSF2= -187.1042
##$ABSG= 5
##$ABSL= 3
##$ALPHA= 0
##$AQORDER= 0
##$ASSFAC= 0
##$ASSFACI= 0
##$ASSFACX= 0
##$ASSWID= 0
##$AUNMP= <proc_1d>
##$AZFE= 0.1
##$AZFW= 0.5
##$BCFW= 0
##$BC_mod= 2
##$BYTORDP= 0
##$COROFFS= 0
##$CY= -3
##$DATMOD= 1
##$DC= 0
##$DFILT= <>
##$DTYPP= 0
##$F1P= 0
##$F2P= 0
##$FCOR= 1
##$FTSIZE= 65536
##$FT_mod= 6
##$GAMMA= 0
##$GB= 0
##$INTBC= 1
##$INTSCL= 5.30512e-09
##$ISEN= 30
##$LB= 1
##$LEV0= 0
##$LPBIN= 0
##$MAXI= 10000
##$MC2= 0
##$MEAN= 0
##$ME_mod= 0
##$MI= 50
##$NCOEF= 0
##$NC_proc= -8
##$NLEV= 6
##$NOISF1= 182.463
##$NOISF2= 159.3651
##$NSP= 0
##$NTH_PI= 0
##$NZP= 0
##$OFFSET= 182.463
##$PC= 4
##$PHC0= -2396.788
##$PHC1= 132.0008
##$PH_mod= 1
##$PKNL= yes
##$PPARMOD= 0
##$PSCAL= 0
##$PSIGN= 0
##$REVERSE= no
##$SF= 81.014009
##$SI= 65536
##$SIGF1= 159.3651
##$SIGF2= -187.1042
##$SINO= 113.3802
##$SIOLD= 16384
##$SREGLST= <1H.CDCl3>
##$SSB= 0
##$STSI= 65536
##$STSR= 0
##$SW_p= 29940.119760479
##$SYMM= 0
##$S_DEV= 0
##$TDeff= 32768
##$TDoff= 0
##$TI= <>
##$TILT= no
##$TM1= 0
##$TM2= 0
##$TOPLEV= 0
##$USERP1= <user>
##$USERP2= <user>
##$USERP3= <user>
##$USERP4= <user>
##$USERP5= <user>
##$WDW= 1
##$XDIM= 65536
##$YMAX_p= 430160086
##$YMIN_p= -75957911
$$ End of Bruker specific parameters
$$ ---------------------------------
##NTUPLES= NMR SPECTRUM
##VAR_NAME=  FREQUENCY,     SPECTRUM/REAL,   SPECTRUM/IMAG
##SYMBOL=    X,             R,               I
##VAR_TYPE=  INDEPENDENT,   DEPENDENT,       DEPENDENT
##VAR_FORM=  AFFN,          ASDF,            ASDF
##VAR_DIM=   65536,         65536,           65536
##UNITS=     HZ,            ARBITRARY UNITS, ARBITRARY UNITS
##FACTOR=    0.456856943014862, 1,           1
##FIRST=     14782.0589164895, 0,            0
##LAST=      -15158.0608439895, 0,           0
##MIN=       -15158.0608439895, -75957911,   0
##MAX=       14782.0589164895, 430160086,    0
$$ Real data points
##PAGE= N=1
##DATA TABLE= (X++(R..R)), XYDATA
$$ [...]
46168A1034722N71012K828537K03117n451276p731123k470618N698410P233938
46160A1916719J85446o017916l421963K912225K865171l302010o240379k410284
46152c512991K005036K592037K331665L044059O88926n691467q615712k966380
46144a0124827M071747K413887n447040p580384J8129Q303503Q780789M084990
46136D520794J310569J245001j86832l563528n111638l003419N14740L193692
46128a080621M684841M060210r8026n674961p291136l200675J553266K093397
46120d953705O37644K215917N982875O352618J962445k294297k887719j906659
46112E109119j934588j540856J356961N340650P490584O754776L414375j648712
$$ plain form
46168 11034722 11605734 14434271 14637388 9186112 1454989 -1015629 4682781 11916719
46160 11916719 12102165 6084249 2662286 5574511 8439682 5137672 -1102707 -3512991
46152 -3512991 -1507955 1084082 3415747 6459806 7148732 1457265 -7158447 -10124827
46144 -10124827 -6053080 -3639193 -9086233 -16666617 -16648488 -8344985 435804 4520794
46136 4520794 5831363 7076364 6889532 3326004 -1785634 -4789053 -4274313 -1080621
46128 -1080621 3604220 7664430 7566404 1891443 -5399693 -8600368 -7047102 -4953705
46120 -4953705 -4316061 -2100144 3882731 10235349 12197794 9903497 7015778 5109119
46112 5109119 3174531 1633675 2990636 8331286 15821870 22576646 25991021 24342309
46104B4342309n489337m791074j067326J68946k192855k563495J716186M450123
46096A4573477k0222o857840p668824l466993k029686m524512m222097J428958
46088a2787739O592212O830420N031502M534811L434300k78541l690518l546977
46080F119470j564160j119995k073361k382340j838446j112381M6959R92086l76446
46071c308614l693484m861229j585802K878417M502248L973684M149363M817669
46063F872252L683015O25250k271247l474163k521009K07173K385763J278411
46055F785445j684546j590180K278915M199039J034653k013161k59044J402437
46047A0153558l578559j0540962r050187J24408M756481k80107n192050r53024
$$ plain form
46104 24342309 18852972 14061898 12994572 13163518 10970663 8407168 10123354 14573477
46096 14573477 14553255 7695415 26591 -3440402 -5470088 -9994600 -14216697 -12787739
46088 -12787739 -6195527 634893 5666395 10201206 13635506 13356965 9666447 6119470
46080 6119470 4555310 3435315 1361954 -1020386 -2858832 -3971213 -3924254 -2932168 -3308614
46071 -3308614 -7002098 -11863327 -13449129 -10570712 -6068464 -2094780 2054583 6872252
46063 6872252 10555267 11180517 8909270 5435107 2914098 3121271 5507034 6785445
46055 6785445 5100899 3510719 5789634 9988673 11023326 9010165 8751121 10153558
46047 10153558 6574999 -3965963 -13016150 -12891742 -8135261 -8415368 -13607418 -14560442
46039a4560442O736343O906819K2877l920790o31262M056178M346732J397831
46031D354286j113238k182877k023628m2914K989146L918070J100321k576334
46023D422832k908085L83342L364957K443999j803966n221836m323618l02016
46015c944391J809521r26091n142156n094556l90339L365204K493527L41953J891413
46006e595915N972411O949142L355478L53996K160869N569411M129768k820395
45998B0074765q848950q572439m240287k246010m539069o236769k272623N651671
45990a1229711J0496744P689615l1984n762896n368529q22289K771122K834440
45982E76512J687834L001591O360109P035833K044442n375585r338896q001591
$$ plain form
46039 -14560442 -7824099 -917280 -894403 -4815193 -5446455 -1390277 2956455 4354286
46031 4354286 3241048 1058171 -965457 -1008371 1980775 5898845 6999166 4422832
46023 4422832 1514747 1898089 5263046 7707045 5903079 681243 -3642375 -3944391
46015 -3944391 -2134870 -3060961 -8203117 -13297673 -13688012 -10322808 -7829281 -7487328 -5595915
46006 -5595915 376496 7325638 10681116 11035112 13195981 18765392 22895160 20074765
45998 20074765 11225815 2653376 -1586911 -3832921 -8371990 -14608759 -16881382 -11229711
45990 -11229711 -732967 6956648 6924664 1161768 -4206761 -5029050 -2257928 576512
45982 576512 2264346 5265937 11626046 18661879 20706321 15330736 5991840 -2009751
45974b009751m030931L07099M515424O608604L659829k614003n666595k703139
45966a933463P70300r58322n030110m620297O63935N222981O430597O296267M965153
45957A1807041K07899n657290o099986m56683L363404L78467l567225r34225N527661
45948D569063O731237M34713o207110o560560j516557L714955N574659L999914
45940A0740314J028349j432570l146363m436097m007289p47024K208617n398n788403
45931e585864p253829j893839K539642K38317k515649K199415R176096P094747
45923C999036k649981o909087r26453N218230L478876j032224j592029j377989
45915a791621m835857o566698K17688R746195R880948J85648p063058m455892
$$ plain form
45974 -2009751 -6040682 -5733583 -1218159 5390445 9050274 6436271 769676 -1933463
45966 -1933463 -1163163 -2121485 -7151595 -11771892 -11107957 -5884976 545621 6841888 11807041
45957 11807041 12014940 6357650 257664 -199019 3164385 3542852 -24373 -958598 4569063
45948 4569063 11300300 11735013 5527903 -1032657 -2549214 1165741 6740400 10740314
45940 10740314 11768663 10336093 7189730 2753633 -1253656 -2000680 207937 202539 -5585864
45931 -5585864 -12839693 -14733532 -12193890 -11955573 -14471222 -12271807 -3095711 3999036
45923 3999036 1349055 -5560032 -6486485 -1268255 2210621 1178397 -413632 -1791621
45915 -1791621 -6627478 -13194176 -12976488 -3230293 6650655 6836303 -226755 -4682647
45907d682647J606268K246986j655464l311374p45618J871678J351315p51848
45899d070704j420128k19848Q43968K78211r74729o09593K214001N496706O208773
45890G746657L366012q93587l251159k407060n45890r31480l483588m191392o72498
45881e263985L304074K227285k884465n116960j494110K645363J794621j580862
45873f369039j430383K416609M635380L036923J139157J500990J738285m61097
45865F206825k510559q43450K817402L529006Q09628l94201K245773L805016p67216
45856A4898224p736015q332853j155328N087910L387948k309162l723459L9710
45848A56975K922084J698933o43745p75761R60900K669002K815500J05273m573049
$$ plain form
45907 -4682647 -3076379 -829393 -2484857 -5796231 -6541849 -4670171 -3318856 -4070704
45899 -4070704 -5490832 -5710680 -4866712 -4588501 -5563230 -6172823 -3958822 1537884 7746657
45890 7746657 11112669 10219082 6967923 4560863 4014973 3083493 -400095 -4591487 -5263985
45881 -5263985 -1959911 267374 -2617091 -7734051 -9228161 -6582798 -4788177 -6369039
45873 -6369039 -7799422 -5382813 -747433 2289490 3428647 4929637 6667922 6206825
45865 6206825 3696266 2852816 5670218 9199224 10008852 9614651 11860424 15665440 14898224
45856 14898224 7162209 -1170644 -2325972 2761938 6149886 3840724 117265 156975
45848 156975 3079059 4777992 4134247 3358486 4319386 6988388 9803888 9909161 5336112
45839E336112o682159k989445K757482M132313J200643m05932J105769K057579
45831F512362J038795O34593O29164k255895o219626m929829J131162L438086
45823b1188n99056k713867J571051M191313j436075p830967n400432J635250L235978
45814g367993L65689O77564L017497O80741l504951p03710O651882O721346j651635
45805D886430o160106j497137K455677j535855o058676k929415K799237K383165
45797e656680k122289k834810J097305M768179O493449P149388M841600j781699
45789A1954443q068043q297942l684768K06220J207550P21940l68781r56048J301125
45780e984304N247632N034739p91951m230944J137561R033931Q892840J452370
$$ plain form
45839 5336112 -1346047 -4335492 -1578010 2554303 3754946 3349014 4454783 6512362
45831 6512362 7551157 8185750 8814914 6559019 339393 -4590436 -3459274 -21188
45823 -21188 -620244 -3334111 -1763060 2428253 992178 -6838789 -12239221 -10603971 -7367993
45814 -7367993 -7002304 -6324740 -3307243 -2626502 -6131453 -6835163 -183281 6538065 4886430
45805 4886430 -1273676 -2770813 -315136 -1850991 -7909667 -10839082 -8039845 -5656680
45797 -5656680 -7778969 -10613779 -9516474 -4748295 1745154 8894542 13736142 11954443
45789 11954443 3886400 -4411542 -8096310 -7890090 -6682540 -5960600 -6329381 -7285429 -5984304
45780 -5984304 -736672 4298067 3506116 -724828 412733 9446664 18339504 19791874
45772A9791874l547543k558008q73033j245141n72570J221337n35109n439496
45764F242311o091705q6104M687192J991700l085002k832686J028744J610970
45756C465420j346086k377402o98030j011397l728785k675035M490400J0251686
45748F370771O832760k186993n978700r07830N227096M558315p78358l481598
45740I655463j891041m79371j419944k099925j624274l297387p663063q843406
45732a7662948k941349M073770L530996k812228m100873M388977J3940086J3413228
45724A1829659L004102p047329q989646m768962j361189k225737m481207l289343
45716a7329652K083734P048911O739251J620276l080225l298193P1292L525058
$$ plain form
45772 19791874 16244331 13686323 12813290 11568149 10995579 12216916 11681807 6242311
45764 6242311 150606 64502 4751694 6743394 3658392 825706 1854450 3465420
45756 3465420 2119334 -258068 -956098 -1967495 -5696280 -8371315 -3880915 6370771
45748 6370771 13203531 11016538 5037838 4130008 9357104 13915419 13137061 9655463
45740 9655463 7764422 7285051 5865107 3765182 2140908 -1156479 -8819542 -17662948
45732 -17662948 -20604297 -16530527 -12999531 -15811759 -19912632 -15523655 -1583569 11829659
45724 11829659 14833761 7786432 -1203214 -5972176 -7333365 -9559102 -14040309 -17329652
45716 -17329652 -15245918 -8197007 -1457756 162520 -2917705 -6215898 -6144606 -2619548
45708b619548N177487N326089M159651J225251k421586l458179K67030N706116
45700A3362311O416213J07253p165262p219106J44155O549025N431243m51730
45692A7174102m093862l646624k950372m361466n606756m266553j712829p63632
45684a0227992j468249j182713J784494N868196P702564N523570R54558k655262
45676F299166l296725j269334J964531M263411K956917k473806p522097o104872
45668e182809J294663O297321K366878o703296j1411095p724382j40250M863619
45660a6339351M634756O03360l314475k768181L068743R391099J0388461N812107
45652A1476519L80039k504494l171427k604353r76325N35305J76898j478451k083039
$$ plain form
45708 -2619548 2557939 7884028 12043679 13268930 10847344 7389165 7656195 13362311
45700 13362311 19778524 19885777 12720515 5501409 5645564 12194589 17625832 17174102
45692 17174102 13080240 9433616 6483244 2121778 -3484978 -7751531 -9464360 -10227992
45684 -10227992 -11696241 -12878954 -11094460 -5226264 2476300 7999870 8954428 6299166
45676 6299166 3002441 1733107 3697638 7961049 10917966 8444160 922063 -5182809
45668 -5182809 -3888146 2409175 4776053 -1927243 -13338338 -21062720 -21202970 -16339351
45660 -16339351 -11704595 -11101235 -14415710 -17183891 -14115148 -4724049 5664412 11476519
45652 11476519 11856558 9352064 6180637 3576284 2599959 3135264 3312162 1833711 -249328
45643b49328j239211o99254r98620j261822k012654m085238m854097m94655P104258
45634h790621J0714813O877711J49724l669452l942938k512020M04222M013458
45626C244897M893757J456692k636063l532850k714559l276394l756552j039746
45618g360818K549966J254361m869425q260968l411416N599776R717293N331348
45610E50117k077646m552796p12364L008894Q31784m309160m404614K098386P134436
45601b432963L803153l946095o743456k191574L242173L661837J32791k778323
45593g252457k848773j279630m49718j708465m049912m723400k109776K463641
45585b1958490O357179P572141M574268k670185r654211r257393l73403Q723660
$$ plain form
45643 -249328 -1488539 -2187793 -3186413 -4448235 -6460889 -10546127 -15400224 -15894879 -8790621
45634 -8790621 1924192 8801903 8951627 5282175 1339237 -1172783 -768561 3244897
45626 3244897 8138654 9595346 6959283 3426433 711874 -2564520 -6321072 -7360818
45618 -7360818 -4810852 -3556491 -8425916 -16686884 -20098300 -14498524 -4781231 550117
45610 550117 -1527529 -6080325 -6792689 -3783795 -2952011 -7261171 -11665785 -9567399 -2432963
45601 -2432963 1370190 -2575905 -9319361 -11510935 -8268762 -4606925 -4474134 -7252457
45593 -7252457 -10101230 -11380860 -11830578 -13539043 -17588955 -22312355 -24422131 -21958490
45585 -21958490 -15601311 -8029170 -3454902 -6125087 -15779298 -25036691 -25410094 -16686434
45577a6686434J0029725N621628K611291J784680j382634o412976p270499k591269
45569a4296488J659300J529053j55304k93369M19611J984657N791584Q132918
45561D771962K041306r867771j3902210l668822Q878746R873224L066235J405345
45553B598015N406310M343598l478412p132095j742084L354705L19868n199961
45545a530056m878932p47348R33726J112591L923431O710333L923257k052377
45537G394625l463918M37140K353192j195858m998270m258976j614920j413642
45529f760627k381658q52492J985030J554855k109578k979659K414622Q631668
45521d97839P484437o29260o504129m550779q8928p9588j720308J917150P898059
$$ plain form
45577 -16686434 -6656709 -1035081 1576210 3360890 1978256 -4434720 -11705219 -14296488
45569 -14296488 -12637188 -11108135 -11263439 -11556808 -11137197 -9152540 -3360956 4771962
45561 4771962 6813268 -3054503 -16956713 -20625535 -11746789 -1873565 1192670 2598015
45553 2598015 8004325 12347923 8869511 1737416 -4668 3350037 3669905 -1530056
45545 -1530056 -6408988 -7156336 -6222610 -5110019 -1186588 5523745 9447002 7394625
45537 7394625 3930707 4367847 6721039 5525181 526911 -3732065 -5346985 -6760627
45529 -6760627 -9142285 -9994777 -8009747 -6454892 -8564470 -11544129 -9129507 -497839
45521 -497839 6986598 6357338 -146791 -4697570 -4786498 -4866086 -6586394 -4669244 3228815
45512C228815O020094l548406p250842J661211J0978871O931958n169990r837462
45504C014249m744869q77116k175378p61198N970584Q736939K469907l864998
45496G768120j576021L989804L320911j734265k642953J174235K882707L90838
45488A3573376j647342p45103P00101J116019J234887L39921k712307n393875
45480F465677m382470j507128p51685r06485J612704M065844M66316o430376o263849
45471g631452K940933R697136N423247k629711k564378M391470O798103N81424
45463A7006772o105730n900133j593686L64460o49593q25994J023033K448794
45455E767923J876118L05297j103992k086304j920437n4956J349086j148691o493522
$$ plain form
45512 3228815 9248909 5700503 -1550339 110872 11089743 18021701 12851711 3014249
45504 3014249 -1730620 -2607736 -4783114 -5544312 426272 9163211 11633118 7768120
45496 7768120 6192099 10181903 13502814 11768549 9125596 10299831 13182538 13573376
45488 13573376 11926034 11180931 11881032 12997051 14231938 14571859 11859552 6465677
45480 6465677 2083207 576079 -175606 -1082091 530613 4596457 5062773 -1367603 -7631452
45471 -7631452 -4690519 5006617 10429864 7800153 5235775 9627245 16425348 17006772
45463 17006772 10901042 5000909 3407223 3771683 3122090 2296096 3319129 5767923
45455 5767923 7644041 7949338 6845346 4759042 2838605 2783649 4132735 2984044 -3509478
45446c509478q119573k204281N451891N675543j755563p518481n229579J117518
45438a6092003M420830L637113J888600K49733j506895j572641R79875K605406
45430e389982J28230l143074j984500K112493L392014J433610J025131K910968
45422D84890K512893j101843k716613J58271K899021J518131j346704j839641
45414E68405p61529j30246J065238L391705L728304P4967m040543m362171j999182
45405b465052o44746o83220j79469R03936J574663K703580N208519P137974N959820
45396A9516005K239843j617938m517936o357220o665628n415927k985329J405598
45388d398532P609559J0700500N190190n291533r773187m697677R24465p6926
$$ plain form
45446 -3509478 -11629051 -13833332 -8381441 -2705898 -4461461 -11979942 -17209521 -16092003
45438 -16092003 -11671173 -8034060 -6145460 -5895727 -7402622 -8975263 -7995388 -5389982
45430 -5389982 -5261752 -8404826 -10389326 -8276833 -4884819 -3451209 -2426078 484890
45422 484890 2997783 1895940 -820673 -662402 2236619 3754750 2408046 568405
45414 568405 -193124 -323370 741868 4133573 7861877 7936844 3896301 -465870 -2465052
45405 -2465052 -3109798 -3793018 -3972487 -3068551 -1493888 1209692 6418211 13556185 19516005
45396 19516005 21755848 20137910 15619974 9262754 2597126 -2818801 -5804130 -4398532
45388 -4398532 3211027 13911527 19101717 13810184 4036997 -660680 263785 186859
45380A86859k163401J918963P630671O477072R76682k53739J762106j385546r097576
45371F052091j0943664l447142M381202N147870K160750R97456J651955K956958
45363H957476N836199P907173L445123o444937j1687122o656939J501652L433203
45355F291828m71518m348694o207754o457571l311899L033433O650446L543806
45347a277923j199834q81983K424461K426315l14811k77824K524565K619667j151207
45338D891426l885033k939884j053914l51280O15494K646272L982826L913453
45330G819360L913103M146322K617653j388565o086984r456204r988730o270596
45322a4694641P43527O391363P131931N205861M407150L577897k09460m271935
$$ plain form
45380 186859 -1976542 -57579 7573092 14050164 15026846 14773107 16535213 15149667 6052091
45371 6052091 -4891573 -8338715 -3957513 1190357 3351107 4348563 6000518 8957476
45363 8957476 14793675 22700848 26145971 19701034 8013912 1356973 2858625 6291828
45355 6291828 5820310 1471616 -4736138 -11193709 -14505608 -11472175 -4821729 -1277923
45347 -1277923 -2477757 -3359740 -935279 1491036 1176225 898401 3422966 6042633 4891426
45338 4891426 1006393 -1933491 -2987405 -3338685 -2723191 -76919 3905907 7819360
45330 7819360 11732463 15878785 18496438 17107873 11020889 1564685 -8424045 -14694641
45322 -14694641 -13951114 -7559751 -427820 4778041 9185191 12763088 12553628 8281693
45314H281693l231574J626934L510848P95204j208102j03630J55221k137373k703256
45305D985965K28897J482317k229072o003291m778628j332054k62047j2078K224061
45296e695930L274315j59596l063212J064404P963779P399052q50213o150900
45288C781699l081384J777540J882263q4744Q0187k65997m301221p384809l260079
45279a0856545M894288P725160K852166k438773k043932J643444K990580P50643
45271E517031k232875l609412k958380o14609K279348L374370J019937l169781
45263c94371m986989j772031M182788P098441L475226l606054p096528l484234
45255f583752L323807O436268L332606k251631m994629l329825l62426k8567k144933
$$ plain form
45314 8281693 5050119 6677053 10187901 10983105 9775003 9671373 9826594 7689221 4985965
45305 4985965 5214862 6697179 4468107 -1535184 -6313812 -7645866 -7907913 -7919991 -5695930
45296 -5695930 -2421615 -2581211 -5644423 -4580019 3383760 10782812 9932599 3781699
45288 3781699 700315 2477855 4360118 4275374 4355561 4089564 -211657 -7596466 -10856545
45279 -10856545 -5962257 1762903 4615069 2176296 132364 1775808 4766388 5517031
45271 5517031 3284156 -325256 -3283636 -3898245 -1618897 1755473 2775410 -394371
45263 -394371 -5381360 -7153391 -2970603 4127838 7603064 3997010 -3099518 -6583752
45255 -6583752 -3259945 3176323 6508929 4257298 -737331 -4067156 -4429582 -4458149 -6603082
45246f603082j995378L349881R125014P353436j672372p500338k835420N841243
45238E062984O940591j57199n441077l564002R6746L33705J28903L070727N167119
45229A1638497J203318n493003p163929l017997N04573k72795k543865l173025
45221h318226k481816j073489J693380M556105M326670Q75833j752997j034005
45213c208545P59987Q16297n1051K93219J711463K858336L514714L671569K384104
45204A2750093k82017k050957j427864k53339r13976k375165j762204O31021Q47490
45195E163082l201886p617100o165802J689516Q515954O991567n79005m530753
45187B65573m11716N377098N442457J820582P97206J485562j864488p713275p347521
$$ plain form
45246 -6603082 -8598460 -5248579 3876435 11229871 9557499 2057161 -778259 5062984
45238 5062984 12003575 11846376 6405299 2841297 2938043 3271748 3400651 6471378 11638497
45229 11638497 12841815 7348812 184883 -2833114 -2328541 -2601336 -5145201 -8318226
45221 -8318226 -10800042 -11873531 -10180151 -5624046 -1297376 -421543 -2174540 -3208545
45213 -3208545 -2448558 -1632261 -1683312 -1390093 321370 3179706 6694420 10365989 12750093
45204 12750093 12468076 10417119 8989255 8735916 7821940 5446775 3684571 4315592 5163082
45195 5163082 1961196 -5655904 -11821706 -10132190 -1616236 5375331 4796326 265573
45187 265573 -146143 5230955 10673412 12493994 13291200 14776762 12912274 5198999 -2148522
45178b148522J134943Q313822O744054M70661l513367n137759o271424l801159
45170d208751L682490Q562610L667938n096582o108046O47604M580476J597672
45162G325411j473941m41638L5194k951074m553179j797936L11996j605208k229106
45153g379481K730024P305925M238336k904382n720166m352389m914182o726103
45145a7722418l133954N323215R213018M032856l016060l729159N15225K988061
45137e529216J088198k610045m922464m089547l08388L021795J650930l555515
45129a5254252o319702l038120K367530M418735L251738K481751L220314L999349
45121d872657M001509K891717J16179k465038q44662M364502N868484p9241n971339
$$ plain form
45178 -2148522 -1013579 7300243 14044297 14514958 11001591 5863832 -407592 -4208751
45170 -4208751 -526261 8036349 11704287 6607705 499659 1147263 5727739 7325411
45162 7325411 5851470 5409832 5445026 2493952 -2059227 -3857163 -3545167 -5150375 -7379481
45153 -7379481 -4649457 2656468 6894804 3990422 -1729744 -6082133 -10996315 -17722418
45145 -17722418 -20856372 -15533157 -6320139 -2287283 -5303343 -9032502 -8517277 -5529216
45137 -5529216 -4441018 -7051063 -11973527 -16063074 -16371462 -13349667 -11698737 -15254252
45129 -15254252 -21573954 -24612074 -22244544 -17825809 -14574071 -12092320 -8872006 -4872657
45121 -4872657 -871148 2020569 2136748 -328290 -1172952 3191550 9060034 8980793 3009454
45112C009454l291836L316593K346788n669251p726881J070231Q925216N401800
45104G382114k841518l649422J516533J615108n296306r510293n217349J936401
45096a4064732M656553L024410R82140K22205M00129O81470p77001m657664p116378
45087a6648868l613930L384457O521690M337392L023314N308734N334473j048881
45079F598381p948500p675069k124704R81307k44824q56601K165498O375552Q328414
45070E599454O676117J645518m321217o613701l305748J383572K433606Q01957
45062D299558L05702K58759k574329o178694m686350K015394O887327N588273
45054E915640J678923k58388j041076l177286n354841m583997j012513K564664
$$ plain form
45112 3009454 -282382 3034211 5380999 -288252 -8015133 -6944902 1980314 7382114
45104 7382114 4540596 891174 2407707 4022815 -1273491 -10783784 -16001133 -14064732
45096 -14064732 -9408179 -6383769 -5401629 -5179424 -4779295 -4097825 -4874826 -9532490 -16648868
45087 -16648868 -20262798 -16878341 -10356651 -6019259 -2995945 2312789 7647262 6598381
45079 6598381 -1350119 -9025188 -11149892 -10168585 -10413409 -11270010 -9104512 -2728960 5599454
45070 5599454 12275571 13921089 9599872 2986171 -319577 1063995 3497601 4299558
45062 4299558 4605260 4864019 2289690 -3889004 -8575354 -6559960 327367 5915640
45054 5915640 7594563 7336175 6295099 3117813 -2237028 -6821025 -7833538 -5268874
45046e268874L994094K571266r97670l699525k167741K418413M389380J028405
45038B267748k986808j748385L707111P126182N434235J458988j294051k688517
45030A1276503l864605m274668k980897j278772j455945l028502k627062J121354
45022g112594M628059L891390Q33479J141016N427597P278018K471535m341372
45014A4217128o271847l917604l178514n651802p025789m217021J186787O293024
45006h565638R021688P517164K235988k298565k799320k575549n574250p533763
44998a0572245j693292P951051R758792J933025m325690k237108J564137N55294
44990B933964r55251J677231L255492r68054m423977k19581N247362K673017l118291
$$ plain form
45046 -5268874 -1274780 1296486 298816 -3400709 -5568450 -3150037 1239343 2267748
45038 2267748 -719060 -2467445 1239666 8365848 13800083 15259071 13965020 11276503
45030 11276503 7411898 3137230 156333 -1122439 -2578384 -5606886 -8233948 -7112594
45022 -7112594 -2484535 1406855 2240334 3381350 8808947 16086965 18558500 14217128
45014 14217128 7945281 4027677 849163 -4802639 -11828428 -16045449 -14858662 -8565638
45006 -8565638 456050 7973214 10209202 7910637 5111317 2535768 -3038482 -10572245
44998 -10572245 -12265537 -4314486 5444306 7377331 3051641 814533 2378670 2933964
44990 2933964 1978713 3655944 6911436 5943382 1519405 1299824 6547186 9220203 6101912
44981F101912j298802M901538K888955o655699r426913j235988N146127J642466
44973B063596k676335J473010Q132590P596522K281358J04292M13672k230977
44965A7157728o228590n703380j215594J739212J894684J614141L58803l088869
44957F528135n064019k097295J420775m84123m232386j858050M518838M778232
44949C510107k295173o098408j273887L659591N66128n137412l811799K857592
44941h023261N249048J159745j866836O33963L310523n3559o530419p601663o52797
44932a4375256P375765Q652448L855538P9146N11024Q14330k420748m677777l32289
44923e17819O667497O503413k265400r861141q735337k642300J231943K266579
$$ plain form
44981 6101912 4803110 9704648 12593603 5937904 -3489009 -4724997 421130 2063596
44973 2063596 -612739 860271 8992861 16589383 18870741 18975033 19388705 17157728
44965 17157728 10929138 5225758 4010164 5749376 7644060 9258201 9617004 6528135
44957 6528135 1464116 -633179 787596 303473 -3928913 -5786963 -1268125 3510107
44949 3510107 1214934 -4883474 -6157361 -2497770 -1931642 -7069054 -10880853 -8023261
44941 -8023261 -2774213 -1614468 -3481304 -2847341 463182 409623 -6120796 -13722459 -14375256
44932 -14375256 -6999491 1652957 5508495 5587641 6098665 6912995 4492247 -185530 -517819
44923 -517819 6149678 12653091 10387691 526550 -8208787 -10851087 -9619144 -7352565
44915g352565L295423L611996J903597J509871N078346P449783K446114n428175
44907A2514390n758512J425365M410948k424707r551794o620214K293515N618389
44899A907380J078550l204351j861087J992872M049056M288739L534594P41849
44891A2527602l436622n099243k454006P26620M90374j129418O66127N555212
44883G846646P779936L892290k899630p260112p426808m575134L56046N739358
44875C452592P271730K008866n352680n574218L124578J0741109P617242k523635
44867B0765584p740409m368708q37151l814498q140532n224219L724932R119492
44859C484491N590830k347939o964710n374230m46718L156972K852381k30417
$$ plain form
44915 -7352565 -4057142 -445146 1458451 2968322 8046668 15496451 17942565 12514390
44907 12514390 6755878 8181243 12592191 10167484 615690 -6004524 -3711009 1907380
44899 1907380 2985930 -218421 -2079508 -86636 3962420 8251159 11785753 12527602
44891 12527602 9090980 3991737 1537731 2264351 2754725 1625307 2291434 7846646
44883 7846646 15626582 19518872 16619242 9359130 1932322 -2642812 -2286766 3452592
44875 3452592 10724322 12733188 7380508 1806290 4930868 15671977 23289219 20765584
44867 20765584 13025175 8656467 7819316 4004818 -4135714 -9359933 -5635001 3484491
44859 3484491 9075321 6727382 -237328 -5611558 -6058276 -2901304 -48923 -279340
44851b79340k844021l283919k630837k001440p75336J156610K056248J391963
44843g210072J490445L357629L674775l62127n599508o538178k616388K247789
44835a1555635N541842P077221N932464J795943j936292j950571q56120l336176
44827G12676p446516o656825n19998M097090L490483J500986J688880K494963
44819f38261K645802L973573N660276L092943l520924o704423k755306J771633
44811C525313K80351l858304m018734q69193J099707K170187M608054N826571
44803H763952K605723j433081p09060K942828L587996R17038j129902k159932
44795A3385562l434432j900537M199636P251550o38383j2496979j3242254j646703
$$ plain form
44851 -279340 -3123361 -6407280 -9038117 -11039557 -11814893 -10658283 -8602035 -7210072
44843 -7210072 -5719627 -2361998 1312777 950650 -4648858 -11187036 -13803424 -11555635
44835 -11555635 -6013793 1063428 6995892 8791835 6855543 4904972 4048852 712676
44827 712676 -6733840 -13390665 -13910663 -9813573 -6323090 -4822104 -3133224 -638261
44819 -638261 2007541 5981114 11641390 14734333 11213409 4508986 1753680 3525313
44811 3525313 3805664 -52640 -4071374 -4940567 -3840860 -1670673 2937381 8763952
44803 8763952 11369675 9936594 9227534 12170362 15758358 16675396 15545494 13385562
44795 13385562 9951130 8050593 12250229 19501779 18863396 6366417 -6875837 -8522540
44787h522540P535989N228720j324112l117378j489550m4994L135915P660667
44779I062717O272983k902822r056904l393135O895558R411247M111310o06791
44771A9794163k775443n569132o078913R29955R954846R023904k074893j0078067
44763A3126420p287641j055896n8706j437185J660193P284004P478371K72863
44755A9982423p746758r745189n362448K38844J674290j509375l994495o36966
44747g099674O472638R750635N600260j341938m856922m370048l134846k449378
44739a429273j159030P88199J682818P53162o45485p92087M92184J825734J874673
44730C390895J007655Q23469J568643J321546q79632k678046j540740J070127
$$ plain form
44787 -8522540 -986551 4242169 2918057 -199321 -1688871 -1733865 1402050 9062717
44779 9062717 15335700 12432878 3375974 -17161 6878397 16289644 20400954 19794163
44771 19794163 17018720 11449588 5370675 6300630 16255476 25279380 23204487 13126420
44763 13126420 5838779 4782883 4724177 3286992 4947185 12231189 19709560 19982423
44755 19982423 12235665 2490476 -2871972 -2633128 -958838 -2468213 -6462708 -7099674
44747 -7099674 -627036 9123599 14723859 13381921 8524999 4154951 1020105 -1429273
44739 -1429273 -2588303 -1800104 -117286 635876 -9609 -801696 -309512 1516222 3390895
44730 3390895 4398550 5222019 6790662 8112208 7232576 4554530 3013790 4083917
44722D083917J691602R582j444830j875599k421701k380035n1787K681589K108849
44713B401587l73678O77443N141765N818822k12641n931178n073452j526690j334705
44704d12727k023154J097660L596153j524550r055683o719470M693441J0179824
44696a68506L090499m709998k120630M329958L228022k476296k274427K771876
44688A670498K649997l013254m264359R78966K890638k664948o321432j407027
44680i480921M023728K59959q136583r604900k581765M739889P513286P588730
44672e678577O305257K887780q84280j888647j024192j280549j812501k072K441457
44663i36324J977100j73611q73630k049146o567748r469734l556802O930770R595392
$$ plain form
44722 4083917 5775519 5785101 4340271 2464672 42971 -2337064 -2388851 292738 2401587
44713 2401587 2027909 2705352 7847117 13665939 13453298 7522120 2448668 921978 -412727
44704 -412727 -2435881 -1338221 2257932 733382 -8322301 -15041771 -10348330 -168506
44696 -168506 2921993 -1788005 -3908635 421323 3649345 1173049 -1101378 1670498
44688 1670498 4320495 1307241 -2957118 -1978152 912486 -1752462 -8073894 -9480921
44680 -9480921 -5457193 -5197234 -13333817 -22938717 -25520482 -20780593 -13267307 -5678577
44672 -5678577 626680 3514460 2630180 741533 -282659 -1563208 -3375709 -3377781 -936324
44663 -936324 1040776 867165 -6465 -2055611 -8623359 -18093093 -21649895 -14719125 -5123733
44654e123733K349356k963308J045041O725957N081636l87732j606017N90756
44646E711956J22319k909981l552661j193300M65004J68713n27828j111340r10280
44637c737398K487423Q005082Q420983k51997j0332262j0975482k587706M767359
44629d203998N410846K775047J106256J55083j288816k714218l573975l380407
44621e714182q18267L245569M128268l42310m778863l532943J69780k67021l238958
44612a1148927j851810L492522N424854K262003J95813J800548K349266k89100
44604B235169j794413l45473P9496j122945J504792Q158627R521541O09879r621806
44595I224867j0465042m211262k07695k07990O19462K154148n75536o609060p870963
$$ plain form
44654 -5123733 -2774377 -5737685 -4692644 2033313 7114949 6727217 5121200 5711956
44646 5711956 5834275 2924294 -628367 -1821667 -1356663 -1187950 -1715778 -2827118 -3737398
44637 -3737398 -1249975 6755107 15176090 14924093 4591831 -6383651 -8971357 -4203998
44629 -4203998 1206848 3981895 5088151 5243234 3954418 1240200 -2333775 -5714182
44621 -5714182 -6532449 -3286880 841388 499078 -4279785 -7812728 -7642948 -7909969 -11148927
44612 -11148927 -13000737 -9508215 -4083361 -1821358 -1625545 175003 2524269 2235169
44604 2235169 440756 95283 174779 -948166 556626 8715253 18236794 18846673 9224867
44595 9224867 -1240175 -5451437 -5659132 -5867122 -5247660 -3093512 -3669048 -10278108 -18149071
44586a8149071o20635Q642816J1262854O108885q99580m034295k614718N6958
44578b46786J201668J344855K191442L319222L550024M147700O322076O495341
44570B8325542J04699r553568j3335595q754690k958129q03268J225424N006649
44562g42936M610921k577182p737873l386244L376916J790337m685589m636548
44554a3988198J571293L332145n89374k11759O053175O435168l548556j0584044
44546a1530150l526902Q287286R123139O01903k663657L396747P689178K847388
44538A4224932m374404n374856k070432r29125j872012m87767K603215K127445
44530C846996k817207o443026m420953L42742K622436K081860J965846K687109
$$ plain form
44586 -18149071 -18769706 -10126890 1135964 7244849 6345269 2310974 -303744 -246786
44578 -246786 954882 2299737 4491179 7810401 11360425 15508125 21830201 28325542
44570 28325542 28430241 18876673 5541078 -3213612 -6171741 -6975009 -5749585 -742936
44562 -742936 3867985 1290803 -6447070 -9833314 -6456398 -4666061 -9351650 -13988198
44554 -13988198 -12416905 -9084760 -9674134 -9885893 -3832718 2602450 -946106 -11530150
44546 -11530150 -15057052 -6769766 2353373 2955276 291619 3688366 11377544 14224932
44538 14224932 9850528 4475672 2405240 1476115 -395897 -883664 1719551 3846996
44530 3846996 1029789 -5413237 -9834190 -9491448 -6869012 -4787152 -2821306 -134197
44522a34197J313651k442981m079576k24971O097213Q719827N401357l81791l605126
44513A0663406k104720J909831L417901o23014o681602p353321q21608N417041
44505C823914L962169j995218k881386L579323Q953499N698092l036342q243485
44497I860566o284005j613500K40489r85427j543714O02178L010152K165123j569906
44488C881956m480682m793578m338199l947520j260895L945113O275300J628433
44480c090072n097015n363272J044890N809142L946211n35572k122545p46948
44472f155181J112561K714053L364140J282732k488730l365954J55463L342470
44464c8446K343022N0567L48834R65520j769197m458006p43829P074665Q704097
$$ plain form
44522 -134197 1179454 -1263527 -5343103 -5568074 529139 9248966 14650323 14268532 10663406
44513 10663406 8558686 10468517 13886418 13263404 6581802 -771519 -1593127 3823914
44505 3823914 7786083 5790865 2909479 6488802 15442301 21140393 18104051 9860566
44497 9860566 3576561 1963061 2203550 1218123 -325591 276587 3286739 5451862 3881956
44488 3881956 -598726 -5392304 -9730503 -13678023 -14938918 -10993805 -4718505 -3090072
44480 -3090072 -8187087 -13550359 -12505469 -6696327 -2750116 -3285688 -5408233 -6155181
44472 -6155181 -5042620 -2328567 1035573 2318305 -170425 -3536379 -3380916 -38446
44464 -38446 2304576 2355143 2703977 3669497 1900300 -2557706 -3301535 3773130 12477227
44455A2477227J76493r198937q352499J277011P761722L263838p576770j3906653
44447a4078568j0249724o58758O835593P848752L873552r35069l347367k186045
44439a2897634J519981M563392L731574m40426l480135k279924P03147Q54477
44431g725548j849533k581467J296807N813233N120762o88044n001529k328517
44423g943836N097171R592641O411175j440846o988306o582535k409278J267794
44415b996020K496403K195784K034205K587487K778986P77197l595216p189129
44407i10303n895553L44539O309579O781641K182106k594945m114800l034074
44399i31810j167557J116580L319141L255851j36438l739159l343304L60297K533316
$$ plain form
44455 12477227 12653720 3454783 -4897716 -3620705 4141017 7404855 -171915 -14078568
44447 -14078568 -24328292 -24987050 -18151457 -10302705 -6429153 -7364222 -10711589 -12897634
44439 -12897634 -11377653 -6814261 -3082687 -3523113 -7003248 -9283172 -8580025 -7725548
44431 -7725548 -9575081 -12156548 -10859741 -5046508 74254 -613790 -5615319 -7943836
44423 -7943836 -2846665 6745976 13157151 11716305 4727999 -1854536 -4263814 -2996020
44415 -2996020 -499617 1696167 3730372 6317859 9096845 9874042 6278826 -910303
44407 -910303 -6805856 -6461317 -151738 6629903 8812009 6217064 2102264 -931810
44399 -931810 -2099367 -982787 2336354 5592205 5455767 1716608 -1626696 -1266399 1266917
44390A266917J650838J702549M341008L776905m714145j4336108j2904490L24996
44382a8891530J1942527J1175424K239593m197554m983987l652627j333211L160969
44374d540396P119449O229293K222991Q32541K465370K184101r47245k277938
44366A3288166n82224p56859m716772o931806l246100J991739K563248o93463
44358I15929k716891k187437j485944j402599p61743L65107J035350J564215K126612
44349b547401J145701j769388l394391r29092L270550M549446K198101n15080
44341B008446j413682j241909j210895j693373k855842m127806l666482n78374
44333a4779917L030744M307807L269554K308739K797399L886239M121641K934993
$$ plain form
44390 1266917 2917755 4620304 8961312 12738217 8024072 -6312036 -19216526 -18891530
44382 -18891530 -6949003 4226421 6466014 2268460 -2715527 -6368154 -7701365 -4540396
44374 -4540396 2579053 8808346 11031337 11863878 14329248 16513349 15566104 13288166
44366 13288166 12705942 11949083 7232311 300505 -2945595 -953856 1609392 915929
44358 915929 -1800962 -3988399 -5474343 -6876942 -7638685 -7273578 -6238228 -4674013 -2547401
44349 -2547401 -1401700 -3171088 -6565479 -7494571 -4224021 325425 2523526 2008446
44341 2008446 594764 -647145 -1858040 -3551413 -6407255 -10535061 -14201543 -14779917
44333 -14779917 -11749173 -7441366 -4171812 -1863073 934326 4820565 8942206 11877199
44325A1877199R41280o98561j833036l687732o070100n674937p51335L783447
44317b113775J510253n047705o070468J345847Q051654O211751O66403L91595
44309D945555M390667M411859j544323o888018o631291k797038L33936P32246
44301c046407j431224l631261j753637M413829Q332704M693407j978995l213338
44293B385078P68026K055143j943051n009064k865709P31860J451041Q48762J680592
44284A02678K607737J728876Q06563J910649L373161K695768O23414p82255j619506
44275A1447085k942506m217786m313401l245627j315980J531811M215134M607054
44267E765784K490392L86844K63816J241709J371902r7299k622834m681804m236076
$$ plain form
44325 11877199 12818479 12119918 10286882 6599150 529050 -5145887 -5897222 -2113775
44317 -2113775 -603522 -5651227 -11721695 -10375848 -2324194 3887557 4553960 4945555
44309 4945555 9336222 13748081 12203758 5315740 -1315551 -4112589 -3778653 -3046407
44301 -3046407 -4477631 -8108892 -9862529 -5448700 2884004 7577411 5598416 2385078
44293 2385078 3153104 5208247 3265196 -1743868 -4609577 -3877717 -2426676 -1577914 102678
44284 102678 2710415 4439291 5245854 7156503 10529664 13225432 13848846 13066591 11447085
44275 11447085 8504579 4286793 -26608 -3272235 -4588215 -3056404 1158730 5765784
44267 5765784 8256176 8643020 8906836 10148545 11520447 11423148 8800314 4118510 -117566
44258a17566r72339K258537K506682N70288o29935l16303L70808J178683J783038
44249F631893P4991m134806n888934j200136N345479N658899j80521m375082l106687
44240a174904k28906J003463J927936L024320K315826Q04632J739912L048071
44232A2460350q26909p607735p583619J151101P946913N113933j613542m196773
44224D843719m024716m880043l595087K711895P832488N252029l82046p97075
44216F961164K277576J456274l012995n080231m190833l931345k780062K470989
44208e829463O845243K910356n086274n386875K897299Q095290M186475j584056
44200G047995k371407j281051k471881l141801n19917J572694m69667l313001
$$ plain form
44258 -117566 -1089905 1168632 3675314 4245602 3615667 3299364 3670172 4848855 6631893
44249 6631893 6706884 2572078 -3316856 -4516992 828487 6487386 6306865 1931783 -1174904
44240 -1174904 -1403810 -400347 1527589 4551909 6867735 7672367 9412279 12460350
44232 12460350 11633441 4025706 -3557913 -2406812 5540101 10654034 9040492 4843719
44224 4843719 819003 -4061040 -7656127 -4944232 2888256 8140285 7758239 6961164
44216 6961164 9238740 10695014 7682019 2601788 -1589045 -5520390 -8300452 -5829463
44208 -5829463 1015780 3926136 -1160138 -6547013 -3649714 4445576 8632051 7047995
44200 7047995 4676588 3395537 923656 -2218145 -2738062 -1165368 -1635035 -4948036
44192d948036k600605l9436O15352k42215m31266J0518R93341L721888O387596
44183C467137M070675k881566o181490p69725O367695N120610l352711q070102
44175b229477k972937N683617P536856J56698q456337q464725R54720J0097823
44167B306238R561778J075772n840205o379419m058570k362526j8818L499585
44159b216165M679031J687211k163532l986537m967951n359830k052081M719711
44151i660143Q540008N935092K468248L698464N651282J631217n927736q626933
44143C709499m484209O27846K423324K032627J346966Q99206J638639L230120
44135A1424018K013668l570506p636523l950172L347795M405806j360648m051458
$$ plain form
44192 -4948036 -7548641 -7588077 -6972725 -7214940 -7646206 -7635688 -6642347 -2920459 3467137
44183 3467137 7537812 4656246 -1525244 -2294969 4072726 9193336 5840625 -2229477
44175 -2229477 -5202414 481203 8018059 8174757 -281580 -8746305 -7791585 2306238
44167 2306238 11868016 12943788 7103583 724164 -3334406 -5696932 -5715750 -2216165
44159 -2216165 2462866 4150077 1986545 -1999992 -6967943 -12327773 -14379854 -9660143
44151 -9660143 -1120135 4814957 7283205 10981669 16632951 18264168 12336432 3709499
44143 3709499 -774710 -146864 2276460 4309087 5656053 6555259 8193898 11424018
44135 11424018 13437686 9867180 2230657 -1719515 1628280 6034086 4673438 621980
44127F21980J362634P459435N995660m98932m149870l148360j692879j914728
44119D034940j662494P44540L686057M194113R17304m174413o483329l241467
44111a984749K155970L286114p94981l906748j618436K195172J143636m376598
44103c900620p974132n789515j70766M533405O219382N078021K585598J015383
44095A596756J568503K479385R72419k595502m640204k911591Q77735L684239
44087A031740M328809L078531L38105k425658k548464K86751J835183j738833
44079D186164p075937o160592L018819J2416398J3275814O295336r39903l788188
44071B1227911l378560j778851J38840O58888j390240k920931K76897N963070
$$ plain form
44127 621980 1984614 9444049 15439709 14940777 10790907 7642547 5949668 4034940
44119 4034940 2372446 3116986 6803043 10997156 11914460 7740047 1256718 -1984749
44111 -1984749 171221 3457335 2662354 -1244394 -2862830 -667658 475978 -3900620
44103 -3900620 -11874752 -17664267 -17835033 -13301628 -7082246 -2004225 581373 1596756
44095 1596756 3165259 5644644 6617063 4021561 -618643 -3530234 -2652499 1031740
44087 1031740 5360549 8439080 8777185 6351527 3803063 4089814 5924997 4186164
44079 4186164 -2889773 -9050365 -6031546 6384852 19660666 25956002 25016099 21227911
44071 21227911 17849351 16070500 16209340 16868228 15477988 12557057 12833954 18797024
44063A8797024O946968J714191k880207k347287j266288m694720r147580q469103
44055a347002l770115k37900K251774P206632J2403871J1483826M777501N89269
44047C3357856L987607J0747196J4319824J3039883Q283554J017017o728803j1171338
44039F6852796j0728462p937889n588440l798924k250787j926613k838203k969846
44031B8813632j245142P72269J239175k9309k181705l454664j433824L338253
44023B5818685N294658M34611n964174m836999L319304Q477788O347770M834101
44015D3725744J0580114J7180591J4274910K920389o354659p918770n751636m996599
44007F3660084n703713n513052l637038j244347n44051k930876o124327n514549
$$ plain form
44063 18797024 25743992 27458183 24577976 22230689 20964401 16269681 7122101 -1347002
44055 -1347002 -5117117 -5355017 -3103243 4103389 16507260 27991086 32768587 33357856
44047 33357856 37345463 48092659 62412483 75452366 83735920 84752937 78024134 66852796
44039 66852796 56124334 48186445 42598005 38799081 36548294 34621681 31783478 28813632
44031 28813632 27568490 28340759 29579934 29550625 27368920 23914256 22480432 25818685
44023 25818685 31113343 31547954 25583780 20746781 24066085 32543873 38891643 43725744
44015 43725744 54305858 71486449 85761359 88681748 82327089 74408319 68656683 63660084
44007 63660084 57956371 52443319 48806281 47561934 47017883 44087007 37962680 32448131
43999C2448131r53758J274811k805685p951340o976176j630544O47500j377184
43991A2675755k154921k81079j305902p219563j0814836n444565M563600Q841124
43983a140387M141001k343751k737727K199254N375111L280414K88324J441621
43975A0503860L963930J092593o162703q273578j157586O346862M970359j213492
43967A0070245j915115K968865M396535l65480m343092l407741j610279j790340
43959D003598r19402J805460J789649j809208l071683l17388l43502n437708o522232
43950a0822416J887667R653629N596724l831321m349903L178022N344980m62384
43942F194998k279114M846654R891162M712858k212453p6657P215329Q974442
$$ plain form
43999 32448131 31494373 32769184 29963499 22012159 15035983 13405439 14052939 12675755
43991 12675755 10520834 10239755 8933853 1714290 -9100546 -14545111 -9981511 -1140387
43983 -1140387 3000614 656863 -2080864 118390 5493501 8773915 9062239 10503860
43975 10503860 14467790 15560383 9397680 1124102 -33484 6313378 11283737 10070245
43967 10070245 8155130 11123995 15520530 15155050 10811958 7404217 5793938 4003598
43959 4003598 3084196 4889656 6679305 4870097 1798414 1481026 1137524 -4300184 -10822416
43950 -10822416 -8934749 718880 6315604 2484283 -1865620 1312402 6657382 6194998
43942 6194998 3915884 8762538 18653700 23366558 21154105 21077448 28292777 37267219
43934C7267219M793968K468006M008450M820636M005153M908835O238583K422151
43926G0933001o171217j1757520r878229m670437j332869Q9130O12890j753517
43918C6071232p725600j2792467j2014947o168814J56757M025132M799650K290805
43910H641748j922362l436625N13181O403439P899680L702728j308705k833196
43902A7659888j924115k134577m307853n797828l978857M83016L885705L178499
43894G063878m78223k673960p89705L051078M938036L740415J374564k43596p84551
43885A5197936q88275j529293l198940m480809k877219J304969L788991J546565
43877H863925k596201l756509j816267m50479m71129Q33892L583366L949601O11027
$$ plain form
43934 37267219 42061187 44529193 48537643 53358279 57363432 62272267 68510850 70933001
43926 70933001 64761784 53004264 43126035 38455598 37122729 37211859 37824749 36071232
43918 36071232 28345632 15553165 3538218 -2630596 -2473839 1551293 6350943 8641748
43910 8641748 6719386 3282761 3795942 10199381 18099061 21801789 20493084 17659888
43902 17659888 15735773 13601196 9293343 3495515 -483342 -326 3885379 7063878
43894 7063878 6585655 3911695 3121990 6173068 11111104 14851519 16226083 15982487 15197936
43885 15197936 14309661 12780368 9581428 5100619 2223400 3528369 7317360 8863925
43877 8863925 6267724 2511215 694948 244469 -226660 607232 4190598 8140199 8751226
43868H751226k380763j962183j041940l451502p144234o730251j105036N249507
43860i815176P721933N343224N8274m763497n668929j888153L156620N182148
43852f73556L721749J737247J202804J306555Q32568O186o05515j403152l031124
43843C093762m892367n017240j947229K774580M920820K217460j867182j835513
43835b552909K147886M026359P07912l094397k039383J557195J442766k673780
43827d78351m524842o77886M414502M663037M34664k298368J16617M265377L952491
43818I867241j507809n784804l971066K56121K85819k471886l86023O835165Q954199
43809A2076957K28841r860089q410987L151403J1229372P404048l642818j1828986
$$ plain form
43868 8751226 6370463 4408280 3366340 -85162 -7229396 -13959647 -15064683 -9815176
43860 -9815176 -2093243 3249981 3308255 -1455242 -7124171 -9012324 -5855704 -673556
43852 -673556 3048193 4785440 5988244 7294799 8127367 8133553 7528038 6124886 3093762
43843 3093762 -1798605 -6815845 -8763074 -5988494 -1067674 1149786 -717396 -2552909
43835 -2552909 -405023 3621336 4329248 1234851 -804532 752663 2195429 -478351
43827 -478351 -5003193 -5681079 -1266577 3396460 3831124 1532756 1649373 5914750 9867241
43818 9867241 8359432 2574628 -1396438 -1140317 -854498 -3326384 -3712407 3122758 12076957
43809 12076957 12305798 2445709 -5965278 -2813875 8415497 15819545 12176727 347741
43801C47741j0817752j297284Q667140Q813507j433257r342944m489893N921126
43793c631616P006528j864245p328411l101080K899767M170957M347243N854279
43785H353422L336610m465749q237438k417676M065193J315219n706461n649658
43777i406538J499935O405197N671053M189698M492956L551320l67794n064485
43769A0971342q006935p325511j696773N665913O895712n13757p860759o232050
43761h102818J144614N099264M250739L548148L367024M84788k696045n51514
43753F544200N283116P639910N097906K165984l52979m971971q697581n844178
43745F864407M83259J383817k678432j949787N639482J0558903Q168425N768953
$$ plain form
43801 347741 -10470011 -11767295 -3100155 5713352 4280095 -5062849 -9552742 -3631616
43793 -3631616 3374912 1510667 -5817744 -8918824 -6019057 -1848100 2499143 8353422
43785 8353422 11690032 7224283 -1013155 -3430831 634362 1949581 -3756880 -9406538
43777 -9406538 -7906603 -1501406 4169647 8359345 12852301 16403621 16035827 10971342
43769 10971342 2964407 -4361104 -6057877 -391964 6503748 5989991 -1870768 -8102818
43761 -8102818 -6958204 -1858940 2391799 5939947 9306971 9791759 7095714 6544200
43753 6544200 11827316 19467226 24565132 26731116 26378137 21406166 12708585 6864407
43745 6864407 7347666 8731483 6053051 4103264 9742746 20301649 28470074 34239027
43737C4239027P592646O049005l538138j1193366o351230M983080Q984615M200324
43729D4965963J288708N679592J1486929J2334163R335277P169134Q615823J4301904
43721A15177493K3440315L3642039M2038194M5991813M1969538K7604943P881950
43714C37746285n093341l919343M558964O394257l890571j8836898k7934298k7722970
43706B61302085k2060329j5921210j0750095n631753k175722n416768j6591115
43699A82755093k7051420k5571698j2571212r46756m03903o700792r713361o548920
43691I3247031j853393O37802J234392J011631J57366n29757J053107P119840
43683A02078019J7762565K9191296L6733865M1964429N1714052O3788679O0131614
$$ plain form
43737 34239027 41831673 47880678 44342540 33149174 26797944 31781024 40765639 44965963
43729 44965963 46254671 51934263 63421192 75755355 85090632 92259766 100875589 115177493
43721 115177493 138617808 172259847 214298041 260289854 302259392 329864335 337746285
43714 337746285 332652944 328733601 333292565 339686822 335796251 316959353 289025055 261302085
43706 261302085 239241756 223320546 212570451 206938698 204762976 199346208 182755093
43699 182755093 155703673 130131975 117560763 116614007 116210104 109509312 99795951 93247031
43691 93247031 91393638 92031440 93265832 94277463 94434829 93905072 94958179 102078019
43683 102078019 119840584 149031880 185765745 227730174 279444226 343232905 403364519
43676D03364519K6795567k1733567n3285050n4733189m2982122l6401209l3399631
43669A87625318k7289718k3459641k6950413k7661241j5671234r60664K58549
43662F5890956q802825j1882198n957916k197844m092982m040589r53581k323755
43654B5639266p310693n886241K155182M748127j611491n632972j590283R91516
43646A1502411m013604p188415p54375O334370L310107l897705l192045L219822
43638E320566L747519k436701m955672l05723L045023o90753n641696l898459
43630e815896L134431P578789N322977n09453m687024n252753l333920J06734
43622c456115M512819O984977L589652m160657q396771m667617J399707K565765
$$ plain form
43676 403364519 430160086 408426519 355141469 300408280 257426158 221024949 187625318
43669 187625318 160335600 136875959 109925546 82264305 66593071 65632407 65890956
43662 65890956 57088131 45205933 39248017 37050173 32957191 28916602 27963021 25639266
43654 25639266 18328573 12442332 14597514 19345641 17734150 12101178 10510895 11502411
43646 11502411 7488807 300392 -453983 5880387 9190494 5292789 2100744 5320566
43638 5320566 9068085 6631384 1675712 1369989 4415012 3724259 -1917437 -5815896
43630 -5815896 -2681465 4897324 10220301 9710848 5023824 -228929 -3562849 -3456115
43622 -3456115 1056704 8041681 11631333 7470676 -926095 -5593712 -4194005 -1628240
43614a628240O18467J237227K723984j47974m066880r47169O968724Q516182J513652
43605A4787973l570641j011558J859699j263602n288425l954774J13988K411467
43597D084127L953194N126881J862265n181805p450132j952071K031327k177820
43589B95966p191911m291431K191374L766071K051000K776904L698832N02272
43581C799077k501127J03951L360219O53684k707559J519271P814047M554544
43573A6596107n547779q650185j729565M255120L184737P66306J024741j23096
43565I776386m365957o070944j908100M046097P521577P951124M316984l614928
43557A7652239r542602o337096J806188L661393j641312l232624L354142Q920417
$$ plain form
43614 -1628240 -1009773 227454 2951438 2803464 -1263416 -2210585 4758139 13274321 14787973
43605 14787973 11217332 10205774 12065473 10801871 5513446 1558672 1672660 4084127
43597 4084127 8037321 13164202 15026467 9844662 2394530 442459 2473786 295966
43589 295966 -6895945 -11187376 -8996002 -5229931 -3178931 -402027 3296805 3799077
43581 3799077 1297950 1401901 4762120 5415804 2708245 4227516 12041563 16596107
43573 16596107 11048328 2398143 668578 4923698 8108435 8874741 9899482 9776386
43565 9776386 5410429 -660515 -2568615 1477482 8999059 16950183 21267167 17652239
43557 17652239 8109637 1772541 3578729 7240122 5598810 2366186 5720328 14640745
43549A4640745N744363j209764l877321k511507j586565j955295k580860l866203
43541B797593m905851k910369J621270M525699M367441L312688J338314l011938
43533G134847o017032j860499O727297J0128408N384158j188028n483836r024540
43525E800775j0117742m105902N178961P215228J522136q14162L539300M160633
43517A2379227l627515q858108l645578K929000R87082l490290j119495L743339
43509g02338K651407m42473K259377N828128P95689q363104r226792j742674L044385
43500e898395J699358P52332K182948J366932r88065R87828N692082M934916j305346
43491I424590l724570P87225M541651K550944p18149j205311j248864k161819
$$ plain form
43549 14640745 20385108 19175344 15298023 12786516 11199951 9244656 6663796 2797593
43541 2797593 -2108258 -5018627 -3397357 1128342 5495783 8808471 10146785 7134847
43533 7134847 1117815 -742684 5984613 16113021 21497179 20309151 14825315 5800775
43525 5800775 -4316967 -8422869 -3243908 3971320 5493456 4679294 8218594 12379227
43517 12379227 8751712 -106396 -3751974 -822974 164108 -3326182 -4445677 -702338
43509 -702338 1949069 1506596 3765973 9594101 10389790 2026686 -7200106 -8942780 -5898395
43500 -5898395 -4199037 -3446705 -1263757 103175 -884890 102938 5795020 10729936 9424590
43491 9424590 5700020 6487245 11028896 13579840 12861691 11656380 10407516 8245697
43483H245697p35426K838991K649010l027696p621867o332573k878766k086001
43475h948631k659859j555281O58660K766472N512653P599793M758444l158975
43467D973276r092667o959164O98651O461937O316822J911173k375190k857605
43459i22767K84532K621682R15589k043997j963681m90807k192669n523015m337717
43450a3652850J543622N265624L729212J628987K452952K990260J11251l524393
43442E44665m175505k136661O88278L307237L731725J08140m359259l568283K462784
43433c396879O895765O069909L291070Q84875l355372q758923r385469l564260
43425a1319284K027884K725003K533803N080965O096407J799741k781464j938118
$$ plain form
43483 8245697 7510271 10349262 12998272 9970576 2348709 -3983864 -6862630 -8948631
43475 -8948631 -11608490 -13163771 -12505111 -9738639 -4225986 3373807 8132251 4973276
43467 4973276 -4119391 -11078555 -10379904 -3917967 2398855 4310028 1934838 -922767
43459 -922767 -638235 1983447 2899036 855039 -1108642 -1599449 -3792118 -9315133 -13652850
43450 -13652850 -12109228 -6843604 -3114392 -1485405 967547 3957807 4069058 544665
43442 544665 -3630840 -5767501 -5079223 -1771986 1959739 2067879 -2291380 -5859663 -3396879
43433 -3396879 3498886 9568795 12859865 13744740 10389368 1630445 -7755024 -11319284
43425 -11319284 -9291400 -6566397 -4032594 1048371 7144778 8944519 6163055 4224937
43417D224937P00020j117098m963865m301648j47656J078589j515387l346797
43409i388905l262313l933998m673718j876242L752985P238299O265109K542250
43401c336533k188829n855802m366818K946234Q613413N354238k902379o406198
43393h142674l953023k396049k946213Q22690R589289J3890769P594394k981294
43385A1477889q472447p688199m374074L00935N849203Q467957N510322N25279
43377A1596865j593836j496629k592361m458513m173970j946821n42163p36662
43369e944090j447075k511690l424983j661005L210886O096753K527953l437434
43361f590685l690347K084796N683965K381657l007844m506988l124029k450330
$$ plain form
43417 4224937 4924957 3807859 -1156006 -5457654 -5605310 -4526721 -6042108 -9388905
43409 -9388905 -12651218 -16585216 -21258934 -23135176 -19382191 -12143892 -5878783 -3336533
43401 -3336533 -5525362 -11381164 -15747982 -12801748 -4188335 1165903 -1736476 -8142674
43393 -8142674 -12095697 -14491746 -17437959 -16615269 -7025980 6864789 14459183 11477889
43385 11477889 3005442 -4682757 -9056831 -8755896 -2906693 5561264 11071586 11596865
43377 11596865 10003029 8506400 5914039 1455526 -2718444 -4665265 -5207428 -5944090
43369 -5944090 -7391165 -9902855 -13327838 -14988843 -11777957 -5681204 -3153251 -6590685
43361 -6590685 -10281032 -8196236 -2512271 -130614 -3138458 -7645446 -10769475 -13219805
43353a3219805j411777K566162O278657L565572m745473r689669m911408N284809
43345a6282932J0898055P006069k046347p548407m412778M187975R499603O138464
43337G439702j559650m665797j143830J908604r40143n266295l526171L539200
43329d214380P875772N187210m81114l458757k866897j052680L89627J076138
43321B454919R57641N98845O33942M27664q30678j895918r75620P29761K65599
43312B366155k125969k910057p76751J429184J356628P0986j046847k636625m656514
43303h929810m660018j177901L523972O000952N157792K240238p21249k124684
43295f90708k571396m635708p937869o714102K224682J1224447R670699k38280
$$ plain form
43353 -13219805 -14631582 -12065420 -5786763 -2221191 -6966664 -16656333 -21567741 -16282932
43345 -16282932 -5384877 1621192 -425155 -7973562 -12386340 -8198365 1301238 7439702
43337 7439702 5880052 1214255 70425 1979029 1038886 -4227409 -7753580 -4214380
43329 -4214380 3661392 8848602 8367488 4908731 2041834 989154 1378781 2454919
43321 2454919 3412560 4011405 4645347 5073011 4242333 2346415 1370795 2100556 2366155
43312 2366155 240186 -2669871 -3446622 -2017438 -660810 -589824 -1636671 -4273296 -8929810
43303 -8929810 -13589828 -14767729 -11243757 -5242805 -85013 2155225 1433976 -690708
43295 -690708 -3262104 -7897812 -15835681 -22549783 -20325101 -9100654 570045 331765
43287C31765n486661j611288J356728l195541o953452j676095N425430L566189
43279h242925k647287p64270P681623Q644108j639701j0309252p397357J082302
43271a3592759M701423K855390J065745J012559J134532J812220L708968M392826
43263G090904J676986k038408k747591n49446N93218k061244o767558q613949
43255a3417088m305549L329081P207660M410485J73522K69898K738841K062559
43247B469409j768043m622680n594017n693287k355606N712750J0912391N173284
43239D234201n145296n610585M103019Q550398P39986o882551l152083M060468
43231H97557J993384o128420p701933j003463M563927M369072K473429J810246
$$ plain form
43287 331765 -5154896 -6766184 -5409456 -8604997 -15558449 -17234544 -11809114 -8242925
43279 -8242925 -10890212 -11654482 -3972859 4671249 3031548 -7277704 -14675061 -13592759
43271 -13592759 -8891336 -6035946 -4970201 -3957642 -2823110 -1010890 2698078 7090904
43263 7090904 8767890 6729482 3981891 3432445 4025663 1964419 -4803139 -13417088
43255 -13417088 -17722637 -14393556 -7185896 -2775411 -2601889 -2331991 406850 2469409
43247 2469409 701366 -3921314 -9515331 -15208618 -17564224 -11851474 -939083 4234201
43239 4234201 -911095 -6521680 -2418661 6131737 6871723 -10828 -3162911 897557
43231 897557 2890941 -3237479 -10939412 -11942875 -7378948 -3009876 -536447 1273799
43223A273799J125506N47685J124353J87061m417025p424152k400384O711083
43215c272074R647047M688112M2146K39985O92967k492968n949680n278794j236362
43206b919621K863653M673503K527796l019903o864230m253863J868817M566499
43198e57349L412213L749514N720425L486470k848055m671397J435189O644689
43190A6371699K760123n449573q029038l991015R9669J319486J968962K360622
43182G410935k4282m352195n857388k566479J784222K675216k06463l452310l477561
43173h066305L05310M555378N181903K450893Q96763K725196M214428J351763
43165A3615329l670095n320429k433082Q08429Q88921j414367l210494k506647
$$ plain form
43223 1273799 2399305 2946990 4071343 4258404 -158621 -7582773 -9983157 -3272074
43215 -3272074 6374973 11063085 11105231 11345216 12038183 9545215 3595535 -1683259 -2919621
43206 -2919621 -55968 4617535 7145331 4125428 -2738802 -6992665 -5123848 -557349
43198 -557349 2854864 6604378 12324803 15811273 12963218 8291821 9727010 16371699
43190 16371699 19131822 13682249 5653211 1662196 1761865 3081351 5050313 7410935
43182 7410935 7386653 3034458 -2822930 -5389409 -3605187 -929971 -1136434 -4588744 -8066305
43173 -8066305 -7760995 -3205617 1976286 4427179 5323942 8049138 12263566 13615329
43165 13615329 9945234 4624805 2191723 3000152 3889073 2474706 -735788 -3242435
43157c242435P99107M523563N086915J202360l469375l736056Q41036N172512
43149G177627M654724K44786l276038k949885m09611R24354M32814O87034K826800
43140A0312605L569512o97500p810981j1161545p474918k78372M902930N611435
43132c026834K153378l660170p715631n640022J476919O679632N433857J237321
43124c061550j08019J607967K826679K759249L020368K807317o9352m148385n420023
43115B14251l414885j678937k008889k444760j358983M51191K197491L840422
43107d203099M125499J857551o44338J02985K388106O07129n424249q210780l122761
43098a2523957L850205M005395j902237n418224k648948J716006L155576L715743
$$ plain form
43157 -3242435 -2443328 2080235 7167150 8369510 4900135 1164079 2005115 7177627
43149 7177627 11832351 12077137 8801099 5851214 5441603 6365957 6798771 7485805 10312605
43140 10312605 13882117 13184617 5373636 -5787909 -13262827 -13541199 -8638269 -3026834
43132 -3026834 -873456 -4533626 -12249257 -17889279 -16412360 -9732728 -4298871 -3061550
43124 -3061550 -3169569 -1561602 1265077 4024326 7044694 9852011 9782659 5634274 214251
43115 214251 -3200634 -4879571 -6888460 -9333220 -10692203 -10241012 -8043521 -4203099
43107 -4203099 -77600 1779951 1135613 1238598 3626704 4233833 -1190416 -9401196 -12523957
43098 -12523957 -8673752 -4668357 -6570594 -11988818 -14637766 -12921760 -9766184 -6050441
43090f050441O335370P574177J959403p653637j0647924k345842P736602O895379
43082C803087l700355j0093933m606365L945393L741500l033428m871579J047803
43074a3767877N696053L343286j65829J778675N668845M224017j711893m799736
43066B65541k174792J709810K442952N03893j456403j990008q25366J552711L692287
43057C720625M387200L891286K606478L1865l052101l497745L4143L630251K610280
43048A4362282j796547m308873l278259k020307k532151k566616r3603L218648
43040I84574M551918L145789O1338k553853j769295L090191P420678N521182j426223
43031A9026299o233369n815033m767941o165186n177660K527068J0973263J0264679
$$ plain form
43090 -6050441 284929 7859106 9818509 2164872 -8483052 -10828894 -3092292 3803087
43082 3803087 102732 -9991201 -14597566 -10652173 -6910673 -9944101 -14815680 -13767877
43074 -13767877 -8071824 -4728538 -4894367 -3115692 2553153 6777170 5065277 265541
43066 265541 -1909251 -199441 2243511 2747404 1291001 -699007 -1524373 28338 3720625
43057 3720625 8107825 11999111 14605589 14637454 11585353 8087608 8121751 11752002 14362282
43048 14362282 12565735 8256862 4978603 2958296 426145 -2140471 -2234074 984574
43040 984574 5536492 8682281 8743619 6189766 4420471 7510662 14931340 20452522 19026299
43031 19026299 12792930 6977897 2209956 -3955230 -9132890 -6605822 4367441 14632120
43023A4632120R20937n984732l676935K180835K661715k585820o603158m967466
43015c422504k52006K280150M76463l185008m421169j674481J763030J331794
43007g103731k599338m244494J90515O594045P501226J879117l269087k129606
42999c181353K449152L561904J97633j716970J599647O051727N532225M31499
42991A4925464l501737l341755j893779k421325m266744m764421k580479J854191
42983e990585O472864P319957J565067p623335j2505778r224594j948077L312885
42975a8621596N383571N815408M402081J161760p12328Q42914K125258j017868
42967f20800n460999m806583M14592L776775L591041M364011O744466M936799
$$ plain form
43023 14632120 15553057 9568325 5891390 8072225 10733940 8148120 1544962 -3422504
43015 -3422504 -3674510 -1394360 -917897 -4102905 -8524074 -10198555 -8435525 -7103731
43007 -7103731 -9703069 -13947563 -13757048 -7163003 338223 2217340 -1051747 -3181353
42999 -3181353 -732201 2829703 3027336 1310366 2910013 8961740 14493965 14925464
42991 14925464 11423727 8081972 6188193 3766868 -499876 -5264297 -7844776 -5990585
42983 -5990585 482279 7802236 9367303 1743968 -10761810 -19986404 -21934481 -18621596
42975 -18621596 -13238025 -7422617 -3020536 -1858776 -2571104 -1728190 397068 -620800
42967 -620800 -6081799 -10888382 -10473790 -6697015 -3105974 1258037 8002503 12939302
42959A2939302k453688p304866l349415L822448M746569p24701n163581n006078
42951b494010k971141j060815J540189L839620K797377j303043m280694l968099
42943g900616k541064k000715j258379Q80405K991577K905726M28369k552812
42935i047509l414949p99847L144247L996800Q11331j613791L63746K768663k53317
42926d044626o293464p331889k208114J468502m09177k263787J246995O386020
42918a3449540P022835M294112K933560K503264k50569l436475k482741R72606
42910a892948Q33035l003869m248897j433298q35015m941455o465258K05038Q496794
42901a3285873Q515021J769112j922193K79543J881241j11426n01706K872852
$$ plain form
42959 12939302 10485614 3180748 -168667 3653781 8400350 7675649 2512068 -2494010
42951 -2494010 -5465151 -6525966 -4985777 -1146157 1651220 348177 -3932517 -7900616
42943 -7900616 -10441680 -12442395 -13700774 -12820369 -9828792 -6923066 -6494697 -9047509
42935 -9047509 -12462458 -13262305 -10118058 -6121258 -5309927 -6923718 -6559972 -3791309 -4044626
42926 -4044626 -10338090 -17669979 -19878093 -18409591 -18818768 -21082555 -19835560 -13449540
42918 -13449540 -6426705 -2132593 800967 3304231 3053662 -382813 -2865554 -1892948
42910 -1892948 -1059913 -4063782 -8312679 -9745977 -10580992 -15522447 -21987705 -21782667 -13285873
42901 -13285873 -4770852 -3001740 -4923933 -4644390 -2763149 -2874575 -3376281 -503429
42893e03429L225964l510762r386527n771830J880076J599923n701564o830435
42885b4998584K863163J1788425R957944L299712K167616M644679K061589m629941
42877G154603o195737q00050L397838K012078k2317P48346J06824m442332o855443
42868d896190j842385N410526O131489L48919m627985n232023m281950m029863
42860a3019462k890076O81187N456923Q773618P900978J649382o264447q036732
42852e748629n19324Q877296J0078573K581252n393487q200472o947121l653415
42844h925327J124324M368785K120619l072438l589083J582365M084854q06572
42836c112473n971824l351399L393714M927351L73868l138287k371023p22760
$$ plain form
42893 -503429 2722535 -788227 -10174754 -15946584 -14066508 -12466585 -18168149 -24998584
42885 -24998584 -22135421 -10346996 -389052 2910660 5078276 9722955 11784544 7154603
42877 7154603 958866 158816 3556654 5568732 5546415 6294761 6401585 1959253 -4896190
42868 -4896190 -6738575 -1328049 4803440 5152359 524374 -4707649 -8989599 -13019462
42860 -13019462 -15909538 -15228351 -9771428 -997810 6903168 8552550 2288103 -5748629
42852 -5748629 -6267953 2609343 12687916 15269168 9875681 1675209 -5271912 -8925327
42844 -8925327 -7801003 -3432218 -1311599 -4384037 -7973120 -6390755 -2305901 -3112473
42836 -3112473 -9084297 -12435696 -9041982 -4114631 -3740763 -6879050 -9250073 -9972833
42828i972833j16956J395495L545604L275237J535262L013578O926885N812469
42820A5414741k738138j0224427q446761r49349K891572J027701p07158J302995
42812b428824M439294N199907L098193p16895m401467n242300k352754J056542
42804a348304J624479O90527J185648J725369p20403l941291l122690K56138J4730
42795c635797l534197k819388L746628O893592L54246q430998q971334k749618
42787a9146866J185323J015480K597075P309531R574600O869619L316274J636130
42779A4357166o54663m629157o501071l860625L81494L039070M250519L704868
42771A0087601n43195o236437o399121N22882N857668K187283n080910m874560
$$ plain form
42828 -9972833 -10089789 -8694294 -5148690 -1873453 -338191 2675387 9602272 15414741
42820 15414741 12676603 2452176 -5994585 -6943934 -4052362 -3024661 -3731819 -2428824
42812 -2428824 2010470 7210377 10308570 9591675 5190208 -52092 -2404846 -1348304
42804 -1348304 276175 966702 2152350 3877719 3157316 -783975 -3906665 -3650527 -3635797
42795 -3635797 -7169994 -9989382 -6242754 650838 1005084 -7425914 -16397248 -19146866
42787 -19146866 -17961543 -16946063 -14348988 -7039457 2535143 9404762 12721036 14357166
42779 14357166 13702503 9073346 2572275 -1288350 -906856 2132214 6382733 10087601
42771 10087601 9544406 3307969 -3091152 -2568270 3289398 5476681 395771 -4478789
42763d478789L791459J0928411R427669K473840l475420o389830p067572n226404
42755a6636q84696L249539M072197J668439j263797k625798k201707o36771J393857
42746B754627L091688L551508K366384K21141j464523j922075j824668k098744
42738D675338k423256j925569p36664O09006K444688M523309M472811J011292
42730A2650955k224579o98637L292449K742939k967194n904471j805729K503945
42722G589678l96281o622219p273436k490685l94265l763379o549746l952117
42714b3852450J713928O372110Q701503P925540L382594j956269l281670r50441
42706a945155j88296k420787l055333J63846L184246K940559K107484K776978
$$ plain form
42763 -4478789 -687330 10241081 19668750 22142590 18667170 12277340 5209768 -16636
42755 -16636 -901332 2348207 6420404 8088843 6825046 4199248 1997541 1360770 2754627
42746 2754627 5846315 9397823 11764207 11985348 10520825 8598750 6774082 4675338
42738 4675338 2252082 326513 -410151 198855 2643543 7166852 11639663 12650955
42730 12650955 10426376 9727739 13020188 15763127 12795933 6891462 5085733 7589678
42722 7589678 7193397 571178 -6702258 -9192943 -9587208 -13350587 -19900333 -23852450
42714 -23852450 -22138522 -15766412 -7064909 860631 4243225 2286956 -994714 -1945155
42706 -1945155 -2133451 -4554238 -7609571 -7445725 -4261479 -1320920 786564 3563542
42698C563542J791226k668854n696579k993295J130615J0559m384194m024325
42690a3271305L036570R832470R943299M495772r35308k481810m94275J367756
42682A1493169k65317l960541m377491J6678L286408J44254n330055m834708K023740
42673a803863P168430N424781K03427l208661m270796m875219m955466l247865
42665i565232J85941L942346N940704M049551j245510n328661m304497q08998
42657g134356l95315k626746j815630K784790M718673Q14828l248311k260040
42649i162107K23897j098455l605437j738699K315352J756264k685668k887845
42641a6882698L511257Q555700N739257m31256j295256M015620Q466566O646934
$$ plain form
42698 3563542 5354768 2685914 -3010665 -6003960 -4873345 -4862786 -9246980 -13271305
42690 -13271305 -10234735 -402265 9541034 14036806 13101498 10619688 10125413 11493169
42682 11493169 11227852 7267311 2889820 2906498 6192906 6337160 1007105 -3827603 -1803863
42673 -1803863 5364567 10789348 10992775 7784114 3513318 -1361901 -6317367 -9565232
42665 -9565232 -9379291 -5436945 503759 4553310 3307800 -2020861 -6325358 -7134356
42657 -7134356 -7529671 -10156417 -11972047 -9187257 -4468584 -3653756 -6902067 -9162107
42649 -9162107 -8938210 -10036665 -13642102 -15380801 -13065449 -11309185 -13994853 -16882698
42641 -16882698 -13371441 -4815741 923516 492260 -802996 3212624 11679190 18326124
42633A8326124J29276n850469p833930o141039l310765j097191R96674L689317
42625a092003N305508L382668j245395m676344m787818l239330k016887r05862
42617i275463O27945K067160L495077N419312N887317J913492m358336n791623
42609a5119N2156N997091M618566j619410n149612m503641l861795m051780j972870
42600a0506414J806821K832324O76024l30284P92049L73513j644016l03630M853331
42591a450282P166917L658157K52206J203512J650079k603054n952666k360689
42583A564180L052607K059852k459194j909875K273908J260576m298572l914184
42575b370702M565716R881247M975367k320637k733786O97423M45519k432898
$$ plain form
42633 18326124 18455400 12604931 4771001 -1370038 -4680803 -5777994 -4781320 -1092003
42625 -1092003 4213505 7596173 6350778 1674434 -3113384 -6352714 -8369601 -9275463
42617 -9275463 -8647518 -6580358 -3085281 2334031 8221348 10134840 5776504 -15119
42609 -15119 37037 6034128 10652694 9033284 3883672 -619969 -4481764 -8533544 -10506414
42600 -10506414 -8699593 -5867269 -5191245 -5521529 -4729480 -4355967 -5999983 -6303613 -1450282
42591 -1450282 5716635 9374792 9626998 10830510 12480589 9877535 3924869 1564180
42583 1564180 4616787 6676639 4217445 2307570 4581478 5842054 1543482 -2370702
42575 -2370702 2195014 12076261 17051628 14730991 11997205 12694628 13140147 10707249
42567A0707249k474888r42067k835554o370819m931888J844662P092950O588658
42559H678303K815371q52759l798796n364287l980656n35505J554399Q56820o78436
42550a305546j297043j205811m59885J564910L876713L981093J234777k099653
42542D289555l706797l245902j415463R71021K749305L033301K303254J611579
42534F589853J102868O36949R74463K545457L900386L401127J700119M41389p47705
42525B0544906l523363p339986r086327o696199j673890K370317L042235J195504
42517a166803m3808J162003L061336K941359J283377N33148K94074k032694n449692
42508E82300n452251j548154J020445k29894j053668J049875J337393l079050
$$ plain form
42567 10707249 8232361 7290294 4454740 -1916079 -6847967 -5003305 2089645 8678303
42559 8678303 11493674 10640915 6842119 1477832 -2502824 -3038329 -1483930 -627110 -1305546
42550 -1305546 -2602589 -3808400 -4268285 -2703375 1173338 5154431 6389208 4289555
42542 4289555 582758 -2663144 -4078607 -3107586 -358281 2675020 4978274 6589853
42534 6589853 7692721 8329670 9304133 11849590 15749976 19151103 20851222 21292611 20544906
42525 20544906 17021543 9681557 595230 -6100969 -7774859 -5404542 -2362307 -1166803
42517 -1166803 -1210611 -48608 3012728 5954087 7237464 7770612 8064686 6031992 582300
42508 582300 -4869951 -6418105 -5397660 -5627554 -6681222 -5631347 -4293954 -7373004
42500g373004n395000R63540R761502R643342J336580l892275j793700M61585
42492C712570j555018k631494J069574M302003J706351l306472m585789k272795
42484c561070l97301j14475M0487R45524L160429O392876O857312P94669p495147
42475F623304q435028j024625M407468J842525j306552K216269O058891Q67119
42467A1249371q656584r958254k238886L195622J419661j04348L869932P562977
42459F339491N015945L94843N77160L659414K231565m867778j0530351q793976
42451e973687j952180K770810J646796j786601j585457K773497N658126L224975
42443D776279j116998k071898k52792j6046j559618r22174K599214M815553L231572
$$ plain form
42500 -7373004 -12768004 -11804464 -2042962 7600380 8936960 5044685 3250985 3712570
42492 3712570 2157552 -473942 595632 4897635 6603986 3297514 -1288275 -3561070
42484 -3561070 -3958371 -4072846 -4032359 -3086835 73594 6466470 13323782 14118451 6623304
42475 6623304 -1811724 -2836349 1571119 3413644 2107092 4323361 10382252 11249371
42467 11249371 2592787 -7365467 -9604353 -6408731 -4989070 -5093418 -1223486 6339491
42459 6339491 11355436 11750279 12327439 15986853 18218418 13350640 2820289 -5973687
42451 -5973687 -7925867 -5155057 -3508261 -5294862 -6880319 -4106822 1551304 4776279
42443 4776279 3659281 1587383 1334591 1318545 -241073 -1163247 1435967 6251520 9483092
42434I483092J81363j771561k844868l193372j811818J30426l90039k681808k008378
42425d906963K643184N500122K312790k807374l377728K53772K769281K317041
42417D704125J624977J985724J391074j347617m819848p449457q045474m308473
42409a6264969M653789J3760586J4908121O810410k159558m122780j287920j199292
42401A5098387m975354o208599j592129L553800L273656k85063q69785K072694
42393A0067607L463614J599256O60861K679697K997602k410953r473449j0890894
42385a306659n946120l96071J977459K492251K613663J286967j406779k301700
42377b986989O87957N025987O257598K896522k290284m668712j643616L897141
$$ plain form
42434 9483092 9664455 7892894 5048026 1854654 42836 173262 -216777 -2898585 -4906963
42425 -4906963 -2263779 3236343 5549133 2741759 -635969 -382197 2387084 4704125
42417 4704125 6329102 8314826 9705900 8358283 3538435 -3911022 -11956496 -16264969
42409 -16264969 -11611180 2149406 17057527 23867937 21708379 17585599 16297679 15098387
42401 15098387 10123033 3914434 2322305 5876105 9149761 8864698 7994913 10067607
42393 10067607 13531221 15130477 15791338 18471035 21468637 19057684 9584235 -1306659
42385 -1306659 -7252779 -7648850 -5671391 -3179140 -565477 721490 -685289 -2986989
42377 -2986989 -2299032 2726955 8984553 11881075 9590791 4922079 3278463 7175604
42369G175604M940068j638181r149300p840085K001538R197834O089469j848546
42361H928401m873820k349737r03818k394146j756286K920293N862844K504640
42353G938371k786818l007345Q22231J419929l133503n970101j829453M519513
42345b027176N011437J37398k316937L96677K178092j170742m349218r93588N473493
42336B339436O695066K239088n44653J150032K023389q85256k670290K29031K477465
42327A3053308k046760r392916j0100981k441137N603307P037579K754099k600106
42319A866393o340009p644227n755456r42414M396608P288934O474111L145178
42311B489118J47973j65926J714054L062378K549675J503048N74207j858475n589827
$$ plain form
42369 7175604 12115672 10477491 1328191 -6511894 -4510356 4687478 10776947 8928401
42361 8928401 4054581 1704844 801026 -1593120 -3349406 -429113 5433731 7938371
42353 7938371 5151553 2144208 2966439 4386368 1252865 -4717236 -6546689 -2027176
42345 -2027176 2984261 3121659 804722 1201399 3379491 2208749 -2140469 -3134057 2339436
42336 2339436 9034502 11273590 10728937 11878969 13902358 13017102 10346812 10575843 13053308
42327 13053308 11006548 1613632 -8487349 -10928486 -5325179 1712400 4466499 1866393
42319 1866393 -4473616 -12117843 -17873299 -18815713 -14419105 -7130171 -656060 2489118
42311 2489118 2637091 2471165 4185219 7247597 9797272 11300320 11874527 10016052 4426225
42302D426225o233756j125866M868608M624509j393085n953592n279425k701154
42294h767536j684192j288648l23631k73116j305805m36907L121622N464907M295876
42285a197430K900293L750309L389736o77512l179504R11737N374514n8732j2342158
42276a128747j6095176m736111R538509J2413793N405032n02755k011834m004645
42268a121934o773813m497655K942743P047222L195450k054007j104092L571517
42260A205431M442555O07214k173468r43686J202228J010116r10483k559590l094832
42251a214515k018991J018162M481810N330470K293366k453149n286069m115988
42243a964904l6592L063867J894397j936928l006703P16706M543252L940878J518463
$$ plain form
42302 4426225 -1807531 -2933397 1935211 6559720 5166635 -786957 -6066382 -8767536
42294 -8767536 -10451728 -11740376 -12064007 -12337123 -13642928 -14079835 -10958213 -5493306 -1197430
42285 -1197430 1702863 5453172 8842908 8165396 4985892 5897629 11272143 11213411 -1128747
42276 -1128747 -17223923 -21960034 -12421525 -7732 5397300 4894545 2882711 -1121934
42268 -1121934 -7895747 -12393402 -9450659 -2403437 792013 -1261994 -2366086 1205431
42260 1205431 5647986 6255200 4081732 3138046 4340274 5350390 4439907 1880317 -1214515
42251 -1214515 -3233506 -2215344 2266466 7596936 9890302 7437153 2151084 -1964904
42243 -1964904 -2001496 1062371 2956768 1019840 -1986863 -1270157 3273095 7213973 8732436
42234H732436K333624M934844L725321p87716j778124K645642N387809P95343
42226B5989179o939780r954528o658255j396622K047777K709502J294874J01886
42218G194033J250438K795200N78949m044975m124482J894421N887896K179704
42210A3611184k982618j666819K405261P10914m651215m291242J928429M414252
42202I478146L34287k184629P83762K035901l073124p249309l366925L111967
42194a29924K886220k802572n898443m553812k857401j085016L913962J0021323
42186e05663J0741981N130875p63950l013209l549815m085514l061263k97230
42178E96212J342888J047612J632808L931833M474881J177058k958532m311587
$$ plain form
42234 8732436 11066060 16000904 19726225 18938509 17160385 19806027 25193836 25989179
42226 25989179 19049399 9094871 2436616 1039994 3087771 5797273 7092147 7194033
42218 7194033 8444471 11239671 11818620 7773645 3649163 5543584 11431480 13611184
42210 13611184 10628566 8961747 11367008 12077922 7426707 3135465 5063894 9478146
42202 9478146 9812433 7627804 8411566 10447467 7374343 125034 -3241891 -129924
42194 -129924 2756296 -46276 -5944719 -10498531 -13355932 -14440948 -10526986 -505663
42186 -505663 10236318 15367193 14603243 11590034 8040219 3954705 893442 596212
42178 596212 1939100 2986712 4619520 8551353 13026234 14203292 11244760 6933173
42170F933173l044447q24894J945317M114931K905639j716686n030798l410961
42162A871274M07841J429506m52918j232861P52372L098575L650579K999823K208357
42153A4732548Q31677j637220l977041m190292j940332O46029J105942m02163
42145E169148j353238q26991j332873m389168o374471l096456K617422L768857
42137e817770J07115p46739M318276P801122L099847m483455n705309j309800
42129b736713R95073K01321K279173P515005Q274760J557336n591262o708746
42121E785947l840840j032152K048773N110028L715785k795302o639487k229336
42113A23416M210083L685468j864738l913912j450819n37023j908025K2826N452214
$$ plain form
42170 6933173 3888726 3063832 5009149 9124080 12029719 10313033 5282235 1871274
42162 1871274 2279115 3708621 3255703 2022842 2775214 5873789 9524368 12524191 14732548
42153 14732548 15564225 13927005 9949964 5759672 3819340 4465369 5571311 5169148
42145 5169148 3815910 2988919 1656046 -2733122 -9107593 -12204049 -9586627 -5817770
42137 -5817770 -5710655 -6457394 -2139118 5662004 8761851 4278396 -1426913 -2736713
42129 -2736713 -1741640 -1540319 738854 8253859 16528619 18085955 12494693 5785947
42121 5785947 1945107 912955 2961728 8071756 11787541 8992239 2352752 123416
42113 123416 4333499 8018967 6154229 2240317 789498 252475 -1655550 -1632724 3819490
42104C819490P004666J698837m064636m879405l499926l527210k564131J929324
42096d082991O109201N054809K30269l634222n318475n892468m485632n23273
42088a2542782K897727L000478J959358K589977K447734j904205p209778o923175
42080a5684666j264362L012266L041488L091386N791614O903447K597546l226751
42072D261968l982942J57816L035933J583434q12845m86904J493130K540824L017437
42063A0807851L921749K832676k699905q701831p987408r73553L501966J363884
42055B065429r1589N171373R951299M253840p275696j0610487l097541M107141
42047D473769M547808L336128L126303j322424q826520p864609L580907R391915
$$ plain form
42104 3819490 10824156 12522993 8458357 3578952 79026 -3448184 -6012315 -4082991
42096 -4082991 2026210 7081019 7311288 3677066 -1641409 -7533877 -12019509 -12542782
42088 -12542782 -9645055 -6644577 -4685219 -2095242 352492 -1551713 -8761491 -15684666
42080 -15684666 -16949028 -13936762 -10895274 -7803888 -2012274 4891173 7488719 4261968
42072 4261968 279026 436842 3472775 5056209 4243364 3756460 5249590 7790414 10807851
42063 10807851 14729600 17562276 14862371 6160540 -1826868 -2800421 701545 2065429
42055 2065429 1973840 7145213 17096512 21350352 14074656 3464169 366628 4473769
42047 4473769 9021577 12357705 15484008 14161584 5335064 -2529545 1051362 10443277
42039A0443277o37607j1994969o990570O652638Q398101k309501p883161k911862
42031g233654N82558j884842m49501O764164O947426l640879r545824p17640J0454886
42022A276694R360514R77006k342164j297940k794640m155011j94591L101106
42014C930974j787572p953026m119351N188925O362423n31038l002325J772947
42006a38043L520321j815719n883340l975307k149012l789620k772490L920845
41998a3082365Q619200N090591j271635k452304O95858K522822J676813N8048
41990A857028j901835l479765j851963L195191O902699N916420L020607K011824
41982A5670206J968304J31495l181544n690049o036248l537897J337095M824878
$$ plain form
42039 10443277 9805670 -2189299 -9179869 -2527231 5870870 3561369 -4321792 -7233654
42031 -7233654 -6651096 -8535938 -8985439 -2221275 4726151 1085272 -8460552 -9178192 1276694
42022 1276694 10637208 11614214 9272050 7974110 5179470 1024459 829868 3930974
42014 3930974 2143402 -5809624 -9928975 -4740050 1622373 1091335 -1910990 -138043
42006 -138043 3382278 1566559 -4316781 -8292088 -10441100 -14230720 -17003210 -13082365
41998 -13082365 -4463165 627426 -644209 -3096513 -2400655 122167 1798980 1857028
41990 1857028 -44807 -3524572 -5376535 -2181344 4721355 10637775 13658382 15670206
41982 15670206 17638510 17770005 14588461 8898412 2862164 -675733 661362 5486240
41974E486240K593552l829329p944454o834692l667630p44221L338184P662274
41966c940076P511492K462181q42965J705346N478287M904680J335660j698084
41958A6916521m885448r070086j0452504o280958p26157J111638P67817K019922
41950a0599255L587363K875869K496905N496356P899694M211227k531201m671561
41942H765397j895330o72023k953563m258016k921718k505007l886608l169739
41934a3496607N82336L035836K401446K479026M995491N652807J500032l762114
41926C388253n886665n967330n799421k822933M432705J0092288P239595j342097
41918C334395n593054j522058L843296K598875l743044p279247m098454K197797
$$ plain form
41974 5486240 8079792 4250463 -3693991 -10528683 -14196313 -14940534 -11602350 -3940076
41966 -3940076 3571416 6033597 5190632 6895978 12374265 17278945 18614605 16916521
41958 16916521 12031073 2960987 -7491517 -13772475 -14498632 -13386994 -12619177 -10599255
41950 -10599255 -7011892 -4136023 -1639118 3857238 11756932 15968159 13436958 8765397
41942 8765397 6870067 6198044 3244481 -1013535 -3935253 -6440260 -10326868 -13496607
41934 -13496607 -12914271 -9878435 -7476989 -4997963 -2472 5650335 7150367 3388253
41926 3388253 -2498412 -8465742 -14265163 -17088096 -12655391 -2563103 4676492 3334395
41918 3334395 -2258659 -3780717 62579 2661454 -1081590 -8360837 -12459291 -10261494
41910a0261494O452518P615080P264916N474699J312268l402097m542262j188479
41902H725149K130719J071803k570210l519041o29877J610255l39875m026088
41894B452835m397099p43413K104244L1177m372574m252208K448884Q876828P162454
41885I311128j078818o643716n036904j196973j63204M63237M071324O809098
41877F535172L171023l473947m369286J346119N137620K140914k084850j147379
41869G255386K454866K195957k347433n756937m925514k011747J8442P47884Q95731
41860a473365N62462p0770j1002J367854K950605K650714m9733k852665l030446
41851D3654j044642r9820j487497k558768p83078K485112M433351M635937L777473
$$ plain form
41910 -10261494 -3808976 3806104 11071020 16545719 17857987 14455890 9913628 8725149
41902 8725149 10855868 11927671 9357461 5838420 5208543 6818798 6478923 2452835
41894 2452835 -1944264 -2687677 -583433 -552256 -4924830 -9177038 -6728154 2148674 9311128
41885 9311128 8232310 1588594 -3448310 -4645283 -4808487 -4345250 -273926 6535172
41877 6535172 9706195 6232248 1862962 3209081 8346701 10487615 8402765 7255386
41869 7255386 9710252 11906209 9558776 3801839 -1123675 -3135422 -3116980 -2369096 -1473365
41860 -1473365 -910903 -981673 -992675 375179 3325784 5976498 5926765 3074100 43654
41851 43654 -1000988 -1100808 -2588305 -5147073 -5930151 -3445039 988312 5624249 9401722
41842I401722J118618l131909n420466l440183r27329k301650m429395r06495
41834a0037087O035337O494934k174634r697648o518903L610926J0070743Q966842
41826F750510M373451L61730j673083o66627K617186L486796j245950o969535
41818G034478o388072k20674L467883Q80516k974506k958093q53826m86983r01389
41809c400666Q88123L602770L412100N06553j190308q63216k181484o120900p365371
41800a2712399j953811M954616M919046j279841l853077J742144P786317N964583
41792E567578n1264q52554L837496N591974J562721j313008J512897M713083K429268
41783B2998191k110849k631519l06139j052324n216198p040925l694819J132996
$$ plain form
41842 9401722 10520340 7388431 1967965 -1472218 -2399547 -4701197 -9130592 -10037087
41834 -10037087 -4001750 2493184 318550 -9379098 -15898001 -12287075 -2216332 6750510
41826 6750510 11123961 11485691 9812608 9145981 11763167 15249963 14004013 7034478
41818 7034478 646406 425732 3893615 4774131 1799625 -1158468 -2012294 -2499277 -3400666
41809 -3400666 -2512543 1090227 4502327 5008880 3818572 2955356 773872 -5347028 -12712399
41800 -12712399 -14666210 -9711594 -4792548 -6072389 -9925466 -8183322 -397005 5567578
41792 5567578 5516314 4663760 8501256 14093230 15655951 14342943 15855840 20568923 22998191
41783 22998191 20887342 18255823 17949684 16897360 11681162 4640237 945418 2078414
41775B078414L150657K404553J374659J470473K343540K496174L23731l712308
41767A1929893o410564n210665j568081J010608J486680J692466K887429M133450
41759I951216L936637J925167q94398k704596k554321k000449l413463o031007
41751a785214o170450k558473J389799K393516J569722J776223L478211N421342
41743E514676O511955N029103l87245o628562p493652k350846J685324M13293
41735B294046o44169L613597P049397J050419r810570j2081319k725366O737963
41727d516002O925135J407963k210708k724602k038303O75354N446822P816222
41719A0781881M721703R2676p77394Q33058j01634m021786o274535l931803P27769
$$ plain form
41775 2078414 5229071 7633624 9008283 10478756 12822296 15318470 15642201 11929893
41767 11929893 5519329 308664 -1259417 -248809 1237871 2930337 5817766 9951216
41759 9951216 13887853 15813020 14918622 12214026 9659705 7659256 4245793 -1785214
41751 -1785214 -7955664 -10514137 -9124338 -6730822 -5161100 -3384877 93334 5514676
41743 5514676 12026631 17055734 16668489 10039927 2546275 195429 1880753 2294046
41735 2294046 1649877 5263474 12312871 13363290 3552720 -8528599 -11253965 -4516002
41727 -4516002 2409133 3817096 1606388 -1118214 -3156517 -2481163 2965659 10781881
41719 10781881 15503584 15596260 14818866 15651924 15550290 11528504 5253969 1322166 2049935
41710B049935L354270J925721j639108l372908j658853O41459N71785K64363L424769
41701E561433P464566N535076k385541p391450l884874K459252L581476L24264
41693A1264202r72998J087225K474729J336571j5790J07754Q04247J107095J069650
41684A8262685Q27755Q23982J586095J736622r93657n024707n292552j035663
41676A0890560J684288q06634l343223j72844N365968O383825L421662J793272
41668B5216874J302787k038361n891796l510615L847187O551544R68173n011131
41660B1434662m282913J11802K510374L680484O296420P660498L996831k009739
41652C9398419m537818k903738q87425L6522J438404L460358M564354M751018
$$ plain form
41710 2049935 5404205 7329926 5690818 2317910 659057 1300516 1872301 2136664 5561433
41701 5561433 13025999 18561075 16175534 8784084 4899210 7358462 10939938 11264202
41693 11264202 10291204 11378429 13853158 15189729 15173939 15281693 16085940 17193035 18262685
41684 18262685 19090440 19914422 21500517 23237139 22243482 17218775 11926223 10890560
41676 10890560 12574848 11768214 8424991 8252147 13618115 20001940 23423602 25216874
41668 25216874 26519661 24481300 18589504 15078889 18926076 25477620 26445793 21434662
41660 21434662 17151749 17263551 19773925 23454409 29750829 37411327 41408158 39398419
41652 39398419 34860601 31956863 31069438 31105960 32544364 36004722 40569076 45320094
41644D5320094M750343L116014j590806o628208p420656l676038P07600L194615
41636C7772958L927889K232648k973124q717807r293293m042357Q06912P60781
41628B0474607r01356N02853K702194K72278n259737o051628L85615O539613N304470
41619B3968909N8547r37701K827350L875539r92060n164825k103843M517706N790638
41610C1840260O3765n188382l725147K156372N922636M599397K43580l656155
41602C2256326m838593k855403Q03426L633590M316686L484807J908118o52326
41594C8056631l885754n841960n020187k526402n52039M26228J180694J313551
41586B3150762k50931k385033k126499Q98796K831550N82367l226462l501797
$$ plain form
41644 45320094 50070437 53186451 51595645 44967437 37546781 33870743 34578343 37772958
41636 37772958 41700847 43933495 40960371 32242564 22949271 18906914 19713826 20474607
41628 20474607 19573251 20076104 22778298 23050576 17790839 11739211 12124826 18664439 23968909
41619 23968909 24027456 23089755 25917105 29792644 28800584 23635759 21531916 26049622 31840260
41610 31840260 31904025 26715643 22990496 25146868 31069504 35668901 35912481 32256326
41602 32256326 27417733 24562330 25365756 28999346 33316032 36800839 38708957 38056631
41594 38056631 34170877 28328917 23308730 20782328 20230289 20656517 21837211 23150762
41586 23150762 22899831 20514798 18388299 19287095 22118645 22701012 19474550 15972753
41578A5972753k48743J074390k195200n555875m310787j274244k339199o344801
41570e221706o123442k34543L524191k11354n348921k783148O179581J1750561
41562A531219R285668L987276J663262J266578r67954m682048o065601l128015
41554B890385J975154M814867K383324l483904o712584l507265K220106L228728
41546C808811j615333o457207p112622n424511l609467k4364N972064R769792
41538d692837P060461P90193k209703M4154L386522L715601P24086l699749p148036
41529b029308p074237k690214L287618O864721O483187L164407j463551n137222
41521A405401m911120l07715M710920N955659L990125J940174J89283k636691
$$ plain form
41578 15972753 15724010 16798400 14603200 9047325 4736538 3462294 1123095 -5221706
41570 -5221706 -11345148 -11579691 -8055500 -8266854 -13615775 -16398923 -10219342 1531219
41562 1531219 10816887 14804163 16467425 17734003 16766049 12084001 6018400 2890385
41554 2890385 4865539 9680406 12063730 8579826 1867242 -1640023 580083 3808811
41546 3808811 2193478 -4263729 -11376351 -16800862 -20410329 -20434693 -14462629 -4692837
41538 -4692837 2367624 3157817 948114 992268 4378790 8094391 8818477 5118728 -2029308
41529 -2029308 -9103545 -11793759 -8506141 -1641420 4841767 8006174 6542623 1405401
41521 1405401 -3505719 -3813434 897486 6853145 10843270 12783444 12972727 10336036
41513A0336036m877092l218444J286875L664381K028256p41995k978271o159019
41505f59273r056595o234478L451289J1795509J0186342P52993o622002o577692
41497b963907k549196P4498q2131j396510j919064k92450K853167M283892J899563
41488i2138j455551j483877J105737K279779K146146M411527P662714M971205
41480A9545542m278772r838994m257090N018235N507584k456762p375752m120057
41472b256066O86454J500849J505250L922811N087137J734777k272820k681221
41464G227171j975853l396224l861207k06009L092395J011583j970756J098724
41456A019824O174031L382348n703231q574985j088831O101735M465593n20026
$$ plain form
41513 10336036 5458944 2240500 3527375 7191756 9220012 8478017 5499746 -659273
41505 -659273 -9715868 -15950346 -12499057 -703548 9482794 10235787 3613785 -2963907
41497 -2963907 -5513103 -5438605 -5520736 -6917246 -8836310 -9128760 -6275593 -1991701 -92138
41488 -92138 -1547689 -3031566 -1925829 353950 2500096 6911623 14574337 19545542
41480 19545542 15266770 5427776 1170686 6188921 11696505 9239743 1863991 -2256066
41472 -2256066 -1569612 -68763 1436487 5359298 10446435 12181212 9908392 7227171
41464 7227171 5251318 1855094 -2006113 -2212122 880273 1891856 -78900 1019824
41456 1019824 7193855 10576203 4872972 -3702013 -4790844 1310891 5776484 5256458
41448E256458o79991J758806O38608k466426k307240r1195m03391j994184m98612
41439g87167K512290J846110j809193l017582j107948m48750j719531j089780
41431e621551J423980Q68370l662425o292036l240344J793063L995360L804549
41423f931034L981261M914648N513698M867092J359011n375954j0389374p183320
41415i243972K173059P128502K570310l675654k407279L761250N606167J278192
41407G190575k905524l362673k873104l585829l665694k067541p17278l77576
41399a2364644O71406K371891K028635p27285k713940k615048k711296k989459
41391a9049740Q40499R279277J4035754P454737n601346j1992107o147646M121120
$$ plain form
41448 5256458 4576467 6335273 6973881 4507455 2200215 2109020 1705629 -288555 -787167
41439 -787167 1725123 3571233 1762040 -1255542 -2363490 -2812240 -4531771 -5621551
41431 -5621551 -4197571 -3329201 -6991626 -13283662 -16524006 -14730943 -10735583 -6931034
41423 -6931034 -2949773 1964875 7478573 12345665 13704676 8328722 -2060652 -9243972
41415 -9243972 -7070913 57589 2627899 -1047755 -3455034 306216 5912383 7190575
41407 7190575 4285051 922378 -1950726 -5536555 -9202249 -11269790 -11987068 -12364644
41399 -12364644 -11693238 -9321347 -7292712 -8019997 -10733937 -13348985 -16060281 -19049740
41391 -19049740 -18209241 -8929964 5105790 12560527 6959181 -5032926 -11180572 -7059452
41383g059452Q452682N240099J11433k263292j468079O99339K046510J019327
41375F778567j521564k463524l24084K162961J422169j981757m043778k611102
41367b582112J01427M96936k104980m324372j885733M893938R092295L934048
41359G621447p212059j2006884m021636P536641Q791048q14552q906010p653101
41351a6665106k131707O24718J975884N789171R177852O628217k53658m299853
41343H45518k614826J057936K911417K561404K98432l787604p158583n878831
41335a1765137L2977N451898N846368J946707k219165l942486l400597j964450
41327a0013885j95306K266005M827258N025567J453953k887418l435769o99567
$$ plain form
41383 -7059452 1393230 6633329 6744762 4481470 3013391 3712730 5759240 6778567
41375 6778567 5257003 2793479 2469395 4632356 6054525 4072768 28990 -2582112
41367 -2582112 -2480685 -1983749 -4088729 -8413101 -10298834 -5404896 3687399 7621447
41359 7621447 409388 -11597496 -15619132 -8082491 708557 -105995 -9012005 -16665106
41351 -16665106 -18796813 -18172095 -16196211 -10407040 -1229188 5399029 5145371 845518
41343 845518 -1769308 -711372 2200045 4761449 5059881 1272277 -5886306 -11765137
41335 -11765137 -11732160 -6280262 -433894 1512813 -706352 -4648838 -8049435 -10013885
41327 -10013885 -10209191 -7943186 -3115928 1909639 3363592 476174 -2959595 -3659162
41319c659162k6889l428867o302433m726248j070883J068263K362077L812970
41311a1971172K844519r39826j618458M083057Q781092M410837l925525m683912
41303c019388K177302N747558J844365k404549k836878m021727p090303m765501
41295a4369121M863401J0985880N206596m884083o659078o5701N186825M681775
41287D946494J982682p1433j701101j962303L562J118739j540597m720847l452097
41278e396901N99177J805498l79840j852116j678883k375844l276754q78096L935895
41269i497864N613574J992759k756512m355855l022873r21726J018221K761750
41261i168526M394904N744104M988111k31181p554578r221717j447740Q450246
$$ plain form
41319 -3659162 -3686051 -7114918 -13417351 -18143599 -19214482 -18146219 -15784142 -11971172
41311 -11971172 -9126653 -10066479 -11684937 -7601880 1179212 5590049 1664524 -3019388
41303 -3019388 -842086 4905472 6749837 4345288 1508410 -2513317 -9603620 -14369121
41295 -14369121 -9505720 1480160 6686756 1802673 -4856405 -4922106 264719 4946494
41287 4946494 6929176 6857743 5156642 3194339 3197901 4316640 2776043 -1944804 -5396901
41278 -5396901 -4797724 -2992226 -3372066 -5224182 -6903065 -9278909 -12555663 -13433759 -9497864
41269 -9497864 -3884290 -1891531 -4648043 -9003898 -12026771 -12948497 -11930276 -9168526
41261 -9168526 -4773622 970482 5958593 5727412 -1827166 -11048883 -12496623 -4046377
41253d046377J0144527L362860l264169m493662k769990j457736j028288j750644
41245e303479l322936k083819M232937R317440M427110p211130j1450301k148871
41237a3543049R404789R399938p23458p792995m058344N279495R908633N378680
41229A3253689l256906o867601k185494M016258L412833k574497n337594k285640
41221a824952J46490j744635k732777J417385N640824L724461j227489j974105
41213A425202J422445L013601J038822r87139j631074k610912l141910m17861
41205a888826L808381L981805m11567l079021m19241L080709K504530K97718J244377
41196I118865L487193J259248m680619o536846j147987M142157J571704n648783
$$ plain form
41253 -4046377 6098150 9461010 6196841 1703179 -1066811 -2524547 -3552835 -5303479
41245 -5303479 -8626415 -10710234 -6477297 2840143 7267253 56123 -11394178 -13543049
41237 -13543049 -4138260 5261678 4538220 -3254775 -7313119 -2033624 7875009 13253689
41229 13253689 9996783 3129182 943688 4959946 8372779 5798282 460688 -1824952
41221 -1824952 -1678462 -3423097 -6155874 -4738489 902335 4626796 3399307 1425202
41213 1425202 2847647 5861248 6900070 5912931 4281857 1670945 -1470965 -1888826
41205 -1888826 1919555 5901360 5489793 2410772 1991531 5072240 7576770 7874488 9118865
41196 9118865 12606058 13865306 9184687 2647841 1499854 5642011 7213715 1564932
41188A564932q120553l985526n45651k059861l698705o02376M028346M997535
$$ plain form
41188 1564932 -6555621 -10541147 -11086798 -13146659 -16845364 -17447740 -13419394 -8421859
$$ [...]
##END NTUPLES=NMR SPECTRUM
##END=
