##TITLE=31Pdec_SR8_r
 CDCl3, 24 sc
 26.10.2020
##JCAMPDX= 6.0         $$ Bruker NMR JCAMP-DX V2.0
##DATA TYPE= NMR SPECTRUM
##DATA CLASS= NTUPLES
##ORIGIN= UXNMR, Bruker Analytische Messtechnik GmbH
##OWNER= root
$$ XWIN-NMR		Version 3.5
$$ Mon Oct 26 13:53:33 2020 Russian Standard Time (UT+4h)  she@DPX200
##.OBSERVE FREQUENCY= 81.013821
##.OBSERVE NUCLEUS= ^31P
##.ACQUISITION MODE= SIMULTANEOUS
##.ACQUISITION SCHEME= undefined
##.AVERAGES= 24
##.DIGITISER RES= 17
##SPECTROMETER/DATA SYSTEM= spect
##.PULSE SEQUENCE= zgpg30
##.SOLVENT NAME= D2O
##.SHIFT REFERENCE= (INTERNAL, D2O, 0, 182.463)
##AUDIT TRAIL= $$ (NUMBER, WHEN, WHO, WHERE, WHAT)
$$ ##TITLE= Audit trail, XWIN-NMR		Version 3.5
$$ ##JCAMPDX= 5.01
$$ ##ORIGIN= Bruker BioSpin GmbH
$$ ##OWNER= she
$$ F:/spectra/data/she/nmr/P31/1/pdata/1/auditp.txt
$$ ##AUDIT TRAIL=  $$ (NUMBER, WHEN, WHO, WHERE, WHAT)
(   1,<2020-10-26 13:52:41.85 +0400>,<she>,<DPX200>,
      <created by zg, POWCHK disabled, PULCHK disabled
       configuration hash MD5:
       00 E9 B6 7A A2 85 ED C7 34 08 36 98 17 FE 4E 26
       data hash MD5: 32K
       90 36 41 2B EC E7 78 6A B4 8E 61 35 65 F8 E5 91>)
(   2,<2020-10-26 13:52:45.45 +0400>,<she>,<DPX200>,
      <Start of raw data processing
       efp BC_mod = 2 LB = 1 FT_mod = 6 PKNL = 1 PHC0 = -2353.427 PHC1 = 28.80069 SI = 64K 
       data hash MD5: 64K
       17 C0 D8 EA 57 1F 20 9C 88 B1 5B F4 E9 21 54 3F>)
(   3,<2020-10-26 13:53:09.07 +0400>,<she>,<DPX200>,
      <pk PHC0 = -9.320321 PHC1 = -5 
       data hash MD5: 64K
       4F 22 D5 9A D1 1D 0E 06 F5 9B 30 C3 BD FA 10 10>)
(   4,<2020-10-26 13:53:12.40 +0400>,<she>,<DPX200>,
      <abs ABSG = 5 
       data hash MD5: 64K
       4A C5 A9 AE 21 77 B7 DA E3 7D B1 9F 3B E7 97 8C>)
$$ ##END=
$$ 
$$ hash MD5
$$ 0E 3F 50 19 06 09 45 BA 64 46 67 85 94 0F FB DB
##$RELAX= 
##$RELAX= 
##$RELAX= 
##$RELAX= 
##$RELAX= 
##$RELAX= 
##$RELAX= 
##$RELAX= 
$$ Bruker specific parameters
$$ --------------------------
##$DU= <F:/spectra>
##$EXPNO= 1
##$NAME= <P31>
##$PROCNO= 1
##$TYPE= <nmr>
##$USER= <she>
##$AMP= (0..31)
100 100 100 100 100 100 100 100 100 100 100 100 100 100 100 100 100 100 
100 100 100 100 100 100 100 100 100 100 100 100 100 100 
##$AQSEQ= 0
##$AQ_mod= 1
##$AUNM= <au_zg>
##$AUTOPOS= <>
##$BF1= 81.014009
##$BF2= 200.13
##$BF3= 200.13
##$BF4= 200.13
##$BF5= 200.13
##$BF6= 200.13
##$BF7= 200.13
##$BF8= 200.13
##$BYTORDA= 1
##$CFDGTYP= 0
##$CFRGTYP= 5
##$CHEMSTR= <none>
##$CNST= (0..31)
1 1 145 1 1 1 1 1 1 1 1 1 1 1 1 1 1 1 1 1 1 1 1 1 1 1 1 1 1 1 1 1 
##$CPDPRG= <waltz16>
##$CPDPRG1= <>
##$CPDPRG2= <waltz16>
##$CPDPRG3= <>
##$CPDPRG4= <mlev>
##$CPDPRG5= <mlev>
##$CPDPRG6= <mlev>
##$CPDPRG7= <mlev>
##$CPDPRG8= <mlev>
##$CPDPRGB= <>
##$CPDPRGT= <>
##$D= (0..31)
0 1 0 0 0 0 0 0 0 0 0 0.03 2e-05 3e-06 0 0 0 0 0 0 0 0 0 0 0 0 0 0 0 0 
0 0 
##$DATE= 1603705961
##$DBL= (0..7)
120 120 120 11 120 120 24 19 
##$DBP= (0..7)
150 150 150 150 150 150 150 150 
##$DBP07= 0
##$DBPNAM0= <>
##$DBPNAM1= <>
##$DBPNAM2= <>
$$ [...]
##$SUBNAM3= <"">
##$SUBNAM4= <"">
##$SUBNAM5= <"">
##$SUBNAM6= <"">
##$SUBNAM7= <"">
##$SUBNAM8= <"">
##$SUBNAM9= <"">
##$SW= 369.568048894756
##$SWIBOX= (0..15)
0 1 3 0 0 0 0 0 0 0 0 0 0 0 0 0 
##$SW_h= 29940.119760479
##$TD= 32768
##$TD0= 1
##$TE= 0
##$TE2= 300
##$TE3= 300
##$TEG= 300
##$TL= (0..7)
0 120 53 12 22 120 120 120 
##$TP= (0..7)
150 150 150 150 150 150 150 150 
##$TP07= 0
##$TPNAME0= <>
##$TPNAME1= <>
##$TPNAME2= <>
##$TPNAME3= <>
##$TPNAME4= <>
##$TPNAME5= <>
##$TPNAME6= <>
##$TPNAME7= <>
##$TPOAL= (0..7)
0.5 0.5 0.5 0.5 0.5 0.5 0.5 0.5 
##$TPOFFS= (0..7)
0 0 0 0 0 0 0 0 
##$TUNHIN= 0
##$TUNHOUT= 0
##$TUNXOUT= 0
##$USERA1= <user>
##$USERA2= <user>
##$USERA3= <user>
##$USERA4= <user>
##$USERA5= <user>
##$V9= 5
##$VALIST= <valist>
##$VCLIST= <CCCCCCCCCCCCCCC>
##$VD= 0
##$VDLIST= <DDDDDDDDDDDDDDD>
##$VPLIST= <PPPPPPPPPPPPPPP>
##$VTLIST= <TTTTTTTTTTTTTTT>
##$WBST= 1024
##$WBSW= 4
##$XGAIN= (0..3)
0 0 0 0 
##$XL= 0
##$YL= 0
##$YMAX_a= 14185
##$YMIN_a= -13595
##$ZGOPTNS= <>
##$ZL1= 120
##$ZL2= 120
##$ZL3= 120
##$ZL4= 120
##$ABSF1= 182.463
##$ABSF2= -187.1042
##$ABSG= 5
##$ABSL= 3
##$ALPHA= 0
##$AQORDER= 0
##$ASSFAC= 0
##$ASSFACI= 0
##$ASSFACX= 0
##$ASSWID= 0
##$AUNMP= <proc_1d>
##$AZFE= 0.1
##$AZFW= 0.5
##$BCFW= 0
##$BC_mod= 2
##$BYTORDP= 0
##$COROFFS= 0
##$CY= -3
##$DATMOD= 1
##$DC= 0
##$DFILT= <>
##$DTYPP= 0
##$F1P= 0
##$F2P= 0
##$FCOR= 1
##$FTSIZE= 65536
##$FT_mod= 6
##$GAMMA= 0
##$GB= 0
##$INTBC= 1
##$INTSCL= 5.30512e-09
##$ISEN= 30
##$LB= 1
##$LEV0= 0
##$LPBIN= 0
##$MAXI= 10000
##$MC2= 0
##$MEAN= 0
##$ME_mod= 0
##$MI= 50
##$NCOEF= 0
##$NC_proc= -5
##$NLEV= 6
##$NOISF1= 182.463
##$NOISF2= 159.3651
##$NSP= 0
##$NTH_PI= 0
##$NZP= 0
##$OFFSET= 182.463
##$PC= 4
##$PHC0= -2362.747
##$PHC1= 23.80069
##$PH_mod= 1
##$PKNL= yes
##$PPARMOD= 0
##$PSCAL= 0
##$PSIGN= 0
##$REVERSE= no
##$SF= 81.014009
##$SI= 65536
##$SIGF1= 159.3651
##$SIGF2= -187.1042
##$SINO= 113.3802
##$SIOLD= 16384
##$SREGLST= <1H.CDCl3>
##$SSB= 0
##$STSI= 65536
##$STSR= 0
##$SW_p= 29940.119760479
##$SYMM= 0
##$S_DEV= 0
##$TDeff= 32768
##$TDoff= 0
##$TI= <>
##$TILT= no
##$TM1= 0
##$TM2= 0
##$TOPLEV= 0
##$USERP1= <user>
##$USERP2= <user>
##$USERP3= <user>
##$USERP4= <user>
##$USERP5= <user>
##$WDW= 1
##$XDIM= 65536
##$YMAX_p= 280362618
##$YMIN_p= -4135661
$$ End of Bruker specific parameters
$$ ---------------------------------
##NTUPLES= NMR SPECTRUM
##VAR_NAME=  FREQUENCY,     SPECTRUM/REAL,   SPECTRUM/IMAG
##SYMBOL=    X,             R,               I
##VAR_TYPE=  INDEPENDENT,   DEPENDENT,       DEPENDENT
##VAR_FORM=  AFFN,          ASDF,            ASDF
##VAR_DIM=   65536,         65536,           65536
##UNITS=     HZ,            ARBITRARY UNITS, ARBITRARY UNITS
##FACTOR=    0.456856943014862, 1,           1
##FIRST=     14782.0589164895, 0,            0
##LAST=      -15158.0608439895, 0,           0
##MIN=       -15158.0608439895, -4135661,    0
##MAX=       14782.0589164895, 280362618,    0
$$ Real data points
##PAGE= N=1
##DATA TABLE= (X++(R..R)), XYDATA
$$ [...]
45910d91492k62789k77798j80426j88924l42060l26330P7781M51711K14935l75069
45900a700461m74436n084J87369j85591k82475L98595J030729P61573Q4082p5835
45890b61534J46904P1294j77318k8133L07691K05048j18752M5740N18286M47855
45880A157081j86021n21240k66179j0528j7675J00133L54090K17757k62832l45995
45870B18591J23228M30561L01722L09351N69534K89060p69671j549489j191477
45861a268590k51718L28654M82762M83728J97419k36315j8815R65733J430102
45852B112960N10820o36954m75596N24796P54433O8831l14607j67447m90193j331466
45842E55577j367823j87059P82526M43249l59227l60524K32838M61562K39317
$$ plain form
45910 -491492 -754281 -1032079 -1212505 -1401429 -1743489 -2069819 -1992038 -1540327 -1325392 -1700461
45900 -1700461 -2174897 -2179981 -1992612 -2178203 -2460678 -2062083 -1031354 -269781 -185699 -261534
45890 -261534 -114630 -43336 -220654 -248787 58904 263952 145200 190940 709226 1157081
45880 1157081 971060 449820 183641 173113 155438 255571 609661 827418 564586 218591
45870 218591 341819 772380 1074102 1383453 1952987 2242047 1472376 -77113 -1268590
45861 -1268590 -1520308 -1191654 -708892 -225164 -27745 -264060 -282875 682858 2112960
45852 2112960 2623780 1986826 1511230 2036026 2790459 2859290 2544683 2377236 1887043 555577
45842 555577 -812246 -999305 -216779 226470 -132757 -493281 -260443 201119 440436
45833D40436J35004K30032K18506J15482l671m27383j139032j315395m20385P32379
45823a434027R99182N10462J96449J66704j68122o17925k96370P15204J172943
45814A244500N40875j73744n4370L36805R141q58564j295554r74794l90476O1861
45804a554320L78807N16021L75184J47515J06063J38620l1218l05837m02424m06652
45794a038241n53449n89595m7474Q28444J147843N76308j55755k77956Q273q789
45784a10391m39943o84377l33309K81187N70787M54508L84239O23702P70812K79633
45774A796848o37178j086800o35075J08148L77192K39572J83986K06345N5461
45765F08499q837L29133M94103k72919j310130j076459L71128R99696k74047j745682
$$ plain form
45833 440436 575440 805472 1023978 1139460 1135789 708406 -430626 -1746021 -2166406 -1434027
45823 -1434027 -434845 75617 272066 438770 270648 -347277 -643647 71557 1244500
45814 1244500 1785375 1611631 1557261 1894066 1903207 1044643 -250911 -1225705 -1616181 -1554320
45804 -1554320 -1175513 -659492 -284308 -136793 -30730 107890 76672 -229165 -631589 -1038241
45794 -1038241 -1591690 -2181285 -2228759 -1400315 -252472 323836 168081 -109875 -101602 -110391
45784 -110391 -550334 -1234711 -1568020 -1286833 -716046 -261538 122701 746403 1517215 1796848
45774 1796848 1159670 72870 -562205 -454057 -76865 162707 346693 553038 608499
45765 608499 599662 928795 1422898 1149979 -160151 -1236610 -865482 134214 -139833 -1885515
45755a885515j321698M10483J189360M20399l76707k25246J21131p4670l22101
45746b064564r4448J67982N8547O5158N51601Q55977L78280k38703p5195N35498
45736A40133N68829k500k49306J31679M08924J07243k90811k59707m0733p6033
45726D37718k21695o2018L30170M54873Q7982m51747p22865n90167k15265J70001
45716g83013L83267L17150K1787k32962j55621J95144L93020J84609j16130q1991
45706A25260J17841n1469n36055n78483J63329R39082Q47415O0158n02876m86483
45696I7719l85547n28840m95746J55847J083194J513700J168513M51365j67933
45687B892272n86090q59185r05853o29479j77034J55807K36564J31962j00200
$$ plain form
45755 -1885515 -3207213 -2796730 -1607370 -1186971 -1563678 -1788924 -1667793 -1742463 -2064564
45746 -2064564 -2159012 -1991030 -1932483 -1867325 -1315724 -459747 -81467 -320170 -395365 140133
45736 140133 708962 706462 457156 588835 997759 1105002 814191 554484 513751 437718
45726 437718 216023 154005 484175 939048 1027030 575283 -147582 -737749 -953014 -783013
45716 -783013 -399746 -82596 -60809 -293771 -449392 -254248 138772 323381 207251 125260
45706 125260 243101 191632 -344423 -922906 -759577 179505 1026920 1087078 584202 97719
45696 97719 -287828 -816668 -1312414 -1156567 -73373 1440327 2608840 3060205 2892272
45687 2892272 2306182 1446997 541144 -88335 -265369 -109562 127002 258964 158764
45678A58764l87944m52622n5157M52393L30391m63252r09829k22386R26638J240978
45668F17974N73204p5816k02217l20874o88651p24584k23299j1117n74131r99972
45658b629483l31207P83507J005702L71209J15233O34524R62105M16455m03093
45649I24952o38146k71603J95904M33340K82861k71273q04214p13161o2397M19903
45639e03834M17435M13073P07724Q20601L41765l23282o37217p17660p99649n59710
45629h40754J92502O92373J32793q91150r82900J6766P31063K74608m92763l47021
45619a514483N24290R73013N70220r0565m94450o68591n90552q0075N13706M10979
45609d46508l76931p26596M6747J006261Q46885j65891o16338r4244L20441q3559
$$ plain form
45678 158764 -229180 -681802 -736959 -284566 45825 -417427 -1327256 -1549642 -623004 617974
45668 617974 1191178 1115362 913145 592271 -96380 -820964 -1044263 -1055380 -1629511 -2629483
45658 -2629483 -2960690 -2177183 -1171481 -800272 -685039 -50515 911590 1328045 924952
45649 924952 286806 15203 211107 644447 927308 656035 -148179 -861340 -923737 -503834
45639 -503834 -86399 326674 1034398 1854999 2196764 1873482 1236265 518605 -281044 -840754
45629 -840754 -648252 44121 176914 -714236 -1697136 -1680370 -949307 -674699 -1167462 -1514483
45619 -1514483 -990193 -17180 553040 462475 -31975 -700566 -1291118 -1371193 -857487 -446508
45609 -446508 -823439 -1550035 -1503288 -497027 349858 183967 -432371 -526615 -206174 -289733
45599b89733n41992j63039O33550Q83515N72570M15543N83014N86140K16547k30798
45589B665317n68129q27581q55158m72561K8902J99908J41318K42942L50808k3992
45579H81774p04808q97699l46880L35415O37321O77492N99748K64518j65930j48069
45569A132882L27132M85727q1479p19319p07271l00622j15950o2801L05277P72340
45559A035916O76716J3246m77846l71999m4486N6072M2877K03005L83114J89765
45549A706380l22794n75193k17828L11433L20707j47210l46653L2686L51416N4751
45539A167695l59857j28958M44889L89020l86828r54100q15737m57220k54709
45530a355805R9498O80454Q60147L43420k03559k06224m8928j85321j90251M18476
$$ plain form
45599 -289733 -831725 -994764 -361214 522301 1094871 1510414 2093428 2679568 2896115 2665317
45589 2665317 2097188 1269607 414449 -58112 -29210 170698 312016 554958 905766 881774
45579 881774 176966 -720733 -1067613 -732198 -94877 582615 1182363 1446881 1280951 1132882
45569 1132882 1460014 1945741 1864262 1144943 437672 137050 21100 -41701 263576 1035916
45559 1035916 1712632 1725878 1248032 876033 831547 887619 930496 1133501 1516615 1706380
45549 1706380 1383586 808393 590565 901998 1222705 1075495 728842 761528 1112944 1167695
45539 1167695 807838 678880 1123769 1512789 1125961 171861 -643876 -1101096 -1355805
45530 -1355805 -1256307 -575853 284294 627714 424155 217931 169003 -16318 -206569 211907
45520B11907J071311Q53764r7601q29536r06593o75908m51454k36826q9161n7047
45510a207144P4409L78497M10738j26828o86735n66467J6550L04941J49822m1854
45500a294071k04244n13560o00072R1528J154470J445641O41660k93054m39338
45491a1040N800K63666k850m55525m94653J49551R43885R09593j03651r27567
45481B77209n52182L98150O39447K10448J58276N02536J60350r02369j182171
45472b90306k4835J029845M20320j069613j461683l91561O21131M54214l08866
45463a021354m96476J20500P71343P15284L5872n02493l38839K07553L51056j26288
45453b83842o47306o80552l33215K3493K34902K79108J48258j024K6594J07849
$$ plain form
45520 211907 1283218 2136982 2039381 1209845 303252 -372656 -824110 -1060936 -1150097 -1207144
45510 -1207144 -1132735 -754238 -343500 -470328 -1157063 -1723530 -1706980 -1402039 -1252217 -1294071
45500 -1294071 -1498315 -2011875 -2611947 -2520419 -1365949 79692 721352 428298 -11040
45491 -11040 -5240 258426 255576 -199949 -694602 -545051 398834 1308427 1204776 277209
45481 277209 -274973 123177 762624 973072 1131348 1633884 1794234 891865 -290306
45472 -290306 -315141 714704 1135024 65411 -1396272 -1787833 -1166702 -712488 -1021354
45463 -1021354 -1517830 -1397330 -625987 89297 125169 -377324 -716163 -508610 -157554 -283842
45453 -283842 -931148 -1611700 -1944915 -1921422 -1686520 -1407412 -1259154 -1260178 -1233584 -1125735
45443a125735J1057p4630J70922M46368J81908l51202k88496L24561M39078k39600
45433e05769o75170k83470M4427l71339n83491M08309J709480J708589N17720
45424A969286l55418l43934k27376m07142l91017p9663p6655m38456m30094J25242
45414f55227M56227J82144j14922q7010k25761p01317p28350J19916R11057N85184
45404b58059m96634j116336p91009M509P44102J159430J000184L10925k56558
45395C00554j35112L10830L00091j62982l27285J02834N24805L30634l33734q86171
45385B4464r39734m63721K75815P63390N84763p0153n38962m78519k26538j87970
45375a257165j93001J83570Q37587J081029M45023p08283j509636j407375n72029
$$ plain form
45443 -1125735 -1114678 -1189308 -1018386 -572018 -390110 -741312 -1029808 -705247 -266169 -505769
45433 -505769 -1180939 -1464409 -1419982 -1791321 -2374812 -1966503 -257023 1451566 1969286
45424 1969286 1613868 1269934 1042558 635416 244399 164736 88081 -350375 -780469 -655227
45414 -655227 -199000 -16856 -131778 -218788 -444549 -1145866 -1874216 -1754300 -843243 -258059
45404 -258059 -754693 -1871029 -2662038 -2657529 -1913427 -753997 246187 557112 300554
45395 300554 165442 476272 776363 613381 286096 388930 913735 1244369 910635 24464
45385 24464 -915270 -1378991 -1103176 -339786 244977 174824 -364138 -842657 -1069195 -1257165
45375 -1257165 -1450166 -1266596 -429009 652020 1097043 388760 -1120876 -2528251 -3100280
45366c100280M09107J036874J081020N31920l23716q52173n19460M09678R53778
45357c73252N41594j97924k49512L57970O08944M3567n57847m31217j0624j16159
45347c84460n35449m29307J35389K49179j97650k15445N20335Q74514N4183r04809
45337h33520o47004L36909N11716k22347m90820J90914P10345L72629J8420L77295
45327C24537O98799R8064q08806q62848k14584Q0098j42275p9049M66703O96656
45317B57295J66958m92847n42671o7569L78249M88647K67156j68727n49923n38610
45307h02042q9709M36707O15827L05263k59245n54969j65108O61220J094639P06445
45297A949028O5049q6379Q6818j22062p32232r72382m29847L65213O67260L45722
$$ plain form
45366 -3100280 -2691173 -1654299 -573279 -41359 -365075 -1217248 -1736708 -1327030 -373252
45357 -373252 168342 -29582 -279094 78876 687820 731387 173540 -257677 -268301 -384460
45347 -384460 -919909 -1349216 -1213827 -964648 -1162298 -1377743 -857408 17106 71289 -833520
45337 -833520 -1480524 -1143615 -631899 -854246 -1345066 -1154152 -443807 -71178 -52758 324537
45327 324537 1023336 1121400 312594 -550254 -764838 -684740 -827015 -906064 -439361 257295
45317 257295 424253 -68594 -611265 -678834 -300585 188062 455218 286491 -263432 -802042
45307 -802042 -891751 -455044 160783 466046 206801 -348168 -513276 147944 1242583 1949028
45297 1949028 2014077 1927698 2014516 1892454 1160222 187840 -242007 123206 790466 1136188
45287A136188j41606k47495K12225P90614P17057j63896j010989j029339n48558
45278b85799l63299l65046J54279R89361J044109R1262o81167m03951K36184K16730
45268F32663k45618k66365J69576K74842j89133n76813m12593l0660N4799j03158
45258f92460r4625J49049K36810m9750k87939O3914P23220P36815j21681p51212
45248h7859k12376P22547N64027o12229j167778l11767Q13927R34272L01762j74812
45238G69714l71458n55576m33535K77976R16619O42132k15318o04649k88508O3287
45228B00684J21467K20978M68479M79472J26694k30649l81186m42646l62329M2447
45218B43411M64979K91852l98285p34004k44319M76495O52444L20874J0990j24589
$$ plain form
45287 1136188 994582 747087 959312 1749926 2466983 2303087 1292098 262759 -285799
45278 -285799 -649098 -1014144 -859865 129496 1173605 1264867 583700 179749 415933 632663
45268 632663 387045 120680 290256 565098 375965 -200848 -613441 -644101 -589302 -692460
45258 -692460 -787085 -638036 -401226 -450976 -738915 -675001 48219 785034 663353 -87859
45248 -87859 -300235 422312 986339 374110 -793668 -1105435 -291508 642764 944526 769714
45238 769714 398256 -157320 -590855 -312879 603740 1245872 1030554 425905 137397 200684
45228 200684 322151 543129 1011608 1491080 1617774 1387125 1005939 563293 200964 243411
45218 243411 708390 1000242 601957 -132047 -376366 100129 752573 1073447 1084437 959848
45208I59848l20738n72569n45893j67307Q6487k46542q78287r46080j14953P87424
45198a958610P17011j22227m63766K10674Q69708M68683m64537o36758J16755
45189a263067P60445O66301K65304O3292m0557k31723l65945l58687l53805k83157
45179a141599J22500O80944P79360L19051k0043J87215M52909K21608j91409j22521
45169A288015L36167M07371k72543j109914j200543l15058Q10449J156434M69312
45160A569690m50115o90395k85756L9653q668m8352J25591J75947o1564j79876
45150A86155J02080M14255L47988J05062O2075J17130j6404k25617k41447j70245
45140F81032k42643k88348m0821K28929K6427m80068n48083M8307O08911M66693
$$ plain form
45208 959848 639110 66541 -479352 -646659 -560172 -806714 -1685001 -2631081 -2746034 -1958610
45198 -1958610 -1241599 -1363826 -1827592 -1616918 -747210 -278527 -743064 -1379822 -1263067
45189 -1263067 -502622 163679 428983 492275 451718 219995 -145950 -504637 -858442 -1141599
45179 -1141599 -1019099 -338155 441205 760256 740213 927428 1380337 1601945 1410536 1288015
45169 1288015 1624182 2031553 1759010 649096 -551447 -866505 -56056 1100378 1569690
45160 1569690 1119575 429180 143424 183077 174409 126057 251648 427595 366031 186155
45150 186155 288235 702490 1050478 1155540 1217615 1334745 1318341 1092724 851277 681032
45140 681032 438389 150041 109220 338149 364576 -115492 -663575 -615268 -6357 460336
45130D60336j04329l44722q7133J30565k05m7101M28155R95898Q19218n4839n74118
45119A621725j59578L76880K9020q32475j007846k98299L08966K88486K21667
45110E48546M66043L66163m98835j260717r18119J15911O25998L14098q9121j50596
45100d80629j54848k65757k21322L688K1058k57621l51892Q7939P63803J116582
45090B61001R05161L13881k15106k53586J86613N29314K57637m04378p55305m54612
45080C70620K16300P47271P14426p933r04962j038438j85550O06463L28182n10704
45070C35675o53072m3036K15083j96043k93014M11235R31315L60055o82984j048552
45060f63338o73295k57885M126L64570O39419M04218j37067l42226p8017K35478
$$ plain form
45130 460336 356007 11285 -75848 54717 54512 7411 435566 1431464 2250682 2195843 1621725
45119 1621725 1462147 1839027 1868047 1035572 27726 -270573 38393 326879 548546
45110 548546 1014589 1380752 881917 -378800 -1296919 -1181008 -555010 -240912 -330033 -480629
45100 -480629 -635477 -901234 -1122556 -1118868 -1097810 -1355431 -1707323 -1619384 -855581 261001
45090 261001 1166162 1480043 1264937 1011351 1197964 1727278 1984915 1580537 825232 370620
45080 370620 586920 1334191 2048617 2040684 1135722 97284 -88266 518197 846379 335675
45070 335675 -317397 -360433 -145350 -341393 -634407 -223172 708143 1068198 385214 -663338
45060 -663338 -1336633 -1594518 -1590392 -1225822 -586403 -182185 -319252 -661478 -739495 -504017
45050e04017L82093M60190L80563k3925m43442l33663K58687O97110O04358J92346
45040A670300k27713n27719n69149k64301J36593K75889J83251J15118L8772j98134
45030F32907l56266j25604J59028j06175p10332p55593p038P10121P21819L38875
45020E01742J48644K06845L25421M71162M49263j24650j053406j440832r00982
45011a416793k19010j80852m29895k56556J40408J53655m298K88252P40947M83349
45001g00793l33336n25457K91698J017059O91431j56499m35352j9420L68129L00073
44991D97533k0254k76344l16299r8936K02266K23888j04400l24442m6660M50990
44981A87342N89708K45185k32113n49429o31053m19160M8178M35992L87637l001
$$ plain form
45050 -504017 -121924 338266 718829 694904 251462 -82201 176486 873596 1477954 1670300
45040 1670300 1442587 914868 345719 81418 218011 493900 677151 792269 831041 632907
45030 632907 276641 151037 310065 203890 -506442 -1262035 -1269073 -558952 162867 501742
45020 501742 650386 857231 1182652 1653814 2103077 1978427 925021 -515811 -1416793
45011 -1416793 -1635803 -1816655 -2246550 -2503106 -2362698 -2209043 -2213341 -1925089 -1184142 -700793
45001 -700793 -1034129 -1559586 -1267888 -250829 440602 284103 -151249 -170669 197460 497533
44991 497533 477279 200935 -115364 -214300 -12034 211854 107454 -216988 -263648 187342
44981 187342 777050 1022235 790122 240693 -390360 -809520 -761342 -325350 62287 59286
44971E9286k93319k30904P1540M12350O47551O31001L33761m72j16593j31489
44961A382712l36201o33721n63366k859M98531L47523k92236n97133l0560R44162
44951G16852J270860M89238o61704j088598o68955k68554m04156n47569j30251
44942a292837M11722L18522j92379k21607L51321O71610L09095q2005J07060M63776
44932H44278L04354k04418l67370l5288L05083L05454M6974k93530n54101m99030
44922a47594j17606J13568k21807p77830q36549l19136J92727M10965O19933R03828
44912a79501Q48165L13161j76225k32200j81721l45861l59832J07287M89067O4237
44902C46577p63469r18117k75576K07849R4422R1358O60954J029613L39888r26113
$$ plain form
44971 59286 -234033 -464937 -393397 18953 666504 1297505 1631266 1630794 1514201 1382712
44961 1382712 1046511 412790 -150576 -153435 345096 692619 400383 -196750 -227310 716852
44951 716852 1987712 2476950 1815246 726648 57693 -210861 -615017 -1162586 -1292837
44942 -1292837 -881115 -562593 -754972 -976579 -625258 46352 355447 273442 380502 844278
44932 844278 1148632 944214 576844 541556 846639 1152093 1199067 905537 351436 -147594
44922 -147594 -265200 -151632 -373439 -1151269 -1987818 -2306954 -2114227 -1703262 -1083329 -179501
44912 -179501 668664 981825 805600 573400 391679 45818 -314014 -206727 282340 346577
44902 346577 -416892 -1335009 -1610585 -1402736 -1308314 -1216956 -556002 473611 813499 -112614
44892a12614j525829j025262l8620P34459R76238N95368j02657l47122J99668
44883f46371P31369L54750m22625l63416M73438P02190k01309j056349q51343
44874a279666j67778O6077P3175M27400P26129L15395l42347l26094J81396K79887
44864d6426l2773K6331M66111M68744o1148k76629M0984M3289n99150r52436l54109
44853a277212M13570L57250j84742j91420M48760R34357P84819K70663j77263
44844A378782l46907k07477O737j18373o02466q74957n49376k8554J08421o3515
44834a297685r7651R0603L12715N62732Q02003O52015l8384o35062m56208J68911
44824F3989L45224n2938l19986j38047K6128j13009j34764K90495P26745N48457
$$ plain form
44892 -112614 -1638443 -2663705 -2702325 -1967866 -991628 -396260 -498917 -846039 -646371
44883 -646371 84998 439748 17123 -346293 127145 829335 628026 -428323 -1279666
44874 -1279666 -1447444 -1381367 -1308192 -880792 -154663 160732 -181615 -507709 -326313 -46426
44864 -46426 -79199 -52868 413243 881987 820839 544210 585194 628483 29333 -923103 -1277212
44853 -1277212 -863642 -506392 -691134 -882554 -433794 500563 1285382 1556045 1378782
44844 1378782 1031875 824398 831135 712762 110296 -764661 -1314037 -1342591 -1234170 -1297685
44834 -1297685 -1395336 -1304733 -992018 -429286 372717 1024732 986348 351286 -104922 63989
44824 63989 409213 356275 36289 -101758 -75630 -188639 -323403 -32908 693837 1242294
44814A242294k10250r51161j168293p40053J39898J016610J347291R19621Q7995
44805A683952n16109n12086o3451K67485N9800m49504n70568o8109M17558K14606
44795D63574l85197n12903L6217N79520N91128L18191J55367J1406l16088n85263
44785C55952m22059L5235K61672O9038j60257m0391K64103K42989k51409p09472
44775c54599n47096J13726N49169L68848j9330p9305J10918J61772P4103J04037
44765D82243J38153j71423o90946q46362m76910q6216o3673j66728l9479J88440
44755a732901J64794j02149k45612J924N37682R75173R39455M26673j21999k88453
44745E54587j58674p6503m1287K12341N68991N20688m6685n64339n42259j94518
$$ plain form
44814 1242294 1032044 80883 -1087410 -1827463 -1687565 -670955 676336 1595957 1683952
44805 1683952 1167843 655757 592306 859791 919591 470087 -100481 -168590 248968 463574
44795 463574 78377 -434526 -398309 181211 772339 1090530 1245897 1257303 941215 355952
44785 355952 -66107 -30872 230800 299838 139581 99190 363293 606282 354873 -354599
44775 -354599 -901695 -787969 -238800 130048 110718 31413 142331 304103 378206 482243
44765 482243 620396 448973 -241973 -1088335 -1565245 -1651461 -1715134 -1881862 -1921341 -1732901
44755 -1732901 -1568107 -1670256 -1915868 -1913944 -1376262 -401089 538366 965039 843040 554587
44745 554587 395913 319410 278123 490464 1059455 1580143 1533458 969119 426860 232342
44735B32342N16j5922o312N6821K7199m0276N5082K82499L72964J99152o9597
44724A094468k29922k93409l95564n38894n40900k93556K114L6999j60563k32864
44714a552091m9095O5795j11172k55646J7993N18280P86776P95224P90932O63705
44704A670701J32846n26544o58872j81088K95165L72286K34035L310n13935j172316
44694c44412j287329n36850M45798Q10228M64741n720r0143K06356M05910j8493
44684E0086r35180j384720o78370M60789O53236k36218q94524m33281N36449J039213
44674a822520R32365M97417j55704o74983m33144L99568P01493O5028m00094J71967
44664g18607R01563N82407l66331p48555n83049o78692q22466j38680J013863
$$ plain form
44735 232342 232858 216936 210624 267445 294644 254368 309450 591949 964913 1164065 1094468
44724 1094468 864546 571137 175573 -363321 -904221 -1197777 -1195663 -1158664 -1319227 -1552091
44714 -1552091 -1601186 -1535391 -1646563 -1902209 -1884216 -1365936 -579160 216064 1006996 1670701
44704 1670701 1803547 1277003 618131 437043 732208 1104494 1338529 1341839 827904 -344412
44694 -344412 -1631741 -2168591 -1722793 -912565 -447824 -453544 -543687 -337331 68579 50086
44684 50086 -885094 -2269814 -2948184 -2487395 -1834159 -2070377 -2964901 -3398182 -2861733 -1822520
44674 -1822520 -890155 -392738 -548442 -1223425 -1656569 -1257001 -555508 -490480 -890574 -718607
44664 -718607 182956 765363 399032 -349523 -932572 -1611264 -2433730 -2572410 -1558547
44655a558547J271767M41337k00205l754K15095j51661m65944j14023M17943M67536
44645C19544K18774J29015J56903J44577K20116L26159R4347l78191m24762Q9387
44635H95869M17954J56134j14138K1177j0430o42620j125926o00630M55471Q79221
44625C32082M42446j61525n54926q75176r70257m27887N59614J184103J005948
44616E34422L79271j28366k48839j2595K73195J38444m88799r84437p78978j92426
44606a509108O1330j7396J70209O95145Q95762M07855l16444p21271p55505n49485
44596a638908r5162M43608O44936M22008K45725L97747M46801n0492o87117o44287
44586e15141J45838Q39975P33790M8101m47588k93776K96280P15411N09078j93336
$$ plain form
44655 -1558547 -286780 154557 -45648 -49402 165693 14032 -451912 -565935 -147992 319544
44645 319544 538318 667333 824236 968813 1188929 1515088 1609435 1231244 806482 895869
44635 895869 1313823 1469957 1355819 1376996 1366566 723946 -401980 -1002610 -547139 332082
44625 332082 774528 613003 58077 -817099 -1787356 -2215243 -1655629 -471526 534422
44616 534422 913693 785327 536488 523893 797088 935532 446733 -537704 -1316682 -1509108
44606 -1509108 -1447778 -1465174 -1294965 -599820 295942 703797 387353 -333918 -1089423 -1638908
44596 -1638908 -1734070 -1290462 -645526 -223518 22207 419954 866755 816263 129146 -515141
44586 -515141 -369303 470672 1204462 1252563 804975 511199 807479 1522890 2031968 1838632
44576A838632p42952o18293j0682M18023L21327o6964m28436o98608p91409m81244
44566a260606J07516L36703j22473o48023m63696J81978L92616O1554J6917N82150
44556h15364R47686M47691l47293m93696m6534J85538j08628m59298l98580N9067
44546a029411N92656Q00832M43729k02351n38681m74162n44129q49894o52009
44537b453420L34348J083843O77337j70178k07771L49791L55154j88445k37513
44528d56854K63810K43108m58615o78612M514N10637K09891j3618M78155Q08274
44518I10690J91797n46648l49251K83493K20162m39413p20570l19233L54613J031429
44508F17069J436697J021544r1900o88893j29564M27980k16176j224807j010749
$$ plain form
44576 1838632 1095680 477387 466705 884728 1206055 1139091 710655 12047 -779362 -1260606
44566 -1260606 -1153090 -816387 -938860 -1586883 -2050579 -1868601 -1475985 -1414431 -1397514 -815364
44556 -815364 132322 580013 232720 -260976 -307510 -121972 -230600 -689898 -1088478 -1029411
44546 -1029411 -436755 364077 807806 605455 66774 -407388 -951517 -1801411 -2453420
44537 -2453420 -2119072 -1035229 -357892 -528070 -735841 -386050 -30896 -219341 -456854
44528 -456854 -193044 50064 -408551 -1087163 -1082649 -572012 -362121 -375739 102416 910690
44518 910690 1102487 555839 206588 490081 710243 270830 -449740 -768973 -414360 617069
44508 617069 2053766 3075310 2983410 2294517 2164953 2592933 2376757 1151950 141201
44499A41201J28354N12990j89836o50700j95836L86872M84987M10221K76389k67082
44489A037560q73651o29338K72067N09917k46877p37893k13001L98630K04325
44480b78261k20830r5058J70673m8349l00804O3053N99026N32951J04313K738
44470E29452P1251k69329p68026o72644l4356L65094K32927M338l186J43421M28006
44459B6948Q05709Q43710K44290l99146k29727N03507N96653m05738j472438j432033
44449i18265m41202L83680M19071Q2476L3632L06460M36528K16291l5640k5162
44439D57869L8385j92314n99541p80319o68823m83560j85130L77014Q21995N28727
44429f85697k82118n81619K0196O48459M52662k07388m45989q9959L99123O94568
$$ plain form
44499 141201 269555 782545 592709 -57991 -253827 133045 618032 1028253 1304642 1037560
44489 1037560 163909 -465429 -193362 316555 69678 -668215 -881216 -482586 -278261
44480 -278261 -499091 -594149 -423476 -471825 -772629 -709576 -110550 422401 526714 529452
44470 529452 600703 331374 -436652 -1109296 -1143652 -778558 -545631 -541293 -544479 -401058 26948
44459 26948 832657 1676367 1920657 1521511 1291784 1795291 2391944 1986206 513768 -918265
44449 -918265 -1359467 -975787 -556716 -474240 -440608 -134148 302380 518671 483031 457869
44439 457869 496254 303940 -295601 -1075920 -1744743 -2228303 -2413433 -2036419 -1214424 -685697
44429 -685697 -967815 -1549434 -1529238 -880779 -428117 -635505 -1081494 -1171453 -772330 -77762
44419g7762O66869J96789m33990m94604J69484O15583Q4572p58985p97912j76484
44409a006440N8918k96586m38663l7604L22513L04108K77506L71362J47131l86379
44399f84134m60479J92963O83418K79323l74514k25493N23360O95722r2424q80944
44389c43202p44099K116L85929J46364n6108K47883N83963K71516m36279o31979
44379e73896j72503J4308n56069r44046j70829J047758J174700K08772k67561
44370b39366L82811P75975k39235j531456j223532M53803J392507N74107o48249
44361c02635o17301M65062J181880R00133K02532k73990m86282n09749k47558
44352C12092J45164J71484l08075p30962n77399r8127J32958P0610P1813J67571
$$ plain form
44419 -77762 589107 785896 351906 -142698 26786 642369 726941 -32044 -829956 -1006440
44409 -1006440 -947522 -1244108 -1682771 -1720375 -1397862 -1093754 -816248 -444886 -297755 -684134
44399 -684134 -1144613 -951650 -268232 11091 -363423 -588916 -65556 630166 537742 -343202
44389 -343202 -1087301 -1085185 -699256 -552892 -609000 -361117 222846 494362 58083 -573896
44379 -573896 -746399 -732091 -1288160 -2232206 -2403035 -1355277 -180577 28195 -239366
44370 -239366 143445 919420 680185 -851271 -2074803 -1621000 -228493 345614 -302635
44361 -302635 -919936 -454874 727006 1627139 1829671 1555681 1069399 559650 312092
44352 312092 457256 628740 320665 -410297 -987696 -1085823 -952865 -882255 -810442 -642871
44342f42871J14687O6291M45442J055630J064505J73367q29825j066211n76956
44333a95941L8367M31535M87241N5985o82007j027176n81779R8383K95719J72513
44323i07160K99244N49992L86103j3580N7467N50449O07764m9216o52778o08217
44313B20068k92003k31588k94052j82423l2561K9861K94872Q23336R61088K22579
44303A519177p37183q24412j5570N77906K01703o01944p77209p6003P25891Q00682
44293G93038J76657m17720m61546j34612J21948J86932J60880K3723j95911j72507
44283H0882K80499P28790O55166K96518K47078L77410K4749p41819j050395o34290
44273B64588k83840m78555n78887l460P06838P82232M00448J21341j42437o29696
$$ plain form
44342 -642871 -528184 -461893 -16451 1039179 2103684 2277051 1447226 381015 -195941
44333 -195941 -157574 273961 761202 817187 135180 -891996 -1473775 -1375392 -1079673 -907160
44323 -907160 -607916 -57924 328179 314599 372066 922515 1530279 1481063 828285 220068
44313 220068 -71935 -303523 -597575 -779998 -812559 -782698 -487826 335510 1296598 1519177
44303 1519177 781994 -42418 -57988 519918 721621 119677 -657532 -733535 -7644 793038
44293 793038 969695 551975 90429 -44183 77765 264697 425577 449300 253389 80882
44283 80882 361381 1090171 1745337 2041855 2288933 2666343 2691092 1949273 898878 264588
44273 264588 -19252 -497807 -1076694 -1080154 -373316 408916 809364 930705 788268 158572
44263A58572q36424k42233N03810L42619m47906n08438N29875J401099R79073
44254A880047k41661r24692n02134M41509R51690N37068m47691j056561o89913
44245e2338J63919M88450K6491m74875l42545K35273O25653M61304k05974r85230
44235e9872j240429o04561M13527Q22634L65965j42276L6859N78823O50123P7152
44225H97945n01889m83977N9068N28673L95629k70300p88586n47553K63596Q35400
44215C88006O90454J61346j52160o8161J69456K59943O2469l08222n02150l00690
44205D00291J9616L4103j32538M1602N45870O79634R7284n93925p10210m30998
44195d9271l13758l20434k1883M77459N52709q112o63489p87145k52157O59892
$$ plain form
44263 158572 -677852 -920085 -416275 -73656 -521562 -1030000 -500125 900974 1880047
44254 1880047 1638386 713694 211560 653069 1604759 2141827 1694136 637575 -52338
44245 -52338 111581 600031 626522 151647 -190898 44375 670028 1131332 925358 -59872
44235 -59872 -1300301 -1904862 -1491335 -668701 -302736 -445012 -408153 170670 820793 897945
44225 897945 396056 -87921 -28853 499820 895449 625149 -163437 -710990 -447394 388006
44215 388006 1078460 1239806 1087646 1019485 1188941 1448884 1511353 1203131 700981 400291
44205 400291 419907 454010 321472 363074 908944 1588578 1685862 1091937 381727 -49271
44195 -49271 -363029 -683463 -705346 -227887 324822 316710 -346779 -1133924 -1386081 -726189
44185g26189J486921J685690R79659k13067j034636j041028n63649j42956Q9692
44176E20437L12938N76253O98936M95285l5149o57737j007408r02292n91105m82761
44166a072603n76502m38989J11230O18542N93757K51081J92709M56348M25768
44157E61341j70476p00317m55455L20277P47223M96204J09683J24051L97510M72676
44147A902717J69640l88110r41229j074749m77969M64232P93520J29790o96995
44138a19153o92098k5470L14600n1142n20259m70367P2520P02198R68714N24722
44128G04265m13268q69663j72484Q69372Q30947k33077p34372O3227Q77658L94463
44118A317068p10627q69708L5817P34423N77841J94297J46118R3772l84007r58905
$$ plain form
44185 -726189 760732 2446422 3426081 3213014 2178378 1137350 573701 430745 520437
44176 520437 833375 1409628 2108564 2603849 2568700 1910963 903555 1263 -589842 -1072603
44166 -1072603 -1649105 -2088094 -1976864 -1358322 -764565 -513484 -320775 135573 561341
44157 561341 390865 -309452 -764907 -444630 302593 798797 908480 1032531 1430041 1902717
44147 1902717 2072357 1684247 743018 -331731 -809700 -345468 448052 577842 -119153
44138 -119153 -811251 -836721 -522121 -573263 -1093522 -1563889 -1491369 -789171 179543 704265
44128 704265 290997 -578666 -751150 118222 949169 716092 -18280 44947 922605 1317068
44118 1317068 606441 -263267 -227450 506973 1084814 1279111 1425229 1519001 1134994 176089
44108A76089r90612l81395L14773M82468Q4823k32797J21720P92409P95609n5633
44098A107454p37806n02046L655j21295n01264j94886O00800Q48399M06742J30276
44088A040029K90916K53234j49427k63062N3628L8545n71649r62846o25412j62041
44078a058085q3776N5549N60423P47444J41945m65941k22967L63940L21113j92236
44068A67409l46927j05541k375N9806N22270R97974O65558k98448q60289o43136
44058A56301k10467Q3223L94890N81318K73075j70158J5793N63815L35558p62211
44048A261137j333306n51134N37478N72025k48486p64798n47824l7425M15290
44039f97043O90905N08851j88396p25027m07143M17820P75990M14391j3204n7556
$$ plain form
44108 176089 -814523 -1195918 -881145 -398677 -313854 -546651 -424931 367478 1163087 1107454
44098 1107454 369648 -132398 -128743 -250038 -751302 -946188 -345388 503011 909753 1040029
44088 1040029 1330945 1584179 1434752 1171690 1225318 1263863 692214 -270632 -896044 -1058085
44078 -1058085 -1141861 -1086312 -525889 221555 363500 -102441 -325408 38532 359645 167409
44068 167409 -179518 -285059 -287434 -227628 294642 1292616 1958174 1659726 799437 156301
44058 156301 -54166 29057 423947 1005265 1278340 1108182 1123975 1687790 2023348 1261137
44048 1261137 -72169 -623303 -85825 486200 237714 -527084 -1074908 -1112333 -697043
44039 -697043 -6138 502713 314317 -410710 -817853 -400033 375957 790348 777144 719588
44029G19588j2331k15831m66446m07257n6010L11797N11960M69568J28391m14572
44019E68857q00444o75277j21025L13710J74621l16716m69434j9677M85864M88490
44009c71031K49019L39388N82962L21661l00655l20395M64220Q74775k1939j439412
43999C78593j867377j025427N4709N55062N85052N28237N15920N63300N78948
43990H67017K68704l99468p95868l77497L34926L61412k37573m39341P1021M00334
43980E3667J0425k95614K91500J115544R45879j36263q51068o15597k53573n43778
43970b78878r77203o09133L89867Q76169L63997k68951n2027O74335P81071L9373
43960I38620n35354k04652M09823L11698l67176o31794j33606M21428L94278j2927
$$ plain form
44029 719588 707257 491426 24980 -382277 -438287 -126490 385470 855038 983429 568857
44019 568857 -231587 -906864 -1027889 -714179 -539558 -856274 -1325708 -1345385 -859521 -371031
44009 -371031 -122012 217376 800338 1121999 821344 500949 965169 1839944 1818005 378593
43999 378593 -1488784 -2514211 -2459502 -1904440 -1319388 -791151 -275231 288069 867017
43990 867017 1135721 736253 -59615 -437112 -102186 259226 21653 -417688 -346667 53667
43980 53667 64092 -231522 59978 1175522 2121401 1985138 1134070 518473 264900 -278878
43970 -278878 -1256081 -1865214 -1475347 -599178 -235181 -504132 -556159 118176 899247 938620
43960 938620 403266 198614 608437 920135 552959 -78835 -212441 208987 603265 590338
43950E90338k93698l00708q9443L38510P71057P26139P5048o13251p50420m72912
43940a9340l12844l74476l04183L3516L12028K24621j22685m04772m37028k17883
43930a623046K22765Q05964J227652J034801J45937p64181q13455k2676N56041
43921G69802J90693m95825m60851J63646L28286k04122m99189p1768K70213j55914
43911a65029o33963j70628P95322R75019K05698l56122n9979L34809l5277q06319
43901H3531r93839m27292J01580m746l87373k85027M18245R97011Q04194J43398
43891D49682j23441K20876M59583N8324m91069m28923J13595L92887K33508J50615
43881A035637L35038L20023j38284n42930l92647N7607J78010k16760p74617j090710
$$ plain form
43950 590338 296640 -4068 -93511 244999 1016056 1742195 1817243 1203992 453572 -19340
43940 -19340 -332184 -706660 -1010843 -977327 -665299 -440678 -563363 -968135 -1405163 -1623046
43930 -1623046 -1400281 -594317 633335 1668136 1814073 1049892 236437 213761 769802
43921 769802 960495 464670 3819 167465 495751 291629 -207560 -279328 -9115 -165029
43911 -165029 -798992 -969620 -174298 800721 1006419 650297 590318 925127 889850 83531
43901 83531 -910308 -1337600 -1236020 -1240766 -1628139 -1913166 -1494921 -497910 306284 449682
43891 449682 326241 547117 1006700 1065024 573955 145032 258627 651514 885022 1035637
43881 1035637 1370675 1690698 1552414 1009484 616837 674444 852454 635694 -138923 -1229633
43871a229633r87483m98333J60721P01018R90902J072773R26573M53461k34766
43862A355233p81336r51435p88943l52549L46142J001605J030568K57416o88317
43853D28384j007651o10568p2756J42957J09529J22119K33791K03470j46691n74390
43843a171806n62990J2213N40318L77335k02737l13520K26475N69351J41187m34000
43833h18174l06945K72792M17655M4261p3772L64573P12421M30293j31434l37041
43823E74629r3694K45164L49964L5613o14113r97523m24504Q48133J574231J000738
43813B498638j25160o23250m46679l85577o00019n00390l7411R319o21488j000275
43803a832292l23678P77458J034773K80045m01062j65771O08178R60948M95036
$$ plain form
43871 -1229633 -2217116 -2715449 -2554728 -1853710 -862808 209965 1136538 1589999 1355233
43862 1355233 573897 -377538 -1166481 -1519030 -1172888 -171283 859285 1116701 428384
43853 428384 -579267 -1189835 -1262591 -1119634 -1010105 -887986 -654195 -450725 -597416 -1171806
43843 -1171806 -1734796 -1722583 -1182265 -804930 -1007667 -1321187 -1094712 -525361 -384174 -818174
43833 -818174 -1125119 -852327 -434672 -390411 -464183 -99610 612811 1043104 911670 574629
43823 574629 480935 726099 1076063 1111676 497563 -499960 -924464 -76331 1497900 2498638
43813 2498638 2373478 1750228 1303549 917972 317953 -182437 -219848 -210529 -832017 -1832292
43803 -1832292 -2155970 -1378512 -343739 -63694 -464756 -630527 -22349 938599 1433635
43794A433635l23121p53656n09949K6842K81212J46005J540N2624Q511l50627
43784A3016o72443n16053n4161K09758K22864L09984M42954K52873j75587k02664
43774a69459M08140R69952O93402k94515j089137j001376k13461M52373L75498
43765A31417j46225j78795O03542J281624Q46923l00942q49314m52303q3025l66665
43755D86237o99511m77037r1242J65J82821P55316R93527K57668o73520o06136
43745A28288K32688O20070K29302k09964l93862o91401r66775n79894K81666O35944
43735g13938L43630L60422R64272J127027K77889o36686o84947l37053l43987
43726C56629l34852K84786R32961O76524j60037n24484l34986l34293n48251k79373
$$ plain form
43794 1433635 1110514 356858 -153091 -126249 154963 300968 302508 355132 363643 13016
43784 13016 -659427 -1175480 -1229641 -1019883 -797019 -487035 -44081 208792 33205 -169459
43774 -169459 238681 1208633 1902035 1607520 518383 -482993 -696454 -244081 131417
43765 131417 -14808 -193603 409939 1691563 2538486 2237544 1388230 935927 852902 486237
43755 486237 -213274 -690311 -781553 -781388 -598567 156749 1150276 1407944 734424 128288
43745 128288 360976 981046 1210348 1000384 606522 -84879 -1051654 -1631548 -1349882 -713938
43735 -713938 -370308 -9886 954386 2081413 2359302 1722616 1037669 700616 356629
43726 356629 21777 306563 1239524 1916048 1756011 1231527 896541 562248 13997 -265376
43716b65376M04823N44189j17507o19359k86543K90226L25984K6703L8401L53922
43706F95463M82918L16058J63804J53138J50178J69556L45930M91606J54713o88019
43696B435345j316956r96305M0296O91610K72740n76533o67757J82158R45394
43687A009992Q21990K11691j29972k50363o17284j035120q57653j53390K56025
43678g44084L7258k07793n128K59482J21266j12143R5081N71402P27471N10125
43668A252937L66931L58485L0768o89885j123840p30655O4594M02312R6081k82164
43658b54436l09145j53131m2454J39342M27663M28671j09258o86979o02407L7727
43648a124407M53878L00685J3809j21J41758K75212M81514O36384L58596k19305
$$ plain form
43716 -265376 139447 683636 566129 -53230 -339773 -49547 276437 303140 341541 695463
43706 695463 1178381 1494439 1658243 1811381 1961559 2131115 2477045 2968651 3123364 2435345
43696 2435345 1118389 122084 162380 853990 1126730 550197 -117560 64598 1009992
43687 1009992 1831982 2043673 1913701 1663338 1046054 10934 -846719 -1000109 -744084
43678 -744084 -706826 -914619 -919747 -660265 -538999 -651142 -556061 15341 742812 1252937
43668 1252937 1619868 1978353 2009121 1319236 195396 -535259 -470665 -68353 27728 -254436
43658 -254436 -563581 -716712 -759166 -619824 -192161 236510 127252 -559727 -1162134 -1124407
43648 -1124407 -670529 -369844 -356035 -356156 -214398 60814 542328 1178712 1537308 1318003
43638A318003l51000J43950L55329l40060j091445p47452L24718P70783L02995
43629F85821p1913J47534K91635l8793j80584K86672N67521q8188r79015q86497
43619b65807P7849O53266K56378l96851n27515k31837M6634K07142K77221J13922
43609B10402k24161k68775J85986N67386K84688k36827m2317Q24254J134133J97110
43599B631879r91958j053828j53051L28934j62477p21575n36458O01K17235K46628
43589a94070M50054N05691j3196o57349o54353j23753J88466J51193K51979M97185
43579D01847L54418j52979l11664J11569M93753M29055K95805M04151M31069J45897
43569B602921q6183k0117k0856l05551m02096J7587L96397P8468o56578j009949
$$ plain form
43638 1318003 967003 1110953 1466282 1126222 34777 -712675 -387957 382826 685821
43629 685821 613908 761442 1053077 1014284 833700 1120372 1687893 1599705 620690 -265807
43619 -265807 -187958 465308 721686 324835 -202680 -434517 -387883 -180741 96480 210402
43609 210402 -13759 -282534 -96548 470838 755526 518699 476382 1300636 2434769 2631879
43599 2631879 1639921 586093 433042 761976 599499 -122076 -658534 -657933 -440698 -194070
43589 -194070 255984 761675 748479 91130 -563223 -686976 -498510 -347317 -95338 401847
43579 401847 756265 603286 291622 403191 896944 1325999 1621804 2025955 2457024 2602921
43569 2602921 2516738 2496621 2475765 2170214 1768118 1785705 2182102 2260570 1603992 594043
43559E94043p10181p5314N24312P15816J71783p49578r74112p7602Q73731P30676
43549A023574m0377j56263M33232O29066J31881j77306L0742o4223p52276r47003
43539A11047K7044R72554M39575r44533j233010J5308J119716O98967n38754j014614
43529c46700l74217M44896P12115N87579M34453K27663j41098m65215m53996j43928
43519D81552J57645K26274O1256k17283m45290m51427j86355J61325K71284k8332
43509C0649n55290q26913m19172N57733J379691J351527N78754j61968l91606
43500A543405m13226o46810r07764p58954k66070J35430L63948P04356J120701
43491H75016J135484N36344k54150o98258o88732m47576k13261j45769k31752
$$ plain form
43559 594043 -116138 -191452 332860 1048676 1220459 470881 -503231 -580833 292898 1023574
43549 1023574 983197 826934 1260166 1889232 2021113 1843807 1874549 1810326 1058050 111047
43539 111047 138091 1110645 1550220 605687 -627323 -612015 507701 1206668 667914 -346700
43529 -346700 -720917 -276021 436094 1023673 1458126 1685789 1544691 1079476 625480 481552
43519 481552 639197 865471 926727 709444 264154 -187273 -373628 -212303 58981 30649
43509 30649 -524641 -1351554 -1770726 -1212993 166698 1518225 2096979 1935011 1543405
43500 1543405 1130179 483369 -424395 -1183349 -1449419 -1313989 -950041 -245685 875016
43491 875016 2010500 2546844 2292694 1594436 905704 458128 244867 99098 -132654
43482a32654k04641J18623M01023J17327n98980r39971m57718L44712P23302N74720
43472e4257K80639L3739k62344n94102o99407l48322L28333P77766M52019m62598
43462e48534r70809l91345O38810R37483M20873R3737L53712L94972k84288q50448
43452b05837l91204N92919Q70616J60015o99764r03303l14837O78266J308043
43443A094914Q57709l79179j056895m28494N17160M60261k89884m08158K79197
43434F46631O26696J10506m38826k91190K01115M59803M64004K49802l80367j142885
43424E05289j195911l65372L99857M28183L23938P73880J170144N14560q08091
43415A746477j378124p46442L9880Q5712j94867j8089M87455O41414L76556K40138
$$ plain form
43482 -132654 -337295 -218672 182351 299678 -299302 -1239273 -1696991 -1352279 -628977 -54257
43472 -54257 226382 260121 -2223 -596325 -1295732 -1644054 -1315721 -537955 -85936 -548534
43462 -548534 -1519343 -1910688 -1271878 -334395 86478 180215 533927 928899 644611 -205837
43452 -205837 -597041 -4122 866494 1026509 326745 -576558 -891395 -213129 1094914
43443 1094914 1952623 1573444 516549 88055 605215 1065476 775592 367434 646631
43434 646631 1273327 1383833 945007 653817 854932 1314735 1778739 2028541 1648174 505289
43424 505289 -690622 -1055994 -656137 -227954 95984 869864 2040008 2554568 1746477
43415 1746477 368353 -378089 -338209 -252497 -447364 -465453 22002 663416 1039972 1280110
43405A280110L60188J93797m93525j048352p90155k7207L74989K12200O5633K63527
43395C91205M48622L33298J60702R2593j51917n67475m84140L65530J004765L93679
43385A986862q98317j269255k82342P58289O54723j76464n03672O7254Q04415
43376A141493Q90714K97219l08189l20362J35002L61342K001m90529n71925l99918
43366G36848l81183l07453K45948Q63111O30638l67372r08681l52487M14849L36367
43356I10585k76069l51144K71772O67837K21791n51599p64963k62386L20331L89259
43346E75414K101l66076m39607l14904j15169J76386M51782M25296P7396j84118
43336B88501q2739J54479K87864M95846Q79445R83930M07229m57635r01037q16309
$$ plain form
43405 1280110 1640298 1834095 1340570 292218 -497937 -525144 -150155 62045 127678 391205
43395 391205 839827 1173125 1333827 1426420 1274503 707028 222888 588418 1593183 1986862
43385 1986862 1088545 -180710 -463052 295237 949960 773496 269824 337078 1141493
43376 1141493 2032207 2329426 2021237 1700875 1835877 2197219 2199220 1708691 1136766 736848
43366 736848 355665 48212 294160 1157271 1787909 1420537 511856 159369 574218 910585
43356 910585 634516 283372 555144 1222981 1444772 893173 128210 -134176 186155 575414
43346 575414 577515 211439 -228168 -543072 -658241 -481855 -30073 395223 472619 288501
43336 288501 205762 360241 648105 1143951 2023396 3007326 3414555 2956920 2055883 1239574
43326A239574n55145k40407J06957J67131j67467k81243K92245Q96378O37451
43317B095474j64056n33494m45461n41298o02235Q5211R74193O90459n73529r70148
43307A5116J66257J219495Q37945j58718m89904m14666o68377p79280l8852Q44433
43297E33449O87720k13209n66336p9003L92475L87902K77453K91144J97793p3276
43287A836112l08223m32985m68789l12392n7130q9523l70032k49742M15061P55997
43277G18354K47221l03090o2584M00327J62632l85788k90265J87315M6969n93237
43267A27854o71533l5894L82697K44434K08976N30122N98765J72931j50535m6576
43257A361241L9831j24074r7671K70223L47842k50056q69095o62840K20085Q17301
$$ plain form
43326 1239574 684429 444022 550979 718110 550643 269400 561645 1458023 2095474
43317 2095474 1931418 1397924 952463 411165 -191070 -105859 868334 1558793 985264 15116
43307 15116 181373 1400868 2238813 2080095 1590191 1175525 507148 -272132 -310984 533449
43297 533449 1221169 1007960 441624 362621 755096 1142998 1420451 1711595 1909388 1836112
43287 1836112 1527889 1094904 626115 313723 256593 167070 -202962 -452704 -37643 718354
43277 718354 965575 662485 599901 1000228 1162860 777072 486807 674122 721091 127854
43267 127854 -543679 -579573 -196876 47558 256534 786656 1385421 1558352 1407817 1361241
43257 1361241 1401072 1276998 1179327 1449550 1797392 1547336 678241 15401 235486 1052787
43247A052787N16004k79543o02042J820Q72199R70574K26520m15902m60729n00732
43237A380956r09969r31059L596R79774Q80896K11662J97550O42659L42785o81224
43227B117626j150447p26861m51524p00838m72141O66734J514372J046810K7844
43218A871575k20317K96148O14036L76651K4053j64378l33640n16212m81550j22656
43208A343710L55606O24305M84877L8757l70347m95495l77197j09047K78309N25019
43198B298497K32723m15725o27514j51891K59398J38134J38438P12056R60516
43189C544632R3853q78118n38051N48860O97590r3496k71171M58778O44434k61271
43179C946040q74933k31475O67394N84818j66951o35449o89917o57034m91808
$$ plain form
43247 1052787 1568791 1289248 687206 689026 1561225 2531799 2758319 2342417 1881688 1380956
43237 1380956 470987 -460072 -456476 523298 1404194 1615856 1813406 2456065 2798850 2117626
43227 2117626 967179 240318 -211206 -912044 -1384185 -717451 796921 1843731 1871575
43218 1871575 1651258 1947406 2561442 2938093 2962146 2797768 2464128 1947916 1466366 1343710
43208 1343710 1699316 2323621 2808498 2847255 2476908 1981413 1604216 1495169 1773478 2298497
43198 2298497 2531220 2115495 1487981 1336090 1595488 1733622 1872060 2584116 3544632
43189 3544632 3638485 2760367 2222316 2771176 3468766 3375270 3104099 3562877 4207311 3946040
43179 3946040 3071107 2839632 3507026 4091844 3924893 3289444 2599527 1942493 1450685
43170A450685j04878K67245N24753P67089O96165m7852q62466p27589J06137L72280
43160B441569j25930l01635Q7898m5784r32466j195926j70558Q64121Q42289N73893
43150B037471R87333J328944O09662m92521p44776l28329k19684m81346n54184
43141B142570n00447o59561p05243k11550M14072N66712M20180L99815L71293
43132B237841K03663L84918J158969J721882J178413k12035j411913j697068r57621
43123B607049L47988J174958P02681n00492j045620o17004j47561l8719K87183
43114B770463Q42362P91998J31875q3404L48885M31386l3388n2263M75871M25241
43104F049026k53404j87331Q31670J355119J020849J110489J667026J078264n50945
$$ plain form
43170 1450685 1345807 1613052 2137805 2904894 3601059 3553207 2690741 1963152 2069289 2441569
43160 2441569 2315639 2014004 2101902 2056118 1123652 -72274 -242832 621289 1463578 2037471
43150 2037471 3024804 4353748 4963410 4470889 3726113 3397784 3178100 2696754 2142570
43141 2142570 1642123 982562 277319 65769 479841 1046553 1466733 1866548 2237841
43132 2237841 2441504 2826422 3985391 5707273 6885686 6673651 5261738 3564670 2607049
43123 2607049 2955037 4129995 4832676 4332184 3286564 2669560 2521999 2483280 2770463
43114 2770463 3612825 4404823 4536698 4453294 4802179 5233565 5200177 5147914 5623785 6049026
43104 6049026 5795622 5608291 6439961 7795080 8815929 9926418 11593444 12671708 12120763
43095A2120763r07229M96500J295950O03926N42605J885967K367693J277629J239607
43086B0923411L117041M040477L158935L888380P339752R947745J1599338J8006739
43078H2021818K8239101K8401879Q612804j9226467l2924042k6730821j4708766
43071E3685506q900433p235834m462306j998761k032846j924479J1153Q26668
43063B7968668o01309o03043K136496L714052K638828K743646N295551O467383
43055D9760272N946465Q782858J5110965J9104714K2732389L6161743N5130275
43048B12729681N3333336J4299601l8958931o5630338n4390032l0667294j8660151
43041G2055872j6414601j2282023o359814m793963n959886m473102j561667j530113
$$ plain form
43095 12120763 11213534 11710034 13005984 13609910 14152515 16038482 18406175 19683804 20923411
43086 20923411 24040452 28080929 31239864 35128244 42467996 52415741 64015079 82021818
43078 82021818 110260919 138662798 147275602 128049135 95125093 68394272 53685506
43071 53685506 44785073 37549239 33086933 31088172 29055326 27130847 27142000 27968668
43063 27968668 27367359 26764316 28900812 32614864 35253692 37997338 43292889 49760272
43055 49760272 55706737 64489595 79600560 98705274 121437663 157599406 212729681
43048 212729681 266063017 280362618 241403687 175773349 121383317 90716023 72055872
43041 72055872 55641271 43359248 36999434 32205471 26245585 21772483 20210816 18680703
43033A8680703l016858k061972J25751k21557k217928k251949o42212m87228j791840
43024F114910k010676r56344m88495n67688J68035J014889K95012j123040j018501
43015A428102K68890N04240n16670r12787j65147L48768Q5579k8792L33733M51470
43005A797386J74195R2586J44991k88278j013918j186197o62223r312M86393P62541
42995B98164M90488k79976o09147J23139J120181J272084O68893P7864l04221
42986B857469o12740o19162k25107P9714M0165Q7446L24239J27367n52545p44458
42976G62388r8855L79686J14443k1148N10283P07990j03536p93551l08996M34790
42966A583494J86559m87451m30023k676j23363l60722P7388N20374L4209n24261
$$ plain form
43033 18680703 15663845 13601873 13727624 13506067 11288139 9036190 8393978 7906750 6114910
43024 6114910 4104234 3147890 2659395 2091707 2259742 3274631 3569643 2446603 1428102
43015 1428102 1696992 2201232 1684562 771775 606628 955396 1040975 1012183 1345916 1797386
43005 1797386 1971581 2064167 2209158 1920880 906962 -279235 -941458 -950770 -464377 298164
42995 298164 788652 508676 -100471 22668 1142849 2414933 3083826 3161690 2857469
42986 2857469 2244729 1625567 1400460 1480174 1520339 1607785 1932024 2059391 1506846 762388
42976 762388 663533 1043219 1157662 1136514 1646797 2354787 2251251 1457700 1148704 1583494
42966 1583494 1770053 1282602 852579 849903 726540 365818 443206 963580 997789 473528
42956D73528J64603J292342R96138m70175j025637p6695P66935M74928l5062J98044
42946B758949P07679O94061K02724l79528q91593j008411k79539J010967J818374
42937D633683J528956O21251j275J27254Q04885J394665J446090J311603J713502
42928A3580614K619625L447478M463649O355468P793451N600623q88807p424154
42920C5547947r210850o577558l784036l085994k951157j900246q56165q66330
42912F315611j169298q31735l47718l44070k91380K75801O16401P9361n84275
42903C718698l97945K71067M73664K63660L64927P91165R60844R39726J455575
42894H841381K572899L325948L206611L359323N215129P778788P532566K368734
$$ plain form
42956 473528 638131 1930473 2926611 2456436 1430799 1354104 2121039 2595967 2560905 2758949
42946 2758949 3466628 4160689 4363413 3983885 3092292 2083881 1804342 2815309 4633683
42937 4633683 6162639 6783890 6782615 6909869 7714754 9109419 10555509 11867112 13580614
42928 13580614 16200239 19647717 24111366 30466834 38260285 43860908 42972101 35547947
42920 35547947 26337097 19759539 15975503 12889509 9938352 8038106 7181941 6315611
42912 6315611 5146313 4314578 3966860 3622790 3331410 3607211 4223612 4302973 3718698
42903 3718698 3320753 3591820 4065484 4329144 4694071 5485236 6446080 7385806 8841381
42894 8841381 11414280 14740228 17946839 21306162 26521291 34300079 41832645 44201379
42886D4201379m915991q911069p661674m540218l312283l604534l015004j576073
42878F664533j208132j877316j581024j9448Q06084J00622m87929L076J93126
42869B593592q49415j589040n77719R12448Q43622l85048p56035K20175J126113
42860A538693R72259K27189l61238o34083o77055n69187m93312m83291k61267
42851g41292K01821M11339J50483l1945K51098M71137J09299l19400p5758N04627
42841I31409N20422m5019l72770j15170K60679L67887L33382L10031K07935k1707
42831B377079k99789o01142q68730q85509n75418k20548m5216J14524L60696L60589
42821b83464o6694l89823n4395N44690N31346j05218l87519K99505J360601J773533
$$ plain form
42886 44201379 39285388 30374319 22712645 18172427 14860144 11255610 8240606 6664533
42878 6664533 5456401 3579085 1998061 1978613 2784697 2885319 2397390 2400466 2593592
42869 2593592 1744177 155137 -422582 489866 1333488 948440 192405 412580 1538693
42860 1538693 2510952 2738141 2376903 1742820 1065765 496578 3266 -480025 -741292
42851 -741292 -539471 -128132 22351 -9594 241504 712641 821940 502540 426782 931409
42841 931409 1451831 1406812 1034042 918872 1179551 1547438 1880820 2190851 2398786 2377079
42831 2377079 2077290 1476148 607418 -278091 -853509 -1074057 -1119273 -1004749 -644053 -283464
42821 -283464 -350158 -739981 -794376 -249686 281660 176442 -211077 88428 1449029 3222562
42811C222562J290823N11571j1618l30951p02917r39331n48212M21924J108532
42802D022383Q02673m8748l21765L82831J346320J750867J547420J201446J079502
42793A1762929J250512J469363J235184K80888r16535j545281j408087r90528
42785A1138445o30022k55197L4722p9838l95704j52470R03040K060833K639938
42776A5263747K853711L237559L656211L332191J671343j088452l806634n095442
42768B0024234m513947l057219j995663j480568r67158n91119r61131j726973
42760D730456j720502p32855J19774J09578k73897n34637q54760j118460o83296
42751i58599K59681N42954m5463k17358N61692R47043L7975q58906l75712N32076
$$ plain form
42811 3222562 4513385 5024956 5013338 4682387 3979470 3040139 2491927 2913851 4022383
42802 4022383 4825056 4776308 4454543 4837374 6183694 7934561 9481981 10683427 11762929
42793 11762929 13013441 14482804 15717988 15998876 15082341 13537060 12128973 11138445
42785 11138445 10508423 10253226 10287948 10208110 9812406 9659936 10562976 12623809 15263747
42776 15263747 18117458 21355017 25011228 28343419 30014762 28926310 25119676 20024234
42768 20024234 15510287 12453068 10457405 8976837 8009679 7418560 6457429 4730456
42760 4730456 3009954 2277099 2396873 2506451 2232554 1697917 843157 -275303 -958599
42751 -958599 -698918 -155964 -201427 -418785 142907 1089950 1127925 269019 -106693 425383
42741D25383K79315n21385j54737J097880J312554N8257j049731r82856n02371
42732c7691m67669o72256p39986p16197m32281M08299J268687J182951L22917
42723A16774j19834J99411L68617q5664m92752m18519l82416o47602n65338J80622
42713a846701P62528M04188m52035q51012n24863J30051O47512O67688J41705
42704i20939l49797j21021O04399R19931N48248N4948k88825p62793j154924p24362
42694b195135L79988R08554L11710m15467l62657j300j4730J0416O19677J168900
42684D09956P47226k09507m96683M9296N08472M39703L53612O09422Q28390O22263
42674C862150J78465j39946k68815k91650j90651R118N3544l30249r95250j295568
$$ plain form
42741 425383 704698 183313 28576 1126456 2439010 2497267 1447536 464680 -37691
42732 -37691 -505360 -1177616 -1917602 -2633799 -3066080 -2657781 -1389094 -206143 116774
42723 116774 -3060 196351 564968 479304 -13448 -431967 -814383 -1461985 -2027323 -1846701
42713 -1846701 -1084173 -679985 -1132020 -1983032 -2507895 -2377844 -1730332 -1062644 -920939
42704 -920939 -1270736 -1391757 -787358 132573 680821 735769 446944 -315849 -1470773 -2195135
42694 -2195135 -1815147 -906593 -594883 -1010350 -1373007 -1374307 -1389037 -1378621 -758944 409956
42684 409956 1157182 947675 450992 500288 1008760 1448463 1802075 2411497 3239887 3862150
42674 3862150 4040615 3900669 3631854 3340204 3149553 3158671 3212215 2881966 1886716 591148
42664E91148p31623K47060N20608k56835r87229n86346L47909L78556m86779p09514
42654a673045L66361J393337R72759l88709j135070o66460L51626J076823J139461
42645A437083O86984L63356P56633J456271J331527J50617r45439j102953q72134
42636C261945r48487r13584k68456K95944l4453o45794m19473L82526O10832J70765
42626A491765m9485O6009k37246r32868j021367k55327L38618R9415l11749j28044
42616i40279L63395M70583J27851k53114l79069j57713K95389N33210K12517k72971
42606b01k43725J79057K40418j71278l74832j64316j52282n12328m87911K65003
42596a422395Q52476M33042m66911p63050l19433J90070M43290O45073Q41531
$$ plain form
42664 591148 -140475 106585 627193 370358 -616871 -1203217 -855308 -476752 -963531 -1673045
42654 -1673045 -1306684 86653 1059412 670703 -464367 -1130827 -779201 297622 1437083
42645 1437083 2124067 2487423 3244056 4700327 6031854 6182471 5237032 4134079 3261945
42636 3261945 2313458 1399874 1131418 1427362 1392909 747115 327642 710168 1321000 1491765
42626 1491765 1442280 1508289 1271043 338175 -683192 -938519 -599901 -500486 -812235 -940279
42616 -940279 -576884 -106301 21550 -231564 -610633 -768346 -472957 60253 272770 -201
42606 -201 -243926 -64869 175549 4271 -370561 -534877 -687159 -1199487 -1687398 -1422395
42596 -1422395 -569919 -136877 -603788 -1366838 -1686271 -1496201 -1052911 -407838 433693
42587D33693Q36159O55982M97300L11676p2865n31511p40017n83648k02779J77150
42577G81140K73546o6755n02122m42279Q7998L39469p3623n43843l85748J77206
42567c55011M94959M35629K28231j23186n50182n26690J99079Q67612O08082k28931
42557A049592o00375l75733l13196n53626l95761K56652M89765j03530o21266
42548a167478k44227N05816O91714L64861J51181N8133l00163o86314m97650J04842
42538a019285L07128p8990l36524j8098M06761L94131J23647K1446L6820p9181
42528b42145j57741J30547N67383N19942j38182o91738m37556L53864O79349M7747
42518F31470q12362p83984J95251R51148N13998o49979j243197p09925L11336
$$ plain form
42587 433693 1269852 1925834 2423134 2734810 2661945 2130434 1390417 806769 603990 781140
42577 781140 1054686 987931 485809 43530 131528 470997 397374 -146469 -532217 -355011
42567 -355011 139948 575577 803808 680622 130440 -396250 -197171 670441 1278523 1049592
42557 1049592 449217 73484 -239712 -793338 -1189099 -932447 -442682 -546212 -1167478
42548 -1167478 -1411705 -905889 -214175 150686 301867 360000 59837 -626477 -1124127 -1019285
42538 -1019285 -712157 -791147 -1127671 -1145769 -739008 -344877 -221230 -199784 -162964 -242145
42528 -242145 -399886 -269339 298044 817986 679804 -11934 -449490 -95626 583723 631470
42518 631470 -180892 -964876 -769625 181523 695521 45542 -1197655 -1907580 -1596244
42509a596244R72096J023641N95549j48230q19325q39518j42962N26158M87611
42500E8776P36k19126q0913r3067l76115m01688J22427O89663O68306J73746j36962
42489D05783K2425K56283J20264k57624m13913k50646j37682k36131j46433L79125
42479b58549P24100J22281r94626j260209k54602P90527P39547J17504K0748K41498
42469a1781k00692j062633r92345K23255J057930N01482l84883j21577R48471
42460d2773J260608L55622o04791n94571R551J98373k78134p20221m70703K31537
42450f55502N43064J31142l28236j07782M23147L09338m27424o84228J6076P08729
42440g1676M62485k07046k27882L97235Q01061O40426L10779N1776k38182m42850
$$ plain form
42509 -1596244 -624148 399493 995042 846812 27487 -812031 -954993 -428835 58776
42500 58776 59512 -159614 -240527 -333594 -709709 -1111397 -988970 -299307 368999 542745 405783
42489 405783 428208 684491 804755 547131 133218 -117428 -255110 -491241 -637674 -258549
42479 -258549 465551 587832 -406794 -1667003 -1921605 -1131078 -391531 -274027 -253279 -11781
42469 -11781 -212473 -1275106 -2267451 -2044196 -986266 -484784 -869667 -991244 -42773
42460 -42773 1217835 1573457 968666 374095 383646 582019 303885 -416336 -887039 -655502
42450 -655502 -112438 18704 -309532 -417314 5833 315171 -112253 -796481 -780405 -71676
42440 -71676 390809 183763 -44119 353116 1154177 1794603 2105382 2157158 1918976 1476126
42430A476126l19540n7881j7474n8863J33724K86420n7352n50651m27715J88584
42420E95378L67888j74571o92839o34181k92474k8209K13488L39039K2640m76660
42410g60501l87469K70674M66329k18857p77772l35708M45579M75036n7512j85820
42400a066021J89672L41089Q1045n2758J15038J68133J1834Q0123M43498N07593
42390H19246j01294r32266j262368q44848L3476Q57638J168189R07204N18596
42381A163573L85676K79565k00781q06880q81887l78952N1551P4326O1002K69778
42371A6971L46534R363l87017m30524k91321k95124k98569l4202K77246K48575
42361h38068P162m2725M4254j03210l68276j68845N91171J197319J025710L30182
$$ plain form
42430 1476126 1156586 1098705 1081231 1022368 1156092 1442512 1385160 834509 406794 595378
42420 595378 963266 788695 95856 -538325 -830799 -859008 -645520 -306481 -283841 -760501
42410 -760501 -1147970 -877296 -410967 -629824 -1407596 -1743304 -1297725 -822689 -880201 -1066021
42400 -1066021 -876349 -535260 -454215 -506973 -391935 -223802 -211968 -131845 311653 819246
42390 819246 717952 -214314 -1476682 -2321530 -2288054 -1430416 -262227 644977 1163573
42381 1163573 1549249 1828814 1628033 821153 -60734 -439686 -388135 -313809 -252807 16971
42371 16971 363505 372868 -14149 -444673 -735994 -1031118 -1329687 -1363889 -1086643 -838068
42361 -838068 -830906 -873631 -829377 -932587 -1300863 -1469708 -878537 318782 1344492 1674674
42351A674674j72583j84985K246M238k58886n39919n02938j14773J85725j5491
42341G7308m29766l37239L14704O50112Q4928p32334q05121j97841K03053Q5204
42331a086992j5379J93682L10253Q6369j00189K4314J45441J7037n5629J55116
42321c25977L16148J79786P6538J86858L948p18411j131041l95859Q31649J153029
42311A76668M32413j15068J72837N86245L69044j96391m79952m46625m06193m36720
42301c43742m81106n20907l70131J79484P96757Q08748J99203k50999j04891J48373
42291F0789J1492k29615r7509L18223O65472Q19074O52792l3000r04440j120328
42281A42950n04312L5327j22957l07469K72949J083061J011265N6277p81378r54041
$$ plain form
42351 1674674 1502091 1317106 1319352 1323590 1064704 524785 21847 -92926 92799 77308
42341 77308 -352458 -689697 -374993 275119 360047 -372287 -1177408 -1375249 -1172196 -1086992
42331 -1086992 -1102371 -908689 -598436 -512067 -612256 -587942 -442501 -425464 -481093 -325977
42321 -325977 -9829 169957 246495 433353 437301 -281110 -1412151 -1808010 -976361 176668
42311 176668 609081 494013 666850 1253095 1622139 1425748 945796 499171 92978 -343742
42301 -343742 -824848 -1345755 -1715886 -1536402 -739645 69103 268306 17307 -87584 60789
42291 60789 72281 -157334 -254843 63380 728852 1547926 2200718 2167718 1263278 142950
42281 142950 -361362 -326035 -448992 -756461 -483512 599549 1610814 1667091 885713 -68328
42271f8328p25473l54780R0885K95982O027l62576k70057J9550m5923j87238K10466
42260a391465P44565M58444l85714m44325N43761J179376N53152l64290l39844
42251E53660K27018J35328o23945r04580j81537P09295P09124j83341r59291p31717
42241a249986K45149P95624K56188n94283n88270J27990L74934j42686l99769
42232a175109J58198O48165K62941l75517l28670J20267J53368p9324J32683O35777
42222A52779O37982R4051l01243l47853m44280n45212j67991N03309O45764J29142
42212C56448k18408N2105L93526L22493J34289J13770n3981n14785p02091k34690
42202c51324L13117K47613j89765l30755j85487k58556n53924n40018k6032N45218
$$ plain form
42271 -68328 -793801 -1148581 -1057696 -761714 -755687 -1118263 -1388320 -1368770 -1414693 -1601931 -1391465
42260 -1391465 -646900 -188456 -574170 -1018495 -474734 704642 1257794 893504 553660
42251 553660 780678 916006 292061 -612519 -794056 -84761 624363 441022 -518269 -1249986
42241 -1249986 -1004837 -209213 46975 -547308 -1135578 -1007588 -632654 -775340 -1175109
42232 -1175109 -1016911 -368746 -105805 -481322 -809992 -689725 -536357 -615681 -482998 152779
42222 152779 790761 884812 583569 235716 -208564 -753776 -921767 -418458 227306 356448
42212 356448 138040 190145 583671 906164 1040453 1154223 1100242 585457 -116634 -351324
42202 -351324 -38207 209406 19641 -311114 -496601 -755157 -1309081 -1849099 -1875131 -1329913
42192a329913O88354L44725j80552m42574j80130L11252L96145m4732l95238k90237
42182a122900k24995n76779o72227J99673J313526J286279J84718m84694n7310
42173a54709L98203k1240n99152l53351K56950J94797l18476j91693O46106J077101
42163I34536N24308l21573p02851o94935n86670k91849J50626K58487j60570n49703
42153a440194m01541J2763K46157M78097J035994J509813J146849J4805r37554
42144A665189j027089m87813P6337L52031K92126p1245n12618o38236l09217J41582
42134e18953L15191K06971P7523K0329r5419l05705m29859l41217j73864j08453
42124a353456p4305J03115L00728J77898k25045l45868J21288O35793N04555n1694
$$ plain form
42192 -1329913 -641559 -296834 -477386 -919960 -1100090 -788838 -392693 -437425 -832663 -1122900
42182 -1122900 -1347895 -1924674 -2596901 -2397228 -1083702 202577 387295 -97399 -154709
42173 -154709 243494 222254 -376898 -730249 -473299 -278502 -596978 -788671 -142565 934536
42163 934536 1458844 1137271 434420 -260515 -847185 -1139034 -988408 -729921 -890491 -1440194
42153 -1440194 -1841735 -1828972 -1582815 -1104718 -68724 1441089 2587938 2602743 1665189
42144 1665189 638100 150287 226624 578655 870781 799536 286918 -351318 -660535 -518953
42134 -518953 -203762 3209 80732 101061 5642 -300063 -729922 -1071139 -1245003 -1353456
42124 -1353456 -1427761 -1324646 -1023918 -846020 -1071065 -1416933 -1295645 -659852 -155297 -206991
42114b06991j88526K54840N15224J53858k61336j58899Q1433j53390n88205m76377
42104a028369J64702N73681M16575J61347J95517K48853m7989n01215n75599r0900
42094d83397N03438N68879M0591l44484P1211P92970O57710l92643r48055j99631
42084B66589N90424j29652j644500j776461n7060J566631J475788L08415m40075
42075A60099l95370n4707L30789O45928M96736j53645n66751k71925J11346o5373
42065B37127k72162L18872J266834J327293K52047r31414j366763j166583p73947
42056a108696l89786j34082p1054K2590L52516O06004L45192j91745l52474p7578
42046i99113P1796r3332j13066K73049O80229O94749L86192K1744k51858l22292
$$ plain form
42114 -206991 -395517 -140677 374547 528405 267069 108170 189603 36213 -551992 -1028369
42104 -1028369 -863667 -289986 126589 287936 483453 732306 684317 183102 -392497 -483397
42094 -483397 20041 588920 629511 285027 356238 1149208 1806918 1414275 466220 266589
42084 266589 857013 727361 -917139 -2693600 -2750660 -1184029 291759 600174 160099
42075 160099 -235271 -289978 40811 686739 1183475 1029830 463079 191154 302500 237127
42065 237127 -35035 283837 1550671 2877964 3130011 2198597 831834 -334749 -1108696
42056 -1108696 -1498482 -1632564 -1703618 -1681028 -1328512 -722508 -377316 -569061 -921535 -999113
42046 -999113 -927317 -1020649 -1133715 -860666 -180437 514312 900504 922248 670390 348098
42036C48098j75402j08830l91848o97589m47797K42252O18635M05139J74189L71007
42026C37854O32156M28406j55956o55193q10422o37780k97895r3028j68735j14617
42016a535210N59531J422817J367302J88795q74758p37569J10794M65775P7629
42007A045106l66048m70026m21061k88749M9284L27957O7297n86952r02109n83961
41997b129262j47206q3097k18176j46595J62009M67413O36779O69610N71948L68850
41987A52273Q0628l32927p88368r21471m86066J26100K33860j98679m72234j52166
41977b759050L55213M98264L63341L52045M52769L35851k0242k61901j54557J97342
41967f40925N57267P01163M61129p7061n11551n44355l59222k94422k93153o0644
$$ plain form
42036 348098 172696 63866 -327982 -1025571 -1473368 -1231116 -612481 -207342 -33153 337854
42026 337854 970010 1398416 1242460 587267 -223155 -860935 -1158830 -1251858 -1420593 -1535210
42016 -1535210 -975679 447138 1814440 2003235 1128477 390908 501702 967477 1045106
42007 1045106 679058 209032 -212029 -500778 -451494 -123537 -56240 -643192 -1545301 -2129262
41997 -2129262 -2276468 -2359565 -2577741 -2724336 -2562327 -2094914 -1458135 -788525 -216577 152273
41987 152273 232901 -100026 -888394 -1809865 -2295931 -2169831 -1935971 -2134650 -2606884 -2759050
41977 -2759050 -2403837 -1905573 -1542232 -1190187 -737418 -401567 -421809 -683710 -838267 -640925
41967 -640925 -83658 617505 1078634 1001573 490022 -54333 -413555 -707977 -1001130 -1061774
41957a061774L43380N22984L45587Q5636o2008j70335k15651r66L96989N44907
41947G28749K30854k48665n50769o26561m51420M6801N35811L84011l43342o28718
41937i23249J18847J008416Q35509j42796o38462k99899m9147l61866m50610L18021
41927e85236J197518J046971n8886r66812q74924m0411P15334P55807Q2529o20572
41917F51318o09932L0458M52946J77733l33939n10798m68794n24121n06779j76461
41907a818369J69108J75561R7738K88460M46703J68729j46793J15208N76825L14795
41897C87965n64051r23079l37706K38913m6675p16686p64731k2518Q36393J195747
41887g16428R40882L65881k5871M0821J85722j76004q20127p93803J81014J076109
$$ plain form
41957 -1061774 -718394 -195410 150177 235813 173805 3470 -212181 -213147 183842 728749
41947 728749 959603 710938 160169 -466392 -917812 -871011 -335200 48811 -294531 -923249
41937 -923249 -804402 204014 1039523 896727 258265 -41634 -90781 -452647 -903257 -585236
41927 -585236 612282 1659253 1600367 633555 -241369 -281780 433554 1189361 1271890 651318
41917 651318 41386 71844 524790 702523 368584 -142214 -611008 -1135129 -1641908 -1818369
41907 -1818369 -1649261 -1473700 -1375962 -1087502 -640799 -472070 -618863 -503655 73170 387965
41897 387965 -176086 -1099165 -1436871 -1197958 -1244633 -1961319 -2726050 -2748568 -1912175 -716428
41887 -716428 224454 590335 564464 605285 791007 615003 -205124 -998927 -817913 258196
41877B58196Q61570j26844p68263o63800l28696j53143J6013K47523K01056l02058
41867g58446q29640p87756j36862N69949Q00483N37025J43728j19829k85392l97008
41857a263748l30378p8119N1548j34667k82948N8776O68404Q45770L73778k52579
41847c44163o06786p57089p77450m66994J36841N21501L77731P0948K6465N8294
41837a760702j98810n06429k55778N85340J235410R38857j57395j075676r68770
41828b163953k0690P40232O38794J00756q5170J05085J12116j77726l68016l96632
41818a515204n53121o42397j19681P77437J077735N58154R4704J35129K8596n17370
41808f76018o32635J13876N79303j89406j135399p05192O28222J117207N09539
$$ plain form
41877 258196 1119766 992922 224659 -439141 -767837 -920980 -904967 -657444 -456388 -758446
41867 -758446 -1588086 -2375842 -2512704 -1942755 -1142272 -605247 -461519 -581348 -866740 -1263748
41857 -1263748 -1594126 -1672245 -1620697 -1755364 -2038312 -1979536 -1311132 -465362 -91584 -344163
41847 -344163 -950949 -1708038 -2485488 -2952482 -2815641 -2294140 -1916409 -1845461 -1818996 -1760702
41837 -1760702 -1959512 -2465941 -2721719 -2136379 -900969 37888 -119507 -1195183 -2163953
41828 -2163953 -2184643 -1444411 -805617 -704861 -790031 -684946 -572830 -750556 -1118572 -1515204
41818 -1515204 -2068325 -2710722 -2830403 -2052966 -975231 -417077 -322373 -187244 -158648 -676018
41808 -676018 -1308653 -1194777 -615474 -804880 -1940279 -2645471 -2017249 -900042 -390503
41799c90503J68790N69790O36026j12990n81641K3058Q37175P78935J71822m4715
41789B055747J73281K33579K3937j55375l11786n77622o42083j40682N75224P25373
41779A959593R4401p50414j170377r95897m45635J20887L86577K90195P7059k377
41769d35988O323j18951m07264n54725k07690N58945J107778Q52654P4126k95090
41759E80118N4495K76512l72048j253241j147477k7452R16209R35368M36577k1243
41749C77818m08590o35399k84485N56094J008713N44104k29926m71103k27546
41740B29680j01642k90199n35975o42801n19622n9820N61155Q16413M89736M9808
41730c267n4663p3966m48754r83192j061134m55215N04456J315132J499216P92460
$$ plain form
41799 -390503 -221713 348077 984103 871113 289472 312530 1149705 1928640 2100462 2055747
41789 2055747 2229028 2462607 2486544 2331169 2019383 1441761 799678 658996 1234220 1959593
41779 1959593 2053994 1303580 133203 -862694 -1308329 -1187442 -800865 -510670 -433611 -435988
41769 -435988 -429665 -548616 -955880 -1510605 -1718295 -1159350 -51572 801082 875208 580118
41759 580118 634613 911125 539077 -714164 -1861641 -1889093 -972884 -37516 399061 377818
41749 377818 -30772 -666171 -950656 -394562 614151 1158255 928329 457226 229680
41740 229680 128038 -162161 -698136 -1340937 -1860559 -1920379 -1359224 -542811 -53075 -3267
41730 -3267 -57930 -131896 -580650 -1563842 -2624976 -3080191 -2575735 -1260603 238613 1031073
41720A031073m00107j078543o98699J21601M30054J58050n4391M9530J43687R0672
41710b07073J59478L60542K15035n05612j239823j211940l69683N58212R10495
41701a330369P50885N60622M70087J53681m60809q37268n34915R9800M37285M36925
41691b54076L92991J49968n39482j076573n68060O07354J003835K19021m47907
41682e12929m7769N53933J94206o81258q21867j13131N38397P33341P57652N92694
41672A193269k8389p46377q82832n51632m51978o25795m47338J43709M28812Q9700
41662a878851k96493j69917L26966P51525Q30486M49314k40038o97257n44936
41653a469201j40209j2452J4324L90043Q30654O91870J45014p0017O6259m8564
$$ plain form
41720 1031073 630966 -447577 -1146276 -1024675 -594621 -436571 -490962 -441432 -297745 -207073
41710 -207073 -47595 312947 527982 22370 -1217453 -2429393 -2799076 -2240864 -1330369
41701 -1330369 -579484 -18862 451225 604906 144097 -693171 -1228086 -1128286 -691001 -254076
41691 -254076 138915 288883 -250599 -1327172 -1895232 -1287878 -284043 -65022 -512929
41682 -512929 -560698 -6765 187441 -493817 -1315684 -1428815 -890418 -157077 600575 1193269
41672 1193269 1164880 418503 -464329 -1015961 -1467939 -2093734 -2541072 -2397363 -1968551 -1878851
41662 -1878851 -2175344 -2345261 -2018295 -1266770 -436284 13030 -227008 -924265 -1469201
41653 -1469201 -1609410 -1621862 -1607538 -1217495 -386841 305029 450043 380026 446285 397721
41643C97721l29436r4196M52472K52676p43661j183221l71742O11364O49542J96479
41633a62002J68191L37648L2977m06294j92338L90118L01613n95126j276484r67008
41623b368705J5330Q71171J150647R24080N59041L41102J37672l33826q35228
41614D61284p76315k58644j53797p02701r49537k74982M60319L18548n7346M60517
41604a472654J401204J343184L31343j45866L10175L42205p22640j496488o73428
41595g82965Q00885J091631J36180n43386k58623R7568k47686p95316p35701j35630
41585a373043L69913M65821K43783j51336m88513m05376J19155M83641J53469
41576e82486n04052n95877Q9094P60966O55206o5706o62614o91279k32506M13709
$$ plain form
41643 397721 68285 -25911 426561 679237 -64424 -1247645 -1619387 -1008023 -358481 -162002
41633 -162002 6189 343837 376814 -29480 -221818 168300 469913 -125213 -1401697 -2368705
41623 -2368705 -2353375 -1482204 -331557 592523 1151564 1492666 1630338 1296512 461284
41614 461284 -315031 -573675 -727472 -1430173 -2379710 -2654692 -2194373 -1875825 -1933171 -1472654
41604 -1472654 -71450 1271734 1603077 1457211 1767386 2109591 1386951 -109537 -782965
41595 -782965 17920 1109551 1245731 702345 443722 541290 293604 -501712 -1237413 -1373043
41585 -1373043 -1003130 -537309 -293526 -444862 -933375 -1338751 -1219596 -735955 -582486
41576 -582486 -1086538 -1682415 -1593321 -832355 -177149 -242855 -905469 -1596748 -1829254 -1415545
41566a415545Q77434P92516J57112m66456m82475M5391N24177N65184K75628o9992
41556H02974k80283k43326m4748j9015l15711n43376k92814J43846J68171j14427
41546g38709j6521N51094Q36694M41247k8814N5747L73358K21490m19743r55429
41536C20414r83591n68106K7745M90541N68820L18931J5982k74787o29030p38153
41526a451234j37950Q51093J223242O84725R6946O2055M9227l78850n35591J41922
41516F05585P53185J92334r25376j094618k64194K33263o9191k45922J49326L05312
41506c60296k61126p57970m68166R5371J58378j13153j45745O4085K31829M08888
41496a147905O57465O65644L01382K2560J52010K58662j46711p69975r76029o61248
$$ plain form
41566 -1415545 -538111 254405 411517 -54939 -537414 -492023 32154 597338 872966 802974
41556 802974 522691 279365 234617 215602 -100109 -643485 -936299 -792453 -624282 -738709
41546 -738709 -755230 -204136 632558 1073805 1044991 1100738 1474096 1695586 1275843 320414
41536 320414 -663177 -1231283 -1203538 -712997 -144177 174754 190736 -84051 -713081 -1451234
41526 -1451234 -1589184 -738091 485151 1169876 1266822 1328877 1378104 999254 463663 605585
41516 605585 1358770 1551104 625728 -468890 -733084 -499821 -569012 -814934 -665608 -360296
41506 -360296 -621422 -1379392 -1847558 -1752187 -1593809 -1706962 -1852707 -1788622 -1556793 -1147905
41496 -1147905 -490440 175204 476586 499146 651156 909818 763107 -6868 -982897 -1644145
41486a644145j51698L44971O58332M78432j45442n26191j76346M13689M51934
41477b96464m822k34426L1613L51041L74449L06984M70395P82911P93160J33181
41467B708022r62227j586027r87558L90912J185250O87764l27467o83580j92599
41458B32490M35592N69603Q9096o73416r91686l07216Q15309R95843j11716j104066
41448e0167p80441Q7642J07802m30769j94635P25311Q41329j84362q60949k47066
41438i86305O37179O09873J37521K44274O80490M57306m10777r07238n08162K76031
41428B30192P53530P20113L29702j50551m69402n83019n88605l68658K52338Q43850
41418I69490N80526m72229j070769m51540M72007M47124k48973l94160J77140
$$ plain form
41486 -1644145 -1795843 -1450872 -792540 -314108 -459550 -985741 -1162087 -748398 -296464
41477 -296464 -301286 -535712 -504099 -153058 221391 528375 998770 1781681 2574841 2708022
41467 2708022 1745795 159768 -827790 -436878 748372 1436136 1108669 425089 232490
41458 232490 668082 1237685 1326781 653365 -338321 -645537 169772 1165615 1053899 -50167
41448 -50167 -830608 -742966 -635164 -1065933 -1260568 -535257 306072 121710 -739239 -986305
41438 -986305 -349126 260747 398268 642542 1323032 1780338 1369561 462323 -45839 230192
41428 230192 983722 1703835 2033537 1882986 1413584 830565 241960 -126698 125640 969490
41418 969490 1550016 1077787 7018 -444522 27485 474609 225636 -168524 8616
41409H616M46386l8324n55899n15195k31319q2989J11760M63438O07028L69913
41399E83415J01600n0021m14495r28707q49729N5911Q51521P36725K90353M57199
41389H33772Q81900M26316r11415j808906j437264m07804L62344P70028J045305
41380b45724R66394K65832o28639r56104n84543j08757l2309k33483k74151K6179
41370a805305M15568N17755K74188L3926J15184L67584M00844J91684J00310K19321
41360H31059J38620l85469q87539p18238O6413P30741P31299K50840j57633k16563
41350C83530j33463k73544o72452r06694n67975J54060O21101N50570L33593L58091
41340a53183M05257R9993l66105m94719k72268r9738r036L56897Q75760Q15043
$$ plain form
41409 8616 455002 416678 -139221 -654416 -885735 -968724 -856964 -393526 213502 583415
41399 583415 685015 634994 220499 -708208 -1557937 -1502026 -650505 86220 376573 833772
41389 833772 1715672 2141988 1230573 -578333 -2015597 -2423401 -2061057 -1291029 -245724
41380 -245724 720670 986502 357863 -598241 -1182784 -1291541 -1323850 -1557333 -1831484 -1805305
41370 -1805305 -1389737 -871982 -597794 -563868 -448684 -81100 319744 511428 611738 831059
41360 831059 969679 584210 -303329 -1021567 -955154 -224413 506886 757726 600093 383530
41350 383530 250067 -23477 -695929 -1602623 -2170598 -2016538 -1395437 -844867 -511274 -153183
41340 -153183 252074 352067 -14038 -508757 -781025 -880763 -889799 -532902 342858 1157901
41330A157901k6164o85799k19502Q55689J092488M1451j132565j221057m88047
41321f25605n4281j95826q8012P21542J424920J061773j8214n71981j70072L42848
41311A827092K21735j72682j77189Q0011Q6325o3512N2555J93212k72011j091574
41301F83962j146126p6640R57674P31536m29565j140423p07619K48294P68112
41292a10795N92990J88510P4766K40207J83691l67683q85437o06072K93523P11995
41282C15695J11460o62588n81368J37349N38282M06208L14083M33307L06872j53627
41272A165673l96200j86947j2318j95009l49570j28834J49297J00862p3579o1227
41262A2148n4008l17112n69148m21960j09700j21822l38217k00129L75912Q90686
$$ plain form
41330 1157901 1131737 445938 226436 1082125 2174613 2216064 1083499 -137558 -625605
41321 -625605 -679886 -875712 -963724 -242182 1182738 2244511 2226297 1654316 1484244 1827092
41311 1827092 2048827 1876145 1698956 1778967 1865292 1801780 1854335 2047547 1775536 683962
41301 683962 -462164 -538804 418870 1150406 720841 -419582 -1127201 -878907 -110795
41292 -110795 482195 670705 745471 985678 1169369 801686 -83751 -689823 -396300 315695
41282 315695 427155 -235433 -816801 -679452 -141170 265038 579121 1012428 1319300 1165673
41272 1165673 769473 582526 570208 375199 25629 -103205 46092 146954 73375 12148
41262 12148 -41860 -358972 -928120 -1350080 -1459780 -1581602 -1919819 -2119948 -1744036 -853350
41252h53350J012156Q25238L68893m08208j140141j158745l79973M35575N87762
41243g10793J92874j91114k67207o7921K61953M49322K38060j53760j29033L98815
41233B1196O71135J08569p62388j008113n55195m7129K86037P32602J144486Q62819
41223A454019j37747q76397n97685K50409P28418N53743P0367m11975p02125n74944
41213b43917j01935K01893P2637l6949K76667N89625L31930j77040k28529N9343
41203G43725l512m07651n04390k77433l67140o93772l42855P61069J345948O69668
41193I23657k43471j78550M53610N11460L6216n4115L02079K57541m20414j018305
41183E69708j082022q48030m18190L91086J206069J189423L15510l99961l27715
$$ plain form
41252 -853350 158806 984044 1352937 944729 -195412 -1354157 -1734130 -1298555 -710793
41243 -710793 -517919 -709033 -976240 -1044161 -782208 -332886 -94826 -248586 -377619 21196
41233 21196 692331 800900 38512 -969601 -1524796 -1571925 -1285888 -553286 591200 1454019
41223 1454019 1316272 439875 -157810 92599 821017 1374760 1445127 1033152 331027 -243917
41213 -243917 -345852 -143959 -71322 -108271 168396 758021 1089951 912911 684382 743725
41203 743725 740213 332562 -171828 -449261 -816401 -1510173 -1853028 -1091959 253989 923657
41193 923657 680186 501636 955246 1466706 1502922 1448807 1750886 2008427 1588013 569708
41183 569708 -512314 -1360344 -1778534 -1387448 -181379 1008044 1323554 923593 595878
41174E95878L649k1511j60359J182K15852J06195j07883r3486p7816l56251o07858
41163e02408m17248p3167r1844k67347j0710N54513O85489K07996j86524o193
41153a07443L62319L52659O7438N216K46630L60539O6409l59030m76882l04771
41143B13084k58769m33034l03785M67838J195785Q32000m43743j092022j62389
41134A4965J259742J325094j86814j605830j502788l05585M92378J89378m94459
41125h13919m48067N05866J391666J152160j33301j293917j381439o32155P5759
41116a577347L34957L46175K43005q3905n05186n80918j58654L44536M61458K26620
41106i49259M7133J81318M63300M97901J32319k80151k66524R8189K62378O5170
$$ plain form
41174 595878 599527 578016 417657 418839 634691 740886 633003 539517 461701 105450 -502408
41163 -502408 -919656 -992823 -1084667 -1352014 -1362724 -808211 -122722 85274 -101250 -107443
41153 -107443 254876 607535 674973 680189 926819 1287358 1353767 994737 517855 213084
41143 213084 -45685 -478719 -782504 -314666 881119 1713119 1269376 177354 14965
41134 14965 1274707 2599801 2412987 807157 -695631 -1001216 -508838 -319460 -813919
41125 -813919 -1261986 -756120 635546 1787706 1654405 360488 -1020951 -1653106 -1577347
41116 -1577347 -1242390 -896215 -653210 -737115 -1242301 -1823219 -1981873 -1637337 -1175879 -949259
41106 -949259 -902126 -720808 -257508 240393 372712 92561 -173963 -75774 186604 251774
41096B51774L0688M62667Q01411M57022k07507m74973m51001p24779j121130q71472
41086a847300j0578M96770K16451j94210j75175J056Q1755L97856J001347J183679
41076A151651N64308j58839k84727j47996k83800l65848L0572L26199k16178j058597
41066d43255j073303l41570N3481j12882L9331P46519J012233K59214o17902n70202
41056a048336J25704M83125K53232k7556k5833P5299N6231r6071l25648n13768
41046a043621m56772j11905K58168L85620L05439K39830L38662N80470P20656
41037A216547L90706m11800j026630q38649k39207j97107p73717q86343R3819
41028b672381J304804J538271P76208r3592n50988o40496l14193M80046J169782
$$ plain form
41096 251774 282462 745129 1546540 2003562 1796055 1321082 870081 145302 -975828 -1847300
41086 -1847300 -1857878 -1361108 -1144657 -1338867 -1514042 -1512986 -1431231 -1033375 -32028 1151651
41076 1151651 1715959 1557120 1272393 1124397 840597 474749 505321 831520 615342 -443255
41066 -443255 -1516558 -1858128 -1804647 -1917529 -1878198 -1131679 -119446 139768 -478134 -1048336
41056 -1048336 -922632 -439507 -186275 -213831 -239664 -164365 -108134 -204205 -529853 -1043621
41046 -1043621 -1500393 -1612298 -1354130 -968510 -663071 -423241 -84579 495891 1216547
41037 1216547 1607253 1195453 168823 -669826 -909033 -1106140 -1879857 -2766200 -2672381
41028 -2672381 -1367577 170694 946902 853310 302322 -338174 -652367 -172321 997461
41019I97461R09613k68260j285550j226113l06257N06554N26431r9609o38799
41010h84529n13064J07708N56853N51577M53338M82789K59983l99598q29856m34155
41000f48954J90506M0833o29917o00204L26139Q65971K24446o36554m81456L43254
40990a005936N75423L0691k35737L06538Q10788L48555o61616r40657j3962J171715
40980C85802J389894N20186m89438q49513o76795m70200l55708k02651r0781j37478
40970i76682j12346J95954M23603J24092l09782n5455P53720R91779K04237o04507
40960F34613m13983L54353N64494j2484o18628p07914m44442j62058K0741J09351
40950f75957K08020M33487N33368Q401r21887j080217J23735J425752J118136
$$ plain form
41019 997461 1907074 1638814 353264 -872849 -1179106 -672552 -146121 -245730 -884529
41010 -884529 -1397593 -1289885 -733032 -181455 271883 754672 1014655 615057 -214799 -648954
41000 -648954 -458448 -417615 -1047532 -1647736 -1321597 -455626 -231180 -867734 -1349190 -1005936
40990 -1005936 -430513 -399822 -635559 -329021 481767 830322 168706 -771951 -785913 385802
40980 385802 1775696 2295882 1806444 956931 280136 -190064 -545772 -748423 -839204 -976682
40970 -976682 -1089028 -893074 -469471 -345379 -655161 -710616 43104 1034883 1239120 634613
40960 634613 220630 574983 1139477 1126993 508365 -199549 -643991 -806049 -785308 -675957
40950 -675957 -467937 -34450 498918 507319 -414568 -1494785 -1371050 54702 1172838
40941A172838n03141j394370n71683O75101Q49294K48927M830J39960j33681p02892
40931b14817n53132M60721J088207M32476o87816q86805j50276L07865n7925l96283
40921f57785P7695P88616P02731l5386l37224J27593M86790R5036n52783p64191
40911f8908o50365n80554l96764N7265K71630j49814n60095j48458O35484O82113
40901i08466J6777k67156J53453M10497J05588J9189N90300R46981L23363n68158
40891H22368o24149o8751N1765l61026l75628L62314R85542O29154l90846r99838
40881C0905o53517R5420L06450j96874o17402l05753K64454K18940k88969l07872
40871a454218K61872M17087j97741n33836J35944Q91422O03568k76415n96048
$$ plain form
40941 1172838 669697 -724673 -1296356 -621255 228039 476966 481796 621756 488075 -214817
40931 -214817 -767949 -307228 780979 1213455 525639 -361166 -511442 -203577 -261502 -657785
40921 -657785 -580090 208526 911257 875871 538647 666240 1153030 1248066 695283 -68908
40911 -68908 -719273 -1299827 -1696591 -1639326 -1367696 -1517510 -2077605 -2226063 -1590579 -908466
40901 -908466 -891689 -1158845 -1005392 -594895 -489307 -470118 120182 1067163 1390526 822368
40891 822368 198219 129468 181233 -179793 -555421 -193107 792435 1421589 1030743 30905
40881 30905 -622612 -527192 -220742 -417616 -1035018 -1340771 -1076317 -857377 -1146346 -1454218
40871 -1454218 -1192346 -775259 -973000 -1506836 -1370892 -479470 124098 -152317 -748365
40862g48365l55906k80554j80523O37425J653409J524627K11600q59589r36263
40853F65861p20271p25315m40363K97825O04141O1550l48127J94246R39898P77231
40843A306676o9109o29274p15145p46316o79020k45000K06491J91489L9160L24058
40833a015990P20402N04882j09813k95560m5357p2712l74463k02825M17839M87513
40823A3916k79696q10181l12981N16629O72994K95187J00617J23726l9277k77869
40813C065k13801k6386j17874k31213J67816P83159P24256j17272q20799p36531
40803e85580k32029R6966J97061K01033J3774k92937k78754J68248M67573K18474
40793b6171q2159J61800N97484M64238j44944m47990k35563l5345k7577K13039
$$ plain form
40862 -748365 -1104271 -1384825 -1565348 -927923 725486 2250113 2461713 1602124 665861
40853 665861 -54410 -779725 -1220088 -922263 -318122 -256572 -604699 -410453 529445 1306676
40843 1306676 1237567 608293 -106852 -853168 -1532188 -1777188 -1570697 -1379208 -1340048 -1015990
40833 -1015990 -295588 209294 99481 -196079 -241436 -314148 -688611 -891436 -473597 13916
40823 13916 -265780 -1075961 -1388942 -872313 -199319 95868 196485 320211 280934 3065
40813 3065 -210736 -237122 -354996 -586209 -418393 364766 1089022 971750 150951 -585580
40803 -585580 -817609 -720643 -523582 -322549 -308775 -601712 -880466 -712218 -244645 -26171
40793 -26171 -108330 53470 650954 1115192 970248 522258 286695 251350 223773 436812
40783D36812O93672P04616k1998p06395o35708j62338K2008o1287m8118l4653
40773A86611k03726j89475K76358N46413p1872r57516q53343K25916R67299O86644
40763F13309N6188k87772n65134q38758m90768N13005R66785M7365j255213j399985
40753b640978l52114O74119R89408Q38980M54902j15720m38595q4639M69366L74543
40743A69272k12100l53679Q5583K66842r1528k62422Q1149K67635k8625r1637
40733a69510M24155N92841k17343r45416l65224P86195Q07011k86357q36171k80649
40723d90468L8519o75573j175783k34835J153047J175879J4676m71200L45235
40714c20503R96852L55283o13312m59343M83439P11150j26257q55772o58813o2965
$$ plain form
40783 436812 1130484 1835100 1813102 1106707 470999 308661 330669 269382 221264 186611
40773 186611 -17115 -206590 69768 616181 544309 -413207 -1266550 -1040634 -73335 613309
40763 613309 669497 381725 -183409 -1022167 -1512935 -999930 -33145 14220 -1240993 -2640978
40753 -2640978 -2993092 -2318973 -1329565 -490585 -35683 -151403 -589998 -674637 -205271 169272
40743 169272 -42828 -396507 -310924 -44082 -135610 -398032 -316883 -49248 -77873 -169510
40733 -169510 254645 847486 630143 -315273 -680497 105698 912709 626352 -209819 -490468
40723 -490468 -451949 -1127522 -2303305 -2538140 -1385093 -209214 -194538 -665738 -320503
40714 -320503 676349 1031632 418320 -41023 442416 1153566 1027309 171537 -487276 -550241
40704e50241K22163L23383M65566K03875o82652j244231m81803R21925J258406
40695D36391J93608p65031n36971P4568o0121n11788j41271Q85816J304543P03953
40685A583697m6485l38373n16653p76922o20413L4030L00015l12873q77207l49343
40675a920527P71057J141046N06997j50445j95910R817M1133m406k3726j66141
40665H895l36611j68223K81436M83716K94726J67972K98177K97075J3927r3985
40655A247105J87380L53878N0993k81845j86417N0774J560j75609k41495m52515
40645E53809r10654j003711l55494K79530O1063n29825m38335K31788M65201O6106
40635a580522j47652J68949M63381M30081L80786L26875j10123o53879m57845
$$ plain form
40704 -550241 -328078 -4695 460871 664746 -17906 -1262137 -1743940 -822015 436391
40695 436391 629999 -135032 -672003 -597435 -657556 -1169344 -1310615 -424799 879744 1583697
40685 1583697 1537212 1198839 682186 -94736 -715149 -681119 -381104 -693977 -1571184 -1920527
40675 -1920527 -1149470 -8424 498573 348128 152218 162035 203168 198762 175036 8895
40665 8895 -327716 -495939 -214503 269213 563939 731911 1030088 1327163 1341090 1247105
40655 1247105 1434485 1788363 1839356 1557511 1371094 1421868 1423428 1247819 1006324 553809
40645 553809 -356845 -1360556 -1716050 -1436520 -1375457 -1905282 -2343617 -2111829 -1646628 -1580522
40635 -1580522 -1728174 -1559225 -1095844 -665763 -284977 41898 -68225 -722104 -1179949
40626a179949M38834R36213N47027L8696m3991j90974o35375o09131K04451P29567
40616B35368J40725o27758k91437P41318J104994N90147J18204O3334j9558k58627
40606A796710l34349l10519m39784l62847L07465Q53085K65419r09815j037250
40597a71885J32663R57837L41572p18134p72466L2349N10228K35445k16715l89537
40587e8643m08329m57916m49424k54370O0852K75256K25698O4719J97139O98673
40577a06345R92655N71461j36692k65245K05275M26029J3429m24452l54780j24510
40567G96825k58618n85951n81645j54892L42404N78277M11656o8277m43516k75688
40557b39425K83960N81706L21261j14400l58744n27277p23228o45488j05111M95121
$$ plain form
40626 -1179949 -741115 195098 742125 780821 736830 545856 -89519 -698650 -494199 235368
40616 235368 376093 -251665 -543102 198216 1303210 1893357 2011561 2074895 2055337 1796710
40606 1796710 1462361 1151842 712058 349211 656676 1509761 1775180 865365 -171885
40597 -171885 -39222 918615 1260187 542053 -230413 -198064 312164 547609 330894 -58643
40587 -58643 -466972 -924888 -1374312 -1628682 -1567830 -1292574 -1066876 -1002157 -805018 -106345
40577 -106345 886310 1457771 1321079 1055834 1261109 1687138 1700567 1276115 921335 796825
40567 796825 538207 -47744 -629389 -784281 -441877 136400 548056 479779 36263 -239425
40557 -239425 44535 626241 947502 833102 474358 -52919 -776147 -1421635 -1526746 -1031625
40547a031625O30716L19341k4029j49628j14647o9614j07517j79119j16869P3182
40537g69809P6810k35076m08705m0662M28188K93698k03290j77692M05470N94735
40527c6333K0232m59443r4474O95264J067325P64311j5013r28821j337507p48464
40517a072923K47192M91585J0090j8769N70775M38967p68118j260279J14446J573750
40507C26716Q78637j106100j649708k58425R28975O94393K09264N11278P78770
40498A313800J21885o71079m62189L43262N05912j47744o38524l00502N05522
40489E70343J013045Q43190K27092k89572m02941l30048m10000o08377o91749
40480g9017o20584l94161J14685O81363O02161k54577q40711l10465N51053M75673
$$ plain form
40547 -1031625 -400909 -81568 -105597 -255225 -369872 -439486 -547003 -726122 -842991 -769809
40537 -769809 -692999 -928075 -1336780 -1377442 -949254 -655556 -858846 -1036538 -631068 -36333
40527 -36333 -16101 -475544 -570018 125246 1192571 1956882 1941869 1013048 -324459 -1072923
40517 -1072923 -825731 -334146 -324056 -342825 227950 666917 -101201 -1361480 -1247034 326716
40507 326716 1205353 99253 -1550455 -1808880 -879905 -185512 23752 535030 1313800
40498 1313800 1435685 764606 302417 645679 1151591 1003847 365323 64821 570343
40489 570343 1583388 2426578 2653670 2364098 1961157 1631109 1221109 612732 -79017
40480 -79017 -699601 -1093762 -979077 -297714 304447 49870 -790841 -1101306 -550253 -74580
40470g4580k05251j27749P23749R48886J43661m31823n6043L38628J6636k41531
40460A034583K61802O54848p6244j264493j541934q49566j56146K01935N93930
40451a141285R49843Q19103L67157K09973L61742K90385q1630l01621k34229j91319
40441A048119k73543k90328k47098k44232m1043N50991R78331M87190o14972j069378
40431B84037k79373Q45248J006190L5443j056729j301345p19338r2434O882k14894
40421a486313k22790O5749K84615K58640J41620l6873l52800m99755p2409N49152
40411a371164N08358p4905m8256Q55726J262173K34692j037328r43922O7241L20453
40401b26932l71445o23647O3434O12762L87789J66393M92641N84347k19141j142383
$$ plain form
40470 -74580 -279831 -407580 316169 1265055 1408716 976893 920850 1259478 1276114 1034583
40460 1034583 1296385 1951233 1874989 610496 -931438 -1781004 -1937150 -1735215 -1141285
40451 -1141285 -191442 627661 994818 1204791 1566533 1856918 1775288 1473667 1239438 1048119
40441 1048119 774576 484248 237150 -7082 -48125 502866 1481197 1968387 1353415 284037
40431 284037 4664 849912 1856102 1891545 834816 -466529 -1185867 -1278301 -1271419 -1486313
40421 -1486313 -1709103 -1643354 -1358739 -1100099 -958479 -995352 -1348152 -1847907 -1920316 -1371164
40411 -1371164 -862806 -937711 -985967 -130241 1131932 1366624 329296 -614626 -547385 -226932
40401 -226932 -598377 -1222024 -1158590 -545828 -158039 8354 500995 1085342 866201 -276182
40391b76182j139931m52207M3206K75246O52423Q57523K29729q33209j057522
40382a700924o3980R95015R44544K4894o57828o07185k56380m2974J71392O04101
40372e89325R69318Q11689K29230k02962k53748l20224o89439r42876n05436M55593
40362a038180J132849J003936K99074l85218o09137l07506J71132L08187J4826
40353E89963j47997K54237P14868L52493p19286j293249o13317N62433R01892
40344F02037J46867o84825o16497K20436R09004Q27927K01363l31198m38796k55357
40334E80961K303K27679K38584j57160o97390p00382L6324P11978M24087n99034
40324F7950j222321p94178K02267Q77615Q24600K36480m06807o69748n11914l25250
$$ plain form
40391 -276182 -1416113 -1868320 -1825114 -1549868 -897445 -39922 189807 -643402 -1700924
40382 -1700924 -1764904 -769889 174655 199549 -458279 -1065464 -1321844 -1364818 -1193426 -589325
40372 -589325 379993 1191682 1420912 1217950 964202 643978 -45461 -988337 -1493773 -1038180
40362 -1038180 94669 1098605 1397679 1012461 403324 95818 266950 575137 589963
40353 589963 441966 696203 1411071 1763564 1044278 -248971 -862288 -299855 602037
40344 602037 748904 64079 -552418 -331982 577022 1404949 1606312 1275114 836318 580961
40334 580961 583264 810943 1049527 892367 194977 -505405 -469081 242897 666984 67950
40324 67950 -1154371 -1948549 -1746282 -868667 -44067 192413 -214394 -884142 -1396056 -1721306
40314a721306l39957j74272N40565J277546J086916r487q63556o86002P963L09263
40304e72327J37583J4610P8633k0629m08174p11433n41551O1267P01202R81016
40294b79803P87210L13309j88755o06335q27664o21318J6691N52179M38075p5011
40284d91422k00410K38991N38604K10702k68288k31570J67122K75666m2619l01242
40274a04466j64853J77632L95831L64644J05274k64137m44877j45297M68895P31519
40264A120165J68104p95087j126492m00968N22884M71144m70806r84774l36014
40255a831844N64614N08060k31615l99036L07026R13193P66716L18475N6116k55843
40245G15862p51277q35409j26655O71812O33635j31952p86723r08986o39818q0380
$$ plain form
40314 -1721306 -2061263 -2235535 -1694970 -417424 669492 660005 -203551 -889553 -881590 -572327
40304 -572327 -434744 -420134 -341501 -362130 -770304 -1481737 -2023288 -1962021 -1260819 -279803
40294 -279803 507407 820716 631961 25626 -802038 -1423356 -1406665 -854486 -416411 -491422
40284 -491422 -691832 -452841 85763 296465 28177 -203393 -36271 239395 196776 -104466
40274 -104466 -269319 -91687 304144 668788 774062 509925 65048 -80249 388646 1120165
40264 1120165 1288269 493182 -633310 -1034278 -511394 -40250 -511056 -1495830 -1831844
40255 -1831844 -1267230 -759170 -990785 -1389821 -1082795 -169602 597114 915589 971705 715862
40245 715862 -35415 -870824 -997479 -325667 307968 176016 -610707 -1519693 -2159511 -2239891
40235b239891O70390J113993P72440m9600n63178n07332k83299j53826M0183L16939
40225h83181L50775N2186j43016J39215O53397Q43093N16457k4738m25682o14951
40215D63555o69265n32768r8106M24219N24309L0585n11434m97928j35587j13679
40205a116099m69208m56861K83811J085573J122608M20721l44213o23153k75023
40196c71844M64457R83624P29534o0169n46912m47411l48485n64175n25712J19624
$$ plain form
40235 -2239891 -1569501 -455508 316932 267332 -295846 -803178 -1086477 -1240303 -1200120 -883181
40225 -883181 -532406 -480220 -623236 -484021 169376 1012469 1528926 1504188 1078506 463555
40215 463555 -205710 -738478 -836584 -412365 111944 142529 -368905 -866833 -1002420 -1116099
40205 -1116099 -1585307 -2042168 -1758357 -672784 449824 870545 526332 -96821 -371844
40196 -371844 92613 1076237 1805771 1745602 1198690 751279 402794 -161381 -687093 -567469
$$ [...]
##END NTUPLES=NMR SPECTRUM
##END=
