##TITLE=31Pdec_SR8_2
 CDCl3, 24 sc
 5.2.2020
##JCAMPDX= 6.0         $$ Bruker NMR JCAMP-DX V2.0
##DATA TYPE= NMR SPECTRUM
##DATA CLASS= NTUPLES
##ORIGIN= UXNMR, Bruker Analytische Messtechnik GmbH
##OWNER= root
$$ XWIN-NMR		Version 3.5
$$ Wed Feb  5 14:03:04 2020 Russian Standard Time (UT+4h)  she@DPX200
##.OBSERVE FREQUENCY= 81.013821
##.OBSERVE NUCLEUS= ^31P
##.ACQUISITION MODE= SIMULTANEOUS
##.ACQUISITION SCHEME= undefined
##.AVERAGES= 24
##.DIGITISER RES= 17
##SPECTROMETER/DATA SYSTEM= spect
##.PULSE SEQUENCE= zgpg30
##.SOLVENT NAME= CDCl3
##.SHIFT REFERENCE= (INTERNAL, CDCl3, 0, 182.463)
##AUDIT TRAIL= $$ (NUMBER, WHEN, WHO, WHERE, WHAT)
$$ ##TITLE= Audit trail, XWIN-NMR		Version 3.5
$$ ##JCAMPDX= 5.01
$$ ##ORIGIN= Bruker BioSpin GmbH
$$ ##OWNER= she
$$ F:/spectra/data/she/nmr/P31/1/pdata/1/auditp.txt
$$ ##AUDIT TRAIL=  $$ (NUMBER, WHEN, WHO, WHERE, WHAT)
(   1,<2020-02-05 14:02:08.76 +0400>,<she>,<DPX200>,
      <created by zg, POWCHK disabled, PULCHK disabled
       configuration hash MD5:
       00 E9 B6 7A A2 85 ED C7 34 08 36 98 17 FE 4E 26
       data hash MD5: 32K
       32 C9 05 7D 2B F5 42 26 26 EB CF D5 3B E6 E3 83>)
(   2,<2020-02-05 14:02:11.07 +0400>,<she>,<DPX200>,
      <Start of raw data processing
       efp BC_mod = 2 LB = 1 FT_mod = 6 PKNL = 1 PHC0 = -1432.096 PHC1 = 20.80132 SI = 64K 
       data hash MD5: 64K
       01 F3 8C CF 8A 17 74 E5 12 69 E8 3D 96 5E 1E D6>)
(   3,<2020-02-05 14:02:33.65 +0400>,<she>,<DPX200>,
      <pk PHC0 = 153.9324 PHC1 = 0 
       data hash MD5: 64K
       41 65 86 9F E8 3D ED 84 C1 C5 0F 8B 38 81 EA 94>)
$$ ##END=
$$ 
$$ hash MD5
$$ AC A4 9A 9C 0C 4F 69 12 B2 AD 02 D1 65 EE 87 22
##$RELAX= 
##$RELAX= 
##$RELAX= 
##$RELAX= 
##$RELAX= 
##$RELAX= 
##$RELAX= 
##$RELAX= 
$$ Bruker specific parameters
$$ --------------------------
##$DU= <F:/spectra>
##$EXPNO= 1
##$NAME= <P31>
##$PROCNO= 1
##$TYPE= <nmr>
##$USER= <she>
##$AMP= (0..31)
100 100 100 100 100 100 100 100 100 100 100 100 100 100 100 100 100 100 
100 100 100 100 100 100 100 100 100 100 100 100 100 100 
##$AQSEQ= 0
##$AQ_mod= 1
##$AUNM= <au_zg>
##$AUTOPOS= <>
##$BF1= 81.014009
##$BF2= 200.13
##$BF3= 200.13
##$BF4= 200.13
##$BF5= 200.13
##$BF6= 200.13
##$BF7= 200.13
##$BF8= 200.13
##$BYTORDA= 1
##$CFDGTYP= 0
##$CFRGTYP= 5
##$CHEMSTR= <none>
##$CNST= (0..31)
1 1 145 1 1 1 1 1 1 1 1 1 1 1 1 1 1 1 1 1 1 1 1 1 1 1 1 1 1 1 1 1 
##$CPDPRG= <waltz16>
##$CPDPRG1= <>
##$CPDPRG2= <waltz16>
##$CPDPRG3= <>
##$CPDPRG4= <mlev>
##$CPDPRG5= <mlev>
##$CPDPRG6= <mlev>
##$CPDPRG7= <mlev>
##$CPDPRG8= <mlev>
##$CPDPRGB= <>
##$CPDPRGT= <>
##$D= (0..31)
0 1 0 0 0 0 0 0 0 0 0 0.03 2e-05 3e-06 0 0 0 0 0 0 0 0 0 0 0 0 0 0 0 0 
0 0 
##$DATE= 1580896928
##$DBL= (0..7)
120 120 120 11 120 120 24 19 
##$DBP= (0..7)
150 150 150 150 150 150 150 150 
##$DBP07= 0
##$DBPNAM0= <>
##$DBPNAM1= <>
##$DBPNAM2= <>
##$DBPNAM3= <>
##$DBPNAM4= <>
##$DBPNAM5= <>
##$DBPNAM6= <>
##$DBPNAM7= <>
##$DBPOAL= (0..7)
0.5 0.5 0.5 0.5 0.5 0.5 0.5 0.5 
##$DBPOFFS= (0..7)
0 0 0 0 0 0 0 0 
$$ [...]
##$SUBNAM2= <"">
##$SUBNAM3= <"">
##$SUBNAM4= <"">
##$SUBNAM5= <"">
##$SUBNAM6= <"">
##$SUBNAM7= <"">
##$SUBNAM8= <"">
##$SUBNAM9= <"">
##$SW= 369.568048894756
##$SWIBOX= (0..15)
0 1 3 0 0 0 0 0 0 0 0 0 0 0 0 0 
##$SW_h= 29940.119760479
##$TD= 32768
##$TD0= 1
##$TE= 0
##$TE2= 300
##$TE3= 300
##$TEG= 300
##$TL= (0..7)
0 120 53 12 22 120 120 120 
##$TP= (0..7)
150 150 150 150 150 150 150 150 
##$TP07= 0
##$TPNAME0= <>
##$TPNAME1= <>
##$TPNAME2= <>
##$TPNAME3= <>
##$TPNAME4= <>
##$TPNAME5= <>
##$TPNAME6= <>
##$TPNAME7= <>
##$TPOAL= (0..7)
0.5 0.5 0.5 0.5 0.5 0.5 0.5 0.5 
##$TPOFFS= (0..7)
0 0 0 0 0 0 0 0 
##$TUNHIN= 0
##$TUNHOUT= 0
##$TUNXOUT= 0
##$USERA1= <user>
##$USERA2= <user>
##$USERA3= <user>
##$USERA4= <user>
##$USERA5= <user>
##$V9= 5
##$VALIST= <valist>
##$VCLIST= <CCCCCCCCCCCCCCC>
##$VD= 0
##$VDLIST= <DDDDDDDDDDDDDDD>
##$VPLIST= <PPPPPPPPPPPPPPP>
##$VTLIST= <TTTTTTTTTTTTTTT>
##$WBST= 1024
##$WBSW= 4
##$XGAIN= (0..3)
0 0 0 0 
##$XL= 0
##$YL= 0
##$YMAX_a= 29280
##$YMIN_a= -24464
##$ZGOPTNS= <>
##$ZL1= 120
##$ZL2= 120
##$ZL3= 120
##$ZL4= 120
##$ABSF1= 0
##$ABSF2= 0
##$ABSG= 0
##$ABSL= 0
##$ALPHA= 0
##$AQORDER= 0
##$ASSFAC= 0
##$ASSFACI= 0
##$ASSFACX= 0
##$ASSWID= 0
##$AUNMP= <proc_1d>
##$AZFE= 0.1
##$AZFW= 0.5
##$BCFW= 0
##$BC_mod= 2
##$BYTORDP= 0
##$COROFFS= 0
##$CY= -3
##$DATMOD= 1
##$DC= 0
##$DFILT= <>
##$DTYPP= 0
##$F1P= 0
##$F2P= 0
##$FCOR= 1
##$FTSIZE= 65536
##$FT_mod= 6
##$GAMMA= 0
##$GB= 0
##$INTBC= 1
##$INTSCL= 5.30512e-09
##$ISEN= 30
##$LB= 1
##$LEV0= 0
##$LPBIN= 0
##$MAXI= 10000
##$MC2= 0
##$MEAN= 0
##$ME_mod= 0
##$MI= 50
##$NCOEF= 0
##$NC_proc= -6
##$NLEV= 6
##$NOISF1= 182.463
##$NOISF2= 159.3651
##$NSP= 0
##$NTH_PI= 0
##$NZP= 0
##$OFFSET= 182.463
##$PC= 4
##$PHC0= -1278.164
##$PHC1= 20.80132
##$PH_mod= 1
##$PKNL= yes
##$PPARMOD= 0
##$PSCAL= 0
##$PSIGN= 0
##$REVERSE= no
##$SF= 81.0140089999434
##$SI= 65536
##$SIGF1= 159.3651
##$SIGF2= -187.1042
##$SINO= 113.3802
##$SIOLD= 16384
##$SREGLST= <1H.CDCl3>
##$SSB= 0
##$STSI= 65536
##$STSR= 0
##$SW_p= 29940.119760479
##$SYMM= 0
##$S_DEV= 0
##$TDeff= 32768
##$TDoff= 0
##$TI= <>
##$TILT= no
##$TM1= 0
##$TM2= 0
##$TOPLEV= 0
##$USERP1= <user>
##$USERP2= <user>
##$USERP3= <user>
##$USERP4= <user>
##$USERP5= <user>
##$WDW= 1
##$XDIM= 65536
##$YMAX_p= 364735173
##$YMIN_p= -21772951
$$ End of Bruker specific parameters
$$ ---------------------------------
##NTUPLES= NMR SPECTRUM
##VAR_NAME=  FREQUENCY,     SPECTRUM/REAL,   SPECTRUM/IMAG
##SYMBOL=    X,             R,               I
##VAR_TYPE=  INDEPENDENT,   DEPENDENT,       DEPENDENT
##VAR_FORM=  AFFN,          ASDF,            ASDF
##VAR_DIM=   65536,         65536,           65536
##UNITS=     HZ,            ARBITRARY UNITS, ARBITRARY UNITS
##FACTOR=    0.456856943014862, 1,           1
##FIRST=     14782.0589164792, 0,            0
##LAST=      -15158.0608439998, 0,           0
##MIN=       -15158.0608439998, -21772951,   0
##MAX=       14782.0589164792, 364735173,    0
$$ Real data points
##PAGE= N=1
##DATA TABLE= (X++(R..R)), XYDATA
$$ [...]
45754F62191J419894Q25160l41056j148990j205606p38478j16434M00424O91913
$$ 662191 2082085 2907245 2566189 1417199 211593 -526885 -643319 -242895 449018
45745D49018P77259O84168L50314j86781o76636r69995j169447j179399n89555
$$ 449018 1226277 1910445 2260759 2073978 1397342 427347 -742100 -1921499 -2511054
45736b511054M62813Q86371l6934j343027j474169m29259L56831J85163j68761
$$ -2511054 -2048241 -1161870 -1198804 -2541831 -4016000 -4445259 -4088428 -3903265 -4072026
45727d072026j1823L39943N59507Q99988J218219O80649p83782j870856j621125
$$ -4072026 -4083849 -3743906 -3184399 -2284411 -1066192 -385543 -1169325 -3040181 -4661306
45718d661306p38601k66750K7045Q03192J592260J475486P49695M92875P63084
$$ -4661306 -5399907 -5666657 -5639612 -4836420 -3244160 -1768674 -1018979 -526104 236980
45709B36980O06804k02931p47835m50816J76112N83711R39021J324786J080691
$$ 236980 843784 640853 -106982 -557798 -381686 202025 1141046 2465832 3546523
45700C546523k76052j954828k540403j700831o22586n08465j070054j014347R7460
$$ 3546523 3270471 1315643 -1224760 -2925591 -3548177 -4056642 -5126696 -6141043 -6043583
45691f043583J183165J155735M28984J60775M59688L95597l43572r54236q05708
$$ -6043583 -4860418 -3704683 -3275699 -3114924 -2655236 -2259639 -2603211 -3557447 -4363155
45682d363155j19626Q47734K084283K912279K161000l1049j817514j904933j060039
$$ -4363155 -4482781 -3635047 -1550764 1361515 3522515 3491466 1673952 -230981 -1291020
45673a291020m78632J6738R10203J409583O00359o87053q84794J955O80964O45720
$$ -1291020 -1769652 -1752914 -842711 566872 1167231 480178 -404616 -402661 278303 924023
45663I24023L57924j48716j122490j881895j480585l79497J88514K36545O52755
$$ 924023 1281947 1133231 10741 -1871154 -3351739 -3731236 -3542722 -3306177 -2653422
45654b653422J167817P54277j24328M3033J038069J018564k39747p95151L1562
$$ -2653422 -1485605 -731328 -855656 -812623 225446 1244010 1004263 209112 240674
45645B40674L49624r59383k142267j476191J4204O73022R60173J829969K191233
$$ 240674 590298 -369085 -2511352 -3987543 -3973339 -3300317 -2340144 -510175 1681058
45636A681058O36597j569241j971419o19171L36076K02329K40882P86837O03993
$$ 1681058 2317655 748414 -1223005 -1842176 -1506100 -1303771 -1062889 -276052 327941
45627C27941n02987r02836K03069J336793R85188k49174p84349k38946M53335
$$ 327941 -175046 -1077882 -874813 461980 1447168 1197994 413645 174699 628034
45618F28034L95357m15189j087355n69885R95061J883328P54701j291404j993994
$$ 628034 1023391 608202 -479153 -1049038 -53977 1829351 2584052 1292648 -701346
45609g01346j064994l24108o28775p18433K30158R39299J98579r19565o11140
$$ -701346 -1766340 -2090448 -2719223 -3437656 -3207498 -2268199 -2069620 -2989185 -3600325
45600c600325R45642J976177J543908K54060r57944j503779j019103K44494J137256
$$ -3600325 -2654683 -678506 865402 1119462 161518 -1342261 -2361364 -2116870 -979614
45591i79614P58739k61262n02645L87284J372495J417929M89857p02877j378856
$$ -979614 -220875 -482137 -984782 -597498 774997 2192926 2682783 1979906 601050
45582F01050j242248p66400o03529n00642M20322J900224K246169P56370p54892
$$ 601050 -641198 -1407598 -2011127 -2511769 -2091447 -191223 2054946 2811316 2056424
45573B056424l48567J075366J092180n64328j818686j635169j238798j511420
$$ 2056424 1707857 2783223 3875403 3311075 1492389 -142780 -1381578 -2892998
45565b892998j470395l64923P25783P91822P10657J518322K249679J424895k72260
$$ -2892998 -4363393 -4728316 -4002533 -3210711 -2500054 -981732 1267947 2692842 2420582
45556B420582q49421k4468N93915J36819o16264r60109j025618o65312M63178
$$ 2420582 1571161 1546693 2140608 2277427 1661163 701054 -324564 -989876 -526698
45547e26698J320974J73511k255495k571756O88498M162796L705389O8032k210194
$$ -526698 794276 967787 -1287708 -3859464 -3170966 991830 4697219 4765251 2555057
45538B555057j099678P29737M83811r06809j085565k04805k39238j475284k077659
$$ 2555057 1455379 2185116 2668927 1762118 676553 471748 232510 -1242774 -3320433
45529c320433j007907O12189J388050J305701R19309K47422o28697q72918Q0258
$$ -3320433 -4328340 -3716151 -2328101 -1022400 -103091 144331 -484366 -1357284 -1277026
45520a277026J328170J401060J97016r06205r06713l08672j39264n19687o87569
$$ -1277026 51144 1452204 1649220 743015 -163698 -472370 -611634 -1131321 -1818890
45511a818890p6016J049802J837044J468394j49961j967864k402721r56375R39671
$$ -1818890 -1894906 -845104 991940 2460334 2310373 342509 -2060212 -3016587 -2076916
45502b076916J363199J80771q54233m43651O85217J051567M36524k44570n11126
$$ -2076916 -713717 -532946 -1387179 -1830830 -1145613 -94046 342478 97908 -413218
45493d13218o47605o74229j38665R13016J701809J691020J025880o8935j364760
$$ -413218 -1060823 -1735052 -1873717 -960701 741108 2432128 3458008 3389073 2024313
45484B024313j995052j013991R32282J765018N83519j039431j288455m49720J41705
$$ 2024313 29261 -984730 -52448 1712570 2296089 1256658 -31797 -481517 -339812
45475c39812L12823O54430Q79988M22889m671N50773J153879J16930j891892k319038
$$ -339812 -26989 627441 1507429 1930318 1925647 2476420 3630299 3747229 1855337 -463701
45465d63701n84765J023361R73792M42865N43457K39050j196429k017538o88901
$$ -463701 -1048466 -25105 948687 1391552 1935009 2174059 977630 -1039908 -1728809
45456a728809J128086R56135n23199p85819K11990K17474j153989j710333m92978
$$ -1728809 -600723 355412 -167787 -953606 -741616 -524142 -1678131 -3388464 -3881442
45447c881442P47573P05945L63199N42437K84838p85796r46929P40228K127383
$$ -3881442 -3133869 -2427924 -2064725 -1522288 -1237450 -2023246 -2970175 -2229947 -102564
45438a02564J006355j150683j231041P22362J678464L10533j333226j268931j33039
$$ -102564 903791 -246892 -1477933 -755571 922893 1233426 -99800 -1368731 -1501770
45429a501770O55977J130820J755955J796962M38055j376163j886289r61296j75896
$$ -1501770 -845793 285027 2040982 3837944 4275999 2899836 1013547 52251 -123645
45420a23645m79001j049547p88845Q0381N64041M35568M04172Q44120J091749
$$ -123645 -602646 -1652193 -2441038 -2360657 -1796616 -1361048 -956876 -112756 978993
45411I78993L78120r22010j551015r06636J99337O18639L00556J21530M67685
$$ 978993 1357113 435103 -1115912 -2022548 -1823211 -1204572 -904016 -782486 -314801
45402c14801O89350J90927n19262m47891L95662P84024j72394j666066j969867
$$ -314801 374549 565476 46214 -401677 -6015 778009 605615 -1060451 -3030318
45393c030318n77183J051911J273526K99719k59409L37895J115127R71964J46988
$$ -3030318 -3607501 -2555590 -1282064 -982345 -1241754 -903859 211268 1183232 1330220
45384A330220m85264p51220r55272r20454l06539M19556M45689m507J41348J082672
$$ 1330220 844956 93736 -861536 -1781990 -2088529 -1668973 -1223284 -1227791 -1086443 -3771
45374c771J708399J257753L76900p8357l37275r56940j526658j215984k39211
$$ -3771 1704628 2962381 3339281 3260924 2923649 1966709 440051 -775933 -1015144
45365a015144L11192L4326l14517m4098N84476R18066P05501N1432q61185j636973
$$ -1015144 -703952 -669626 -984143 -1028241 -443765 474301 1179802 1231234 370049 -1266924
45355a266924j668661o92181Q04066J934122K075411J199703j27510j025807r70574
$$ -1266924 -2935585 -3627766 -2823700 -889578 1185833 2385536 2258026 1232219 261645
45346B61645l39330J9529j93552n66163q18820j094253j193758m53199R78759
$$ 261645 -77685 -58156 -251708 -817871 -1636691 -2730944 -3924702 -4377901 -3399142
45337c399142J628814N55888q95945o33321J105794J881772O20086o93044K7167
$$ -3399142 -1770328 -1214440 -2110385 -2743706 -1637912 243860 863946 170902 198069
45328A98069J720756J649176n47106k204947j253984J150505K336132J315268
$$ 198069 1918825 3568001 3020895 815948 -438036 712469 3048601 4363869
45320D363869o47261j940005k057904j424922o66299j74237J00993N25257J169046
$$ 4363869 3716608 1776603 -281301 -1706223 -2372522 -2546759 -2445766 -1920509 -751463
45311g51463J412675N72501j044029k122920j641059j3985J297439J310068M23041
$$ -751463 661212 1233713 189684 -1933236 -3574295 -3588280 -2290841 -980773 -557732
45302e57732l05978n10127o98635j149768j307925o87552K00496N12049K75686
$$ -557732 -863710 -1373837 -2072472 -3222240 -4530165 -5217717 -5017221 -4505172 -4229486
45293d229486J34919J79691J4787j65139K49652R63237R42709K32189J68188J142366
$$ -4229486 -4094567 -3914876 -3900089 -4065228 -3815576 -2852339 -1909630 -1677441 -1509253 -366887
45283c66887J654905O52228o44406p20696k68454p49210j446247m16870J905499
$$ -366887 1288018 1940246 1295840 575144 306690 -442520 -1888767 -2305637 -400138
45274d00138K709401R31630r94831o42053J084249J606118K88988j241584j626418
$$ -400138 2309263 3240893 2246062 1604009 2688258 4294376 4583364 3341780 1715362
45265A715362j129653p40130r52946j362129j013919M37957J762529J288858o15297
$$ 1715362 585709 -154421 -1107367 -2469496 -3483415 -3045458 -1282929 5929 -609368
45256f09368j506606r2169J897621K225029J130695K00799m32807j550576k346219
$$ -609368 -2115974 -2208143 -310522 1914507 3045202 3246001 2813194 1262618 -1083601
45247a083601j129735J471266K569178R33866j308058j840850j117326q86382
$$ -1083601 -2213336 -742070 1827108 2760974 1452916 -387934 -1505260 -2391642
45239b391642j357540j433178p74975p9133K35886M08034O84767J130565J687710
$$ -2391642 -3749182 -5182360 -5957335 -6036468 -5800582 -5392548 -4707781 -3577216 -1889506
45230a889506J811436P51981j037589j680024j99845J711445J683804j02080j276205
$$ -1889506 -78070 673911 -363678 -2043702 -2243547 -532102 1151702 1049622 -226583
45221b26583o34035O16746J119713J088771J104733P85265k35635j140133r93433
$$ -226583 -860618 -243872 875841 1964612 3069345 3854610 3618975 2478842 1485409
45212A485409k48234P321k44286k24664L9881k43700j037750j269117n28525K30177
$$ 1485409 1237175 1244496 1000210 775546 815427 571727 -466023 -1735140 -2263665 -2033488
45202b033488K36892J00746O89982J650185J958870J378876M34528n79878j532900
$$ -2033488 -1796596 -1695850 -1005868 644317 2603187 3982063 4416591 3836713 2303813
45193B303813j754964o50036R76402J398455R6303j571768k166137j686928q78705
$$ 2303813 548849 -101187 875215 2273670 2369973 798205 -1367932 -3054860 -3933565
45184c933565j4720R29797J664678J886368J644872R22401l97630j643890j515511
$$ -3933565 -3948285 -3018488 -1353810 532558 2177430 3099831 2702201 1058311 -457200
45175d57200O297J024378K31400j013058p21354N38591O20785n25726o79205Q98628
$$ -457200 -450903 573475 804875 -208183 -929537 -390946 229839 -295887 -975092 -76464
45165g6464K044138J037154p65762j124823j22382N24704K20622k18829l81150
$$ -76464 1967674 3004828 2239066 1114243 991861 1516565 1737187 1518358 1137208
45156A137208o69364j083782r79047j59044O93845P89374m5496j196010j486169
$$ 1137208 467844 -615938 -1594985 -1754029 -1060184 -270810 -316306 -1512316 -2998485
45147b998485j72655J813854K422908R67542q17769j055396r2390N24753M38758
$$ -2998485 -3171140 -1357286 1065622 2033164 1215395 159999 67609 592362 1031120
45138A031120L35703J97603n04519j287536j165756n24040o30377j265922q44490
$$ 1031120 1366823 1564426 1059907 -227629 -1393385 -1917425 -2547802 -3813724 -4658214
45129d658214P28674J386787J7167j545406j018401J084052K237481J290596l26353
$$ -4658214 -3929540 -2542753 -2525586 -4070992 -5089393 -4005341 -1767860 -477264 -803617
45120h03617o55419M94756J490936P79534j198632k193739p20020J841705K675796
$$ -803617 -1459036 -964280 526656 1306190 107558 -2086181 -2806201 -964496 1711300
45111A711300R93697j170634j809399j143629m26468m9696J41961p5861o34390
$$ 1711300 2704997 1534363 -275036 -1418665 -1845133 -1894829 -1752868 -1828729 -2463119
45102b463119n50345O62142J748017J314713K6704l84600J62795J87575o36113
$$ -2463119 -3013464 -2351322 -603305 711408 738112 353512 516307 703882 67769
45093F7769q17830L48272J314324N51437j009134j313062k63601K24638p30290
$$ 67769 -750061 -401789 912535 1463972 454838 -858224 -1121825 -897187 -1627477
45084a627477j512314m10749J642288K111498K79905j811989k109996r13200K03608
$$ -1627477 -3139791 -3550540 -1908252 203246 483151 -1328838 -3438834 -4352034 -4148426
45075d148426O52375Q66076R42390O77787M41821N68494L11740r58195j927020
$$ -4148426 -3496051 -2629975 -1687585 -1009798 -567977 517 312257 -645938 -2572958
45066b572958q01655J460553J882247n4546j354114j37216J392284O29029j185602
$$ -2572958 -3374613 -1914060 -31813 -86359 -1440473 -1577689 -185405 443624 -741978
45057g41978j161109N18918J238043L43755l60017k00373m74213j381907j192865
$$ -741978 -1903087 -1384169 -146126 197629 -162388 -362761 -836974 -2218881 -3411746
45048c411746N82980J829365R51087p65102j338791q38052m02358n2903P81952
$$ -3411746 -2828766 -999401 -48314 -813416 -2152207 -2990259 -3392617 -3445520 -2663568
45039b663568J578966J274442K3861r42313r61611m46496q873J07898o3022k43607
$$ -2663568 -1084602 189840 213701 -728612 -1690223 -2136719 -2145592 -2037694 -2100716 -2344323
45029b344323l5541N91204J186684J388064J201267O86298j0832l34132R6256
$$ -2344323 -2379864 -1788660 -601976 786088 1987355 2673653 2662821 2328689 2424945
45020B424945N49040n2065j274410j444356k01911P06657L5848r73166m93870
$$ 2424945 2973985 2921920 1647510 203154 1243 707900 743748 -229418 -723288
45011g23288J031506J458443o0200j946034k115545k89647J710158J789058j13558
$$ -723288 308218 1766661 1706461 -239573 -2355118 -2644765 -934607 854451 740893
45002G40893j748225j233995M24451Q22797j89747m50496O77554J027332o07117
$$ 740893 -1007332 -2241327 -1816876 -994079 -1183826 -1634322 -956768 70564 -536553
44993e36553k006498r35484J074931J064554o37122j034925P98225K538294K245934
$$ -536553 -2543051 -3478535 -2403604 -1339050 -1976172 -3011097 -2212872 325422 2571356
44984B571356O64727n86237j072419j167221j149899j203477j234753o26701P98739
$$ 2571356 3236083 2649846 1577427 410206 -739693 -1943170 -3177923 -3804624 -3005885
44975c005885J919051J686793Q26729O12803O17179l71507j763803j821314n79205
$$ -3005885 -1086834 599959 1426688 2039491 2656670 2285163 521360 -1299954 -1879159
44966a879159L61079P78949J800543K863368J896234q14169k200627j082710o9908
$$ -1879159 -1518080 -739131 1061412 3924780 5821014 5006845 2806218 1723508 1653600
44957A653600j076582k057384o51877J600416J692757j28571j193667o69063L3121
$$ 1653600 577018 -1480366 -2132243 -531827 1160930 1032359 -161308 -830371 -797250
44948g97250K77404P26594J211878P23503n00270j099935q06647n67925n70918
$$ -797250 -519846 206748 1418626 2142129 1641859 541924 -264723 -832648 -1403566
44939a403566q2917P82310J022847N16624J13620r435l95735p94620l56230O78452
$$ -1403566 -1486483 -704173 318674 835298 948918 939483 543748 -250872 -607102 71350
44929G1350J184380R75165P01677J67565j228911k510374j911410J40132J215192
$$ 71350 1255730 2230895 2932572 3100137 1871226 -639148 -2550558 -2410426 -1195234
44920a195234N02420k07529J64384K89620p75904j603586q68411L04781L61945
$$ -1195234 -692814 -900343 -735959 -446339 -1222243 -2825829 -3694240 -3389459 -3027514
44911c027514j15554J08912M55283k21687j122402o26458Q35067J362500O38216
$$ -3027514 -3143068 -3034156 -2578873 -2800560 -3922962 -4549420 -3714353 -2351853 -1713637
44902a713637J53080M72245M48532m73935j055075j35629J530017K092234O34912
$$ -1713637 -1560557 -1088312 -639780 -1113715 -2168790 -2304419 -774402 1317832 1952744
44893A952744j916429l450210k385789N97625K831525K435430M17245r01322r08297
$$ 1952744 36315 -3413895 -5799684 -5202059 -2370534 64896 482141 -419181 -1327478
44884a327478p54688q86365m44850O85778J125995J14089j029541n90829J249843
$$ -1327478 -2082166 -2968531 -3413381 -2727603 -1601608 -1487519 -2517060 -3107889 -1858046
44875a858046K713754K466458P48201j068141j633841q06555J06635j47264j016251
$$ -1858046 855708 3322166 4070367 3002226 1368385 561830 668465 521201 -495050
44866d95050q19719P30080J950377J602405N18788p3579n37416j711557k762808
$$ -495050 -1314769 -584689 1365688 2968093 3486881 3413302 2875886 1164329 -1598479
44857a598479k003972L31927J888158J178295n54910j167139l09563N93933M74610
$$ -1598479 -3602451 -3270524 -1382366 -204071 -758981 -1926120 -2235683 -1641750 -1167140
44848a167140k68159o72901l94792K57669Q83733J172132Q55366j4327q36040
$$ -1167140 -1435299 -2108200 -2502992 -2245323 -1361590 -189458 665908 651581 -184459
44839a84459r63516m32832K43933R23538J762373K253661J405045n60128j786802
$$ -184459 -1147975 -1580807 -1336874 -413336 1349037 3602698 5007743 4447615 2660813
44830B660813j154098j33589p70787k445681k588597n27460J516328J772513J153011
$$ 2660813 1506715 1373126 602339 -1843342 -4431939 -4959399 -3443071 -1670558 -517547
44821e17547J076489R98323k10029j801832k024966p13195P44627J523926J790590
$$ -517547 558942 1557265 1347236 -454596 -2479562 -3192757 -2448130 -924204 866386
44812H66386J403350j0004j678799k063297r43314J76226J07105o66923r87651
$$ 866386 2269736 2259732 580933 -1482364 -2425678 -2249452 -2142347 -2809270 -3796921
44803c796921m05547P10641J605920J514729L90659p06953p47862j17596L7403
$$ -3796921 -4202468 -3491827 -1885907 -371178 19481 -687472 -1435334 -1552930 -1515527
44794a515527m33538p45912p01017p06033m74762N70225J587658R79961q82070
$$ -1515527 -1949065 -2694977 -3395994 -4102027 -4576789 -4006564 -2418906 -1438945 -2321015
44785b321015j678214n87187M15797j91801j049937l38565J216758J753645J263264
$$ -2321015 -3999229 -4586416 -4170619 -4362420 -5412357 -5750922 -4534164 -2780519 -1517255
44776a517255J000265R37167J11069j037810r29245N90898J819709J495985O8791
$$ -1517255 -516990 420177 531246 -506564 -1435809 -844911 974798 2470783 2539574
44767B539574j384245k185413j991628r10023K86282R48907J249962J277616L18786
$$ 2539574 1155329 -1030084 -3021712 -3931735 -3645453 -2696546 -1446584 -168968 149818
44758A49818j635114k684700j245803J239628K009203R39506L74294J163745J577598
$$ 149818 -1485296 -4169996 -5415799 -4176171 -2166968 -1227462 -853168 310577 1888175
44749A888175N61952n80699o73686m92879r54820j446746j140143k99125O73846
$$ 1888175 2450127 1869428 1195742 702863 -251957 -1698703 -2838846 -3137971 -2464125
44740b464125J808373K413132J331361p66419j546927n59056j72405j539038k320568
$$ -2464125 -655752 1757380 3088741 2322322 775395 216339 43934 -1495104 -3815672
44731c815672n68281J724136J748067L87155L35397J388063J251775J1010p2115
$$ -3815672 -4383953 -2659817 -911750 -524595 -189198 1198865 2450640 2461650 2389535
44722B389535J076198R69598j030824k394148j428165L70089J118846J098089
$$ 2389535 3465733 4435331 3404507 1010359 -417806 -47717 1071129 2169218
44714B169218J201110J119082M75450j06030l46878j033086k230248k465704r44322
$$ 2169218 3370328 4489410 4964860 4858830 4511952 3478866 1248618 -1217086 -2161408
44705b161408R30585J483416Q63644J28162l85248o69140m06697J78989J89510
$$ -2161408 -1230823 252593 1116237 1244399 859151 190011 -216686 -37697 151813
44696A51813k35626L45513K066598K669384O48885k136498k904430j643695l47885
$$ 151813 -83813 261700 2328298 4997682 5646567 3510069 605639 -1038056 -1385941
44687a385941K34195Q04482J327771J022428J62462k18950j57165l75993n01475
$$ -1385941 -1151746 -347264 980507 2002935 2165397 1946447 1789282 1413289 911814
44678I11814K55211J005711J59761j566145j664824K43383J530467M56280j359803
$$ 911814 1167025 2172736 2332497 766352 -898472 -655089 875378 1331658 -28145
44669b8145j580792k92027R17872J355182J168200K70416j082881j719793j099454
$$ -28145 -1608937 -1900964 -983092 372090 1540290 1810706 727825 -991968 -2091422
44660b091422n03899j140576j936493r99795J294349K579583J736649J05165p13593
$$ -2091422 -2595321 -3735897 -5672390 -6672185 -5377836 -2798253 -1061604 -956439 -1670032
44651a670032o80113n12800m18338k69754o8848L33850J164808J943443J671548
$$ -1670032 -2350145 -2862945 -3281283 -3551037 -3619885 -3286035 -2121227 -177784 1493764
44642A493764L42633o47303l28607M14783J75573q58693j257774n14014L48456
$$ 1493764 1836397 1189094 860487 1275270 1450843 592150 -665624 -1179638 -831182
44633h31182M06313m540j29782Q0530K41914K89520L28237J55628m01141r02309
$$ -831182 -424869 -429409 -559191 -478661 -236747 52773 381010 536638 135497 -766812
44623g66812p02524Q8811O02802K62419n62706j058137p98554J7150Q61329J250661
$$ -766812 -1469336 -1380525 -777723 -515304 -1078010 -2136147 -2934701 -2917551 -2056222 -805561
44613h05561J028771M46299q8073l55146l89362l19179k73930l00638k14066K51872
$$ -805561 223210 669509 581436 226290 -163072 -482251 -756181 -1056819 -1270885 -1019013
44603a019013R29199J179872P47637K79323M23730P48641L63360n76359j001689
$$ -1019013 -89814 1090058 1837695 2117018 2540748 3289389 3652749 3076390 2074701
44594B074701o26245l78849p64229r24932r3770R53337R29231p1551q01489o71237
$$ 2074701 1448456 1069607 305378 -619554 -713324 240013 1169244 1097693 296204 -375033
44584c75033k68652j52406j44647m65N7795j79391m55865l95332N6391O94355
$$ -375033 -643685 -796091 -940738 -941203 -883408 -1062799 -1518664 -1913996 -1857605 -1163250
44574a163250J209776J203483M83980m75070p92174j85246N46224L55737q37809
$$ -1163250 46526 1250009 1733989 1258919 466745 281499 827723 1183460 345651
44565C45651k000280k034678q58756N81172J284889J092150N97224L48788L56597
$$ 345651 -1654629 -3689307 -4548063 -3966891 -2682002 -1589852 -992628 -643840 -287243
44556b87243L34127J26680k00984m85543n57871l54114P528L43344N30455M43898
$$ -287243 46884 173564 -27420 -512963 -1070834 -1424948 -1417420 -1074076 -543621 -99723
44546i9723L5944l34505j14634M89174L89421p97104j716122j026021L70753M98201
$$ -99723 -63779 -398284 -512918 -23744 365677 -431427 -2147549 -3173570 -2802817 -2304616
44536b304616n44889o71808P07865J611778P92401j87542K89699J152581O80629
$$ -2304616 -2849505 -3521313 -2813448 -1201670 -409269 -596811 -307112 845469 1526098
44527A526098m60244o31847k92726r18539j798059r25392J245771J996371N29923
$$ 1526098 1065854 434007 141281 -777258 -2575317 -3500709 -2254938 -258567 271356
44518B71356r13260p67886k52288p27285j400774j069174j51426M77291J015236
$$ 271356 -641904 -1409790 -1662078 -2389363 -3790137 -4859311 -5010737 -4533446 -3518210
44509c518210J700847J768269Q38946j4923K8506J01713o71946j372972p76482
$$ -3518210 -1817363 -49094 789852 774929 803435 905148 233202 -1139770 -1916252
44500a916252M74461R08899N42324M00481M62509o8766q79999p92516J69720O25001
$$ -1916252 -1441791 -532892 9432 409913 872422 803656 -76343 -868859 -699139 -74138
44490g4138m8993q36676o91786O8539M46277J19708l27474k38322K68450L50212
$$ -74138 -123131 -959807 -1651593 -1583054 -1136777 -1017069 -1344543 -1582865 -1314415 -964203
44480i64203m09622j116649o58167L75989K27809j182609j647351M1588J900297
$$ -964203 -1373825 -2490474 -3148641 -2772652 -2544843 -3727452 -5374803 -5333215 -3432918
44471c432918J568841p5539l76495Q80416J297504j69332j607618j162220M13394
$$ -3432918 -1864077 -1939616 -2316111 -1435695 -138191 -307523 -1915141 -3077361 -2663967
44462b663967J261419R50337L34227p2627m02229o51553n61244j44715K19788
$$ -2663967 -1402548 -452211 -117984 -190611 -592840 -1244393 -1805637 -1950352 -1730564
44453a730564K47682J27770M03076J265358J902113J140132q38670k169481j504962
$$ -1730564 -1482882 -1355112 -952036 313322 2215435 3355567 2516897 347416 -1157546
44444a157546J37823Q14298L26733M6072M22212L88183n66757j352632r62359
$$ -1157546 -1019723 -205425 121308 167380 589592 977775 411018 -941614 -1903973
44435a903973L113K80186l67735j074319r95309r3915Q33548Q01713k52411j087349
$$ -1903973 -1900860 -1620674 -1988409 -3062728 -4058037 -4151952 -3318404 -2516691 -2769102 -3856451
44425c856451n02540J080937K153759K075418J549723J189140O85194l35625j501773
$$ -3856451 -4358991 -3278054 -1124295 951123 2500846 3689986 4375180 4039555 2537782
44416B537782k077695j630899l20291R48264R67311l75923j523526j048711L85003
$$ 2537782 460087 -1170812 -1491103 -542839 424472 48549 -1474977 -2523688 -2138685
44407b138685J044581O38316K97648L74613O2334p50499j066351n22615J12047
$$ -2138685 -1094104 -455788 -158140 216473 278807 -471692 -1538043 -2060658 -1948611
44398a948611M74148R53541J258391N36747o64485o38632O43596J127715J3725
$$ -1948611 -1474463 -520922 737469 1274216 609731 -28901 614695 1742410 1756135
44389A756135q09865J8107R82506L55788q48889p70219J35599K25875l13851j14437
$$ 1756135 946270 964377 1946883 2302671 1453782 683563 819162 1045037 731186 616749
44379F16749N70675K42723j047593j613791p74085M20261J082608J298752J033182
$$ 616749 1187424 1430147 382554 -1231237 -2005322 -1585061 -502453 796299 1829481
44370A829481j2342j274544j577087o98959M93013J361162J740693J252414j35144
$$ 1829481 1817139 542595 -1034492 -1733451 -1240438 120724 1861417 3113831 2978687
44361B978687j202496q11504J13668k39033j561165j648397J60604J845114J597400
$$ 2978687 1776191 964687 1078355 839322 -721843 -2370240 -2209636 -364522 1232878
44352A232878M1278j161172j303051n02596Q72725J834281J243469n00336j532700
$$ 1232878 1274156 112984 -1190067 -1692663 -819938 1014343 2257812 1757476 224776
44343B24776j025609k38927l02938n19381L1861P14078N93648K07872M58958P58177
$$ 224776 -800833 -1039760 -1342698 -1862079 -1830218 -1116140 -522492 -314620 144338 902515
44333I02515M5672j036127q55230O15776J682061J414746O48097K66182o083n96379
$$ 902515 948187 -87940 -943170 -327394 1354667 2769413 3417510 3683692 3677609 3081230
44323C081230j124802j133198q45606n65515j23776M33145M10241m41086j049515
$$ 3081230 1956428 823230 -22376 -587891 -711667 -278522 131719 -309367 -1358882
44314a358882k97476J189831J680997P18789l30462l92092j25844n13969j072588
$$ -1358882 -1656358 -466527 1214470 1933259 1602797 1210705 1084861 570892 -501696
44305e01696o85006M20123R60469O58539M99574P73344M29248r71867k065171
$$ -501696 -1186702 -766579 193890 852429 1352003 2125347 2554595 1582728 -482443
44296d82443j475491K25489J462436J725960J528849J009245n2389j179002j464963
$$ -482443 -1957934 -1732445 -270009 1455951 2984800 3994045 3941656 2762654 1297691
44287A297691q40141p8582L31919M65090L48639k5104l32071l68882m68007o67613
$$ 1297691 457550 378968 710887 1175977 1524616 1499512 1167441 798559 330552 -337061
44277c37061j89103J154032J878914P00672j225760j737290p84630o4303O3714
$$ -337061 -526164 627868 2506782 3207454 1981694 244404 -540226 -604529 -540815
44268e40815Q31877K191091K331477P30360p59400q25565m67221p66348j084025
$$ -540815 291062 2482153 4813630 5543990 4784590 3959025 3491804 2725456 1641431
44259A641431p85778o57401j091404q79726M98700J366622N56510k93551N77655
$$ 1641431 855653 198252 -893152 -1772878 -1274178 92444 648954 355403 933058
44250I33058J834415J162318p93866j523151p04858j46474k77646J24496Q59643
$$ 933058 2767473 3929791 3135925 1612774 907916 761442 483796 608292 1467935
44241A467935K06553j648606k153280l27558J523082J290197p5915o19569k42537
$$ 1467935 1674488 25882 -2127398 -2454956 -931874 358323 282408 -337161 -579698
44232e79698J22932N09231J299109J827799J257767r397j121742k049911k787625
$$ -579698 -456766 52465 1351574 3179373 4437140 4427743 3306001 1256090 -1531535
44223a531535k343038j52328K266879K823131J610315N07664K81475j24703j270217
$$ -1531535 -3874573 -4026901 -1760022 1063109 2673424 3181088 3462563 3337860 2067643
44214B067643k007349j346763j33475K42519p9758J18306J020897J397844N08216
$$ 2067643 60294 -1286469 -1419944 -1177425 -1257183 -1138877 -117980 1279864 1788080
44205A788080o71719p39319K51170R73311O10170l54223j074968j249136r25911
$$ 1788080 1116361 377042 628212 1601523 2211693 1857470 782502 -466634 -1392545
44196a392545k56346K26903q8557q37739p95628L23868J171916P71094J57560
$$ -1392545 -1648891 -1421988 -1510545 -2348284 -3143912 -2820044 -1648128 -877034 -719474
44187g19474O85554J637174J305720j43829r59597p12402o76371j164505r14113
$$ -719474 -33920 1603254 2908974 2765145 1805548 1093146 416775 -747730 -1661843
44178a661843K25212M67892q41836j675563n23946R55768O47394m81331j82002
$$ -1661843 -1436631 -968739 -1810575 -3486138 -4010084 -3054316 -2406922 -2888253 -3070255
44169c070255J061404Q84844p12291j212145J60343J139060K62105p98557k41353
$$ -3070255 -2008851 -1124007 -1836298 -3048443 -2888100 -1749040 -1486935 -2285492 -2526845
44160b526845R02746Q07581O7045N05353J804163J807971J477j574679j362890
$$ -2526845 -1624099 -816518 -749473 -244120 1560043 3368014 3369491 1794812 431922
44151D31922m29080n93155j653827j767568j29841J910450K571225J658526L93052
$$ 431922 2842 -590313 -2244140 -4011708 -4141549 -2231099 340126 1998652 2391704
44142B391704l08981o28206r03782p52474K15590J268545J135388j79440j059706
$$ 2391704 2082723 1454517 550735 -201739 13851 1282396 2417784 2238344 1178638
44133A178638k50742J427742J996377O93965j150614j657063m53965R54597Q59443
$$ 1178638 927896 2355638 4352015 5045980 3895366 2238303 1784338 2738935 3598378
44124C598378o94570j921031j488646k07305K10271l34102l21911P92117J543734
$$ 3598378 2903808 982777 -505869 -713174 -502903 -837005 -1158916 -366799 1176935
44115A176935P56807n44874p65524j52681l1369m49130l95170R5937K9492m53672
$$ 1176935 1933742 1388868 623344 470663 439294 -9836 -405006 -309069 -279577 -733249
44105g33249j06160J037413J360202L63398l75722R9473M88633l45435j235560
$$ -733249 -839409 198004 1558206 1921604 1545882 1645355 2133988 1788553 552993
44096E52993q00899j0695m30267j203309l67174J594701K244101R66263m30672
$$ 552993 -247906 -258601 -688868 -1892177 -2259351 -664650 1579451 2545714 2115042
44087B115042r41181j403355j866403q49363J617006K894959J412644p60638r65655
$$ 2115042 1173861 -229494 -2095897 -2945260 -1328254 1566705 2979349 2218711 1253056
44078A253056K73243O95582j0855m16970k12039l46417q33763p48821k02022j59183
$$ 1253056 1526299 2221881 2211026 1794056 1582017 1235600 401837 -346984 -549006 -708189
44068g08189l84463K90690J543077J578077J4263j295944j061816l29048m77619
$$ -708189 -1092652 -801962 741115 2319192 2333455 1037511 -24305 -353353 -830972
44059h30972j030713p03222M78420J340885J197347L73679m50447p78082n47246
$$ -830972 -1861685 -2564907 -2086487 -745602 451745 825424 374977 -403105 -950351
44050i50351k04814j39636m4356M95337R84253O76034P9429L15106R11484J05642
$$ -950351 -1155165 -1294801 -1339157 -843820 140433 816467 895896 1211002 2122486 2228128
44040B228128k128505l360933k113742j41542K46424m12125N2277J880484L140594
$$ 2228128 99623 -3261310 -5375052 -5516594 -5270170 -5682295 -5630018 -3749534 -608940
44031f08940K610848J058458k71158r24246r51901n62856j57122P6107L71486
$$ -608940 2001908 3060366 2789208 1864962 913061 350205 193083 269190 640676
44022F40676O09170Q6558j046189j182652N09959K254158J861245j4376r12527
$$ 640676 1249846 1336404 290215 -892437 -382478 1871680 3732925 3718549 2806022
44013B806022l07470Q7139m39893p07191l25246n40556j491823j260392Q43618
$$ 2806022 2498552 2585691 2145798 1438607 1113361 572805 -919018 -2179410 -1335792
44004a335792K390982J249335r61175j204099M48121J224043K8201j193992o99767
$$ -1335792 1055190 2304525 1343350 139251 587372 1811415 1839616 645624 -54143
43995e4143O64998J163539O53121K25318K65189M8561r18921k016975k225143
$$ -54143 610855 1774394 2427515 2652833 2918022 2966583 2047662 30687 -2194456
43986b194456j345073j23184P78292J401939J811556J467359J27757j113746r80013
$$ -2194456 -3539529 -3662713 -2884421 -1482482 329074 1796433 1924190 810444 -169569
43977a69569p1168k27996j592115k083389o02960J039105P88442n65989p79857
$$ -169569 -240737 -468733 -2060848 -4144237 -4747197 -3708092 -2919650 -3485639 -4265496
43968d265496M33335J374110J121097L43200l40863r08121r40255P1595J361438
$$ -4265496 -3832161 -2458051 -1336954 -993754 -1334617 -2242738 -3182993 -3111398 -1749960
43959a749960J546925P31495K28717J90805m52638j482580j190101N57873J441883
$$ -1749960 -203035 528460 757177 947982 495344 -987236 -2177337 -1619464 -177581
43950a77581J88486j238996p03004P62006Q54171k13344l66946P26456J312410
$$ -177581 10905 -1228091 -1931095 -1169089 -314918 -528262 -895208 -168752 1143658
43941A143658N97287k49954l73102l90372p71586q95844m30165q2435k01662q294
$$ 1143658 1740945 1490991 1117889 727517 -44069 -939913 -1370078 -1452513 -1654175 -1662469
43931a662469R28659J679563J359321M80856p4260m53819j072627j282891j73779
$$ -1662469 -733810 945753 2305074 2785930 2711670 2257851 1185224 -97667 -271446
43922b71446J699282K683915K076764P63354j91996o29885q44386r47949j005306
$$ -271446 1427836 4111751 6188515 6951869 6759873 6129988 5285602 4337653 3332347
43913C332347j132731j151803o92261R7252N06870K60224k1814J83720L87915
$$ 3332347 2199616 1047813 355552 452804 959674 1219898 1198084 1381804 1769719
43904A769719j29857r84228j031137o0837P61964N02806k72556m57221m2167Q5042
$$ 1769719 1639862 655634 -375503 -436340 325624 828430 555874 98653 56486 141528
43894A41528l00923m39900N0175M69332J95132k14505J69505J152963J541992
$$ 141528 -159395 -599295 -549120 -79788 115344 -99161 70344 1223307 2765299
43885B765299P02730o36501j277032q55291p8788J92148m6345j9638N97439R18094
$$ 2765299 3468029 2831528 1554496 699205 620417 812565 766220 746582 1344021 2262115
43875B262115J4852j343135j326465K44383J225838J71394j271986o19457J649994
$$ 2262115 2276967 933832 -392633 -148250 1077588 1248982 -23004 -642461 1007533
43866A007533K625729J140783p38334r20075o3068o2464j179439k031743j670668
$$ 1007533 3633262 4774045 4035711 3115636 3052568 2990104 1810665 -221078 -1891746
43857a891746m85862N81126Q89173M39097r8107j5019M93190N78320J27686M9952
$$ -1891746 -2377608 -1796482 -907309 -468212 -566319 -581338 -88148 490172 617858 667810
43847F67810P90121J509298J318316M20302n93625j608472k397152k195055q48087
$$ 667810 1457931 2967229 4285545 4705847 4112222 2503750 106598 -2088457 -2936544
43838b936544M70154P07031L40821L85491Q20827J059908J107655J070142L80111
$$ -2936544 -2466390 -1759359 -1418538 -1033047 -212220 847688 1955343 3025485 3405596
43829C405596j135411k202869j600969p5951O93596L90832j60491o92532j190636
$$ 3405596 2270185 67316 -1533653 -1609604 -916008 -525176 -685667 -1378199 -2568835
43820b568835p14507J285613L025824K232651k58625j360184l24262L16036r54290
$$ -2568835 -3283342 -1997729 1028095 3260746 3002121 1641937 1317675 1633711 679421
43811F79421k232550j450207L97980J065801L04620m99824o11253k28176M68428
$$ 679421 -1553129 -3003336 -2605356 -1539555 -1234935 -1734759 -2346012 -2574188 -2105760
43802b105760J145122J118423M87788M51400J417529J970478R05706q90253j865422
$$ -2105760 -960638 157785 645573 1096973 2514502 4484980 5390686 4500433 2635011
43793B635011j905633j625935q06536P62218J877353J255163l09625q40589J10147
$$ 2635011 729378 -896557 -1703093 -940875 936478 2191641 1882016 1041427 1151574
43784A151574J127185J013309o7046j199793j412321k72545J214137J108041r32012
$$ 1151574 2278759 3292068 3225022 2025229 612908 340363 1554500 2662541 1730529
43775A730529k610250j879801J91296J132253O15204K17736M29664K82390l32648
$$ 1730529 -879721 -2759522 -2568226 -1435973 -820769 -603033 -173369 109021 -223627
43766b23627l48093L59440O53225K12908J3772M24730O32586L02770R5307J78050
$$ -223627 -571720 -212280 440945 653853 667625 1092355 1724941 2027711 2123018 2301068
43756B301068j09279p61855r09311m26270j21749q3109L97938R72945L05617j457736
$$ 2301068 2191789 1429934 520623 94353 -27396 -110505 287433 1260378 1565995 108259
43746A08259k292679j190598L97779R08290O58674M99255K46779l10477m19306
$$ 108259 -2184420 -3375018 -2977239 -2068949 -1410275 -911020 -664241 -974718 -1394024
43737a394024L10490R11110N95917L6546r036k5556n50169r98043q85742q58575
$$ -1394024 -1083534 -172424 423493 460039 451003 425447 -124722 -1122765 -2008507 -2867082
43727b867082j204787p88030R95747K534884K036999J86265r67110q37507l29594
$$ -2867082 -4071869 -4859899 -3864152 -1329268 707731 893996 -73114 -910621 -1240215
43718a240215L4188K34976j17786r29929p58530J156238K811805J776876r08849
$$ -1240215 -1206027 -971051 -1088837 -2018766 -2777296 -1621058 1190747 2967623 2058774
43709B058774j811738l5428J686342J341662L28196N35599J134837K67178j585618
$$ 2058774 247036 211608 1897950 3239612 3567808 4103407 5238244 5505422 3919804
43700C919804k156263p79191P13523O28912n01450j022953l99482M56788O86610
$$ 3919804 1763541 984350 1697873 2326785 1825335 802382 402900 859688 1546298
43691A546298L85754j26101r87180j981077j796816M61110L166197L339886N30285
$$ 1546298 1932052 1805951 818771 -1162306 -2959122 -2498012 668185 4008071 4538356
43682D538356k140871j907867J68676J177476M66415k73285k01412k39581q67338
$$ 4538356 2397485 489618 658294 1835770 2302185 2028900 1827488 1587907 720569
43673G20569j176813n71013K75695O52018O42982L84239j95075o04752j40294
$$ 720569 -456244 -1027257 -751562 -99544 543438 927677 732602 127850 -12444
43664a2444P09452O49512k75166n20990L85898Q10795m63614k159212k278435
$$ -12444 697008 1346520 1071354 550364 936262 1747057 1283443 -875769 -3154204
43655c154204q88664K71836K97018j10156n4900M64038Q66256O90892j0950o59964
$$ -3154204 -4042868 -3771032 -3474014 -3584170 -3639070 -3175032 -2308776 -1617884 -1628834 -2288798
43645b288798p08575l18757n4562P5275N18014J104649J123297O66958O70623
$$ -2288798 -2997373 -3316130 -3370692 -3295417 -2777403 -1672754 -549457 117501 788124
43636G88124J182578J007044j86331q83557j2987J156257R13217k36053n93670
$$ 788124 1970702 2977746 2791415 1907858 1894871 3051128 3964345 3728292 3134622
43627C134622q8915l8665n86183n89278l6700l24516j626656k082065n63309J486395
$$ 3134622 3045707 3007042 2420859 1831581 1794881 1470365 -156291 -2238356 -2801665 -1315270
43617a315270K168653J625648J081000O50845k60864j247788j321409o08930l9710
$$ -1315270 853383 2479031 3560031 4210876 3950012 2702224 1380815 771885 732175
43608G32175L25312R76563J229046j14486k115957k015946P37012K854576J398775
$$ 732175 1057487 2034050 3263096 3148610 1032653 -983293 -246281 2608295 4007070
43599D007070j954631l118822j137085J054272J191847L11125J80589N83815N30617
$$ 4007070 2052439 -1066383 -2203468 -1149196 42651 353776 534365 1118180 1648797
43590A648797K81632M45016L99004n59441j433354p91965P32819J115748p4706
$$ 1648797 1930429 2375445 2774449 2215008 781654 -10311 722508 1838256 1763550
43581A763550j174282j040043m58548m73386p94107o29785k2678M49681N86812
$$ 1763550 589268 -450775 -909323 -1382709 -2176816 -2806601 -2829279 -2379598 -1792786
43572a792786N47920M56208M56104O76022Q46032M72116l91453j069506j089066
$$ -1792786 -1244866 -788658 -332554 343468 1189500 1661616 1270163 200657 -888409
43563h88409n22660M49309J542105J963218J031189o01741j382678q23019L1075
$$ -888409 -1411069 -961760 580345 2543563 3574752 2973011 1590333 767314 798389
43554G98389M33019R30153J815291J943800L69149j762860k427169j376236j93098
$$ 798389 1231408 2161561 3976852 5920652 6289801 4526941 2099772 723536 530438
43545E30438J06647R3896L72454L94034m37505j414224j336719l73934n2994j100506
$$ 530438 637085 730981 1103435 1497469 1059964 -354260 -1690979 -2064913 -2117907 -3218413
43535c218413k120667j237875J283615L127464K815774J394264N72587L06364
$$ -3218413 -5339080 -6576955 -5293340 -2165876 649898 2044162 2616749 2923113
43527B923113m82584j569982j604413m70655L70824K53052K34305R41323J218525
$$ 2923113 2440529 870547 -733866 -1204521 -833697 -580645 -346340 594983 1813508
43518A813508J56347r89509n58461Q00136J021733j93853r78278k10022Q77587
$$ 1813508 1969855 980346 421885 1222021 2243754 2049901 1071623 861601 1739188
43509A739188P03726l26874o01039K40412Q42852J90003r16043j066959l31411
$$ 1739188 2442914 2116040 1515001 1755413 2598265 2788268 1872225 805266 473855
43500D73855p7553p51746j074463p6699J188434J151634J48009j95423M31114
$$ 473855 396302 -355444 -1429907 -1506606 -318172 833462 981471 786048 1217162
43491A217162P51709K00534l14722k36741j68944l36690j3706P74228P71651l03698
$$ 1217162 1968871 2169405 1854683 1617942 1448998 1112308 1098602 1872830 2644481 2340783
43481B340783r06806k66585M3132j166443k193638r56162J334339J687709j45229
$$ 2340783 1433977 1167392 1210524 44081 -2149557 -3105719 -1771380 -83671 -228900
43472b28900j409518n57956Q74607J126259O39162O04450Q16053L03557q65333
$$ -228900 -1638418 -2196374 -1321767 -195508 443654 1048104 1864157 2167714 1302381
43463A302381j579751j130396M975P10432L97542k87493k06149N92513O71615
$$ 1302381 -277370 -1407766 -1402791 -692359 -294817 -582310 -788459 -195946 475669
43454D75669o33096j770213r60545J050188J859366P46608o05049q34209o12555
$$ 475669 -157427 -1927640 -2888185 -1837997 21369 767977 162928 -671281 -1283836
43445a283836j070602j924625k005557q10761J074616K535718K665670J551784
$$ -1283836 -2354438 -4279063 -6284620 -7095381 -6020765 -3485047 -819377 732407
43437G32407L76256J10463L25800J10227l06289j20992K33894m23510j716249
$$ 732407 1108663 1219126 1544926 1655153 1348864 1227872 1461766 1038256 -677993
43428f77993j794894k28837J039293N50841m97963k26090J071299J582369P66132
$$ -677993 -2472887 -2701724 -1662431 -1111590 -1609553 -1835643 -764344 818025 1584157
43419A584157p6657J21346P92160O97619m00652j446575j332486k10227O75451
$$ 1584157 1507500 1628846 2421006 3118625 2717973 1271398 -61088 -271315 404136
43410D04136M94374k99126q73975j075664r27639J9413J631827K264090O20247
$$ 404136 898510 599384 -274591 -1350255 -2277894 -2258481 -626654 1637436 2257683
43401B257683j820287k230962l56973J098532M76790o43069k96240Q34823Q60770
$$ 2257683 437396 -1793566 -2150539 -1052007 -575217 -1218286 -1514526 -679703 181067
43392A81067k76729j019560o34176J79712O69739O78610K20609m49752n85068
$$ 181067 -95662 -1115222 -1749398 -1569686 -899947 -221337 -728 -450480 -1035548
43383a035548K45353J290332J451715Q16992M86587Q94062J122455J89283j468834
$$ -1035548 -790195 500137 1951852 2768844 3255431 4149493 5271948 5461231 3992397
43374C992397k275696j346659L02979R06670K35140k05026L73946O97861l56033
$$ 3992397 1716701 370042 673021 1579691 1814831 1609805 1983751 2681612 2325579
43365B325579j512967r31271O39572Q73543l91530j019401j83174O42809O96983
$$ 2325579 812612 -118659 520913 1394456 1002926 -16475 -199649 443160 1140143
43356A140143J034978J768586J199831q70631j867432m00990J143629K96956j584637
$$ 1140143 2175121 3943707 5143538 4272907 2405475 2004485 3148114 3445070 1860433
43347A860433j767722m82346J44939p7372K26348Q55355L66180r91518j477569
$$ 1860433 92711 -389635 -244696 -322068 -95720 759635 1125815 134297 -1343272
43338a343272p04967J56377O45870J172478J391726P52210J17170M61564O62429
$$ -1343272 -2048239 -1891862 -1245992 -73514 1318212 2070422 2187592 2649156 3311585
43329C311585p24804k230566j239728J348289J814517p01437k779359j886830
$$ 3311585 2586781 356215 -883513 464776 2279293 1577856 -1201503 -3088333
43321c088333L40190J317339J023233O38953K56764k25675k3698R91574J445542
$$ -3088333 -2748143 -1430804 -407571 231382 488146 262471 238773 1230347 2675889
43312B675889O24096k56533k26937q2820l84007q2148J168250J490660k81433
$$ 2675889 3299985 3043452 2816515 2733695 2349688 2267540 3435790 4926450 4645017
43303D645017k043820j276213R92196J706235K89043j023663q31248j8286L70257
$$ 4645017 2601197 1324984 2317180 4023415 4312458 3288795 2457547 2439261 2809518
43294B809518M58606M77092J80413k95819l80891j22226j52432n34155p09455
$$ 2809518 3268124 3745216 3925629 3629810 3248919 3126693 2974261 2440106 1730651
43285A730651n65186m88126m44227p4851L76596L16590o3647L9054P09054J119893
$$ 1730651 1165465 677339 233112 158261 534857 851447 787800 826854 1535908 2655801
43275B655801P29927j39119q67807r48092p4941J308850J879857Q94238m69911
$$ 2655801 3385728 3246609 2378802 1430710 1355769 2664619 4544476 5438714 4968803
43266D968803m09506R92366J827668R84400o07172j598030j781252j531700q95453
$$ 4968803 4559297 5551663 7379331 8363731 7756559 6158529 4377277 2845577 1950124
43257A950124j6631M38221J46568j96969J40665P71542P91456J78791k42316p9093
$$ 1950124 1933493 2371714 2518282 2321313 2461978 3233520 4024976 4203767 3961451 3882358
43247C882358K03485J89166R0591J52994J33600j25246j03121O84844J624148
$$ 3882358 4085843 4275009 4365600 4518594 4652194 4526948 4423827 5108671 6732819
43238F732819J556923M85179k65753M386L03364l46422j135585p50172K69104
$$ 6732819 8289742 8774921 8509168 8513554 8816918 8470496 7334911 6584739 6853843
43229F853843K16734r15567j222645R7943J428390J272865L71906O3260O7319
$$ 6853843 7070577 6155010 4932365 5030308 6458698 7731563 8103469 8166729 8234048
43220H234048n21894j224671r45683j775L79898J06133O2858K66518o9629p50871
$$ 8234048 7712154 6487483 5541800 5540025 5919923 6026056 6088914 6355432 6285803 5534932
43210E534932o80659J22219L23224n07909j114121o23239J04489P0314k42682
$$ 5534932 4854273 4976492 5299716 4791807 3677686 3054447 3158936 3229250 2986568
43201B986568O2494O56331O70949L30014N67172J325923J501193O53570k57568
$$ 2986568 3049062 3705393 4376342 4706356 5273528 6599451 8100644 8754214 8496646
43192H496646k00443O14405J220511J193235Q62307M59907k13482j072837j346387
$$ 8496646 8296203 8910608 10131119 11324354 12186661 12646568 12433086 11360249 10013862
43183A0013862n07862P17925J075031M41347j16660q5325k03053q97507j193758
$$ 10013862 9506000 10223925 11298956 11740303 11623643 11538318 11335265 10437758 9244000
43174I244000k24274J121617J475071J265432J971700L299676L126804Q14486
$$ 9244000 9019726 10141343 11616414 12881846 14853546 18153222 21280026 22094512
43166B2094512j275121q11769J223310J858594J56978j636481j060253J639074
$$ 22094512 20819391 20007622 21230932 23089526 23246504 21610023 20549770 22188844
43158B2188844M034350M297400K892700J742004K184361L901287N653422O743534
$$ 22188844 26223194 30520594 33413294 35155298 37339659 41240946 46894368 53637902
43150E3637902P562994Q875930J0911361J3235305J5356638J7414815K0194695
$$ 53637902 61200896 70076826 80988187 94223492 109580130 126994945 147189640
43143A47189640K4024095K7357530K7066624K1157779J1310130J889084l968424
$$ 147189640 171213735 198571265 225637889 246795668 258105798 259994882 256026458
43136B56026458o843267r471249j3401661j7709674k0504206k0940731j9716002
$$ 256026458 249183191 239711942 226310281 208600607 188096401 167155670 147439668
43129A47439668j8042944j6395693j4301610j1381539q358017o564022o371348
$$ 147439668 129396724 113001031 98699421 87317882 78959865 72395843 66024495
43122F6024495o621998n982021m515696l425169l363664l592216l064204j951435
$$ 66024495 59402497 53420476 48904780 45479611 42115947 38523731 35459527 33508092
43114C3508092j491392k213159k938789k204434l85783N84342j76370j243121
$$ 33508092 32016700 29803541 26864752 24660318 24274535 24858877 24682507 23439386
43106B3439386r40958K78685O87731o6234o07998o9803P47228Q01738K18584k59789
$$ 23439386 22498428 22777113 23464844 23398610 22790612 22720809 23468037 24269775 24488359 24228570
43096B4228570k58087L43028J605607L007377L530479K936311K222880K208240
$$ 24228570 23970483 24313511 25919118 28926495 32456974 35393285 37616165 39824405
43088C9824405K515707K723930L553840N736641Q401299R982195J0447707J1355528
$$ 39824405 42340112 45064042 48617882 54354523 62755822 72738017 83185724 94541252
43080I4541252J3817977J7594182K2092055K6953403L1471483L4578132L5602062
$$ 94541252 108359229 125953411 148045466 174998869 206470352 241048484 276650546
43073B76650546L4018310K8632443J8768917O664957l313596r076471j2927354
$$ 276650546 310668856 339301299 358070216 364735173 361421577 352345106 339417752
43066C39417752j7918309k3593881k7263068k8242699k8225940k7855422k5758713
$$ 339417752 321499443 297905562 270642494 242399795 214173855 186318433 160559720
43059A60559720k1525429j7155485j4408950j2679511j0792805r143829q446323
$$ 160559720 139034291 121878806 107469856 94790345 83997540 74853711 66407388
43052F6407388p853274o243567m369995l782292m275979m285282l326620k196871
$$ 66407388 58554114 52310547 47940552 44158260 39882281 35596999 32270379 30073508
43044C0073508j159249M7578O12044p09384l133825m174150k947599j217416n38837
$$ 30073508 28914259 28961837 29573881 28864497 25730672 21556522 18608923 17391507 16852670
43035A6852670l67520J46699M74997J8255n97436p85841j034339j497760j190762
$$ 16852670 16485150 16631849 17106846 17125101 16527665 15741824 14707485 13209725 12018963
43026A2018963Q7278O98674m03155j799758j844547j113543p33326o8149J540178
$$ 12018963 12106241 12804915 12401760 10602002 8757455 7643912 6910586 6842437 8382615
43017H382615K446186J060724q27038m21956J373205J343044n13481j043737L01722
$$ 8382615 10828801 11889525 11062487 10640531 12013736 13356780 12843299 11799562 12101284
43008A2101284L41354j970146l064317n49139K459764K069023m37183j177559
$$ 12101284 12442638 10472492 7408175 6859036 9318800 11387823 10950640 9773081
43000I773081N0033K88468j021089j349297J44929J151833L55961l56177O96116
$$ 9773081 9823114 10111582 9090493 7741196 7886125 9037958 9393919 9037742 9733858
42991I733858K079827J654357k5086p53159N5549J098880J569117J954790K535989
$$ 9733858 11813685 13468042 13442956 12689797 12745346 13844226 15413343 17368133 19904122
42982A9904122K725289K399449K677860M501931P061356Q547066Q267943P164886
$$ 19904122 22629411 25028860 27706720 32208651 39270007 47817073 56085016 63249902
42974F3249902O174847N008589L005099L94924k076576m230509o217078p572496
$$ 63249902 69424749 74433338 77438437 77833361 75756785 71526276 65309198 57736702
42966E7736702p609435o635575n713556n215903m669228l972452l509296l024686
$$ 57736702 50127267 43491692 37778136 32562233 27893005 23920553 20411257 17386571
42958A7386571j894465p35518r80686k269474k233268k4745J872333J109150q92950
$$ 17386571 15492106 14756588 13775902 11506428 9273160 9248415 11120748 12229898 11336948
42949A1336948j072612N97944J255428l35802k109233k057741r48225n77960j049523
$$ 11336948 10264336 10862280 12117708 11781906 9672673 7614932 6666707 6088747 5039224
42940E039224j165590m55336N25344J284355J618059J141514k71136j656171j624934
$$ 5039224 3873634 3418298 3943642 5227997 6846056 7987570 7716434 6060263 4435329
42931D435329j51391J112909Q38278k67703n32759K39916N55451l48250j161726
$$ 4435329 4283938 5396847 6235125 5967422 5434663 5674579 6230030 5881780 4720054
42922D720054n01778Q20890R97437M5452l65850K49372N36644j56195n99444P8896
$$ 4720054 4218276 5039166 6036603 6082055 5716205 5965577 6502221 6346026 5746582 5825478
42912E825478Q17085N29772m874L34208R45165O30094k65572n58848k51806j61076
$$ 5825478 6642563 7172335 7167461 7501669 8446834 9076928 8811356 8252508 8000702 7839626
42902G839626k17822J86899P49757P90981O69536J005193J112408N0253j315040
$$ 7839626 7621804 7808703 8558460 9349441 10018977 11024170 12136578 12186831 10871791
42893A0871791j328987k59508J56914l16213j87529R33800J611169J098127L85651
$$ 10871791 9542804 9283296 9440210 9123997 8936468 9870268 11481437 12579564 12965215
42884A2965215J45180k61686r80068r31233J73064R93985P78887O08191J342706
$$ 12965215 13110395 12848709 11868641 10937408 11110472 12104457 12883344 13491535 14834241
42875A4834241K125398K166339K234721K917589L129623K139095J564551L268564
$$ 14834241 16959639 19125978 21360699 24278288 27407911 29547006 31111557 34380121
42867C4380121O352451Q408454R040611R948579J1821278J3249922J2838245J0585546
$$ 34380121 40732572 49141026 58181637 68130216 79951494 93201416 106039661 116625207
42859A16625207O876228J755686m120024r013162j1410610j1308700r894769q434470
$$ 116625207 123501435 125257121 121137097 112123935 100713325 89404625 79509856 71075386
42851G1075386p552582p028334o169922m786958l653417l494148l802226l454435
$$ 71075386 63522804 56494470 50324548 45537590 41884173 38390025 34587799 31133364
42843C1133364k340365j441651j261720j206559q37245o97931j171586j314783
$$ 31133364 28792999 27351348 26089628 24883069 24045824 23347893 22176307 20861524
42835B0861524L9584K262382L233242K057074N03333Q73293K992808M455954L745056
$$ 20861524 20901108 23163490 26396732 28453806 28957139 29830432 32823240 37279194 41024250
42826D1024250J864402N55371J51562j8333k11331m08479j056222k360918l418944
$$ 41024250 42888652 43444023 43595585 43577252 43365921 42957442 41901220 39540302 36121358
42817C6121358l392183l026646l489761m163904l446844j590106o61142j365023
$$ 36121358 32729175 29702529 26212768 22048864 18602020 17011914 16350772 14985749
42809A4985749j960015j082067J97827J83057j065737k232340k448179j612023
$$ 14985749 13025734 11943667 12141494 12324551 11258814 9026474 6578295 4966272
42801D966272j48341Q15870K56688j099812j301165L7354J083674O57203j66424
$$ 4966272 4817931 5633801 5890489 4790677 3489512 3526866 4610540 5267743 5101319
42792E101319l08398l93689q14608l85378J149231J542091n09651k411642j249977
$$ 5101319 4792921 4399232 3584624 3199246 4348477 5890568 5380917 2969275 1719298
42783A719298J343619J511575p01265j544531L20981J989089J304718q1758j32905
$$ 1719298 3062917 4574492 3873227 2328696 2649677 4638766 5943484 5861726 5728821
42774E728821L01711l77894j540056j601467o13518K74649O62978P29268M08275
$$ 5728821 6030532 5652638 4112582 2511115 1897597 2172246 2835224 3564492 3972767
42765C972767N510L94089J432714J545391J08899j214651r73465k33344n77099
$$ 3972767 3978277 4372366 5805080 7350471 7459370 6244719 5271254 5037910 4460811
42756D460811j185843k27355J700794K080588L06565j374950j196828q7959K71611
$$ 4460811 3274968 3047613 4748407 6828995 7135560 5760610 4563782 4475823 4747434
42747D747434q6496j05701L20062M59054K63921M28953R67419R11560j42927j076316
$$ 4747434 4660938 4555237 4875299 5334353 5598274 6027227 6994646 7906206 7763279 6686963
42737F686963o24487P64027J483402J110077R36651J675036J951751L64752j895214
$$ 6686963 6062476 6826503 8309905 9419982 10356633 12031669 13983420 14348172 12452958
42728A2452958k325285p61254K92805n80772j640894q26787R78126J270762m07362
$$ 12452958 10127673 9366419 9659224 9078452 7437558 6610771 7588897 8859659 8452297
42719H452297k007585j922385p07080L41101Q75848J178613J186187O78336l8367
$$ 8452297 6444712 4522327 3815247 4156348 5032196 6210809 7396996 8075332 8036965
42710H036965l11920J54422J188711K526092L802820M236562K967982J65238k564299
$$ 8036965 7725045 7879467 9068178 11594270 15397090 19633652 22601634 22766872 20202573
42701B0202573l543461k816768j908929j687541j408357m05944L76659k22506
$$ 20202573 16659112 13842344 11933415 10245874 8837517 8431573 8808232 8585726
42693H585726j417371j378706j08651M32789n71554j401384m51931J239873J503556
$$ 8585726 7168355 5789649 5680998 6113787 5542233 4140849 3688918 4928791 6432347
42684F432347R3651j216950j118097p2693O45410K44159j077568k130100j550855
$$ 6432347 6525998 5309048 4190951 4118258 4763668 5007827 3930259 1800159 249304
42675B49304N58803K163051J418809r26722k264428j245279P60568J516359M56342
$$ 249304 808107 2971158 4389967 3463245 1198817 -46462 714106 2230465 2686807
42666B686807r97296j216810j13732Q65430M67965p95664j282098m23007N29319
$$ 2686807 1689511 472701 358969 1224399 1692364 896700 -385398 -808405 -279086
42657b79086L54985m55288o29994Q6129J018355J718698J926303J076729p66905
$$ -279086 75899 -379389 -1009383 -923254 95101 1813799 3740102 4816831 4049926
42648D049926k050384j431870k4073q9439j555229j946638k32999J483135J195884
$$ 4049926 1999542 567672 543599 454160 -1101069 -3047707 -3280706 -1797571 -601687
42639f01687j01072l56775L15573L82862k28197k23350N72961R69588N76511K33102
$$ -601687 -702759 -1059534 -743961 -361099 -589296 -812646 -239685 729903 1306414 1539516
42629A539516J32369m85292j354411r70104P90851J813207Q09876n46112k80940
$$ 1539516 1671885 1186593 -167818 -1137922 -347071 1466136 2276012 1729900 1448960
42620A448960O64780J55936j292744j161030Q45413K056221R01503q40758r90092
$$ 1448960 2113740 2269676 976932 -184098 661315 2717536 3619039 2778281 1788189
42611A788189M3069P16078R30524J286747J220083j5298j466130j674733j079128
$$ 1788189 1831258 2547336 3477860 4764607 5984690 5969392 4503262 2828529 1749401
42602A749401j134544j566956q05523R99177J795356P96944m10179n34128k27498
$$ 1749401 614857 -952099 -1757622 -758445 1036911 1833855 1423676 889548 662050
42593F62050k33407M8909R42233J267438K22535r76572q64486N8528L84232L9870
$$ 662050 428643 477552 1419785 2687223 2909758 1933186 1068700 1127228 1511460 1551330
42583A551330l9657L44880O56903O70931L32298n82751j548967j189486N50091
$$ 1551330 1511673 1856553 2513456 3184387 3516685 2933934 1384967 195481 745572
42574G45572J473551J58168j449993p46650J372755J855940L19064o15397K03901
$$ 745572 2219123 2377291 927298 180648 1553403 3409343 3728407 3113010 3316911
42565C316911Q65904j3752j085595q79775r2380J88566L54316Q53179Q87294J33314
$$ 3316911 4182815 4169063 3083468 2203693 2111313 2299879 2654195 3507374 4394668 4527982
42555D527982q9873R09072J504325K20869j696856k215295j566719j184303r04599
$$ 4527982 4438109 5347181 6851506 7072375 5375519 3160224 1593505 409202 -495397
42546d95397K85813J686642J681055N17596j93912k91161q36165j514587j043713
$$ -495397 -209584 1477058 3158113 3675709 3481797 3190636 2354471 839884 -203829
42537b03829J0497j44338r48555J39250K989949M022355J575167j228898j157066
$$ -203829 -193332 -337670 -1286225 -1146975 1842974 5865329 7440496 6211598 5054532
42528E054532N12865P53736l10341n08344J92147J75909k01230Q65326K809685
$$ 5054532 5567397 6321133 6010792 5502448 5694595 5870504 5669274 6534600 9344285
42519I344285K922426P35141j019626o23062L08640j50881j393567j883908j571179
$$ 9344285 12266711 13001852 11982226 11359164 11667804 11516923 10123356 8239448 6668269
42510F668269j166715o13103K50282P31942K81212n50170j062731j279766j205493
$$ 6668269 5501554 4888451 5138733 5870675 6151887 5601717 4538986 3259220 2053727
42501B053727n47374J57926k67665j528478j720331l22246O49928j88599j329556
$$ 2053727 1506353 1664279 1396614 -131864 -1852195 -2174441 -1524513 -1713112 -3042668
42492c042668r68398J89538P44186J156670K037769J911487k61053k053656o69000
$$ -3042668 -4011066 -3821528 -3077342 -1920672 117097 2028584 1767531 -286125 -955125
42483i55125K158269K328300j98308j414091K40597J799104J033891m45993q75424
$$ -955125 1203144 3531444 3333136 1919045 2159642 3958746 4992637 4546644 3671220
42474C671220j141436j857421j309515J055995K331686M35740j949219j141360
$$ 3671220 2529784 672363 -637152 418843 2750529 3186269 1237050 95690
42466I5690J834651K901163J018859r32034q53110K11488N48602L0752n50848
$$ 95690 1930341 4831504 5850363 4918329 4065219 4276707 4825309 4856061 4305213
42457D305213o36827j20485M45076J84721n99621k68096J548531K608506J222790
$$ 4305213 3668386 3547901 3992977 4177698 3578077 3309981 4858512 7467018 8689808
42448H689808o52647R917K643509L816146K200099K2061n14607K49673Q30157
$$ 8689808 8037161 8047078 10690587 14506733 16706832 16728893 16214286 16463959 17294116
42439A7294116M43719q40699k083880j678594P09128K821130K444792P66180N97487
$$ 17294116 17737835 16897136 14813256 13134662 13843790 16664920 19109712 19875892 20473379
42430B0473379J804975J600595o57224k386485k133905j605228k133975k340509
$$ 20473379 22278354 23878949 23221725 20835240 18701335 17096107 14962132 12621623
42422A2621623j075018J41327k34817r97118l31421J155821J809383J747959K049065
$$ 12621623 11546605 11687932 11453115 10455997 10124576 11280397 13089780 14837739 16886804
42413A6886804K406569J900335J164276J534044K569795K463980O99147j383058
$$ 16886804 19293373 21193708 22357984 23892028 26461823 28925803 29624950 28241892
42405B8241892k556291k864155k868276k868326k848478k469543j387901j27745
$$ 28241892 25685601 22821446 19953170 17084844 14236366 11766823 10378922 10251177
42397A0251177J1502j337521k680108k337471n57091Q57505O40772q03766j970837
$$ 10251177 10262679 8925158 6245050 3907579 3350488 4207993 4848765 4044999 2074162
42388B074162j576767K20616J806976J922762J238471J081401J115061J10999
$$ 2074162 497395 718011 2524987 4447749 5686220 6767621 7882682 7993681
42380G993681j287613j122405K84983K46124j799325k817743r72475J138022N60799
$$ 7993681 6706068 5583663 5868646 6114770 4315445 1497702 525227 1663249 2224048
42371B224048j319454j297000M79683J329731O72211K68505N86473L78507l81656
$$ 2224048 904594 -392406 87277 1417008 2089219 2357724 2944197 3322704 2941048
42362B941048l66919K77913j5410j171872j320204o1606Q46118N54250K15697
$$ 2941048 2574129 2852042 2836632 1664760 344556 282950 1129068 1683318 1899015
42353A899015L95932K2507j206350j827050j082393j66788N1141L59038J094783
$$ 1899015 2294947 2317454 1111104 -715946 -1798339 -1965127 -1913986 -1554948 -460165
42344d60165R55373n52271j510351l49651J387658J153638p93256j813941o67243
$$ -460165 495208 -57063 -1567414 -1917065 -529407 624231 -169025 -1982966 -2650209
42335b650209J075172J512594Q13664N32570J290966J888962Q75444j307599k472126
$$ -2650209 -1575037 -62443 751221 1283791 2574757 4463719 5339163 4031564 1559438
42326A559438j372562N59164J122998K76773k85330O084M6874n83562p31544K24709
$$ 1559438 186876 746040 1869038 2145811 1860481 1866565 1913439 1329877 598333 823042
42316H23042J110470P47901l09006p76692l37258M58480J043113R42201k5761
$$ 823042 1933512 2681413 2372407 1595715 1258457 1716937 2760050 3702251 3676490
42307C676490j103485j124531j65580M03505k4332m16673J35810J054054J395687
$$ 3676490 2573005 1448474 1282894 1686399 1662067 1245394 1381204 2435258 3830945
42298C830945J125004M77695p08780k113746k546052j481587k2852O34220P26982
$$ 3830945 4955949 5433644 4724864 2611118 65066 -1416521 -1439373 -805153 -78171
42289g8171R54020R96660K13071r36522j356949p75366J65356Q29690R00710L19310
$$ -78171 875849 1872509 2085580 1149058 -207891 -983257 -817901 11789 912499 1231809
42279A231809m13775m33640L93804J140227J037029L54196k93561o52318m98441
$$ 1231809 818034 384394 778198 1918425 2955454 3309650 3016089 2363771 1865330
42270A865330L20820J067473N49612j020504j872909j099448Q7395L30724l4882
$$ 1865330 2186150 3253623 3803235 2782731 909822 -189626 -102231 228493 193611
42261A93611j20963l3316o3139L19180J257594J517667K43302j330178j506232
$$ 193611 72648 39332 -23807 295373 1552967 3070634 3313936 1983758 477526
42252D77526n84693r4993l47113l92417J34287P03547J052821J316373J317765
$$ 477526 -107167 -202160 -549273 -941690 -807403 -103856 948965 2265338 3583103
42243C583103Q11788N218r50589k139721k770195j287937K063313M266689K987367
$$ 3583103 4394891 4400109 3449520 1309799 -1460396 -2748333 -685020 3581669 6569036
42234F569036j39551j677786q59334K51133J89514o75452j759413k662629k248686
$$ 6569036 6429485 4751699 3892365 4143498 4333012 3657560 1898147 -764482 -3013168
42225c013168K24456L046454L444630J246738r18758j247005n16001k8569N5569
$$ -3013168 -2788712 257742 3702372 4949110 4030352 2783347 2267346 2238777 2294346
42216B294346j22988o70033j078326n09235O46056J069429N82446K28660K34977
$$ 2294346 2171358 1501325 422999 -86236 559820 1629249 2211695 2440355 2675332
42207B675332j66532p63260l86325P56268J026870J45064l01134J96311R0124
$$ 2675332 2508800 1745540 1359215 2115483 3142353 3287417 2986283 3182594 3272718
42198C272718j208737j829575m72165J239759J234996O2010l74611K62813Q78598
$$ 3272718 2063981 234406 -237759 1002000 2236996 2299006 1924395 2187208 3065806
42189C065806Q94848M65003l17543j049156q21239L50598R57363J14648q79857
$$ 3065806 3960654 4425657 4108114 3058958 2237719 2588317 3545680 3660328 2780471
42180B780471m95992O01766O37830n83481j612610j457466m70266M52288N93195
$$ 2780471 2284479 2886245 3524075 2940594 1327984 -129482 -599748 -147460 445735
42171D45735j68609r86755p95983J33426N09547K57433P34610K000608K032597
$$ 445735 277126 -709629 -1505612 -1372186 -862639 -605206 129404 2130012 4162609
42162D162609M4073j615045q69094P71434P85226k04973J35231J451581J148357
$$ 4162609 4206682 2591637 1722543 2493977 3279203 3074230 3209461 4661042 5809399
42153E809399j065261k379545j136513Q68839J224780q0107j385656j462082j18179
$$ 5809399 4744138 2364593 1228080 2096919 3321699 3241592 1855936 393854 275675
42144B75675J953682L338250K973593J406833J14463k85453j20745N14268J545065
$$ 275675 2229357 5567607 8541200 9948033 10062496 9777043 9656298 10170566 11715631
42135A1715631J999138J066133k36067k72004O90315J151895J093956J574312
$$ 11715631 13714769 14780902 14544835 14272831 14963146 16115041 17208997 18783309
42127A8783309J977248O84247j369912j219353J186710K064309n18469l368329
$$ 18783309 20760557 21444804 20074892 18855539 20042249 22106558 21588089 18219760
42119A8219760l016314r34581p57586k456061k925172j261796J68980k05878j170153
$$ 18219760 15203446 14268865 13511279 11055218 8130046 6868250 7037230 6831352 5661199
42110E661199j231633o45328k57668k45658o05336j322819j639669o56908R45026
$$ 5661199 4429566 3784238 3526570 3280912 2675576 1352757 -286912 -943820 1206
42101A206J292681j04761j589469j685039p85095J28933J024782K081894K579492
$$ 1206 1293887 1189126 -400343 -2085382 -2870477 -2741544 -1716762 365132 2944624
42092B944624J771255K31608p62090q21805n44722l47141r3444K38012L36867
$$ 2944624 4715879 4947487 4185397 3363592 2818870 2471729 2378285 2616297 2953164
42083B953164J21696n5917N2581K21114P8877m01545q54198q49183k60885N90875
$$ 2953164 3074860 3018943 3071524 3292638 3371515 2969970 2115772 1266589 1005704 1596579
42073A596579J193191J324695J209749J061918O28322m59798j846070k421927
$$ 1596579 2789770 4114465 5324214 6386132 7014454 6554656 4708586 2286659
42065B286659j537554L7181R53438R99006J185560J933406K196353J186412Q0884
$$ 2286659 749105 786286 1739724 2738730 3924290 5857696 8054049 9240461 9321345
42056I321345O42056K526470L599568L084912K705626L940342N607545N391340
$$ 9321345 9963401 12489871 16089439 19174351 21879977 25820319 31427864 36819204
42048C6819204K797551o40017l347736m646834m348234k876610j537680j334602
$$ 36819204 39616755 38976738 35629002 30982168 26633934 23757324 22219644 20885042
42040B0885042j617928j058489K74254J116377J073321Q85573N99958o62378k543622
$$ 20885042 19267114 18208625 18482879 19599256 20672577 21558150 22158108 21495730 18952108
42031A8952108k915471p50009J827579J897690n80138k894999l008819j511884
$$ 18952108 16036637 15286628 17114207 19011897 18431759 15536760 12527941 11016057
42023A1016057k07200N3222k51413l57365j45718j57979q01792j599102j523213
$$ 11016057 10808857 10862079 10610666 10253301 10107583 9949604 9147812 7548710 6025497
42014F025497k17160J454619K216700J433478n50629k458330k577225l54167K254125
$$ 6025497 5808337 7262956 9479656 10913134 10362505 7904175 5326950 4972783 7226908
42005G226908K403760J3125j691153l99652K051071K436499Q14145O332J114569
$$ 7226908 9630668 9643793 7952640 7552988 9604059 12040558 12854703 12861035 13975604
41996A3975604K368324K543264K658309L391875L426828J866100J28846l85898
$$ 13975604 16343928 18887192 21545501 24937376 28364204 30230304 30359150 29973252
41988B9973252o96399k163572l539630k696227m40947K11404j489093k952932
$$ 29973252 29276853 27113281 23573651 20877424 20436477 20647881 19158788 16205856
41980A6205856k221604o50778m92001j641849k295384j653621m75455M28914R44618
$$ 16205856 13984252 13333474 12841473 11199624 8904240 7250619 6775164 7204078 8148696
41971H148696J158454J125958J062213J121511J129468R72603R11292J043805
$$ 8148696 9307150 10433108 11495321 12616832 13746300 14718903 15630195 16674000
41963A6674000R49180M96380M97387J680297L375923M297547M518289N444333
$$ 16674000 17623180 18119560 18616947 20297244 23673167 27970714 32489003 37933336
41955C7933336P509257R089705Q508625O234103L996974K272125L6467k952100
$$ 37933336 45442593 54532298 63040923 69275026 73272000 75544125 75580592 72628492
41947G2628492n147722n280144m343935m301648n330495n736765m612079l229524
$$ 72628492 67480770 62200626 57856691 53555043 48224548 42487783 37875704 34646180
41939C4646180l245328m465711n168356m155701j909537k2213J98483j046590
$$ 34646180 31400852 26935141 21766785 17611084 15701547 15679334 15877817 14831227
41931A4831227k066515j518875k48305k57086j677853k323197r99968M80648Q7381
$$ 14831227 12764712 11245837 10997532 10740446 9062593 6739396 5739428 6220076 6307457
41922F307457j214608j162160K9950J91660j025935j683695r43451j72988j42605
$$ 6307457 5092849 3930689 3960639 4152299 3126364 1442669 499218 326230 183625
41913A83625J73510J065700J027652l78796j107846Q8933J231518J97450j699037
$$ 183625 357135 1422835 2450487 2071691 963845 1052778 2284296 2481746 782709
41904G82709j817763l99977J88206n27330q17571q5695L25426j93462n52143r8534
$$ 782709 -1035054 -1435031 -1246825 -1774155 -2591726 -2677421 -2351995 -2545457 -3097600 -3196134
41894c196134M36423O08426R02982J211889N81693q73053j564237o65622P91444
$$ -3196134 -2759711 -2151285 -1248303 -36414 545279 -327774 -1892011 -2557633 -1766189
41885a766189J660986J925656J592431J31541k021667l043380k019756l72502
$$ -1766189 -105203 1820453 3412884 3544425 1522758 -1520622 -3540378 -3912880
41877c912880J74185j49470j40313K74305L29898L3221Q4531O11770J078234J146419
$$ -3912880 -3738695 -3888165 -4028478 -3754173 -3424275 -3391054 -3306523 -2694753 -1616519 -470100
41867d70100Q42989K71531k03471m4179N99341Q10367K77871j22181J74839L68418
$$ -470100 372889 644420 440949 396770 996111 1806478 2084349 1962168 2137007 2505425
41857B505425k69537q92170l06508J019832J575441R88335K67547J28625L03332
$$ 2505425 2235888 1343718 1037210 2057042 3632483 4620818 4888365 5016990 5320322
41848E320322L74206K10634l04307j019671j209860m99910K05356j68761j110327
$$ 5320322 5694528 5905162 5600855 4581184 3371324 2871414 3076770 2908009 1797682
41839A797682j171148k38328L09855j29099m98055j2018M70510K993o36292n9678
$$ 1797682 626534 388206 698061 568962 70907 58889 529399 532392 -103900 -163578
41829a63578J320838J477242m48377k714997l024762j288692N65435J230871J280575
$$ -163578 1157260 2634502 2186125 -528872 -3553634 -4842326 -4276891 -3046020 -1765445
41820a765445J524080J401335J05658j524242j769816m63607Q81086J414838J754615
$$ -1765445 -241365 1159970 1265628 -258614 -2028430 -2492037 -1610951 -196113 1558502
41811A558502K088522J369065o25572k138432j783499p01893p30044j495188j188922
$$ 1558502 3647024 5016089 4390517 2252085 468586 -233307 -963351 -2458539 -3647461
41802c647461M73565J969836K290702J775038Q16061n44342j711774j817385j078498
$$ -3647461 -3173896 -1204060 1086642 2861680 3677741 3133399 1421625 -395760 -1474258
41793a474258n75255o17964n64391j43083L66924J053351J960100K037016L40149
$$ -1474258 -2049513 -2667477 -3231868 -3374951 -3008027 -1954676 5424 2042440 2382589
41784B382589j799285j890934J59907J716190J127639l55540j098296j228667
$$ 2382589 583304 -1307630 -1147723 568467 1696106 1340566 242270 -986397
41776i86397j141125j38067J736040K453240O88117j686125j956265l59256O82857
$$ -986397 -2127522 -2265589 -529549 1923691 2611808 925683 -1030582 -1389838 -706981
41767g06981L16058j14563J46600K13572m37675r22040n25767J86339N02336N97848
$$ -706981 -390923 -505486 -358886 -145314 -582989 -1505029 -2030796 -1844457 -1342121 -744273
41757g44273Q10481Q82277N65257J93957N1399k11435r34855j662473j549655
$$ -744273 66208 948485 1513742 1707699 1759098 1547663 612808 -1049665 -2599320
41748b599320m02212J022615J712031J306294L82209j88398j70756l7804r9180
$$ -2599320 -3001532 -1978917 -266886 1039408 1421617 1233219 1062463 1024659 925479
41739I25479p3818K14091L45247P0370P179P67183J720618J544945j5232j688938
$$ 925479 851661 1065752 1410999 1481369 1488548 2255731 3976349 5521294 5506062 3817124
41729C817124k091469j075082L49240R58815K14389j290026k218474j705214k02850
$$ 3817124 1725655 650573 999813 1958628 2173017 882991 -1335483 -3040697 -3243547
41720c243547J088508J454821J076333N21548K36082K83421K32802m03993j326806
$$ -3243547 -2155039 -700218 376115 897663 1133745 1417166 1649968 1245975 -80831
41711h0831j511483n28776P60812J347922J261169R49074K47654j008025j948125
$$ -80831 -1592314 -2121090 -1360278 -12356 1248813 2197887 2445541 1437516 -510609
41702e10609j528320j81608O03131K82567k71843k80051P0049L30203L71440J53460
$$ -510609 -2038929 -2220537 -1617406 -1334839 -1606682 -1886733 -1816684 -1486481 -1115041 -961581
41692i61581k01530j34147O25235J204749N84530o81098j031454j70132O74571
$$ -961581 -1163111 -1297258 -672023 532726 1117256 436158 -595296 -765428 -90857
41683i0857Q68287J120832J730034J770944P79362k88149o58073q53818j226601
$$ -90857 777430 1898262 3628296 5399240 6178602 5890453 5232380 4378562 3151961
41674C151961q80223O21485J799364J092777q16107k058317k127595j799222j286092
$$ 3151961 2271738 2893223 4692587 5785364 4969257 2910940 783345 -1015877 -2301969
41665b301969k91093N78885L53799m56626l46195P53655J221736K65490q77884
$$ -2301969 -2593062 -2014177 -1660378 -2117004 -2463199 -1709544 -487808 -222318 -1100202
41656a100202q40920P1586O70795M85619o4321l70329p1071N98082P35269k05340
$$ -1100202 -1941122 -1869536 -1198741 -713122 -777443 -1147772 -1218843 -620761 114508 -90832
41646i0832j325269j215241n396P49323M09341M3751M30150P86828L33068k86567
$$ -90832 -1416101 -2631342 -2636738 -1887415 -1478074 -1434323 -1004173 -217345 115723 -170844
41636a70844k40311K4164j98100m10147J12663O88188R0953j410825k276221j672223
$$ -170844 -411155 -386991 -585091 -995238 -882575 -194387 -103434 -1514259 -3790480 -5462703
41626e462703r3393J564010K396075J602469l30065j166519N25876K745008K126643
$$ -5462703 -5556096 -3992086 -1596011 6458 -323607 -1490126 -964250 1780758 3907401
41617C907401j299618l760308k753029j29972R96346L91726L0978P43823J485246
$$ 3907401 2607783 -1152525 -3905554 -4035526 -3039180 -2647454 -2616476 -1872653 -387407
41608c87407J284597L30893n90932p27859J01745Q81066K10071j469091j802093
$$ -387407 897190 1228083 637151 -90708 11037 892103 1102174 -366917 -2169010
41599b169010J03915J791252Q18035j381118j526774N02657J655164N20314q91092
$$ -2169010 -2065095 -273843 544192 -836926 -2363700 -1861043 -205879 314435 -576657
41590e76657p38317J06132K11535j25618j31850r8956k86409m9696O26045N21669
$$ -576657 -1314974 -1208842 -997307 -1122925 -1254775 -1353731 -1640140 -1689836 -1063791 -542122
41580e42122n18650o42267R75026K149510R05127j149183j248495K19904P90756
$$ -542122 -1060772 -1703039 -728013 1421497 2326624 1177441 -71054 148850 939606
41571I39606J91392K18549Q91188K98382j499371j934139k01676J168760M38419
$$ 939606 1130998 1349547 2240735 2539117 1039746 -894393 -1096069 72691 511110
41562E11110n94118J04370J323085Q80376n66919p51731L51232O96445k76355
$$ 511110 -83008 21362 1344447 2224823 1657904 906173 1257405 1953850 1677495
41553A677495q78610j65700N36781j47557j492377j756028n84158N82366L02244
$$ 1677495 798885 633185 1169966 1022409 -469968 -2225996 -2810154 -2227788 -1925544
41544a925544j154171k044133j136605P71856J829799J482717Q98563Q82587O90160
$$ -1925544 -3079715 -5123848 -6260453 -5488597 -3658798 -2176081 -1277518 -394931 295229
41535B95229l36062j260937r78891j44808j11262o03139k24645R79594J337562
$$ 295229 -40833 -1301770 -2280661 -2425469 -2536731 -3139870 -3364515 -2384921 -1047359
41526a047359J78204j018040p52777M69377J062417M53834n07442p49693l3424
$$ -1047359 -869155 -1887195 -2639972 -2170595 -1108178 -654344 -1161786 -1911479 -1944903
41517a944903R27889J165206M91121k49970l09808l2399o7593j18221M06922Q78374
$$ -1944903 -1017014 148192 639313 389343 79535 47136 -20457 -138678 268244 1146618
41507A146618J19997j401158j782094n22972N71238J68057n81308r0378J037168
$$ 1146618 1266615 -134543 -1916637 -2439609 -1868371 -1700314 -2281622 -2372000 -1334832
41498a334832J114495J19023n03525k27539J74172L70323P63799J027802J97142
$$ -1334832 -220337 -101314 -604839 -832378 -658206 -287883 475916 1503718 1700860
41489A700860j377843j886183n91181R63986J172139M59538J08443J96559N8978
$$ 1700860 323017 -1563166 -2154347 -1190361 -18222 441316 549759 746318 805296
41480H05296j31846J99120N96710J82945n94834m64961M36038N27227o75840j631107
$$ 805296 673450 872570 1469280 1652225 1057391 592430 1028468 1555695 879855 -751252
41470g51252j104047M1845M26535K84293O78807J456684J475419M76126o15825
$$ -751252 -1855299 -1813454 -1386919 -1102626 -423819 1032865 2508284 2984410 2368585
41461B368585j108178j107083p81659j83070K44941P2708j91763K92011J116949
$$ 2368585 1260407 153324 -628335 -811405 -566464 -493756 -685519 -393508 723441
41452G23441R14387m96756j522751r29149N36374J356985J134233M68963k29461
$$ 723441 1637828 1141072 -381679 -1310828 -774454 582531 1716764 2185727 1956266
41443A956266q84174j224346r86364l81795K15392P41522J154207J089120L06836
$$ 1956266 1072092 -152254 -1138618 -1520413 -1305021 -563499 590708 1679828 1986664
41434A986664q36952j728834j985069j471805m08606M23656L39629k02755q8066
$$ 1986664 1149712 -579122 -2564191 -4035996 -4444602 -4020946 -3681317 -3884072 -3972138
41425c972138P61629J290065J126910J078741J344203R29451l12558q64517j4593
$$ -3972138 -3210509 -1920444 -793534 285207 1629410 2558861 2246303 1381786 1367193
41416A367193O60446r6869r21327j96793R26690M35998r67614j110916k04114
$$ 1367193 2027639 1930770 1009443 812650 1739340 2175338 1207724 96808 -107306
41407a07306k43474j103886p13799Q41596R88803r00888k189525j225167K91441
$$ -107306 -350780 -1454666 -2168465 -1326869 -338066 -1238954 -3428479 -4653646 -4362205
41398d362205O45074P29530J493021J648405K25374j048485m31072Q02367N71290
$$ -4362205 -3717131 -2987601 -1494580 153825 379199 -669286 -1100358 -297991 273299
41389B73299n11069m86893N37736R88326O84796N40557L68175m99397j235199
$$ 273299 -237770 -724663 -186927 801399 1486195 2026752 2394927 1895530 660331
41380F60331o49142M51710M88067m6633M59746J595007J492617J35765p08209
$$ 660331 11189 462899 950966 904333 1364079 2959086 4451703 4587468 3879259
41371C879259o30670q13009j196713m20473J190432J612519O40656M09204J587712
$$ 3879259 3248589 2435580 1238867 818394 2008826 3621345 4262001 4671205 6258917
41362F258917K069025O53321q40657p15542l4559l06131q59036n37384j0736k97436
$$ 6258917 8327942 8981263 8140606 7425064 7390505 7084374 6225338 5687954 5677218 5379782
41352E379782o87524k18581K93385k19521r10543n26521J61064l06850j329299
$$ 5379782 4692258 4473677 4767062 4547541 3636998 3110477 3271541 2964691 1635392
41343A635392j176029O3800P74749N67505M88749P66793N43157j97712m74651
$$ 1635392 459363 523163 1297912 1865417 2354166 3120959 3664116 3466404 2991753
41334B991753j57669p0525j72569M15447J358633J106618n15013j611737r51861
$$ 2991753 2834084 2763559 2590990 3006437 4365070 5471688 4956675 3344938 2393077
41325B393077K64882M07659k01240j46987P69653J343263O87365p33659j633047
$$ 2393077 2657959 3065618 2864378 2717391 3487044 4830307 5517672 4784013 3150966
41316C150966j065571O09801J759532J052841p95941j613185m20586J313138J592988
$$ 3150966 2085395 2695196 4454728 5507569 4711628 3098443 2677857 3990995 5583983
41307E583983L11071r61587j015411l4403J064233J519119J053426J3071p26017
$$ 5583983 5895054 4933467 3918056 3883653 4947886 6467005 7520431 7533502 6807485
41298F807485n05656K71799M23063o24773j958658k067771n92596J190496J796670
$$ 6807485 6301829 6573628 6996691 6371918 4413260 2345489 1752893 2943389 4740059
41289D740059J069091l8264p72112j011687p20651K2731M58185k22100j360569
$$ 4740059 5809150 5770886 4998774 3987087 3266436 3289167 3747352 3525252 2164683
41280B164683j206603N54706J912041J182355n96224j268970n84839O1301K19441
$$ 2164683 958080 1512786 3424827 4607182 4010958 2741988 2157149 2218450 2437891
41271B437891P12610J501288J264116l76475j861916j732303m59741N29198P07524
$$ 2437891 3150501 4651789 5915905 5539430 3677514 1945211 1485470 2014668 2722192
41262B722192N27772L50699J11353k21892l87536n9122O54583R12405j31198j914291
$$ 2722192 3249964 3600663 3712016 3490124 3102588 3043466 3698049 4610454 4479256 2564965
41252B564965k586134j375922L7473j92290j271049j018699O52482J699770J252466
$$ 2564965 -21169 -1397091 -1359618 -1551908 -2822957 -3841656 -3189174 -1489404 -236938
41243b36938N90973N33799K74157m54920m46574O00427R64020l68959j751846
$$ -236938 354035 887834 1161991 707071 260497 860924 1824944 1455985 -295861
41234b95861j282199M47348J588091J548629P55616n57620j728062j429695K00105
$$ -295861 -1578060 -1130712 457379 2006008 2761624 2204004 475942 -953753 -753648
41225g53648Q73688m83548j533993q5474K011653J599804o04973j165236N40080
$$ -753648 120040 -363508 -1897501 -1982975 28678 1628482 1023509 -141727 398353
41216C98353J766244J276121Q66285J423774J207889o18071k017672j373970l6517
$$ 398353 2164597 3440718 4307003 5730777 6938666 6320595 4302923 2928953 2892436
41207B892436K24858o8959K14102O02166M38443N57777J489666J744789Q8231
$$ 2892436 3117294 3048335 3262437 3864603 4303046 4860823 6350489 8095278 8183509
41198H183509j977281k268519j195477o47166o86651Q7103J507831J780990M39945
$$ 8183509 6206228 3937709 2742232 2095066 1408415 1495518 3003349 4784339 5224284
41189E224284q57659p76401K03062R94280J122651N39202m63028j010368m93420
$$ 5224284 4366625 3590224 3793286 4787566 5910217 6449419 5986391 4976023 4482603
41180D482603L44067K64905o66992j311497j202755p72873j34463Q44117J449310
$$ 4482603 4826670 5091575 4424583 3113086 1910331 1137458 1002995 1847112 3296422
41171C296422P98483l84670m20152O95110J090134r7283j402549j330719l79973
$$ 3296422 4094905 3710235 3290083 3985193 5075327 4978044 3575495 2244776 1864803
41162A864803J63161J08247K7600J17941L38476P73933J071425M53405r49587
$$ 1864803 2027964 2136211 2163811 2281752 2620228 3394161 4465586 4918991 3969404
41153C969404j758375j141399P840M88249L55488J84126j16486o25924n98868
$$ 3969404 2211029 1069630 1077470 1565719 1921207 2105333 1988847 1362923 764055
41144G64055L29098R88997K15060j130979j257726j37330N51212M4385n63463
$$ 764055 1093153 2082150 2297210 1166231 -91495 -228825 322387 366772 -196691
41135a96691k34249N31047N97240l54011j636803k168549j215086P74091K181077
$$ -196691 -430940 100107 697347 343336 -1293467 -3462016 -4677102 -3903011 -1721934
41126a721934J844278M46175n72794r97815j439023j422880J57926K508097K980102
$$ -1721934 122344 568519 -4275 -1002090 -2441113 -3863993 -3706067 -1197970 1782132
41117A782132O39969j952759j903060L60734K090623J916229Q43871P0262m20902
$$ 1782132 2422101 469342 -1433718 -1072984 1017639 2933868 3777739 3848001 3427099
41108C427099r25288j101274n87384K09145M67940j48124j115293j461394o99718
$$ 3427099 2501811 1400537 813153 1022298 1490238 1342114 226821 -1234573 -1934291
41099a934291N11990R80462M36550j17701J70498Q58246R54544J91550r85836
$$ -1934291 -1422301 -441839 -5289 -122990 47508 905754 1860298 2051848 1066012
41090A066012k012241k195890j000756Q34053J439134K31310q12717J66425J892374
$$ 1066012 -946229 -3142119 -4142875 -3308822 -1869688 -1638378 -2451095 -2284670 -392296
41081c92296J665942m71719j753260q86038L70806M63511L02563J005230J676079
$$ -392296 1273646 801927 -951333 -1837371 -1466565 -1003054 -700491 304739 1980818
41072A980818J195902L89884M51339O95522j5284q52268l49790P36196L94836
$$ 1980818 3176720 3566604 4017943 4713465 4698181 3845913 3496123 4232319 4627155
41063D627155j237802j929434q03718N97019R69347P29729L25151p31531k209009
$$ 4627155 3389353 1459919 656201 1253220 2222567 2952296 3277447 2545916 336907
41054C36907k464647o54894J746961K752250K044820N27730j034099j974439j622756
$$ 336907 -2127740 -2782634 -1035673 1716577 3761397 4289127 3255028 1280589 -342167
41045c42167l70765K53622l49743q24172O54J141189J010082j39028q78803q55597
$$ -342167 -712932 -459310 -809053 -1633225 -1632571 -491382 518700 379672 -499131 -1354728
41035a354728p13853m39638M83975J639626K006879J506452Q15257J5054j093049
$$ -1354728 -2068581 -2508219 -2024244 -384618 1622261 3128713 3943970 3959024 2865975
41026B865975j777510j202967j54937r6182p22235m92899M84484M58573p70660
$$ 2865975 1088465 -114502 -269439 -365621 -1087856 -1580755 -1096271 -637698 -1408358
41017a408358j197672p065Q74251K2080r72729j62172J443816J515041Q1913q08171
$$ -1408358 -2606030 -2613095 -1738844 -1716764 -2689493 -2851665 -1407849 107192 189105 -619066
41007f19066l67015K96238M30188L52655J7006j019237k005598j399137O17663
$$ -619066 -986081 -689843 -259655 93000 110006 -909231 -2914829 -4313966 -3696303
40998c696303J811948Q70198q21871j277809m83819K08976K41736J50232K82347
$$ -3696303 -1884355 -1014157 -1836028 -3113837 -3597656 -3388680 -3146944 -2996712 -2714365
40989b714365L88674L44688M07961O93185R06214O61943j53716j228035j908194
$$ -2714365 -2325691 -1981003 -1573042 -879857 26357 688300 534584 -693451 -2601645
40980b601645j706277q47291k313N95955J301760K167423K494732J681982J17700
$$ -2601645 -4307922 -5155213 -5157526 -4561571 -3259811 -1092388 1402344 3084326 3202026
40971C202026j188185j615109j294119p46046m22474l65892j79223L79235P95318
$$ 3202026 2013841 398732 -895387 -1641433 -2063907 -2429799 -2609022 -2229787 -1434469
40962a434469L68233n61724p85420L7279P18632K72399n37143l24306Q51329J657076
$$ -1434469 -1066236 -1627960 -2413380 -2376101 -1657469 -1385070 -1922213 -2246519 -1395190 261886
40952B61886J380004N18815l37232j027764j181533l00405J129651J660801O04755
$$ 261886 1641890 2160705 1823473 795709 -385824 -686229 443422 2104223 2708978
40943B708978j027625j840161j620572j061480o02462k60997j36143l32472n94261
$$ 2708978 1681353 -158808 -1779380 -2840860 -3443322 -3704319 -3840462 -4172934 -4767195
40934d767195n46834j26136N33249J248719J534927Q38764m47326r34194j9552
$$ -4767195 -5314029 -5440165 -4906916 -3658197 -2123270 -1284506 -1731832 -2666026 -2685578
40925b685578R38562L41696j223144j629522j54360J637445K132157J424350M40223
$$ -2685578 -1747016 -1405320 -2628464 -4257986 -4412346 -2774901 -642744 781606 1221829
40916A221829l30024n62142J17015J102568P54714j347011l032303j992958R30040
$$ 1221829 891805 329663 446678 1549246 2303960 956949 -2075354 -4068312 -3138272
40907c138272K595330J579254l10650p97585J52145J044197J010573L07072n04813
$$ -3138272 -542942 1036312 725662 -71923 80222 1124419 2134992 2442064 1937251
40898A937251r45063p10620j42239j39469r25106j384158m42077J265479J998337
$$ 1937251 992188 281568 139329 -140 -925246 -2309404 -2751481 -1486002 512335
40889E12335J045109n73789j490510j269423k70862Q68759J338708N94114p32157
$$ 512335 1557444 983655 -506855 -1776278 -2047140 -1178381 160327 754441 22284
40880B2284j025258M10559K049864J708797o14216k442923j755254N95916K062341
$$ 22284 -1002974 -592415 1457449 3166246 2552030 109107 -1646147 -1050231 1012110
40871A012110J398075m21462j885282k354202j749052j67946J578541K150226
$$ 1012110 2410185 1988723 103441 -2250761 -3999813 -4167759 -2589218 -438992
40863d38992J304954N00463Q70570J440420O86880q36158j214407k51735J91050
$$ -438992 865962 1366425 2236995 3677415 4364295 3528137 2313730 2061995 2253045
40854B253045p62715j649290j171697k03284l8490k47927J46012O68343L95373
$$ 2253045 1490330 -158960 -1330657 -1533941 -1572431 -1820358 -1674346 -1006003 -610630
40845f10630m3292N07700J372648R04184o08128j199461n01338l54129j535825
$$ -610630 -653922 -146222 1226426 2130610 1522482 323021 -178317 -532446 -2068271
40836b068271k238205j022681P69817J249575R39992J410003K116689J118980
$$ -2068271 -4306476 -5329157 -4559340 -3309765 -2369773 -959770 1156919 2275899
40828B275899j361870k582086j072486J166829J403314j98425j063978K52632
$$ 2275899 914029 -1668057 -2740543 -1573714 -170400 -368825 -1432803 -1180171
40820a180171K319521K712145Q27621j552831k218639p68491J124585J599967
$$ -1180171 1139350 3851495 4679116 3126285 907646 139155 1263740 2863707
40812B863707N44011o07216q19764n83546q04181j218428p74612N10690J097395
$$ 2863707 3407718 2800502 1980738 1397192 593011 -625417 -1400029 -889339 208056
40803B08056r7096j936521k264871p14758P70474N88615l61481r8954J475532
$$ 208056 110960 -1825561 -4090432 -4805190 -4034716 -3446101 -3807582 -3906536 -2431004
40794b431004K349571J205155p76792j548104p48655L10526P19391Q31818R78296
$$ -2431004 -81433 1123722 346930 -1201174 -1949829 -1639303 -919912 -88094 890202
40785H90202N17886j007298k448550k003498K95355K123362J564505m61880j457417
$$ 890202 1408088 400790 -2047760 -4051258 -3755903 -1632541 -68036 -529916 -1987333
40776a987333o21517M13405K14207n16904m02324L95767P06555M34742O12041
$$ -1987333 -2608850 -2195445 -1981238 -2498142 -2900466 -2504699 -1798144 -1363402 -751361
40767g51361J455736J809127R25241l20827o89081k84438k04171q42031j338254
$$ -751361 704375 2513502 3438743 3117916 2428835 2144397 1940226 1098195 -240059
40758b40059q14548L50026Q78745J85982q54784j130979q71269j081577j519601
$$ -240059 -1054607 -704581 174164 360146 -494638 -1625617 -2496886 -3578463 -5098064
40749e098064p02627J460984K661451J229017j095529j379927L48007J441877
$$ -5098064 -5800691 -4339707 -1678256 -449239 -1544768 -2924695 -2576688 -1134811
40741a134811P40679j83233k8166N38857Q18841J264977J761759J080398o99898
$$ -1134811 -394132 -577365 -605531 -66674 752167 2017144 3778903 4859301 4159403
40732D159403j531893o47256q5595j108969j601108L25244K397518J327975j631635
$$ 4159403 2627510 1980254 1894659 785690 -815418 -490174 1907344 3235319 1603684
40723A603684k236977K20785J999033Q78272q38886n82667N78591K80657j329381
$$ 1603684 -633293 -412508 1586525 2464797 1625911 1043244 1621835 1902492 573111
40714E73111k296890j814876o55131K54091L36643m73793j057892J00879K427202
$$ 573111 -1723779 -3538655 -4193786 -3939695 -3603052 -4076845 -5134737 -5033858 -2606656
40705b606656L117508Q48571j916331k036366J88967J925717J775297O95443l58491
$$ -2606656 510852 1359423 -556908 -2593274 -2404307 -478590 1296707 1992150 1633659
40696A633659j371905j936647j185018M73256J300857N85706l29747o9735Q90579
$$ 1633659 261754 -1674893 -2859911 -2386655 -1085798 -500092 -829839 -899574 -8995
40687h995J185115N15449k69357n42364m85009m50770m06882j42895L01979O30428
$$ -8995 1176120 1691569 1422212 879848 394839 -55931 -462813 -605708 -303729 326699
40677C26699O48646M71841K71671j4679m45553o83052l30377L31615N47267J71124
$$ 326699 975345 1447186 1718857 1704178 1258625 575573 245196 576811 1124078 1295202
40667A295202j27066j5398q0355p45270j351724j050017l6986Q60896J331419
$$ 1295202 1168136 1152738 1072383 327113 -1024611 -2074628 -2111614 -1250718 80701
40658H0701J477812J076890k8415j067197r69373J24700R07674N46472n23300
$$ 80701 1558513 2635403 2606988 1539791 570418 695118 1602792 2149264 1625964
40649A625964j477276j884208j463819n3935J694004K374709J306840m40293j151686
$$ 1625964 148688 -1735520 -3199339 -3253274 -1559270 815439 2122279 1681986 530300
40640E30300m41625M48946L53236l88201n88984n654K65573n53298j570468j365647
$$ 530300 88675 537621 890857 502656 -86328 -91982 173591 -379707 -1950175 -3315822
40630c315822j55996L18042p65099k123560k156803q74519P20841K176193L388984
$$ -3315822 -3471818 -3153776 -3918875 -6042435 -8199238 -9073757 -8352916 -6176723 -2787739
40621b787739L627373K188666j65563j680918j574986o03658K43930O07282L56267
$$ -2787739 839634 3028300 2862737 1181819 -393167 -996825 -752895 -145613 210654
40612B10654n22160j372023j170981J81057J523902J701846O82646o77701j437296
$$ 210654 -311506 -1683529 -2854510 -2673453 -1149551 552295 1234941 557240 -880056
40603h80056j132963j92102K04808o40265j835341j775599j76133J563586K133191
$$ -880056 -2013019 -2205121 -2000313 -2640578 -4475919 -6251518 -6427651 -4864065 -2730874
40594b730874J633422R36818N39165L93888K87777O3548j92775k09323j21954
$$ -2730874 -1097452 -160634 378531 772419 1060196 1123744 930969 721646 599692
40585E99692n71394j507041j570266M9206J719786J192580q36332j264245Q34796
$$ 599692 28298 -1478743 -3049009 -2999803 -1280017 -87437 -923769 -2188014 -1353218
40576a353218K615433J705883k61945m03145R61145J257127L8284n58749L43666
$$ -1353218 1262215 2968098 2706153 2303008 3264153 4521280 4559564 4000815 4344481
40567D344481R25535j30116j386699j036093J90234K75582r09073j570243q58710
$$ 4344481 5270016 5139900 3753201 2717108 2907342 3182924 2273851 703608 -155102
40558a55102j1985k29308q06935l43416J004460J663319Q60618m18266r41252
$$ -155102 -167087 -396395 -1203330 -1546746 -542286 1121033 1981651 1563385 622133
40549F22133p15917m06851j39856K28592L22288j33500l49008N19336J607437
$$ 622133 -93784 -500635 -640491 -411899 -89611 -223111 -572119 -52783 1554654
40540A554654J194231n20890j254745O5441J542591J016028q97767j977453j524734
$$ 1554654 2748885 2227995 973250 1038691 2581282 3597310 2699543 722090 -802644
40531h02644o05194R8760P98827J253154P55405l74010q55745l43817Q1039l30852
$$ -802644 -1407838 -1309078 -510251 742903 1498308 1124298 268553 -75264 5775 -325077
40521c25077r88108j134538q67362m63991K14902J026743J228609N52981k29449
$$ -325077 -1313185 -2447723 -3315085 -3779076 -3564174 -2537431 -1308822 -755841 -985290
40512i85290m79874n82853r33747r09741J38026J500589J847024J008649r964
$$ -985290 -1465164 -2048017 -2981764 -3891505 -3753479 -2252890 -405866 602783 592819
40503E92819n58424p88883o88353Q2741J097924J100741k57009j497162j091391
$$ 592819 34395 -754488 -1442841 -1360100 -262176 838565 581556 -915606 -2006997
40494b006997L75684R12866j57162j324765j035093L03809J145422R37356M90867
$$ -2006997 -1631313 -718447 -875609 -2200374 -3235467 -2931658 -1786236 -848880 -358013
40485c58013N13945P47334O43289J16023o11447j279626j487112r26805L300M38065
$$ -358013 155932 903266 1546555 1662578 1051131 -228495 -1715607 -2642412 -2639112 -2201047
40475b201047K03343O3240L92293L81334o74334j900491j685351J63049J996074
$$ -2201047 -1997704 -1934464 -1542171 -1160837 -1835171 -3735662 -5421013 -5257964 -3261890
40466c261890K177593P74938o92787q05181M33746J533883R89506r14292k214340
$$ -3261890 -1084297 -309359 -1002146 -1807327 -1373581 160302 1149808 235516 -1978824
40457a978824j629115j61880M47319K06236N21359J671948K225466J295730n8345
$$ -1978824 -3607939 -3769819 -3322500 -3116264 -2594905 -922957 1302509 2598239 2539894
40448B539894m53079r1516p4929n77870q20646m83517q6074o647k3838J2300j84785
$$ 2539894 2086815 1995299 1920370 1342500 521854 38337 -47737 -54384 -78222 -65922 -250707
40437b50707o82176q91349l29373M96573O01997r5902n55985l6471Q47043J022692
$$ -250707 -932883 -1824232 -2153605 -1657032 -1055035 -1150937 -1706922 -1743393 -896350 126342
40427A26342M40074j49915n59388j202284j783556j266853L86985J678769J521916
$$ 126342 566416 416501 -142887 -1345171 -3128727 -4395580 -4008595 -2329826 -807910
40418h07910O31957Q8630k95499r36162r82286L84721J935751J705162K0771q13629
$$ -807910 -175953 -87323 -382822 -1318984 -2301270 -1916549 19202 1724364 1745135 931506
40408I31506Q5376J105873Q16034k04056q23891q88164n08500M96242J516702
$$ 931506 1016882 2122755 2938789 2734733 1910842 1022678 514178 1010420 2527122
40399B527122J090383r49233k637366k357094q83309J97016P13257J141629R87923
$$ 2527122 3617505 2668272 30906 -2326188 -3209497 -3012481 -2299224 -1157595 -169672
40390a69672j90502j130713l07729J464091J886207M82956q52956p59910m9625
$$ -169672 -360174 -1490887 -1798616 -334525 1551682 2034638 1181682 421772 372147
$$ [...]
##END NTUPLES=NMR SPECTRUM
##END=
