##TITLE=31Pdec_SR89_rm3
 , 24 sc
 20.09.2021
##JCAMPDX= 6.0         $$ Bruker NMR JCAMP-DX V2.0
##DATA TYPE= NMR SPECTRUM
##DATA CLASS= NTUPLES
##ORIGIN= UXNMR, Bruker Analytische Messtechnik GmbH
##OWNER= root
$$ XWIN-NMR		Version 3.5
$$ Mon Sep 20 12:54:00 2021 Russian Standard Time (UT+4h)  she@DPX200
##.OBSERVE FREQUENCY= 81.013821
##.OBSERVE NUCLEUS= ^31P
##.ACQUISITION MODE= SIMULTANEOUS
##.ACQUISITION SCHEME= undefined
##.AVERAGES= 24
##.DIGITISER RES= 16
##SPECTROMETER/DATA SYSTEM= spect
##.PULSE SEQUENCE= zgpg30
##.SOLVENT NAME= CDCl3
##.SHIFT REFERENCE= (INTERNAL, CDCl3, 0, 248.564)
##AUDIT TRAIL= $$ (NUMBER, WHEN, WHO, WHERE, WHAT)
$$ ##TITLE= Audit trail, XWIN-NMR		Version 3.5
$$ ##JCAMPDX= 5.01
$$ ##ORIGIN= Bruker BioSpin GmbH
$$ ##OWNER= she
$$ F:/spectra/data/she/nmr/P31/1/pdata/1/auditp.txt
$$ ##AUDIT TRAIL=  $$ (NUMBER, WHEN, WHO, WHERE, WHAT)
(   1,<2021-09-20 12:52:38.76 +0400>,<she>,<DPX200>,
      <created by zg, POWCHK disabled, PULCHK disabled
       configuration hash MD5:
       00 E9 B6 7A A2 85 ED C7 34 08 36 98 17 FE 4E 26
       data hash MD5: 32K
       F2 00 DF 2D C9 CF 25 8A 01 12 F2 64 F9 E9 5D 60>)
(   2,<2021-09-20 12:53:02.48 +0400>,<she>,<DPX200>,
      <Start of raw data processing
       efp BC_mod = 2 LB = 1 FT_mod = 6 PKNL = 1 PHC0 = -8109.692 PHC1 = 81.07024 SI = 64K 
       data hash MD5: 64K
       03 85 EB FE 88 93 D8 75 B1 F7 87 4C 7A 22 FD CE>)
(   3,<2021-09-20 12:53:29.37 +0400>,<she>,<DPX200>,
      <pk PHC0 = 102.6901 PHC1 = -266 
       data hash MD5: 64K
       27 96 39 AF A5 9E 9D E8 8F 0F 32 32 8D 21 9A B2>)
(   4,<2021-09-20 12:53:32.40 +0400>,<she>,<DPX200>,
      <abs ABSG = 5 
       data hash MD5: 64K
       36 AD 32 BA 2D 66 B6 28 74 6C 64 FB B1 B3 D8 27>)
$$ ##END=
$$ 
$$ hash MD5
$$ CB 94 B9 04 D0 73 B6 8A E7 F9 3E F5 6E 53 6C FF
##$RELAX= 
##$RELAX= 
##$RELAX= 
##$RELAX= 
##$RELAX= 
##$RELAX= 
##$RELAX= 
##$RELAX= 
$$ Bruker specific parameters
$$ --------------------------
##$DU= <F:/spectra>
##$EXPNO= 1
##$NAME= <P31>
##$PROCNO= 1
##$TYPE= <nmr>
##$USER= <she>
##$AMP= (0..31)
100 100 100 100 100 100 100 100 100 100 100 100 100 100 100 100 100 100 
100 100 100 100 100 100 100 100 100 100 100 100 100 100 
##$AQSEQ= 0
##$AQ_mod= 1
##$AUNM= <au_zg>
##$AUTOPOS= <>
##$BF1= 81.014009
##$BF2= 200.13
##$BF3= 200.13
##$BF4= 200.13
##$BF5= 200.13
##$BF6= 200.13
##$BF7= 200.13
##$BF8= 200.13
##$BYTORDA= 1
##$CFDGTYP= 0
##$CFRGTYP= 5
##$CHEMSTR= <none>
##$CNST= (0..31)
1 1 145 1 1 1 1 1 1 1 1 1 1 1 1 1 1 1 1 1 1 1 1 1 1 1 1 1 1 1 1 1 
##$CPDPRG= <waltz16>
##$CPDPRG1= <>
##$CPDPRG2= <waltz16>
##$CPDPRG3= <>
##$CPDPRG4= <mlev>
##$CPDPRG5= <mlev>
##$CPDPRG6= <mlev>
##$CPDPRG7= <mlev>
##$CPDPRG8= <mlev>
##$CPDPRGB= <>
##$CPDPRGT= <>
##$D= (0..31)
0 1 0 0 0 0 0 0 0 0 0 0.03 2e-05 3e-06 0 0 0 0 0 0 0 0 0 0 0 0 0 0 0 0 
0 0 
##$DATE= 1632127958
##$DBL= (0..7)
120 120 120 11 120 120 24 19 
##$DBP= (0..7)
150 150 150 150 150 150 150 150 
##$DBP07= 0
##$DBPNAM0= <>
##$DBPNAM1= <>
##$DBPNAM2= <>
$$ [...]
##$SUBNAM3= <"">
##$SUBNAM4= <"">
##$SUBNAM5= <"">
##$SUBNAM6= <"">
##$SUBNAM7= <"">
##$SUBNAM8= <"">
##$SUBNAM9= <"">
##$SW= 501.771253377433
##$SWIBOX= (0..15)
0 1 3 0 0 0 0 0 0 0 0 0 0 0 0 0 
##$SW_h= 40650.406504065
##$TD= 32768
##$TD0= 1
##$TE= 0
##$TE2= 300
##$TE3= 300
##$TEG= 300
##$TL= (0..7)
0 120 53 12 22 120 120 120 
##$TP= (0..7)
150 150 150 150 150 150 150 150 
##$TP07= 0
##$TPNAME0= <>
##$TPNAME1= <>
##$TPNAME2= <>
##$TPNAME3= <>
##$TPNAME4= <>
##$TPNAME5= <>
##$TPNAME6= <>
##$TPNAME7= <>
##$TPOAL= (0..7)
0.5 0.5 0.5 0.5 0.5 0.5 0.5 0.5 
##$TPOFFS= (0..7)
0 0 0 0 0 0 0 0 
##$TUNHIN= 0
##$TUNHOUT= 0
##$TUNXOUT= 0
##$USERA1= <user>
##$USERA2= <user>
##$USERA3= <user>
##$USERA4= <user>
##$USERA5= <user>
##$V9= 5
##$VALIST= <valist>
##$VCLIST= <CCCCCCCCCCCCCCC>
##$VD= 0
##$VDLIST= <DDDDDDDDDDDDDDD>
##$VPLIST= <PPPPPPPPPPPPPPP>
##$VTLIST= <TTTTTTTTTTTTTTT>
##$WBST= 1024
##$WBSW= 4
##$XGAIN= (0..3)
0 0 0 0 
##$XL= 0
##$YL= 0
##$YMAX_a= 7582
##$YMIN_a= -9389
##$ZGOPTNS= <>
##$ZL1= 120
##$ZL2= 120
##$ZL3= 120
##$ZL4= 120
##$ABSF1= 248.5645
##$ABSF2= -253.2056
##$ABSG= 5
##$ABSL= 3
##$ALPHA= 0
##$AQORDER= 0
##$ASSFAC= 0
##$ASSFACI= 0
##$ASSFACX= 0
##$ASSWID= 0
##$AUNMP= <proc_1d>
##$AZFE= 0.1
##$AZFW= 0.5
##$BCFW= 0
##$BC_mod= 2
##$BYTORDP= 0
##$COROFFS= 0
##$CY= -3
##$DATMOD= 1
##$DC= 0
##$DFILT= <>
##$DTYPP= 0
##$F1P= 0
##$F2P= 0
##$FCOR= 1
##$FTSIZE= 65536
##$FT_mod= 6
##$GAMMA= 0
##$GB= 0
##$INTBC= 1
##$INTSCL= 5.30512e-09
##$ISEN= 30
##$LB= 1
##$LEV0= 0
##$LPBIN= 0
##$MAXI= 10000
##$MC2= 0
##$MEAN= 0
##$ME_mod= 0
##$MI= 50
##$NCOEF= 0
##$NC_proc= -8
##$NLEV= 6
##$NOISF1= 182.463
##$NOISF2= 159.3651
##$NSP= 0
##$NTH_PI= 0
##$NZP= 0
##$OFFSET= 248.5645
##$PC= 4
##$PHC0= -8007.002
##$PHC1= -184.9298
##$PH_mod= 1
##$PKNL= yes
##$PPARMOD= 0
##$PSCAL= 0
##$PSIGN= 0
##$REVERSE= no
##$SF= 81.014009
##$SI= 65536
##$SIGF1= 159.3651
##$SIGF2= -187.1042
##$SINO= 113.3802
##$SIOLD= 16384
##$SREGLST= <1H.CDCl3>
##$SSB= 0
##$STSI= 65536
##$STSR= 0
##$SW_p= 40650.406504065
##$SYMM= 0
##$S_DEV= 0
##$TDeff= 32768
##$TDoff= 0
##$TI= <>
##$TILT= no
##$TM1= 0
##$TM2= 0
##$TOPLEV= 0
##$USERP1= <user>
##$USERP2= <user>
##$USERP3= <user>
##$USERP4= <user>
##$USERP5= <user>
##$WDW= 1
##$XDIM= 65536
##$YMAX_p= 436112654
##$YMIN_p= -23364666
$$ End of Bruker specific parameters
$$ ---------------------------------
##NTUPLES= NMR SPECTRUM
##VAR_NAME=  FREQUENCY,     SPECTRUM/REAL,   SPECTRUM/IMAG
##SYMBOL=    X,             R,               I
##VAR_TYPE=  INDEPENDENT,   DEPENDENT,       DEPENDENT
##VAR_FORM=  AFFN,          ASDF,            ASDF
##VAR_DIM=   65536,         65536,           65536
##UNITS=     HZ,            ARBITRARY UNITS, ARBITRARY UNITS
##FACTOR=    0.620285442955139, 1,           1
##FIRST=     20137.2065510759, 0,            0
##LAST=      -20513.1999529892, 0,           0
##MIN=       -20513.1999529892, -23364666,   0
##MAX=       20137.2065510759, 436112654,    0
$$ Real data points
##PAGE= N=1
##DATA TABLE= (X++(R..R)), XYDATA
$$ [...]
13039D862059r24269m272056l887302j097487M01803q4389r69198j963911l418046
$$ 4862059 3937790 -334266 -4221568 -5319055 -4917252 -5001641 -5970839 -7934750 -11352796
13030a1352796l839286j659528J475691K540246J801417K381849N022561O533430
$$ -11352796 -15192082 -16851610 -15375919 -12835673 -11034256 -8652407 -3629846 2903584
13022B903584M466794N48389k164132l234124l780450l294413n42921L027056
$$ 2903584 7370378 7918767 5754635 2520511 -1259939 -4554352 -5097273 -2070217
13014b070217M075976K103824M04486J011973J610224k80558k708414k307046
$$ -2070217 2005759 4109583 4514069 5526042 7136266 6855708 4147294 1840248
13006A840248r9013m108k193309k659566n5891J832952L87989j496013m46542
$$ 1840248 1741235 1737127 -456182 -3115748 -3171639 -1338687 -950698 -2446711 -2893253
12997b893253J684202J144126j285484j616257R05079K828356J555945j993829
$$ -2893253 -1209051 -64925 -1350409 -2966666 -2061587 766769 2322714 328885
12989C28885n365625o234692k960672L063112O395915L027985l225235m285840
$$ 328885 -5036740 -11271432 -14232104 -11168992 -4773077 -1745092 -4970327 -9256167
12981i256167J487945O781008N312990k1597k078788Q03452L831320K732764j809794
$$ -9256167 -7768222 -987214 4325776 4304179 2225391 3028843 6860163 9592927 7783133
12972G783133n977826o368939k270081L328574N484929K217745k672602l648089
$$ 7783133 1805307 -4563632 -6833713 -3505139 1979790 4197535 1524933 -2123156
12964b123156M6374L869930L728456J39573l358514l847412p53749L922102O285996
$$ -2123156 -2076782 1793148 5521604 5661177 2302663 -1544749 -2298498 1623604 7909600
12955G909600L423460k989860p244850n314226N94518M396665K632492k372097
$$ 7909600 11333060 8343200 1098350 -4215876 -3621358 775307 3407799 1035702
12947A035702n491656l959336M05314L429408K913523P22894R8783J215452J128856
$$ 1035702 -4455954 -8415290 -8009976 -4580568 -1667045 -944151 -845368 370084 1498940
12938A498940j286277k815458o09062K566656J628269k747754l947211J178545
$$ 1498940 212663 -2602795 -3211857 -645201 983068 -1764686 -5711897 -4533352
12930d533352P023391O587388R00712l312335l428497l011202m211979l831165
$$ -4533352 2490039 9077427 9978139 6665804 3237307 226105 -3985874 -7817039
12922g817039O11328N322207M823489j53439l518548j980400J286384J688631
$$ -7817039 -7205711 -1883504 2939985 2786546 -732002 -2712402 -1426018 262613
12914B62613r75334l190297k443625L73209K595970K551185P10346j210902j939283
$$ 262613 -712721 -3903018 -6346643 -5973434 -3377464 -826279 -115933 -1326835 -3266118
12905c266118j338525K89935K595221M268043L055961j411720n389335m270941
$$ -3266118 -4604643 -4314708 -1719487 2548556 5604517 4192797 -1196538 -5467479
12897e467479J333757N503082M443686J198087L33204P77643j557011n618559
$$ -5467479 -4133722 1369360 5813046 7011133 7344337 8121980 6564969 946410
12889I46410n670626n80736L500018K416274K06498J621059L626332P91198m467406
$$ 946410 -4724216 -5304952 -1804934 611340 817838 2438897 6065229 6856427 2389021
12880B389021m826903K49662L856546K839568J470236K304987J708247k002329
$$ 2389021 -2437882 -2188220 1668326 4507894 5978130 8283117 9991364 7989035
12872G989035l842257q77147J291882k441104o850829l792567M267023P074954
$$ 7989035 4146778 3269631 4561513 2120409 -4730420 -8522987 -4255964 2818990
12864B818990J599859m346249m113539l02029J294482j09638j130101N24692M000368
$$ 2818990 4418849 72600 -4040939 -4342968 -3048486 -3158124 -4288225 -3763533 236835
12855B36835O265461M389924r50386m744540l345979J75527K71532k645563l081861
$$ 236835 6502296 10892220 9941834 5197294 1851315 2026842 2298374 -347189 -3429050
12846c429050N45147L533182K493783j31643j030162o55038n25699j9724J511411
$$ -3429050 -2883903 649279 3143062 3011419 1981257 1326219 800520 780796 2292207
12837B292207K660242K275955J196325J43654j281750k396031j531434M17763
$$ 2292207 4952449 7228404 8424729 8568383 7286633 4890602 3359168 3776931
12829C776931J02987l065198n288030l714007j42840K302931L004141K670405
$$ 3776931 3879918 814720 -4473310 -8187317 -8330157 -6027226 -3023085 -352680
12821c52680J524879L86362O01846J458188O46075j653159k560603j299956k76045
$$ -352680 1172199 1558561 2160407 3618595 4264670 2611511 50908 -1249048 -1525093
12812a525093l43233M82317K146051J381394k378161m822769l223906m21814M55163
$$ -1525093 -1868326 -1386009 760042 2141436 -236725 -5059494 -8283400 -8705214 -8250051
12803h250051M80657J067467O70816r52433k89006L692086N738792J944648l228862
$$ -8250051 -7769394 -6701927 -6031111 -6983544 -7272550 -3580464 2158328 4102976 874114
12794H74114l379669J21506J176324j119498k230819k62897J955781K296017J572319
$$ 874114 -2505555 -2384049 -1207725 -2327223 -4558042 -4820939 -2865158 -569141 1003178
12785A003178O57115l01262l09354J056211J698665L4359j638371o15151J351601
$$ 1003178 1660293 1359031 1049677 2105888 3804553 3838912 2200541 1585390 2936991
12776B936991R71845q29162r02658K15115l08153j719410q35055J734297K211991
$$ 2936991 3908836 3079674 2177016 2392131 2083978 364568 -470487 1263810 3475801
12767C475801K35921p60666J70977L50690r52670j256212j579L82824l51895N00545
$$ 3475801 3711722 2951056 3122033 3472723 2520053 1263841 1262262 1645086 1293191 1793736
12757A793736K639321J709374l151234o114687k841432K593990L590955N23672
$$ 1793736 4433057 6142431 2991197 -3123490 -5964922 -3370932 220023 743695
12749G43695r30322R04294J795865q04124l501609k462550O13297J356063o22566
$$ 743695 -186627 717667 2513532 1709408 -1792201 -4254751 -3641454 -2285391 -2907957
12740b907957j843193r61861l49012r64680k45992K494389L112295o47454l501520
$$ -2907957 -4751150 -5713011 -6062023 -7026703 -7272695 -4778306 -1666011 -2313465 -5814985
12731e814985K2222N407602L514902m559191p395496k10128P406934N616705j858082
$$ -5814985 -5792763 -385161 3129741 -1429450 -8824946 -9035074 -1628140 3988565 2130483
12722B130483m911646j800841J354794J712873J902707K877864K242989l18462
$$ 2130483 -2781163 -4582004 -3227210 -1514337 388370 3266234 5509223 5190761
12714E190761j963879j538150r72944j515339k054581j290720P95465K980297
$$ 5190761 3226882 1688732 715788 -799551 -2854132 -4144852 -3349387 -369090
12706c69090K990759j85047l208865j545911K874150K822184k775321n670769
$$ -369090 2621669 2436622 -772243 -2318154 555996 3378180 602859 -5067910
12698e067910j195608L542749J408730k539142k14623M599902K446147m829208
$$ -5067910 -6263518 -2720769 -1312039 -3851181 -4065804 534098 2980245 -1848963
12690a848963o326062K4127M614144K022234k155907k603228j597438j780184
$$ -1848963 -8175025 -8150898 -3536754 -1514520 -3670427 -6273655 -7871093 -9651277
12682i651277j242003M82305J30901j918068k00684O034979R456092N437023r73848
$$ -9651277 -10893280 -10410975 -10280074 -12198142 -12398826 -6363847 3092245 8529268 7555420
12673G555420l455264l100342l744865m521444k500737J504571M379364M780608
$$ 7555420 4100156 999814 -2745051 -7266495 -9767232 -8262661 -3883297 897311
12665H97311K851695o28347k875626j125453K396656K375654j371802l205622
$$ 897311 3749006 3120659 245033 -880420 1516236 3891890 2520088 -685534
12657f85534p29545J753560R48323q24767j283623j814283k623263j077963K053334
$$ -685534 -1415079 338481 1286804 462037 -821586 -2635869 -5259132 -6337095 -4283761
12648d283761J915541j437645j245869M299227O913559R14064o638796o098283
$$ -4283761 -2368220 -3805865 -5051734 -752507 6161052 7075116 436320 -5661963
12640e661963P82991N201410M545023K794488J512638r65349l550358l329748
$$ -5661963 -4878972 322438 4867461 7661949 9174587 8209238 4658880 1329132
12632A329132j191751j42614L31072K134224K876796q90317o085195n832079K13070
$$ 1329132 137381 -5233 325839 2460063 5336859 4446542 -1638653 -7470732 -7257662
12623g257662M734641K934582j606447k826634K94647L943278M364286J076431
$$ -7257662 -2523021 411561 -1194886 -4021520 -3726873 216405 4580691 5657122
12615E657122l145499m792911l012354k87087O94229l08202j924462k733422j518404
$$ 5657122 2511623 -2281288 -5293642 -5580729 -4886500 -5194702 -7119164 -9852586 -11370990
12606a1370990J557975L585320J796325j748638k250704M55549J457557j089299
$$ -11370990 -9813015 -6227695 -4431370 -6180008 -8430712 -7975163 -6517606 -7606905
12598g606905k969867j236631J361179K250800L203057M792966L086996k981075
$$ -7606905 -10576772 -11813403 -10452224 -8201424 -4998367 -205401 2881595 -99480
12590i9480o884900l405357K771545M019656R21670o52078K01706j56907j845528
$$ -99480 -6984380 -10389737 -7618192 -3598536 -2676866 -3328944 -3127238 -3284145 -5129673
12581e129673j618752K59427M18841j064428r19021J023542J676063N02802J14622
$$ -5129673 -6748425 -6488998 -6070157 -7134585 -8053606 -7030064 -5354001 -4851199 -4736577
12572d736577J363025K582264L077877L036276J287217k353452m359766k079601
$$ -4736577 -3373552 -791288 2286589 5322865 6610082 4256630 -103136 -2182737
12564b182737J032396K71432k419512j728843J742298K673888M65845k20069J550502
$$ -2182737 -1150341 -878909 -3298421 -5027264 -3284966 -611078 -145233 -365302 1185200
12555A185200J250597k470205m705399k302289J339846K370783J916486K252861
$$ 1185200 2435797 -34408 -4739807 -7042096 -5702250 -3331467 -1414981 837880
12547H37880K327714O14710j338991j695300j736291l192260m377706k328022
$$ 837880 3165594 3780304 2441313 746013 -990278 -4182538 -8560244 -10888266
12539a0888266K263433N120411L558022k00948j800668k57151Q93862r52206k708613
$$ -10888266 -8624833 -3504422 53600 -147348 -1948016 -2205167 -1311305 -2263511 -4972124
12530d972124K31227N699855N982218r02391o796959m293875K761065N069643
$$ -4972124 -4740897 958958 6941176 6038785 -758174 -5052049 -2290984 2778659
12522B778659O41388m358076n252476l072012j29399K741456M408773L585982
$$ 2778659 3420047 -938029 -6190505 -9262517 -9391916 -6650460 -2241687 1344295
12514A344295J108008j163375k982558m411376l857584r70096R43475m04138j774801
$$ 1344295 2452303 1288928 -1693630 -6105006 -9962590 -10932686 -9989211 -10393349 -12168150
12505a2168150O32546M343705M219317O51992j664232j282822m50249K36233J634263
$$ -12168150 -11535604 -7191899 -2972582 -2320590 -3984822 -5267644 -5717893 -5481660 -3847397
12496c847397K232337N85538l14417K504745N323858K728397k640823l357404
$$ -3847397 -1615060 -1029522 -1343939 1160806 6484664 9213061 6572238 3214834
12488C214834R82925L639165J901940j82745m08883j140042k673871k208838n31987
$$ 3214834 4197759 7836924 9738864 9556119 9147236 8007194 5333323 3124485 2592498
12479B592498j668990m784571m582124q65994P66934r60454j097422J690310K660995
$$ 2592498 923508 -3861063 -8443187 -9309181 -8542247 -9502701 -10600123 -8909813 -6248818
12470f248818O13327M19702L065865K866680j758858m454159k148701m13933k612129
$$ -6248818 -5635491 -5215789 -2149924 716756 -1042102 -5496261 -7644962 -8058895 -10671024
12461a0671024l359368J254440O106121O177205M546290M588053K960807k279346
$$ -10671024 -14030392 -12775952 -6669831 -492626 4053664 8641717 11602524 9323178
12453I323178n217492j904854J532808p29345l752654j211672K579381P51850
$$ 9323178 4105686 2200832 3733640 3004295 -748359 -1960031 619350 1371200
12445A371200k942452q93160L979379L115251k318684l593326L62832K186498
$$ 1371200 -1571252 -2464412 1514967 4630218 2311534 -1281792 -918960 1267538
12437A267538m05450j906889n3261R65715o87329j590552J6874K035514L200177
$$ 1267538 862088 -1044801 -1098062 -132347 -819676 -2410228 -2393354 -357840 2842337
12428B842337L106305n55990p078319q387384N04131J0057925P345230l685475
$$ 2842337 5948642 5392652 -1685667 -10073051 -9568920 489005 7834235 4148760
12420D148760p147127J29066M731178j96367m656756p37479L918207R78279l716178
$$ 4148760 -2998367 -2869301 1861877 1665510 -2991246 -3728725 189482 1167761 -2548417
12411b548417j657703K815542J191627l280265j579948M699834N988058P40230
$$ -2548417 -4206120 -1390578 -198951 -3479216 -5059164 -359330 5628728 6368958
12403F368958l123142j569118J191031J446302J17288j824433m180236m125743
$$ 6368958 3245816 1676698 2867729 4314031 4431319 2606886 -1573350 -5699093
12395e699093M36182M754976K409136l710765m078664L067940Q543400N546787
$$ -5699093 -5262911 -507935 1901201 -1809564 -5888228 -2820288 5723112 11269899
12387A1269899j612643n187461l651850k23981K472755K696407m90748m247930
$$ 11269899 9657256 4469795 817945 593964 3066719 5763126 5272378 1024448
12379A024448l458127J778679M847644J962147k193039k077212L56324j0963k761840
$$ 1024448 -2433679 -655000 4192644 6154791 3961752 1884540 2240864 2229901 -531939
12370e31939l387734r38645J361735J689728Q76876p00642k788923k912415P54308
$$ -531939 -3919673 -4858318 -3496583 -1806855 -929979 -1630621 -4419544 -7331959 -6577651
12361f577651M856961M245092k53143k587480m86043J652097L42447j744324r14321
$$ -6577651 -1720690 2524402 2271259 -316221 -802264 849833 1192280 -552044 -1466365
12352a466365J523895K032287N79131k54097O3917n0805p99318q25104j19675
$$ -1466365 57530 2089817 2668948 2414851 2478768 2427963 1628645 803541 683866
12343F83866j80173j281953k092278k144610k314279k350280l21114M123926P631084
$$ 683866 503693 -778260 -2870538 -5015148 -7329427 -9679707 -10000821 -5876895 1754189
12334A754189O312695P21494m074137m014237m91934J937902J558241J028080
$$ 1754189 8066884 8788378 4714241 700004 208070 2145972 3704213 4732293
12326D732293K463349L650481J443072k978138n616195n511213n068958m577792
$$ 4732293 7195642 10846123 12289195 9311057 3694862 -1816351 -6885309 -11463101
12318a1463101j295513M320819O504942K012194l853780l947499O03908K611685
$$ -11463101 -12758614 -8437795 -1932853 79341 -3774439 -7721938 -7118030 -4506345
12310d506345j83027k613180j097681J081102R3124j930792p48976K894402M487416
$$ -4506345 -4689372 -7302552 -8400233 -7319131 -7226007 -9156799 -9905775 -7011373 -2523957
12301b523957K536862L1437n69742k58479o84997j155697N3687K635281L860529
$$ -2523957 12905 44342 -525400 -783879 -1468876 -2624573 -2570886 64395 3924924
12292C924924J341789l870489p044127l751388M731990J0886872P926474k348273
$$ 3924924 5266713 1396224 -5647903 -9399291 -4667301 6219571 14146045 11797772
12284A1797772j0503187r298067j219400N096758M730596N62630k197426k573963
$$ 11797772 1294585 -8003482 -9222882 -4126124 604472 1167102 -1030324 -3604287
12276c604287l038439m073181k941470J570069O067920O420277L239039P56971
$$ -3604287 -6642726 -10715907 -13657377 -12087308 -6019388 400889 3639928 4396899
12268D396899N65216l30929l917600o653298l911857K308890M541006p7587m928315
$$ 4396899 4962115 4631186 713586 -5939712 -9851569 -7542679 -3001673 -3079260 -8007575
12259h007575k522803M671839P044635J062507n840750n613893M7183L695376
$$ -8007575 -10530378 -5858539 1186096 2248603 -3592147 -9206040 -9158857 -5463481
12251e463481K953775J759293K226167J571199j588412l370149m64254L712591
$$ -5463481 -2509706 -750413 1475754 3046953 1458541 -1911608 -2375862 1336729
12243A336729L027415k581674o487748m029803J507018L509434P39439j547496
$$ 1336729 4364144 1782470 -4705278 -8735081 -7228063 -3718629 -2979190 -4526686
12235d526686O97103M596458M665557P66190k203181k039838j665694k497514
$$ -4526686 -3829583 766875 5432432 6198622 3995441 1955603 289909 -2207605
12227b207605r86636M418055P808637L305429n109095q035951l469458J656580
$$ -2207605 -3194241 1223814 9032451 12337880 7228785 -807166 -4276624 -2620044
12219b620044K236686L03822r92713j743568j919500k4314K660165K217115j321651
$$ -2620044 -383358 -79536 -1072249 -2815817 -4735317 -4759631 -2099466 117649 -1204002
12210a204002l073817r93660J336733J549705J705624K410562Q83999k097462
$$ -1204002 -4277819 -5271479 -3934746 -2385041 -679417 1731145 2615144 517682
12202E17682j084154M194061N975078O82165m243585k268955J569440m7289m196710
$$ 517682 -566472 3627589 9602667 10284832 6041247 3772292 5341732 5294443 1097733
12193A097733l785392J16136J862556J764874K936917K741518j792100m847998
$$ 1097733 -2687659 -2571523 -708967 1055907 3992824 6734342 4942242 94244
12185I4244j11830N992285K742936o101752o739192K280483P609153K786513k950625
$$ 94244 -17586 5974699 8717635 2615883 -4123309 -1842826 5766327 8552840 5602215
12176E602215j725559J456231M88414j267153J50098O46660l417697o882407m051544
$$ 5602215 3876656 5332887 5821301 4554148 4704246 5350906 1933209 -4949198 -9000742
12167i000742J876626M775932M413132L110820M71275k529931j398997L617839
$$ -9000742 -7124116 -2348184 2064948 5175768 5647043 3117112 1718115 5335954
12159E335954M590668j959785p689227m965802Q86311J002923k388234j376815
$$ 5335954 9926622 7966837 277610 -4688192 -3801881 -2798958 -5187192 -6564007
12151f564007L043425L343460q72308k918062j227944q18091k733520k007004
$$ -6564007 -3520582 -177122 -1049430 -3967492 -5195436 -6013527 -8747047 -10754051
12143a0754051K632689N704905L736808K9260j490913j335102j330269j255083
$$ -10754051 -8121362 -2416457 1320351 1349611 -141302 -1476404 -2806673 -4061756
12135d061756n14268L07384O14318L5774j976754m186754l074412K148028O353359
$$ -4061756 -4576024 -4268640 -3654322 -3618548 -5595302 -9782056 -12856468 -10708440 -4355081
12126d355081M790586K49742j164727Q37446J720056M00628l5882J047049J168521
$$ -4355081 435505 685247 -479480 357966 2078022 2478650 2442768 3489817 4658338
12117D658338L99090J167050K310551j4171m766204n993365j868815K420027K775469
$$ 4658338 5057428 6224478 8535029 8520858 3754654 -2238711 -4107526 -1687499 1087970
12108A087970J430147J697708K694832K091049r8317k827861n352740n624413
$$ 1087970 2518117 4215825 6910657 9001706 8903389 6075528 722788 -4901625
12100d901625j628122L999050N370755J543517j450566N33046L633951K328640
$$ -4901625 -6529747 -2530697 2840058 4383575 2933009 3466055 7100006 9428646
12092I428646k325715n106787m132581j584032P62813K520313K804257J196910
$$ 9428646 7102931 1996144 -2136437 -3720469 -2957656 -437343 2366914 3563824
12084C563824m84378n48273k76066j332990j952053N09576M324642N001193J945599
$$ 3563824 3079446 2531173 2255107 922117 -1029936 -520360 3804282 8805475 10751074
12075A0751074p74939r19042r85867l013270m551748k752370O17842J837327P73502
$$ 10751074 9976135 9057093 8071226 5057956 506208 -2246162 -1628320 209007 982509
12066I82509j75518j144407m016314o911322m942829J920468O838249M998696
$$ 982509 806991 -337416 -4353730 -11265052 -16207881 -14287413 -7449164 -2450468
12058b450468J98615j437162l71475r93342l039982k255437J572369L938625L147168
$$ -2450468 -2251853 -3689015 -4060490 -5053832 -8093814 -10349251 -8776882 -4838257 -1691089
12049a691089K151673K131092P72731j514743n76812L568867M651665l0485m252394
$$ -1691089 460584 2591676 3364407 1849664 1272852 4841719 9493384 9462899 5210505
12040E210505k549781P57024j132230o046407o486069j632810K316399K370614
$$ 5210505 2660724 3417748 2285518 -3760889 -10246958 -11879768 -9563369 -7192755
12032g192755J589276J942382J620954L62894Q34405K937400K604297j285578
$$ -7192755 -5603479 -3661097 -2040143 -1677249 -842844 2094556 4698853 3413275
12024C413275l868429j293722L229526L921813L01579k939827k561710j59488
$$ 3413275 -455154 -1748876 1480650 5402463 5704042 2764215 202505 43017
12016D3017R60164K0192j018966n17627R25098J936242K352033K223477J79216
$$ 43017 1003181 1023373 4407 -513220 411878 2348120 4700153 6923630 7102846
12007G102846m226600p142242l690413M474878R393833O589489K75487l614330
$$ 7102846 2876246 -4265996 -7956409 -3481531 5912302 12501791 12777278 9162948
11999I162948m652630m771258l333046m54820k59866m345638o252830r5710Q561964
$$ 9162948 4510318 -260940 -3593986 -4048806 -4308672 -8654310 -14907140 -15002850 -6440886
11990f440886R194766J833704l293182j362181J592972M43973j477688l81395
$$ -6440886 2753880 4587584 1294402 -67779 1525193 1969166 491478 110083
11982A10083Q77774r53703k815880q01127K657494K949305Q59513L13145J431491
$$ 110083 987857 34154 -2781726 -3582853 -925359 2023946 2883459 3196604 4628095
11973D628095J329562k26880j217280j987012m308237o496424m592898J090292
$$ 4628095 5957657 5730777 4513497 2526485 -1781752 -8278176 -12871074 -11780782
11965a1780782N127305M079553Q22018j12941J431621K394702J682518J072695
$$ -11780782 -6653477 -2573924 -1751906 -1864847 -433226 1961476 3643994 4716689
11957D716689J501009J462754j55636k024863k543746k180054j836477o34869
$$ 4716689 6217698 7680452 7524816 5499953 2956207 776153 -1060324 -1695193
11949a695193K077323L878750J904543k148385l454685p78916K113164K379181
$$ -1695193 382130 4260880 6165423 4017038 562353 -216563 1896601 4275782
11941D275782J156847l60759k918804n183159l102024L227886P056549L813395
$$ 4275782 5432629 5071870 2153066 -3030093 -6132117 -2904231 4152318 7965713
11933G965713j978503l585274j554345m85770l66219J686797L870993J815926
$$ 7965713 5987210 2401936 847591 361821 -4398 1682399 5553392 7369318
11925G369318l007485m647527k068439J59062N44955K301798N261877M139359
$$ 7369318 4361833 -285694 -2354133 -2195071 -1650116 651682 5913559 10052918
11917A0052918k363537p651516o239217j138521J702400J649938J722178K295491
$$ 10052918 7689381 37865 -6201352 -7339873 -5637473 -3987535 -2265357 30134
11909C0134J257741j308455k697199j603016Q9545R286j478002j606060R72775
$$ 30134 1287875 -20580 -2717779 -4320795 -4231250 -4221964 -5699966 -7306026 -6333251
11900f333251L579006K693937m63220j012336K014396L743374J410530j104958
$$ -6333251 -2754245 -60308 -523528 -1535864 478532 4221906 5632436 4527478
11892D527478n98365n65082m127279o699201l430315J170293M57064j842807K379019
$$ 4527478 3929113 3364031 -763248 -7462449 -10892764 -9722471 -9265407 -11108214 -8729195
11883h729195R913087R460014K72542n767588k742975J624087O86988j352978
$$ -8729195 1183892 10643906 10916448 5148860 2405885 4029972 4716960 3363982
11875C363982m7077O47887k404242l892785K04641M138246K113010j412385K0915
$$ 3363982 3316905 3964792 1560550 -2332235 -2127594 2010652 4123662 2711277 2732192
11866B732192L409094K406934j094028j107542J532517J816338J74605K83188
$$ 2732192 6141286 8548220 7454192 6346650 7879167 9695505 9870110 10153298
11858A0153298O49605k376126n824117l636164K545384M906751J133584l357694
$$ 10153298 10802903 8426777 2602660 -1033504 1511880 6418631 7552215 4194521
11850D194521m485255l503592k157361o01202m9267j423163j902997J348565N267640
$$ 4194521 -290734 -3794326 -5951687 -6552889 -6602156 -8025319 -9928316 -8579751 -3312111
11841c312111M985653K179457K005894L141655l77772p363219q969093k208199
$$ -3312111 1673542 3852999 5858893 9000548 8622776 1259557 -7709536 -9917735
11833i917735M753912M644535Q97339M57059K912483K844325q61783l974137l473287
$$ -9917735 -5163823 -519288 378051 835110 3747593 6591918 5730135 1755998 -1717289
11824a717289n55136K207311L356027K554613N64652q69749o93587O4277l75733
$$ -1717289 -2272425 -65114 3290913 5845526 6410178 5540429 4846842 4911119 4535386
11815D535386k025733k791410r01901K477067L694165P35542l431822l784663
$$ 4535386 2509653 -281757 -1183658 1293409 4987574 5723116 2291294 -1493369
11807a493369K1392K710771P07389k816544l008130m78899O23210m06512n42347
$$ -1493369 -1471977 1238794 1946183 -870361 -3878491 -4357390 -3734180 -4140692 -4683039
11798d683039J068370J690032j7997j623521p53316J641924L134063K866735J712708
$$ -4683039 -3614669 -1924637 -1942634 -3566155 -4319471 -2677547 456516 3323251 5035959
11789E035959O98555o2287j299275l121395l689372j203591K381967K705796n11928
$$ 5035959 5734514 5672227 4372952 1251557 -2437815 -3641406 -1259439 1446357 934429
11780I34429k095223Q30350L804414J849670k483342l317331p34348M60216o65566
$$ 934429 -1160794 -330444 3473970 5323640 2840298 -477033 -1211381 -751165 -1416731
11771a416731o76673R00068P72858j270975j520406N85318J145784p89391j163517
$$ -1416731 -2093404 -1193336 -420478 -1691453 -3211859 -2626541 -1480757 -2270148 -3433665
11762c433665J272157J851172j536703l269755J341728P334351O565898k68217
$$ -3433665 -2161508 -310336 -1847039 -5116794 -3775066 3559285 10125183 9856966
11754I856966m836139l007460R28509K067995J072916O89818O01442j121062l784717
$$ 9856966 5020827 2013367 2941876 5009871 6082787 6772605 7374047 6252985 2468268
11745B468268m365993j540017K495128M347879K671992q69112l223378k679964
$$ 2468268 -1897725 -3437742 -942614 3405265 6077257 5208145 1984767 -695197
11737f95197o02536j85311k590314m654226k244211L606528O412751K238280m178297
$$ -695197 -1297733 -1483044 -4073358 -8727584 -10971795 -7365267 -952516 1285764 -2892533
11728b892533m992251J79417M103247K672910J35454J124569L004343R45325l315976
$$ -2892533 -7884784 -7705367 -3602120 -929210 -793756 330813 3335156 4280481 964505
11719I64505l856266Q9097L082178J632927j624435k559693m02279K715756L947610
$$ 964505 -2891761 -2802664 279514 1912441 288006 -2271687 -2673966 41790 3989400
11710C989400J399553l312035m725961M38167P351725P690768M53337o560455
$$ 3989400 5388953 2076918 -2649043 -2210876 5140849 12831617 13284954 6724499
11702F724499p005127k882680M95431J536660J447079L74939j750933l122272
$$ 6724499 -280628 -3163308 -2667877 -1131217 315862 690801 -1060132 -4182404
11694d182404k237093m82688J45572J55272Q23066J148799m94629k825119k692152
$$ -4182404 -6419497 -6902185 -6756613 -6601341 -5778275 -4629476 -5124105 -7949224 -10641376
11685a0641376P04659M819077O681642N197625J259655k594677l309862k07211
$$ -10641376 -9936717 -5117640 1564002 6761627 8021282 5426605 2116743 1909532
11677A909532L398561L372017l18890l534921l155624o66210L77109q06751j556690
$$ 1909532 5308093 8680110 8361220 4826299 1670675 1004465 1381574 574823 -981867
11668i81867K02860K908983L350295Q22374k208031l380540k670027j054271J030762
$$ -981867 -779007 2129976 5480271 6302645 4094614 714074 -1955953 -3010224 -1979462
11659a979462K847442K908211J083293m35747k38828j65782k178533m266951k863057
$$ -1979462 867980 3776191 4859484 4423737 4184909 4019127 1840594 -2426357 -5289414
11650e289414J337627L745325K357409J73802J8295M03898j351806m465381n711521
$$ -5289414 -3951787 -206462 2150947 2324749 2343044 2746942 1395136 -3070245 -8781766
11641h781766l785609n30878J583740J820014J402170K077599L908121M519886
$$ -8781766 -12567375 -13098253 -11514513 -9694499 -8292329 -6214730 -2306609 2213277
11633B213277J876165k234484l565072q63283K293318K278288j72438k020282
$$ 2213277 4089442 1854958 -1710114 -2573397 -280079 1998209 1825771 -194511
11625a94511k309321k030176j039681J759291N214677N741170J625353l975020
$$ -194511 -2503832 -4534008 -5573689 -3814398 1400279 7141449 8766802 4791782
11617D791782n852540k343900K812337M455334J332441l099677m888404l373922
$$ 4791782 -1060758 -3404658 -592321 3863013 5195454 2095777 -2792627 -6166549
11609f166549l68136K670615M810443M345236M60277l746730l364588J715431
$$ -6166549 -6534685 -3864070 946373 5291609 5751886 2005156 -1359432 355999
11601C55999N283690K432357l594176n478304j469919K860496K539947q78096
$$ 355999 5639689 8072046 4477870 -1000434 -2470353 390143 2930090 2051994
11593B051994k743019j768122o20755j397307k819828j996952K019114O503381
$$ 2051994 -691025 -2459147 -3079902 -4477209 -7297037 -9293989 -7274875 -771494
11585g71494P025308K142798m033452n831280k763137L64079P87150J294802L877640
$$ -771494 6253814 8396612 4363160 -1468120 -4231257 -3867178 -3080028 -1785226 2092414
11576B092414M382750j076489p479096o201817J671330N737535J787749j828871
$$ 2092414 6475164 5398675 -2080421 -8282238 -6610908 -873373 914376 -914495
11568i14495J942715O844482L123552o340941r685402l548450L047197K763620
$$ -914495 1028220 7872702 10996254 4655313 -5030089 -8578539 -5531342 -2767722
11560b767722j153441k562686j343846n63687l48794R00145K663018L295252K554251
$$ -2767722 -3921163 -6483849 -7827695 -8391382 -8740176 -7840031 -5177013 -1881761 672490
11551F72490R23095j227317k520196j528980K53515j12563j887700j306346J742570
$$ 672490 1595585 368268 -2151928 -3680908 -3427393 -3539956 -5427656 -6734002 -4991432
11542d991432K888897Q41247L9603K887795N028113K390339k088888l439520k005937
$$ -4991432 -2102535 -1261288 -1221685 1666110 6694223 9084562 6995674 3556154 1550217
11533A550217r69047m97560M19507j21114l487912n814497k708133L279970N669793
$$ 1550217 581170 83610 503117 382003 -3105909 -8920406 -11628539 -8348569 -2678776
11524b678776L253712P49214R80469J751605O65166j495938k900070k924317j911284
$$ -2678776 574936 1324150 2304619 4056224 4721390 3225452 325382 -2598935 -4510219
11515d510219q85802r54157j215566R55334N354042P275084L585591j996838l467643
$$ -4510219 -5396021 -6350178 -7565744 -6610410 -1256368 6018716 9604307 7607469 4139826
11506D139826l63704K774154K971077J060293j108075k165922j289083L86123
$$ 4139826 3776122 6550276 9521353 10581646 9473571 7307649 6018566 6404689
11498F404689J94238j959657k778112j085832q1116j248582j247999J172729J276095
$$ 6404689 6598927 4639270 1861158 775326 694210 -554372 -1802371 -629642 646453
11489F46453l075303n392258o21834M861408K662241l414340l524799J601999
$$ 646453 -2428850 -7821108 -8442942 -3581534 -919293 -4333633 -7858432 -6256433
11481f256433K617774j585712k187394L453657O804440K605674k949757l107219
$$ -6256433 -3638659 -5224371 -7411765 -3958108 2846332 5452006 2502249 -604970
11473f04970o1328J404817J504954J621442J35996k969091l619771k29534K851114
$$ -604970 -666298 738519 2243473 3864915 4000911 1031820 -2587951 -2817485 33629
11464C3629K182051L4260o98685o08450j81259J629137K898542j45040n099503
$$ 33629 2215680 2249940 1551255 942805 761546 2390683 5289225 5144185 44682
11455D4682m564922J637838M458551K5682l633464j78792M445828K786475j663506
$$ 44682 -4520240 -2882402 1576149 1601831 -2031633 -2210425 2235403 5021878 3358372
11446C358372k081720o51396k779079n274665j726853M763367N823908J908766
$$ 3358372 1276652 625256 -2153823 -7428488 -9155341 -4391974 1431934 3340700
11438C340700O98723L097619K443444k358362m330463q40015J889478k12479k771075
$$ 3340700 4039423 7137042 9580486 7222124 2891661 2051646 3941124 3728645 957570
11429I57570j671785J41094n64643q17984K482045N539591L148035k364062m002267
$$ 957570 -714215 -573121 -1137764 -1955748 526297 6065888 9213923 6849861 2847594
11420B847594j81991L697990L363995N17557j150026q78312p5495N90055J003251
$$ 2847594 2665603 6363593 9727588 10245145 9095119 8216807 8141312 8731367 9734618
11411I734618J24258k568477m658252k876097J629239L284569m64103m636447
$$ 9734618 9858876 7290399 2632147 -243950 1385289 4669858 4205755 -430692
11403d30692l285995J693812L384538L85847j623451M55620K481358O63949k252999
$$ -430692 -3716687 -2022875 1361663 1747510 124059 579679 3061037 3724986 1471987
11394A471987k450455j474790k216893k755151j4974L566998L182063n33509k770909
$$ 1471987 -978468 -2453258 -4670151 -7425302 -7440276 -3873278 -691215 -1224724 -3995633
11385c995633k257949j720594j538491O34491L752320L477304n4890q09038L878569
$$ -3995633 -6253582 -7974176 -9512667 -8878176 -5125856 -1648552 -1703442 -2512480 1366089
11376A366089Q050535N421019j177434l920832j286501N77781k276649n872413
$$ 1366089 9416624 14837643 13660209 9739377 8452876 9030657 6754008 881595
11368H81595m794346m00210J450090r31109l145601j723653J159581J916569J049023
$$ 881595 -3912751 -4312961 -2862871 -3793980 -6939581 -8663234 -7503653 -5587084 -4538061
11359d538061J236499K260123J697425m10377j429970m37628Q23993J355840J953360
$$ -4538061 -3301562 -1041439 655986 245609 -1184361 -1621989 -797996 557844 2511204
11350B511204K550668J705005o93308k913809l853586l518965j555531J595011
$$ 2511204 5061872 6766877 6073569 3159760 -693826 -4212791 -5768322 -4173311
11342d173311K939743L65565k848174j711490K582917L881112M68392k702032
$$ -4173311 -1233568 -868003 -3716177 -5427667 -2844750 1036362 1504754 -1197278
11334a197278k216425m03458M63293J752337L563939K522680j888875m465007
$$ -1197278 -3413703 -3817161 -3353868 -1601531 1962408 4485088 2596213 -1868794
11326a868794j853523J981946K012470o71144j955508q03644J445840L792610
$$ -1868794 -3722317 -1740371 272099 -399045 -2354553 -3158197 -1712357 2080253
11318B080253M412748J276142l264753l769119k70141R35772j820771j924761
$$ 2080253 6493001 7769143 4504390 735271 465130 1400902 -419869 -2344630
11310b344630L565383P152976L011584k705639k370149K53321j998813n858826
$$ -2344630 1220753 8373729 11385313 8679674 6309525 6562846 4564033 -1294793
11302a294793l835835J211157R29838k786777r73887N241948N354965j903971
$$ -1294793 -5130628 -3919471 -2989633 -5776410 -6750297 -1508349 3846616 1942645
11294A942645n239730N07270N788110K223847m396782m385220J302053M530159
$$ 1942645 -3297085 -2789815 2998295 5222142 825360 -3559860 -2257807 2272352
11286B272352K020697k785827n692354m489133O22466N588511N175748o4461l548267
$$ 2272352 4293049 1507222 -4185132 -8674265 -8051799 -2463288 2712460 2647999 -900268
11277i00268j658674J681751J804931l46129j458942q02826P61941K454709K289321
$$ -900268 -2558942 -877191 927740 581611 -877331 -1680157 -918216 1536493 3825814
11268C825814j200632m552991k467648L100031L928771j726248n180787n62016
$$ 3825814 2625182 -1927809 -4395457 -1295426 2633345 907097 -4273690 -4835706
11260d835706N609571M381557k395238o123968m106097o60203J137187J657870
$$ -4835706 773865 5155422 2760184 -3363784 -7469881 -8130084 -6992897 -5335027
11252e335027Q32398j426437k443786j83554K133104L62986l246474l006153J098566
$$ -5335027 -4502629 -5929066 -8372852 -8556406 -6423302 -6060316 -9306790 -12312943 -11214377
11243a1214377L481704J956721N03488K057883M028427L038407l1404k073281
$$ -11214377 -7732673 -5775952 -5272464 -3214581 813846 3852253 3820849 1747568
11235A747568j991316r12295n4370J12473k76977o85381q98055j333576j819943
$$ 1747568 -243748 -1156043 -1210413 -1097940 -1374917 -2060298 -2958353 -4291929 -6111872
11226f111872j037245J408242L490297L213196J578183J082977K100119K770269
$$ -6111872 -7149117 -5740875 -2250578 962618 2540801 3623778 5723897 8494166
11218H494166J744459q09970l941213n830865m457276o10851J463406o62518l424370
$$ 8494166 10238625 9428655 5487442 -343423 -4800699 -5411550 -3948144 -4610662 -8035032
11209h035032k062569J919066K877970M4121j226959J731204M493968K728145
$$ -8035032 -10097601 -8178535 -5300565 -5256444 -6483403 -4752199 -258231 2469914
11201B469914j107280k270785j171062j386772k744488j847202J404976L181702
$$ 2469914 1362634 -908151 -2079213 -3465985 -6210473 -8057675 -6652699 -3470997
11193c470997J975999O87445J423329K705575L322942M316650M898689J408910
$$ -3470997 -1494998 -807553 615776 3321351 6644293 10960943 15859632 17268542
11185A7268542n880972r606030m425731M134555O393704J766487j968437j446981
$$ 17268542 11387570 1781540 -2644191 1490364 7884068 9650555 7682118 6235137
11177F235137j245680l729942m392529q29174J864491N0454j269009K862828P464110
$$ 6235137 4989457 1259515 -3133014 -3962188 -2097697 -2047243 -3316252 -453424 7010686
11168G010686M883176k105117l891924J030222M184463O10385m479025m788492
$$ 7010686 11893862 9788745 5896821 6927043 11111506 11721891 7242866 2454374
11160B454374j324888J556662K509144J905982r44048n215577o730990k780252
$$ 2454374 1129486 2686148 5195292 7101274 6157226 941649 -5789341 -8569593
11152h569593L286955N567397K498381k031886l504156j086587K176961K631739
$$ -8569593 -5282638 284759 2783140 751254 -2752902 -3839489 -1662528 969211
11144I69211j01947k779309k759805j099451J93724J573985L465572K986139j832531
$$ 969211 867264 -1912045 -4671850 -5771301 -5577577 -4003592 -538020 2448119 615588
11135F15588o312129l921777L519256P180646L665809q42311r88854L23082j259391
$$ 615588 -5696541 -9618318 -6099062 1081584 4747393 3905082 2916228 3239310 1979919
11126A979919l695544k859100N5872J165088O09045J122390K293784J590933l94333
$$ 1979919 -1715625 -4574725 -4518853 -3353765 -2744720 -1622330 671454 2262387 1868054
11117A868054o79674Q85701J478954R4904j250181j105879k95863J7095n18846
$$ 1868054 1188380 2074081 3553035 3647939 2397758 1291879 996016 1013111 494265
11108D94265k045677l950154m015073n04789M722520P119698M062222k300811
$$ 494265 -1551412 -5501566 -9516639 -10021428 -5298908 1820790 5883012 3582201
11100C582201o910610o205854j195867L561217M589179K836224J483857J479297
$$ 3582201 -3328409 -9534263 -10730130 -7168913 -2579734 256490 1740347 3219644
11092C219644J385705P18677K92405l29767k102820l354674j578209J401928R56585
$$ 3219644 4605349 5324026 5616431 5286664 3183844 -170830 -1749039 -347111 609474
11083F09474k750550m140676r40866K312904K214629J785552L788660M756413
$$ 609474 -2141076 -6281752 -7222618 -4909714 -2695085 -909533 2879127 7635540
11075G635540J263149k902429k356670R76274J447926q52919j448570j59404q49184
$$ 7635540 8898689 5996260 3639590 4615864 6063790 5210871 3762301 3602897 2753713
11066B753713l361776l201135L65068K706717J441893m13069k79226N73542R87222
$$ 2753713 -608063 -3809198 -3444130 -737413 704480 291411 12185 585727 1572949
11057A572949J950093K846691Q52781l563495n308329j730028K983659L490674
$$ 1572949 3523042 6369733 7222514 3659019 -1649310 -3379338 -395679 3094995
11049C094995L3763l363365m362657k996592L64569M386465N993478L445434p55860
$$ 3094995 3128758 -234607 -4597264 -7593856 -7229287 -2842822 3150656 6596090 5840230
11040E840230k494377q98746J237866J164897j169117l477715l134147L09316
$$ 5840230 3345853 2447107 3684973 4849870 3680753 203038 -2931109 -2621793
11032b621793L908067L910336K60017l029322k820298l98856J028980N22573m99171
$$ -2621793 1286274 5196610 5456627 2427305 -392993 -791849 237131 759704 260533
11023B60533q25124k94900R10315K147050K170412N08201j583901k575545k294675
$$ 260533 -564591 -859491 50824 2197874 4368286 4876487 3292586 717041 -1577634
11014a577634j187487Q02500L115673L550361O82527l025444l128362R62760M228999
$$ -1577634 -2765121 -1962621 1153052 4703413 5385940 2360496 -767866 194894 4423893
11005D423893J964648l835858o510908l084039K105441L343560O13464j841492
$$ 4423893 6388541 2552683 -3958225 -7042264 -4936823 -1593263 -979799 -2821291
10997b821291k175949k236477k625985j159243K312681L982451J911178L7410
$$ -2821291 -4997240 -7233717 -9859702 -11018945 -8706264 -4723813 -2812635 -2775225
10989b775225K431296O472921O472885K117201j827531l057951l474957l736369
$$ -2775225 -343929 6128992 12601877 14719078 12891547 9833596 6358639 2622270
10981B622270j996260J036253J582049p54476j448647J392661L201970L08994
$$ 2622270 626010 1662263 3244312 2489836 1041189 2433850 5635820 5944814
10973E944814l643437l325501L379J144618p44318k026375j217153l29941k15667
$$ 5944814 2301377 -1024124 -1020745 123873 -620445 -2646820 -3863973 -4193914 -4409581
10964d409581L66098J045994K7109j605734n08764K910939L732038k60680m678920
$$ -4409581 -4043483 -2997489 -2970380 -4576114 -5084878 -2173939 1558099 1297419 -3381501
10955c381501m585484j152873J001703P30147P83608K331245K906454O58164k063028
$$ -3381501 -7966985 -9119858 -8118155 -7388008 -6604400 -4273155 -1366701 -708537 -2771565
10946b771565j432102K364196M569835J827158k742715k971848J777199M816515
$$ -2771565 -4203667 -1839471 2730364 4557522 1814807 -1157041 620158 5436673
10938E436673J013116n535934o588732q42921M802382M873423J331392j168211
$$ 5436673 6449789 913855 -5674877 -6517798 -1715416 3158007 4489399 3321188
10930C321188j467042j070138p39218o48428j353333k278336j527731R20722K400396
$$ 3321188 1854146 784008 44790 -603638 -1956971 -4235307 -5763038 -4842316 -2441920
10921b441920J695026R43400J426798J127864p73028j035334K098719M374402
$$ -2441920 -746894 196506 1623304 2751168 1978140 942806 3041525 7415927
10913G415927J567849l198594m050909j669847j242480k799594j373066L189801
$$ 7415927 8983776 5785182 1734273 64426 -1178054 -3977648 -5350714 -2160913
10905b160913M692645R01384k090269N28004M587650L647191j326150m219631
$$ -2160913 2531732 3433116 1342847 1870851 6458501 10105692 8779542 4559911
10897D559911k603213O81245K802647L282345K046902r64224m318685n828464
$$ 4559911 1956698 2637943 5440590 8722935 10769837 9805613 5486928 -341536
10889c41536m745942j870045J529679L592678K366469j576342m307178k440263
$$ -341536 -5087478 -6957523 -5427844 -1835166 531303 -1045039 -5352217 -7792480
10881g792480K744224O527235N598259R17317l459748m018277j171224J208478
$$ -7792480 -5048256 1478979 7077238 7994555 4534807 516530 -654694 553784
10873E53784Q06049M1868J728889L514563J271099l134625l692297j98089P87932
$$ 553784 1359833 1401701 3130590 6645153 7916252 4781627 1089330 891241 1679173
10864A679173l018818n193594j265249L361255K074361k341853k919963K11433
$$ 1679173 -1339645 -6533239 -7798488 -4437233 -2362872 -4704725 -7624688 -7413255
10856g413255J528340N1394k77076J480897K318433J527132J263794J426723K16974
$$ -7413255 -5884915 -5833521 -6110597 -4629700 -2311267 -784135 479659 1906382 2123356
10847B123356q18025J232075M031991K277729l096723n050087j090954K934299
$$ 2123356 1305331 2537406 6569397 8847126 5750403 700316 -390638 2543661
10839B543661J919274j680117k880681q96140K001535L903699K993552j867246
$$ 2543661 4462935 2782818 -97863 -994003 1007532 4911231 7904783 6037537
10831F037537p658577q360715k402570M568707O824697M843628K050152n59432
$$ 6037537 -1621040 -9981755 -12384325 -7815618 -990921 3852707 5902859 5343427
10823E343427l006884l190079K61533M002378L256178j552348m985699l461876
$$ 5343427 2336543 -853536 -592003 3410375 6666553 5114205 128506 -3333370
10815c333370P51843K880817J136161j869175k343315O49328M350375N292084
$$ -3333370 -2581527 299290 1435451 -433724 -2777039 -2127711 2222664 7514748
10807G514748K640451j539347m415710m336111j927176N968p48980k399388r47466
$$ 7514748 10155199 8615852 4200142 -135969 -2063145 -2057177 -2806157 -5205545 -6153011
10798f153011L361659M949002J006576l187056j644091K876345K961454j697735
$$ -6153011 -2791352 2157650 3164226 -22830 -1666921 1209424 4170878 2473143
10790B473143l758544L00402M997579M177868j010457n184269n499991k651154
$$ 2473143 -1285401 -984999 4012580 8190448 7179991 1995722 -3504269 -6155423
10782f155423J472560M439826M069229Q15663k222539k825210j621983k90663
$$ -6155423 -4682863 -243037 3826192 4641855 2419316 -405894 -2027877 -2318540
10774b318540J72552o28000k072205k209980j8911K686935L732157L440632K538511
$$ -2318540 -2145988 -2773988 -4846193 -7056173 -7075084 -4388149 -655992 2784640 5323151
10765E323151j39319m130324m848672q1953M144147J331299m310624l251245L862693
$$ 5323151 5183832 1053508 -3795164 -3877117 267030 1598329 -2712295 -5963540 -2100847
10756b100847O342028L30756n125876k754692K116640J575047k187474j958687
$$ -2100847 4241181 4571937 -553939 -3308631 -1191991 383056 -1804418 -3763105
10748c763105K262867M086763Q97354l380131m288949j054464L792020N893688
$$ -3763105 -1500238 2586525 3483879 103748 -4185201 -5239665 -1447645 4446043
10740D446043K395161l682580n466825j132555L071371J689397k365874l055353
$$ 4446043 6841204 3158624 -2308201 -3440756 -369385 1320012 -1045862 -4101215
10732d101215o699K626335K887848J778380j94182k524718k769183L81078L588712
$$ -4101215 -4107914 -1481579 1406269 3184649 2990467 465749 -2303434 -1922356 1666356
10723A666356K675571j187211l065207j272162R71676P21063j155207k126935
$$ 1666356 4341927 3154716 89509 -1182653 -210977 510086 -645121 -2772056
10715b772056j344573J5344N70531K05239j23500K56670J211716K593491L920280
$$ -2772056 -4116629 -4101285 -3530754 -3325515 -3449015 -3192345 -1980629 612862 4533142
10706D533142K984863k046537p658543o642991J674645P787096M273223l066167
$$ 4533142 7518005 5471468 -2187075 -8830066 -7155421 631675 4904898 1838731
10698A838731m072594J41987O53306l075020k920011K140606L426486j536811
$$ 1838731 -2233863 -2091876 -1438570 -4513590 -7433601 -5292995 -1866509 -3403320
10690c403320l722644J565780N965371K433282k759976j324282L198409K817002
$$ -3403320 -7125964 -5560184 405187 2838469 78493 -1245789 1952620 4769622
10682D769622j211562k310204m27465n9086r38218K1571J246635l66047k310669
$$ 4769622 3558060 1247856 820391 761305 -176913 -155342 1091293 725246 -1585423
10673a585423p83596J294453r78233m877267m017980N30373K151647J79251L22950
$$ -1585423 -2369019 -1074566 -2052799 -6930066 -10948046 -10417673 -8266026 -8086775 -7763825
10664g763825L769335M629275j75614n653841n811818r52985M127070N671336
$$ -7763825 -3994490 634785 459171 -5194670 -11006488 -11959473 -7832403 -2161067
10656b161067L291291p17489l448072l760011k238667Q73777M928561O279907
$$ -2161067 1130224 412735 -3035337 -6795348 -9034015 -8160238 -3231677 3048230
10648C048230J528262n467221o098291P52949N784931K719003k438446j490768
$$ 3048230 4576492 -890729 -6989020 -6236071 -451140 2267863 -170583 -1661351
10640a661351L214405L851349j3666k056704O4586K309678J400542j591268l943008
$$ -1661351 1553054 5404403 5390737 3334033 3398619 5708297 7108839 5517571 1574563
10631A574563l492138P4680L290037J642080l190308l969178J036799M230218
$$ 1574563 -1917575 -1842895 1447142 3089222 -101086 -4070264 -3033465 1196753
10623A196753N83905l962572k473435J714364J784524o19552N21553M153586M297417
$$ 1196753 1780658 -2181914 -4655349 -2940985 -1156461 -1776013 -1254460 2899126 7196543
10614G196543P34725j283461k02803O30800m23357j871187k799603k983144j520314
$$ 7196543 7931268 6647807 6445004 7075804 6652447 4781260 1981657 -1001487 -2521801
10605b521801O60080N27272j403868n32726L134194L076544k229249m745924l52859
$$ -2521801 -1861721 -1334449 -2738317 -3271043 -136849 2939695 710446 -4035478 -4388337
10596d388337K862929j432097n469099l91397P147855N024889m096695o998149
$$ -4388337 -1525408 -2957505 -8426604 -8818001 -1670146 3354743 -741952 -7740101
10588g740101o34228N232402M330722L57649k126524k574842q20353K440226K984257
$$ -7740101 -8374329 -3141927 1188795 1546444 -580080 -3154922 -3975275 -1535049 1449208
10579A449208j214019m529332j787060K461123J388617k231338j171187L777818
$$ 1449208 235189 -4294143 -6081203 -3620080 -2231463 -4462801 -5633988 -1856170
10571a856170O235997M941523K901949N33814j849780o91304L239123J753768
$$ -1856170 4379827 9321350 12223299 12757113 10907333 10216029 13455152 15208920
10563A5208920o945869j1020108k872539O345738L860423l823875l346921K224564
$$ 15208920 8263051 -2757057 -5629596 716142 4576565 752690 -2594231 -369667
10555c69667J080164m654004l788396K538263M140370J467061K522873M798160
$$ -369667 710497 -3943507 -7731903 -5193640 -1053270 413791 2936664 7734824
10547G734824L9369p148626n477082K041909L253474j002220m30626L292760L93831
$$ 7734824 7774193 625567 -4851515 -2809606 443868 -558352 -988978 2303782 2697613
10538B697613n484246k465756N772768M881395l631592m756334K445171L991123
$$ 2697613 -2786633 -5252389 520379 5401774 1770182 -2986152 -540981 3450142
10530C450142k678342n658729j938411k23402r28489L094425P484178K414517
$$ 3450142 771800 -4886929 -6825340 -7048742 -7977231 -4882806 2601372 5015889
10522E015889n179082j368446O885488K198107r491485p496164N155456O577382
$$ 5015889 -163193 -1531639 5353849 7551956 -1939529 -9435693 -4280237 2297145
10514B297145l275577l984350M632005K827582q039390o588557N435723N192444
$$ 2297145 -978432 -4962782 -330777 2496805 -5542585 -12131142 -6695419 -1502975
10506a502975m861087l62793J3654879P978505j1283560p960906J3681786J0823458
$$ -1502975 -6364062 -6726855 6928024 14906529 3622969 -4337937 9343849 20167307
10498B0167307j5387391j5146871J5092424J8805713j2542558j4780139K3918233
$$ 20167307 4779916 -10366955 4725469 23531182 10988624 -3791515 20126718
10491B0126718K4223911l0193698k0687910J13081853K16557232J13004548j15211033
$$ 20126718 44350629 14156931 -6530979 106550874 323108106 436112654 320901621
10484C20901621k15248991j10704635J9739275K6138035k8045480k6001651J4613681
$$ 320901621 105652630 -5052005 14687270 40825305 12779825 -13221826 1391855
10477A391855J5435151j3448243j1825036J3042562J1220947j1593560j1104961
$$ 1391855 16827006 3378763 -8446273 4596289 15817236 4223676 -6881285
10470f881285R840295J1637608o348121j0061226L415587N955071n453112p236232
$$ -6881285 2959010 14596618 8248497 -1812729 1602858 7557929 2104817 -5131415
10462e131415K872800M732343k776846k161626N854024M799978l411039k676863
$$ -5131415 -2258615 2473728 -303118 -2464744 3389280 8189258 4778219 2101356
10454B101356M596609K751680n289055l965342L545329J806897n358559j676911
$$ 2101356 6697965 9449645 4160590 195248 3740577 5547474 188915 -1487996
10446a487996Q839739P679387m009868q135589k964232k845272p370749k205363
$$ -1487996 7351743 15031130 11021262 2885673 -78559 -2923831 -10294580 -12499943
10438a2499943R887182J0082118k448753p456173J358283O766827l82335o728201
$$ -12499943 -2612761 7469357 5020604 -2435569 -1077286 5689541 5307206 -1420995
10430a420995k027344M457162K940705j487109j817070n97149n53562J388485
$$ -1420995 -3448339 1008823 3949528 2462419 645349 48200 -505362 883123
10422H83123M601719L162317j875865k405691J539445J031867m749727o129891
$$ 883123 5484842 8647159 6771294 4365603 5905048 6936915 2187188 -3942703
10414c942703o01247K706135j22604j914979N09541P76944k816968k753537K567676
$$ -3942703 -4543950 -1837815 -1960419 -3875398 -3365857 -2588913 -5405881 -8159418 -5591742
10405e591742M007218j758506n262805q70204L480689J147045j709164J347090
$$ -5591742 -1584524 -3343030 -8605835 -9476039 -5995350 -4848305 -6557469 -5210379
10397e210379M767761J524112l900008l528564P59024J970940J29407K33962K505502
$$ -5210379 -442618 1081494 -2818514 -6347078 -5588054 -3617114 -3487707 -3253745 -748243
10388g48243L134512J726942Q84266O63587o05441j836487n75939K313937L264175
$$ -748243 2386269 4113211 4997477 5661064 5055623 3219136 2643197 4957134 8221309
10379H221309P09347l131725m637238k180148J849305K946099J13493k118187
$$ 8221309 8930656 5798931 1161693 -1018455 830850 3776949 3890442 1772255
10371A772255r0934L090256K333145j392194l302417k793750k717630k558421
$$ 1772255 1681321 4771577 7104722 5712528 2410111 -383639 -3101269 -5659690
10363e659690K88273L544151K315142j847116k251005J932766M044697P34564
$$ -5659690 -5371417 -1827266 487876 -1359240 -3610245 -1677479 2367218 3101782
10355C101782l410292m085675k715890j153277J999769O514879Q095822M348784
$$ 3101782 -308510 -4394185 -7110075 -8263352 -6263583 251296 8347118 12695902
10347A2695902j470769n154765n656001l218451J409807M595310K351829l055714
$$ 12695902 11225133 6070368 414367 -2804084 -1394277 3201033 5552862 2497148
10339B497148m717069r85382K208199R30775j268592l46889J897040K196512J244126
$$ 2497148 -2219921 -3205303 -997104 -66329 -1334921 -1681810 215230 2411742 3655868
10330C655868Q10426m5440k019104k707194l77742K671838L607391K776099J365726
$$ 3655868 4466294 4420854 2401750 -305444 -683186 1988652 5596043 8372142 9737868
10321I737868j147693m405495n412778k529627J403815K622617Q65662j727732
$$ 9737868 8590175 4184680 -1228098 -3757725 -2353910 268707 1134369 -593363
10313e93363l620394l964678k286273K09225J401272J387504K053690K943160
$$ -593363 -4213757 -8178435 -10464708 -10255483 -8854211 -7466707 -5413017 -2469857
10305b469857J410517k022071k913256M71365M019269L797292J282093k54187
$$ -2469857 -1059340 -3081411 -5994667 -5523302 -1504033 2293259 3575352 3321165
10297C321165p77594j576296j673685Q7008J909832J564216N340o67329p95953
$$ 3321165 2543571 967275 -706410 -619402 1290430 2854646 2859986 2192657 1396704
10288A396704j551154j801386n5452K139558K245681Q21299R6091k31088j895271
$$ 1396704 -154450 -1955836 -2011288 128270 2373951 3195250 3291341 3060253 1164982
10279A164982l685432k574687P73089K217274Q42858P32516L717746M996239L86238
$$ 1164982 -2520450 -5095137 -4322048 -2104774 -1261916 -529400 3188346 8184585 8570823
10270H570823n390603l965442L884873P600279J210828p748612q341491q51823
$$ 8570823 3180220 -785222 3099651 10699930 11910758 4162146 -4179345 -5031168
10262e031168M895275L469967q91332k727322k070648r57200N99094K080142J014379
$$ -5031168 -135893 3334074 2442742 -284580 -2355228 -3312428 -2713334 -633192 381187
10253C81187k375930l466164j4516L413747K169341j074232q00082K407958L186569
$$ 381187 -1994743 -5460907 -5475423 -2061676 107665 -966567 -1766649 641309 3827878
10244C827878l8777l526143m564287m002563k478253P55559M362002M737363R69955
$$ 3827878 3789101 262958 -4301329 -8303892 -10782145 -10026586 -5664584 -927221 42734
10235D2734l124266l444088q872L917374N372598L885286J440017L39446M33191
$$ 42734 -3081532 -6525620 -6534492 -2617118 2755480 6640766 8080783 8420229 8853420
10226H853420m63882k664091l442008j487843L20703n51176j788664j32958K552693
$$ 8853420 8389538 5725447 2283439 795596 1116299 565123 -1223541 -1356499 1196194
10217A196194J921970j525219k947071p37340J447044R21284l77656J8278J234570
$$ 1196194 3118164 1592945 -1354126 -2091466 -644422 276862 -100794 -82516 1152054
10208A152054J354142P25245O70524O76227q81696l709366m921858k125487L041738
$$ 1152054 2506196 3231441 3901965 4578192 3696496 -12870 -4934728 -7060215 -4018477
10199d018477N636492K978254j501971k503526k47964L43583j912341k202653
$$ -4018477 1618015 4596269 3094298 590772 342808 686391 -1225950 -3428603
10191c428603J937140N581845L784872p67318k566364j750614j874536k426929
$$ -3428603 -1491463 4090382 7875254 7107936 4541572 2790958 916422 -1510507
10183a510507k96936L140741L242908j01169k079673n96264J173857M76680j463578
$$ -1510507 -1807443 1333298 4576206 4475037 2395364 1799100 2972957 3449637 1986059
10174A986059k282215j146550J479862L619403K479165j227085k076302K279482
$$ 1986059 -296156 -1442706 37156 3656559 6135724 4908639 2832337 5111819
10166E111819N299618L38270p426483o952120J424160N234871j222795p759713
$$ 5111819 10411437 10749707 3323224 -3628896 -2204736 3030135 1807340 -5952373
10158e952373l834295N498672P588679O67324n044682k809680K685715L950710
$$ -5952373 -9786668 -4287996 3300683 3968007 -1076675 -3886355 -1200640 2750070
10150B750070N75021k424429j942742Q94723L576211M310518K261989j521026
$$ 2750070 3325091 900662 -1042080 -147357 3428854 7739372 10001361 8480335
10142H480335l595920j416030K264249J582201l936135o798111j501994O115756
$$ 8480335 4884415 3468385 5732634 7314835 3378700 -3419411 -4921405 1194351
10134A194351N792005k404904q026658n531462r05822m1213M09795M556928P589152
$$ 1194351 6986356 4581452 -3445206 -8976668 -9882490 -9923703 -9513908 -4956980 2632172
10125B632172L129999m954010p226834k288794K647580K984245Q42130q72535
$$ 2632172 5762171 808161 -6418673 -8707467 -6059887 -3075642 -2233512 -3106047
10117c106047j422104j08579K525702K669088j525830m767956j472720M510389
$$ -3106047 -4528151 -4636730 -2111028 558060 -967770 -5735726 -7208446 -2698057
10109b698057M812980o05852m018679k283415K19464P11612J057602J238117j199357
$$ -2698057 2114923 1509071 -2509608 -4793023 -4573559 -3861947 -2804345 -1566228 -2765585
10100b765585m068725j836762M379246O876072L435292M80028J631433K218093
$$ -2765585 -6834310 -8671072 -4291826 2584246 6019538 6499566 8130999 10349092
10092A0349092j098459l944773k355159K76069l14069k101213j325387R58567
$$ 10349092 9250633 5305860 2950701 3226770 2912701 811488 -513899 444668
10084D44668J528653l9463k501791m887621n019922r37949M395564N311677J848662
$$ 444668 1973321 1933858 -567933 -5455554 -10475476 -11413425 -7017861 -1706184 142478
10075A42478k93654O25763L93906j921765j638252J752325J941922k776587n044706
$$ 142478 -151176 474587 868493 -1053272 -2691524 -939199 1002723 -1773864 -6818570
10066f818570r02305K836614N31873k230625J018257N555303L572827k265585
$$ -6818570 -7720875 -4884261 -4352388 -6583013 -5564756 -9453 3563374 1297789
10058A297789l712536l81079J842998J892024K991584L985364J048675l711112
$$ 1297789 -2414747 -2795826 -952828 939196 3930780 7916144 8964819 5253707
10050E253707m499590j459746L61868L49309K013119M249192J967068m045137
$$ 5253707 754117 -705629 -343761 5548 2018667 6267859 8234927 4189790
10042D189790o467427k401303K485064L080614J530415J814473L044717J946334
$$ 4189790 -2277637 -4678940 -2193876 886738 2417153 4231626 7276343 9222677
10034I222677j312510l276489j987336M90292N59971k086825l149528O33432N336077
$$ 9222677 7910167 4633678 2646342 3136634 3696605 1609780 -1539748 -906316 4429761
10025D429761L937333k840276o091376j792682K872456J267415j933732N57816
$$ 4429761 8367094 5526818 -564558 -2357240 515216 1782631 -151101 406715
10017D06715N358629L816372l105692o219411k925907J35427m33625k62418K612026
$$ 406715 5765344 9581716 6476024 256613 -2669294 -2533867 -2967492 -3229910 -617884
10008f17884L006542j680099n304030k172186L726515M668462K65840l137383
$$ -617884 2388658 708559 -4595471 -6767657 -3041142 1627320 1893160 -1244223
10000a244223j821123J585746K986171J563907p75091k349626k911791k456224
$$ -1244223 -3065346 -1479600 1506571 3070478 2295387 -54239 -2966030 -5422254
9992e422254j54719M007238O961106M920179r03677m432718k777825k72983j098666
$$ -5422254 -5576973 -1569735 5391371 10311550 9407873 4975155 2197330 1924347 825681
9983H25681k228923R69240N804874N870308J456634j140456l1885J79871k618862
$$ 825681 -1403242 -434002 5370872 11241180 12697814 11557358 11525473 11705344 9086482
9974I086482m409583k479289q2234p29299k867900l152782j045453K095658M905974
$$ 9086482 4676899 2197610 2115376 1386077 -1481823 -4634605 -5680058 -3584400 1321574
9965A321574N394794K225211k005402k718333J64745J886273J35308k101627k448038
$$ 1321574 6716368 8941579 6936177 4217844 4382589 6268862 6404170 4302543 1854505
9956A854505k528160l037589r61892M481177P871051M402528k497377n187907
$$ 1854505 -673655 -3711244 -4673136 -191959 7679092 12081620 9584243 4396336
9948D396336j615632L078051L712211L17743l421167m385410k518895l27625J17373
$$ 4396336 2780704 5858755 9570966 9888709 6467542 2082132 -436763 -764388 -647015
9939f47015n60759p90200q45484j332852l18197L737276P025441M185814k531125
$$ -647015 -1207774 -1997974 -2843458 -4176310 -4494507 -757231 6268210 10454024 7922899
9930G922899m643641J08870L992365J517089k177730q85477J939917N1482l799733
$$ 7922899 3279258 3388128 7380493 8897582 6719852 5834375 7774292 7825774 4026041
9921D026041k833113Q00404p46122o193990n629224K580015P327409J941601m979429
$$ 4026041 1192928 1993332 1247210 -4946780 -10576004 -7995989 -668580 1273021 -3706408
9912c706408l297009L049626L814479n93195j328978K812004L611998j659657
$$ -3706408 -7003417 -3953791 -139312 -732507 -2061485 750519 4362517 2702860
9904B702860m798301p2529O011856M506177k703381o384133l134226J640253K527256
$$ 2702860 -2095441 -2167970 3843886 8350063 5646682 -737451 -3871677 -2231424 295832
9895B95832J71249j661957j039686Q81791J439224o29293k909969j717445K138209
$$ 295832 467081 -1194876 -2234562 -1352771 86453 -542840 -3452809 -5170254 -3032045
9886c032045L387897L94419j283357K311693N816607K218128n312875p593235
$$ -3032045 355852 750271 -533086 1778607 7595214 9813342 4500467 -3092768
9878c092768l592832j073926l142534m260052j688738n08352k810638j881441
$$ -3092768 -6685600 -7759526 -10902060 -15162112 -16850850 -17359202 -20169840 -22051281
9870b2051281N967838J2379176Q557756o41028l983711n65546J139656j760962
$$ -22051281 -16083443 -3704267 4853489 4212461 228750 -336796 802860 -958102
9862i58102l373578n86580K203819J799643J152457K734995L968078K579340P68244
$$ -958102 -4331680 -4918260 -2714441 -914798 237659 2972654 6940732 9520072 10288316
9853A0288316O18853J55511k617553n647908n987268l850687r32158K199132M510292
$$ 10288316 10907169 11062680 8445127 2797219 -3190049 -7040736 -7972894 -5773762 -1263470
9844a263470L565925o97801l854225k076864K307699L681943O94487k274429j436977
$$ -1263470 2302455 1604654 -2249571 -4326435 -2018736 1663207 2357694 83265 -1353712
9835a353712J395473J734183j084757k813638l25273L560775L788361L53513j899006
$$ -1353712 41761 1775944 691187 -2122451 -2447724 1113051 4901412 5254925 3355919
9826C355919q76804n1116j941383l541348j575236J873707L211264L035561L125658
$$ 3355919 2479115 2427999 486616 -3054732 -4629968 -2756261 455003 3490564 6616222
9817F616222J490699l451017o932252l483852L361077M959491M07290k806536
$$ 6616222 8106921 4655904 -2276348 -5760200 -2399123 2560368 2967658 161122
9809A61122j246405K68331j222218j505334K108816M814437K403786j213096o47657
$$ 161122 -1085283 -816952 -2039170 -3544504 -1435688 3378749 5782535 4569439 3921782
9800C921782J989899J230804k360031l448994m80413K782673L222434J292251
$$ 3921782 5911681 7142485 4782454 1333460 853047 3635720 6858154 8150405
9792H150405j283824l107542l149507j919997j371048j609175j45947L148538
$$ 8150405 6866581 3759039 609532 -1310465 -2681513 -4290688 -4436635 -1288097
9784a288097L790271p57880n527372m264023R95896K600592j220175l915701q34348
$$ -1288097 2502174 1744294 -3783078 -8047101 -7051205 -4450613 -5670788 -9586489 -10420837
9775a0420837L941613M070507J08886k031536J22691K664368J481881k016195
$$ -10420837 -6479224 -2408717 -2299831 -4331367 -4208676 -1544308 -62427 -2078622
9767b078622l356080j277040J343153K398346K940163L581577K297643j235769
$$ -2078622 -5434702 -6711742 -5368589 -2970243 -30080 3551497 5849140 4613371
9759D613371k544540J586847O273599L980560l860703p689121l398595K112095
$$ 4613371 2068831 3655678 9929277 13909837 10049134 2360013 -1038582 1073513
9751A073513J938534j148197r03194K112382K678112k33604k923068l226679j989530
$$ 1073513 3012047 1863850 960656 3073038 5751150 5517546 2594478 -632201 -2621731
9742b621731J25737K515452K853770M6400k523146j262785J703325J758271o00551
$$ -2621731 -2495994 19458 2873228 2919628 396482 -866303 837022 2595293 1994742
9733A994742r41966J185607J566962j137914k946651j015484K317955L610461
$$ 1994742 1052776 2238383 3805345 2667431 -279220 -1294704 1023251 4633712
9725D633712K383702k42014l095353l892309o83446M047879M733321K02673l935081
$$ 4633712 7017414 6775400 3680047 -212262 -895708 3152171 7885492 8088165 4153084
9716D153084k874515Q47521J518994j625211l991806k192554J975807M147637
$$ 4153084 1278569 2126090 3645084 2019873 -1971933 -4164487 -2188680 1958957
9708A958957K341193j014119j775703R78758L547271K384526j043510k708773
$$ 1958957 4300150 3286031 1510328 2489086 6036357 8420883 7377373 4668600
9700D668600k083342j909392k371560m13833M012434N988980K555489k454318
$$ 4668600 2585258 675866 -1695694 -2109527 1902907 7891887 10447376 7993058
9692G993058l761454j649063k05629j105649k601949k858519j272227J794713
$$ 7993058 4231604 2582541 2376912 1271263 -1330686 -4189205 -5461432 -3666719
9684c666719M058708K394521k329747m300918k74268M797995M294875l42294k121519
$$ -3666719 391989 2786510 456763 -3844155 -4118423 679572 4974447 4632153 2510634
9675B510634P09058K938653J530792k88635J63587M08757j786642l593197j879984
$$ 2510634 3219692 6158345 7689137 7400502 7564089 7972846 6186204 2593007 713023
9666G13023J097658J276498p21637j266293p1328j94075k293726l188839p31144
$$ 713023 1810681 3087179 2365542 1099249 1027921 833846 -1459880 -4648719 -5379863
9657e379863L075246M817450L441520N25648j708842k105002j235892n50482m56128
$$ -5379863 -2304617 2512833 5954353 6480001 4771159 2666157 1430265 879783 423655
9648D23655M4240J248724J722446N92893o81016n99058j70169r23740j717652
$$ 423655 467895 1716619 3439065 4031958 3350942 2751884 2581715 1657975 -59677
9639e9677l73114K240306K823001L94612k298978k596370r09300O55775Q63394
$$ -59677 -432791 1807515 4630516 5025128 2726150 129780 -779520 -123745 739649
9630G39649K8189n71688J61991J660785J979145N87211n58180k63886k96687j847263
$$ 739649 767838 196150 358141 2018926 3998071 4585282 4027102 3763216 3466529 1619266
9620A619266k284937P23217L944904K400773k674672n069963k424391J671717
$$ 1619266 -665671 57546 4002450 6403223 3728551 -1341412 -3765803 -2094086
9612b094086M289047N792275N467467J409085l667858l638357J367617L588165
$$ -2094086 2194961 7987236 13454703 14863788 11195930 7557573 8925190 12513355
9604A2513355o72462n250413m413262j389324q25096k85009L147951M767126J24823
$$ 12513355 11840893 6590480 2177218 787894 -37202 -322211 2825740 7592866 7717689
9595G717689m752634j921835L992446K219112n515257o461621K207269P853134
$$ 7717689 2965055 1043220 5035666 7254778 1739521 -4722100 -2514831 5338303
9587E338303K151132o130372n446782J471068M068212M53800k481909j611911
$$ 5338303 7489435 1359063 -4087719 -2616651 1451561 1905361 -576548 -2188459
9579b188459p84564k393740l456641j171284K763584M758745L302751j78052k542781
$$ -2188459 -2973023 -5366763 -8823404 -9994688 -7231104 -2472359 830392 652340 -1890441
9570a890441j539333J243655J424694k339231n546273l547907J642233L646349
$$ -1890441 -3429774 -2186119 -761425 -3100656 -8646929 -12194836 -10552603 -6906254
9562f906254K31795l829414l069963J958448N801757M881431J326096n88235k79589
$$ -6906254 -6674459 -10503873 -13573836 -11615388 -5813631 -932200 393896 -194339 -473928
9553d73928o22693k155666j613402J804018L287527j49144l336729n47461L976103
$$ -473928 -1096621 -3252287 -4865689 -3061671 225856 76712 -3260017 -3807478 168625
9544A68625J905554m388773l879340M817075R006998J093510q622642o859388
$$ 168625 2074179 -2314594 -6193934 -1376859 7630139 8723649 101007 -6758381
9536f758381L295803Q343154M075387j782315l653636l739304l945431k204298
$$ -6758381 -3462578 4880576 8955963 7173648 3520012 -219292 -4164723 -6369021
9528f369021J513810L451924K305573R24986O75015K05743L29493L166360N617635
$$ -6369021 -4855211 -1403287 902286 1827272 2502287 2708030 3037523 6203883 11821518
9519A1821518J691679o510702q668044j190805N930990L416034l390964l271544
$$ 11821518 13513197 7002495 -1665549 -2856354 3074636 6490670 3099706 -171838
9511a71838L280472N337047j209085p696187n819765J437919N778992M532733
$$ -171838 3108634 8445681 7236596 -459591 -6279356 -4841437 937555 5470288
9503E470288J013650j938819l679965l250355j09136L130240K758270q83813l481777
$$ 5470288 6483938 4545119 865154 -2385201 -2494337 635903 3394173 2510360 -971417
9494i71417k471303J76120J536726J213398J84183r22319q91899J730248N192038
$$ -971417 -3442720 -3266600 -1729874 -516476 -332293 -1254612 -2146511 -416263 4775775
9485D775775M565312j498590o833818n066134J040567L018377j134467m465210
$$ 4775775 9341087 7842497 1008679 -4057455 -3016888 1489 -1132978 -5598188
9477e598188k023123K008934J680406j380179j331402K137958L470403K22595
$$ -5598188 -7621311 -5612377 -3931971 -5312150 -6643552 -4505594 -1035191 -812596
9469h12596l031144j544276K600965L464890k30334k999849r4004N421260O263018
$$ -812596 -3843740 -5388016 -2787051 677839 447505 -2552344 -2646348 2774912 9037930
9460I037930J011846l777057l261613j326118l480030o796980m067937L722560
$$ 9037930 10049776 6272719 3011106 1684988 -1795042 -8592022 -12659959 -8937399
9452h937399P468236L430357j595897j489807O34771k99079k457841j607637R78536
$$ -8937399 -1469163 1961194 365297 -1124510 -489739 -788818 -3246659 -4854296 -3875760
9443c875760J739910J568192K593005K204286k271988o202350l309601L266185
$$ -3875760 -2135850 -567658 2025347 4229633 1957645 -4244705 -7554306 -4288121
9435d288121M461720o06684l194314R61545M912090J581858n600196q270594m471818
$$ -4288121 173599 -433085 -3627399 -2665854 2246236 3828094 -1772102 -10042696 -14514514
9426a4514514P97694L434427L863950M077698M721954N094604M065237J085230
$$ -14514514 -13716820 -10282393 -6418443 -2340745 2381209 7475813 11541050 12626280
9418A2626280k798151n357497n078765k292921J254986L279326K254806r59232
$$ 12626280 9828129 4470632 -608133 -2901054 -1646068 1633258 3888064 2928832
9410B928832l604732m088053l217205j714888P90418K901328J478589k604802
$$ 2928832 -675900 -4763953 -7981158 -9696046 -8905628 -6004300 -4525711 -7130513
9402g130513l149891K378595O982585L690766k840616k744621L329186N057889
$$ -7130513 -10280404 -7901809 -919224 2771542 -69074 -2813695 515491 5573380
9394E573380p14062m813807q46005M513292K571690l730931n067521J77930M943979
$$ 5573380 4859318 45511 -800494 3712798 6284488 2553557 -2513964 -2336034 2607945
9385B607945M354602O95023j865003k116995j126156n14772j655012l938403m294340
$$ 2607945 6962547 7657570 5792567 3675572 2549416 2034644 379632 -3558771 -7853111
9376g853111q69328L533605M282485Q13053k676885k461214P13176L225759K842025
$$ -7853111 -8722439 -5188834 -906349 -93296 -2770181 -5231395 -4518219 -1292460 1549565
9367A549565O63113p77415o28578k16254o49945j505276k366751l495880l825759
$$ 1549565 2212678 1435263 806685 590431 -59514 -1564790 -3931541 -7427421 -11253180
9358a1253180j207126L222634M423542O28432k613218l78403L459743K525671
$$ -11253180 -12460306 -9237672 -4814130 -4185698 -6798916 -7177319 -3717576 -1191905
9350a191905j000493r2867M400869M665240n79786l927724k183523p44526k108007
$$ -1191905 -2192398 -2285265 2115604 6780844 6201058 2273334 89811 -654715 -2762722
9341b762722j037793L922501N032728j608409p560979m951722J012817J868779
$$ -2762722 -3800515 121986 5154714 3546305 -4014674 -8966396 -7953579 -6084800
9333f084800Q6898K518816O393377M133996k271730m077503l91723J766866M44347
$$ -6084800 -5997902 -3479086 2914291 7048287 4776557 699054 307331 2074197 2518544
9324B518544K66257J675887J45622l420511k692172K214058L635022n16171k937441
$$ 2518544 2784801 4460688 4606310 1185799 -1506373 707685 4342707 3826536 889095
9315H89095L52723L310291M56415m383759n165308k480269l52497Q4659m18158
$$ 889095 1241818 4552109 5008524 624765 -4540543 -7020812 -7373309 -7288650 -7706808
9306g706808j398936r32987K719706N761162K231725m997613n297846L690762
$$ -7706808 -9105744 -10038731 -7319025 -1557863 673862 -4323751 -9621597 -5930835
9298e930835J0355945N529682m093696o863911k950665p42220k172803k103707
$$ -5930835 4425110 9954792 5861096 -1002815 -3953480 -4695700 -6868503 -8972210
9290h972210P94494K556494K137182K396822L225779J441698k255461l159963
$$ -8972210 -8177716 -5621222 -3484040 -1087218 2138561 3580259 1324798 -1835165
9282a835165j8606L262941L797564K387923J19436k502220l311349p59486J882511
$$ -1835165 -1853771 1409170 5206734 7594657 7714093 5211873 1900524 1141038 3023549
9273C023549K11756l653823l228053K156190N682856K967904k268730m481586
$$ 3023549 3235305 -418518 -3646571 -1490381 4192475 7160379 4891649 410063
9265D10063l042533m32688J741543K611452J751068P93229J786520L043151R41711
$$ 410063 -2632470 -3065158 -1323615 1287837 3038905 3832134 5618654 8661805 9603516
9256I603516l331945m120179O4223L789267K918595L6342j219016j612657k461534
$$ 9603516 6271571 2151392 2215615 6004882 8923477 8959819 7740803 6128146 3666612
9247C666612j851576Q21314J672289j252195l278636n51789K653365R72639k066778
$$ 3666612 1815036 2636350 4308639 3056444 -222192 -773981 1879384 2852023 785245
9238G85245L51632N677035M825087k858301p638164m395135q320j335978m075293
$$ 785245 1136877 6813912 11638999 8780698 1142534 -3252601 -3260921 -4596899 -8672192
9229h672192m44469P448626R814145K920401o055347q444328l779617J382844
$$ -8672192 -9116661 -1668035 8146110 11066511 5011164 -3433164 -7212781 -5829937
9221e829937J697516j630997l167519m0330M513698N280775J650849k249743l399503
$$ -5829937 -4132421 -5763418 -8930937 -8971267 -4457569 823206 2474055 224312 -3175191
9212c175191k548322r20353J634110L889582L023517k86268o89318M145391Q205346
$$ -3175191 -5723513 -6643866 -5009756 -1120174 1903343 1617075 927757 5073148 13278494
9203A3278494M464815m660607r670647o157855N68857L579166K324382Q15370
$$ 13278494 17743309 13082702 3412055 -2745800 -2176943 1402223 3726605 4541975
9195D541975J398602K819753K685897Q7502l379768m681390k550004M17323M96597
$$ 4541975 5940577 8760330 11446227 11533729 8153961 3472571 922567 1339890 1836487
9186A836487k390595m581881l437047j08957K684905L450548K032880p27773k622557
$$ 1836487 -554108 -5135989 -8573036 -8681993 -5997088 -2546540 -513660 -1241433 -3863990
9177c863990j552322J489266K840084Q17963j856480j755191P21921K298453J247678
$$ -3863990 -5416312 -3927046 -1086962 -268999 -2125479 -3880670 -3158749 -860296 387382
9168C87382j008225k275388j856904l31065J543453K973693K929196R57280j586549
$$ 387382 -620843 -2896231 -4753135 -5084200 -3540747 -567054 2362142 3319422 1732873
9159A732873k279234o63734N11060r01749k292291M85488N485899N259516k289332
$$ 1732873 -546361 -1210095 -699035 -1600784 -3893075 -3407587 2078312 7337828 5048496
9150E048496q726163n918787J916884M069377r56896m009317J63179N641918N451709
$$ 5048496 -3677667 -9596454 -7679570 -3610193 -4567089 -8576406 -8413227 -2771309 2680400
9141B680400J193404j930462l189552l901164k389258K191793N142615K248308
$$ 2680400 3873804 1943342 -1246210 -5147374 -7536632 -5344839 -202224 2046084
9133B046084k426926j928775K428659K994456j777445m891672k111919J904313
$$ 2046084 -380842 -2309617 119042 3113498 1336053 -3555619 -5667538 -3763225
9125c763225J896827l3686O51765K834734K095689j473294l252454j156187J832440
$$ -3763225 -1866398 -1900084 -1248319 1586415 3682104 2208810 -1043644 -2199831 -367391
9116c67391K543042J369524J29922p93863j456319p81251J577968L056740O94698
$$ -367391 2175651 3545175 3675097 2881234 1424915 643664 2221632 5278372 5973070
9107E973070m183659o533190l778264R81267L464995L426870K969173K134812
$$ 5973070 1789411 -4743779 -8522043 -7540776 -4075781 -648911 2320262 4455074
9099D455074L343j479966L46883L297217K254547k588639m938038j723893K277898
$$ 4455074 4458417 2978451 3325334 6622551 8877098 6288459 1350421 -373472 1904426
9090A904426K110183l34705r07940m0769j90841n53209M41263R27660o26470r75586
$$ 1904426 4014609 3679904 2771964 2731195 2540354 1987145 2428408 3356068 2729598 1754012
9080A754012K473620N192597J728158m278907m490821J109964M306506J651857
$$ 1754012 4227632 9420229 11148387 6869480 2378659 3488623 7795129 9446986
9072I446986j504977j245413n57309j921534k527401o09334N34632j077622k160356
$$ 9446986 7942009 6696596 6139287 4217753 1690352 1081018 1615650 538028 -1622328
9063a622328p51258m08177l091669m042829M89804N777223N319872Q10868j283174
$$ -1622328 -2373586 -2781763 -5873432 -9916261 -9426457 -3649234 1670638 2481506 1198332
9054A198332R0874O09993j134664j882051K72216L241716M306364K552209j257917
$$ 1198332 1289206 1899199 764535 -1117516 -845300 2396416 6702780 9254989 7997072
9045G997072m436595l795631j06575J537583j057592l190179o25415L048745K063095
$$ 7997072 3560477 -235154 -341729 1195854 138262 -3051917 -3677332 -628587 1434508
9036A434508j999759l070376n44635R87929N81309J739607M454426M114505k62202
$$ 1434508 -565251 -3635627 -4180262 -3192333 -2611024 -871417 3583009 7697514 7435312
9027G435312l467034j849958J999070M213811M111652K028945k026636n645404
$$ 7435312 3968278 2118320 4117390 8331201 12442853 14471798 12445162 6799758
9019F799758n098208j282408M23175j613500k583193M44666L105651P68601l716521
$$ 6799758 1701550 419142 842317 -771183 -3354376 -2909710 195941 964542 -2751979
9010b751979m235986j39584L979026M976977L417423Q35779j456220k004382p10290
$$ -2751979 -6987965 -7127549 -3148523 1828454 5245877 6081656 4625436 2621054 1910764
9001A910764L40909k45967j098395q45590o50600j572895j919968j57115J839018
$$ 1910764 2251673 2005706 907311 61721 -588879 -2161774 -4081742 -4238857 -2399839
8992b399839J600609J03702j96651N93801R55926J139032J795172J484958p73297
$$ -2399839 -799230 -695528 -892179 -298378 657548 1796580 3591752 5076710 4303413
8983D303413k550868j631140l36993j519842k590433L54445M113296J693702n757355
$$ 4303413 1752545 121405 -215588 -1735430 -4325863 -3971418 141878 1835580 -3921775
8974c921775q576626k656682L924706K964784j910824j855380L501846O714982
$$ -3921775 -12498401 -15155083 -11230377 -8265593 -10176417 -12031797 -8529951 -1814969
8966a814969M509602J279125O66029P12014q59851k229793j108263J303545K687500
$$ -1814969 2694633 3973758 4639787 5351801 4491950 2262157 1153894 2457439 5144939
8957E144939K794084J935976n95023m027442n006125k100655J105425Q56423j087758
$$ 5144939 7939023 9874999 9279976 5252534 246409 -1854246 -748821 107602 -980156
8948i80156n47180K142762K954759R31651r28386j382186k160659k831741l78885
$$ -980156 -1527336 615426 3570185 4501836 3573450 2191264 30605 -2801136 -3180021
8939c180021M078426M336765j319616n415999j817120L922453K374207m612514
$$ -3180021 898405 5235170 3915554 -1500445 -3317565 604888 2979095 -1633419
8931a633419n892517J735119P875864L801743m690844o145503J19374M457917
$$ -1633419 -7525936 -5790817 2085047 5886790 1195946 -4949557 -4830183 -372266
8923c72266J909429j411190J203543O548712O194734j194702p533487n838392
$$ -372266 1537163 125973 1329516 7878228 14072962 12878260 5344773 -493619
8915d93619R19853M170180Q67371l511969l191574N38322K342270M03862k415861
$$ -493619 426234 4596414 5463785 1951816 -1239758 -701436 1640834 2044696 -371165
8906c71165l601929l493666k877001j392727Q41449K457355K592625J741603N36302
$$ -371165 -3973094 -7466760 -10343761 -11736488 -10895039 -8437684 -5845059 -4103456 -3567154
8897c567154o16702p40089Q03347K572104K359723K97842j424734j685720r64051
$$ -3567154 -4183856 -4923945 -4120598 -1548494 811229 1109071 -315663 -2001383 -2965434
8888b965434O50121L026168M083656J837657j799823k999643j676946j000788
$$ -2965434 -2315313 710855 4794511 6632168 4832345 1832702 155756 -845032
8880h45032j424779l85995J615481P62673k616366k836756J907943N465701L036193
$$ -845032 -2269811 -2655806 -1040325 -277652 -2894018 -5730774 -3822831 1642870 4679063
8871D679063j412524k159457o06927r55106j847020L76852L558039K565941j761860
$$ 4679063 3266539 1107082 500155 -454951 -2301971 -1925119 1632920 4198861 2437001
8862B437001l839836k213290k66846R09285L196296N391771L773697p70229l074499
$$ 2437001 -1402835 -3616125 -3882971 -2973686 222610 5614381 9388078 8617849 5543350
8853E543350k062054j977953l960509l497758J197452M967681L491824l36183
$$ 5543350 3481296 1503343 -2457166 -5954924 -4757472 210209 3702033 3365850
8845C365850j867406j732529k842019m079484k069238K569721N095285K589853
$$ 3365850 1498444 -234085 -3076104 -7155588 -9224826 -6655105 -1559820 1030033
8837A030033k463677m699863j231319N047023P922581M894037L93927m17923R85035
$$ 1030033 -1433644 -6133507 -7364826 -2317803 5604778 10498815 10892742 10474819 11459854
8828A1459854l85842m231963n256164k036152R10946R72569P67185J695594R01304
$$ 11459854 11074012 6842049 1585885 -450267 460679 1433248 2200433 3896027 4797331
8819D797331k227453k965786J120444N026418L505100j237170l636853k366293
$$ 4797331 2569878 -395908 724536 5750954 9256054 8018884 4382031 2015738
8811B015738M62893L369081M465187J040825n055826o590794r91639L996504J357134
$$ 2015738 2478631 5847712 10312899 11353724 6297898 -292896 -1284535 2711969 4069103
8802D069103l748558k134873L992888M269833k779846o994004k315819M683769
$$ 4069103 320545 -1814328 2178560 6448393 3668547 -3325457 -5641276 -957507
8794i57507N702400K032895l0396P54579P15521j765141m151085l470543M70001
$$ -957507 4744893 6777788 6747392 7501971 8217492 6452351 2301266 -1169277 -699276
8785f99276M746159N326443J083779l885422m213926K20249M196837L655255l75824
$$ -699276 4046883 9373326 10457105 6571683 2357757 2578006 6774843 10430098 10054274
8776A0054274m283673n383522l013758Q51501K295265j95106k846603j665115
$$ 10054274 5770601 387079 -2626679 -1775178 520087 324981 -2521622 -4186737
8768d186737R82239j01315l796408l622742J575710N033570K560430j099753k85602
$$ -4186737 -3204498 -3305813 -7102221 -10724963 -9149253 -4115683 -1555253 -2655006 -2940608
8759b940608K985347L299693K56668k487727l179133k162504Q46217M786502N271061
$$ -2940608 44739 3344432 3601100 1113373 -2065760 -4228264 -3382047 1404455 6675516
8750F675516k0986n823200m759075K404741P263312M664325j667218n225964m282315
$$ 6675516 6654530 831330 -3927745 -1523004 5740308 10404633 8737415 3511451 -770864
8741g70864j743224m77069o51575l32049K061408N115076M996103L45437m599992
$$ -770864 -2514088 -2991157 -3642732 -3974781 -1913373 3201703 8197806 8543243 3943251
8732C943251m529956o5L349912K295727p76165k510014k528032j428987J254055
$$ 3943251 -586705 -586770 2763142 5058869 4282704 1772690 -755342 -2184329 -930274
8723i30274M532188M648192r1381n194258m734647N92134M236126K736627l33806
$$ -930274 3601914 8250106 8158725 2964467 -1770180 -1178046 3058080 5794707 5460901
8714E460901p40036L06743m63352k106046j156998J827576K477370l04813k286707
$$ 5460901 4720865 5027608 4564256 2458210 1301212 3128788 5606158 5301345 3014638
8705C014638o69889J441704L17129k199584j794901J246039K512567J87751k725159
$$ 3014638 2344749 3786453 4103582 1903998 109097 1355136 3867703 4055454 1330295
8696A330295k956581m80954K777129M940989M598244J653772j971193m294487
$$ 1330295 -1626286 -2107240 669889 5610878 10209122 11862894 9891701 5597214
8688E597214n366111n548661l389224J613719N745683M924962R84866o23538R69779
$$ 5597214 231103 -5317558 -8706782 -7093063 -1347380 3577582 4562448 3938910 4908689
8679D908689J397988j154679l229580k391326o89889r4766J04328l96257l107989
$$ 4908689 6306677 5151998 1922418 -468908 -1158797 -1253563 -1149235 -1545492 -4653481
8670d653481n057888j86427R650734J2826243L435731q153725q483152N44966
$$ -4653481 -9711369 -9897796 -247062 12579181 16014912 7861187 -621965 -76999
8662g6999N998786L189827l33977O36788J614785j635135n188591l960454k2583
$$ -76999 5921787 9111614 8777637 9414425 11029210 9394075 4205484 245030 222447
8653B22447J398116j33167j155078k50708J061107J514752R24213p79490k791571
$$ 222447 1620563 1487396 332318 81610 1142717 2657469 3581682 2802192 10621
8644A0621k966710l02443L061687M093683K393776J49297p85606o16813o07484
$$ 10621 -2956089 -3258532 -196845 3896838 6290614 6439911 5654305 5037492 4430008
8635D430008j044651p48464P67206J300893j431766m791999k709987N278932J0587570
$$ 4430008 3385357 2636893 3404099 4704992 3273226 -1518773 -4228760 1050172 11637742
8626A1637742N926233l986377q236388m418572l04086j034186k613735l78699
$$ 11637742 17563975 13577598 5341210 922638 618552 -415634 -3029369 -3408068
8618c408068L269788L700927J350018j99197K73862J703796L178366L311354M28927
$$ -3408068 -138280 3562647 4912665 4713468 4987330 6691126 9869492 13180846 13609773
8609A3609773l915440n153804k115780P00308J50399q05293Q81192K371402Q3880
$$ 13609773 9694333 4540529 2424749 3125057 3275456 2470163 3351355 5722757 5806637
8600E806637l263860k743953N90472J744544o6666j341297q49267l60338J0072
$$ 5806637 2542777 -201176 389296 2133840 2067174 725877 -123390 -483728 -473656
8591d73656J297357J537216j668666n041188k771532L943716P304560M033911
$$ -473656 823701 2360917 692251 -4348937 -7120469 -3176753 4127807 8161718
8583H161718m95161j182638J88444Q2926j021584j596385k565304l940181k718166
$$ 8161718 7666557 6483919 6672363 6755289 5733705 4137320 1572016 -2368165 -5086331
8574e086331J612830L933777O94789l710187l190633P98500K391116J148407J786296
$$ -5086331 -3473501 460276 1155065 -2555122 -5745755 -4947255 -2556139 -1407732 378564
8565C78564N035865N996064K540085j103740j361116m05010j289537k678344k125707
$$ 378564 5414429 11410493 13950578 12846838 11485722 11080712 9791175 7112831 4987124
8556D987124q94875j281054j864469m94K757806K602750L3895o46357J292525
$$ 4987124 4092249 2811195 946726 946232 3704038 6306788 6340683 5694326 6986851
8547F986851J510172j724364l636937m25132L713649K376791k927500m829086
$$ 6986851 8497023 6772659 3135722 2710590 6424239 8801030 5873530 1044444
8539A044444j434846J283779l07524j869988O78198L333269L71577n352082n672272
$$ 1044444 -390402 893377 585853 -1284135 -605937 2727332 3098909 -2253173 -7925445
8530g925445N37746N310258K909792k730907m413211j007762K909337L833308
$$ -7925445 -7387699 -2077441 832351 -1898556 -6311767 -7319529 -4410192 -576884
8522e76884K329721O14887j15587j58649n07233j492924k062597j225967R9201
$$ -576884 1752837 2367724 2252137 2093488 1586255 93331 -1969266 -3195233 -3096032
8513c096032K91274k72313L9682Q51025J71668j617230j545753J040626K778397
$$ -3096032 -2804758 -3077071 -3037389 -2186364 -2014696 -3631926 -5177679 -4137053 -1358656
8504a358656J426463m27845N33439L046561L178598P3308l109620l304168m35813
$$ -1358656 67807 -360038 173401 3219962 6398560 6471868 3362248 58080 -377733
8495c77733L207125M893069L398537K13956j946105k293054k171904k053503r49620
$$ -377733 2829392 7722461 11120998 11334954 9388849 7095795 4923891 2870388 1920768
8486A920768O34949O00076o13020L06387L605800M463252J63654m828460n218186
$$ 1920768 2555717 3155793 2542773 2849160 6454960 10918212 11081866 6253406 1035220
8477A035220k580950j625063k065289m17706K352333J900120j547548l079089
$$ 1035220 -1545730 -3170793 -5236082 -5653788 -3301455 -1401335 -2948883 -6027972
8469f027972j211469K87653m06608m79470J277680J597611j108661l040057r54977
$$ -6027972 -7239441 -6951788 -7358396 -7837866 -6560186 -4962575 -6071236 -9111293 -10066270
8460a0066270K427536K744655M77871n83048Q57612K581056K252985m35603l794575
$$ -10066270 -7638734 -4894079 -4416208 -4999256 -4141644 -1560588 692397 256794 -3537781
8451c537781m902580j977480K957726N633167M441631J599890p79840k592598
$$ -3537781 -8440361 -10417841 -7460115 -1826948 2614683 4214573 3434733 842135
8443H42135l242389j283116J942005K262195j493899n055792m418898q92963J744232
$$ 842135 -2400254 -3683370 -1741365 520830 -973069 -6028861 -10447759 -11340722 -9596490
8434i596490K057498P95711r26572j246128J294470M286753L116434j684638l427346
$$ -9596490 -7538992 -6743281 -7669853 -8915981 -7621511 -3334758 -218324 -1902962 -5330308
8425e330308J198160O451782N741901R78955j529513o52074J31679o7756O10442
$$ -5330308 -4132148 2319634 8061535 9040490 7510977 6858903 6990582 6922826 7533268
8416G533268J474424R0641k417034k542717l86351P38974J91480L33617J330420
$$ 7533268 9007692 9098333 6681299 4138582 3752231 4491205 4682685 5016302 6346722
8407F346722Q53359r39339j177312N47570J460068N10370m72439r26212k292231
$$ 6346722 7200081 6260742 5083430 5631000 7091068 7601438 7128999 6202787 3910556
8398C910556l985688l147506N51111L826943M359845K852236L27534k548342l390104
$$ 3910556 -75132 -3222638 -2671527 1155416 5515261 8367497 8695031 6146689 2756585
8389B756585j06217M421321M604108J53354l092630j721335Q83587O35072j667222
$$ 2756585 2650368 7071689 11675797 11829151 8736521 7015186 7898773 8533845 6866623
8380F866623l282032l596933k581881O32751M700071N479457J753306j892820
$$ 6866623 3584591 -12342 -2594223 -1961472 2738599 8218056 9971362 8078542
8372H078542j230963J590892J641375j693959m708045m705815k241225P40541
$$ 8078542 6847579 8438471 10079846 8385887 3677842 -1027973 -3269198 -2528657
8364b528657K482221K045273J41456j419174j796087j330510Q2885K292145K919872
$$ -2528657 -46436 1998837 2140293 721119 -1074968 -2405478 -2322593 -30448 2889424
8355B889424n6604l584557k266258L041582M905671R6860m962590l533575J731179
$$ 2889424 2832820 -751737 -3017995 23587 4929258 5026118 63528 -3470047 -1738868
8346a738868L685009J350401m46300K51580N18360j338401l037767k346696o466
$$ -1738868 1946141 3296542 2850242 3101822 3620182 2281781 -755986 -3102682 -3109148
8337c109148K024720K527129J057990j638931l334672k404900k1182J182733o85
$$ -3109148 -1084428 1442701 2500691 861760 -2472912 -4877812 -4898994 -3716261 -3716946
8328c716946k822189n552371n901031k456914K808501N652254M794500L568032
$$ -3716946 -6539135 -12091506 -17992537 -20449451 -17640950 -11988696 -7194196 -3626164
8320c626164M560656N654574L976084P72379r71525j311436k195291l477957l520665
$$ -3626164 934492 6589066 10565150 11337529 10366004 9054568 6859277 3381320 -139345
8311a39345k251019o77136J024215K378341J755970o82056j805078k39565P76923
$$ -139345 -2390364 -3067500 -2043285 335056 2091026 1408970 -396108 -635673 141250
8302A41250j222634l097172j095973K503501L045614J150122R14055K479716K529790
$$ 141250 -1081384 -4178556 -5274529 -2771028 274586 1424708 2338763 4818479 7348269
8293G348269Q51442K06386N61188k57035q40930J981525N601943L417392m328371
$$ 7348269 8199711 8406097 8967285 8710250 7869320 9850845 15452788 18870180 14541809
8284A4541809q836375m957440J313777J786692k610593m625924j570977J999664
$$ 14541809 5705434 747994 2061771 3848463 1237870 -3388054 -4959031 -2959367
8276b959367J726155p08926m49477L582600O453525L031413m585169q371223m484316
$$ -2959367 -1233212 -1942138 -2391615 1190985 7644510 10675923 6090754 -2280469 -6764785
8267f764785J408527K113926j159541j785498J875276N169292N117325L334119
$$ -6764785 -5356258 -3242332 -4401873 -6187371 -4312095 857197 5974522 9308641
8259I308641J099112k223365n198612m720687j492285L15143l40368o45988j51394
$$ 9308641 10407753 8184388 2985776 -1734911 -3227196 -2912053 -3252421 -3898409 -4049803
8250d049803j232278k666615j98591M835370N415644J30509l580482j244125J899082
$$ -4049803 -5282081 -7948696 -8147287 -3311917 2103727 2234236 -1346246 -2590371 -691289
8241f91289R22400m69550J691246K928911j493691o239547l514134L661063N889913
$$ -691289 231111 -238439 1452807 4381718 2888027 -3351520 -6865654 -3204591 2685322
8232B685322J947689j248889j190037j884148l966674l038544J019939K658443
$$ 2685322 4633011 3384122 2194085 309937 -3656737 -6695281 -5675342 -3016899
8224c016899O48809M86460L963991N076525M43176m185533l139020K72217J47812
$$ -3016899 -2368090 -1881630 2082361 7158886 7602062 3416529 277509 549726 697538
8215F97538k279015j996533P57619J626300j77718j477381r23203J16574J173365
$$ 697538 -1581477 -3578010 -2820391 -1194091 -1371809 -2849190 -3772393 -3655819 -2482454
8206b482454K420441K267879k4479j088945J821924M653098J687504m231620m609699
$$ -2482454 -62013 2205866 2181387 1092442 2914366 7567464 9254968 5023348 413649
8197D13649J027902L402816j587067n514234j046484N404409L703715l382718
$$ 413649 1441551 4844367 3257300 -2256934 -3303418 2100991 5804706 2421988
8189B421988m813882N15360K700796j636317l629068J798750O100814J151185
$$ 2421988 -2391894 -1876534 824262 -812055 -4441123 -2642373 3458441 4609626
8181D609626o440957n492699J744668L619036k040954n407606j216434L839774
$$ 4609626 -1831331 -7324030 -5579362 -1960326 -4001280 -9408886 -10625320 -6785546
8173f785546L459930J314155K700331M562381J116059n467258p477307k733590
$$ -6785546 -3325616 -2011461 688870 5251251 6367310 900052 -6577255 -9310845
8165i310845K962549M049233J171706j478223j418314M39613J583536P16360q97636
$$ -9310845 -6348296 -2299063 -1127357 -2605580 -4023894 -3584281 -2000745 -1284385 -2182021
8156b182021j305400p00211o55400q61579M33987K383579J678062j812619l445197
$$ -2182021 -3487421 -4187632 -4843032 -5704611 -5270624 -2887045 -1208983 -3021602 -6466799
8147f466799m65231L200247K327652j988637m027582j278707L110794N115285
$$ -6466799 -6932030 -3731783 -1404131 -3392768 -7420350 -8699057 -5588263 -472978
8139d72978L935938J378087n48587j152670j319177j991805k241106m32082K450454
$$ -472978 3462960 4841047 4292460 3139790 1820613 -171192 -2412298 -2844380 -393926
8130c93926L310085J612781K85823N15030m36749l734608n477001k535085J754403
$$ -393926 2916159 4528940 4814763 5329793 4893044 1158436 -4318565 -6853650 -5099247
8121e099247K485305Q28295J329277L694405L427841q2832k278104q02259J311579
$$ -5099247 -2613942 -1785647 -456370 3238035 6665876 6583044 4304940 3502681 4814260
8112D814260J152880j68251r10062j766325l310130l804822k009436L51055J075044
$$ 4814260 5967140 5798889 4888827 3122502 -187628 -3992450 -6001886 -5650831 -4575787
8103d575787M94415K62538Q60713J799050K746206L144575K079872l12973k448788
$$ -4575787 -4081372 -3818834 -2958121 -1159071 1587135 4731710 6811582 6498609 4049821
8094D049821l077653k359545q13433J218236K535479J399521j904372m192615
$$ 4049821 972168 -1387377 -2200810 -982574 1552905 2952426 1048054 -3144561
8086c144561k582037J924446N187188M368620J045963o60386Q13682K283718J31958
$$ -3144561 -5726598 -3802152 1385036 5753656 6799619 6139233 6952915 9236633 9368591
8077I368591m113843n488787k988234j096565k091784j565927M116463R801940
$$ 9368591 5254748 -234039 -3222273 -4318838 -6410622 -7976549 -3860086 5941854
8069E941854P369642k077018q675832o827150j384820Q23660k67728p93644K76317
$$ 5941854 13311496 11234478 2558646 -4268504 -5653324 -4829664 -5097392 -5891036 -5614719
8060e614719J255266J582574J773187J406355J55426p33046m35666l83579j748755
$$ -5614719 -4359453 -2776879 -1003692 402663 558089 -174957 -610623 -994202 -2742957
8051b742957k777763j218709J867178L269087J810246p20344k049864j079374
$$ -2742957 -5520720 -6739429 -4872251 -1603164 207082 -513262 -2563126 -3642500
8043c642500J862727M517289L646592j159675n490072m545452O80431M175259
$$ -3642500 -1779773 2737516 6384108 5224433 -265639 -4811091 -4130660 44599
8035D4599K142394k775484n188585k981746J418435M372496M182987J529669j778298
$$ 44599 2186993 -588491 -5777076 -8758822 -7340387 -2967891 1215096 2744765 966467
8026I66467l999897m001386j498063K545342N781390N696960J943498k667237
$$ 966467 -3033430 -7034816 -8532879 -5987537 -206147 5490813 7434311 4767074
8018D767074m429989k402493P82796K169373J776156J635339K150927J462137
$$ 4767074 337085 -2065408 -1282612 886761 2662917 4298256 6449183 7911320
8010G911320r91332k638747j561866j88960j850675m629936l210648K403755N104589
$$ 7911320 6919988 4281241 2719375 2530415 679740 -3950196 -7160844 -4757089 347500
8001C47500N96920n266593m046182K962454O055889O99315o056507n123687K676685
$$ 347500 944420 -4322173 -8368355 -5405901 649988 1349303 -4707204 -9830891 -7154206
7992g154206P935013M542476l090390n664692k60651O241555N914396j10358l665166
$$ -7154206 780807 5323283 2232893 -3431799 -3692450 2549105 8463501 8353143 4687977
7983D687977j178420J750968m95578m936772n061451p06541K923621L656658L420855
$$ 4687977 3509557 5260525 4764947 -171825 -5233276 -5939817 -3016196 640462 4061317
7974D061317K363709j156985m881326m067694L41949J878225j245254k988332
$$ 4061317 6425026 5268041 386715 -3680979 -3339030 -1460805 -2706059 -5694391
7966e694391M66500M265489K916354r86240j512318J384322L015497J472331j052121
$$ -5694391 -5227891 -962402 1953952 967712 -544606 839716 3855213 5327544 4275423
7957D275423k403602j755881J228289M879746N413379J731709k255227l346227
$$ 4275423 1871821 115940 1344229 6223975 11637354 13369063 11113836 7767609
7949G767609l636580n460865n811873j339024M389242N091687J142957j746551
$$ 7767609 4131029 -1329836 -7141709 -8480733 -4091491 1000196 2143153 396602
7941C96602j706655j847200l054712k620822k86141R08119N41499J408667L382076
$$ 396602 -1310053 -3157253 -6211965 -8832787 -9118928 -8210809 -7669310 -6260643 -2878567
7932b878567K997846L07519m64106J202651N96066l204886m084951J028197N596224
$$ -2878567 119279 426798 -37308 1165343 1761409 -1443477 -5528428 -4500231 1095993
7923A095993K874931l520816n316732j962716J80184j040835j030669K668888
$$ 1095993 3970924 450108 -4866624 -6829340 -6649156 -7689991 -8720660 -6051772
7915f051772N768964L885356q54703k970589r49242J429544M68619k738965l904654
$$ -6051772 -282808 3602548 2747845 -222744 -1171986 257558 726177 -2012788 -5917442
7906e917442j410295J226455L69876j911993o74025L743516N406898J970866j358175
$$ -5917442 -7327737 -6101282 -5731406 -7643399 -8317424 -4573908 832990 2803856 1445681
7897A445681k57198J669426o11894m425205l431592J810916M566567K301106o53299
$$ 1445681 1188483 2857909 2246015 -2179190 -5610782 -3799866 766701 3067807 2414508
7888B414508j058414o71138r29530p2773K210462K840544P15791r82038o21348
$$ 2414508 1356094 684956 -244574 -317347 1893115 4733659 5449450 4467412 3846064
7879C846064j199193m132811n018946m24015N114160M693074p39977l787953j392334
$$ 3846064 2646871 -1485940 -6504886 -6928901 -1814741 2878333 2138356 -1649597 -3041931
$$ [...]
##END NTUPLES=NMR SPECTRUM
##END=
