##TITLE=31Pdec_SR89_rm2
 , 24 sc
 20.09.2021
##JCAMPDX= 6.0         $$ Bruker NMR JCAMP-DX V2.0
##DATA TYPE= NMR SPECTRUM
##DATA CLASS= NTUPLES
##ORIGIN= UXNMR, Bruker Analytische Messtechnik GmbH
##OWNER= root
$$ XWIN-NMR		Version 3.5
$$ Mon Sep 20 11:32:41 2021 Russian Standard Time (UT+4h)  she@DPX200
##.OBSERVE FREQUENCY= 81.013821
##.OBSERVE NUCLEUS= ^31P
##.ACQUISITION MODE= SIMULTANEOUS
##.ACQUISITION SCHEME= undefined
##.AVERAGES= 24
##.DIGITISER RES= 16
##SPECTROMETER/DATA SYSTEM= spect
##.PULSE SEQUENCE= zgpg30
##.SOLVENT NAME= CDCl3
##.SHIFT REFERENCE= (INTERNAL, CDCl3, 0, 248.564)
##AUDIT TRAIL= $$ (NUMBER, WHEN, WHO, WHERE, WHAT)
$$ ##TITLE= Audit trail, XWIN-NMR		Version 3.5
$$ ##JCAMPDX= 5.01
$$ ##ORIGIN= Bruker BioSpin GmbH
$$ ##OWNER= she
$$ F:/spectra/data/she/nmr/P31/1/pdata/1/auditp.txt
$$ ##AUDIT TRAIL=  $$ (NUMBER, WHEN, WHO, WHERE, WHAT)
(   1,<2021-09-20 11:30:44.39 +0400>,<she>,<DPX200>,
      <created by zg, POWCHK disabled, PULCHK disabled
       configuration hash MD5:
       00 E9 B6 7A A2 85 ED C7 34 08 36 98 17 FE 4E 26
       data hash MD5: 32K
       1B EF 7A A0 E0 E1 7E 7D 33 1B E3 E0 E9 93 B9 86>)
(   2,<2021-09-20 11:31:09.29 +0400>,<she>,<DPX200>,
      <Start of raw data processing
       efp BC_mod = 2 LB = 1 FT_mod = 6 PKNL = 1 PHC0 = -8108.689 PHC1 = 74.07025 SI = 64K 
       data hash MD5: 64K
       11 79 2F 95 BF 94 F9 A1 8C 60 01 50 6B B0 88 4A>)
(   3,<2021-09-20 11:32:18.90 +0400>,<she>,<DPX200>,
      <pk PHC0 = 4.255177 PHC1 = -12.40001 
       data hash MD5: 64K
       47 65 ED 22 FB BE F4 CA 0B E9 04 8D BF 7B 46 54>)
$$ ##END=
$$ 
$$ hash MD5
$$ 06 B5 E6 23 39 67 3D 2C 8C 08 50 BE 9D 7A 6C B3
##$RELAX= 
##$RELAX= 
##$RELAX= 
##$RELAX= 
##$RELAX= 
##$RELAX= 
##$RELAX= 
##$RELAX= 
$$ Bruker specific parameters
$$ --------------------------
##$DU= <F:/spectra>
##$EXPNO= 1
##$NAME= <P31>
##$PROCNO= 1
##$TYPE= <nmr>
##$USER= <she>
##$AMP= (0..31)
100 100 100 100 100 100 100 100 100 100 100 100 100 100 100 100 100 100 
100 100 100 100 100 100 100 100 100 100 100 100 100 100 
##$AQSEQ= 0
##$AQ_mod= 1
##$AUNM= <au_zg>
##$AUTOPOS= <>
##$BF1= 81.014009
##$BF2= 200.13
##$BF3= 200.13
##$BF4= 200.13
##$BF5= 200.13
##$BF6= 200.13
##$BF7= 200.13
##$BF8= 200.13
##$BYTORDA= 1
##$CFDGTYP= 0
##$CFRGTYP= 5
##$CHEMSTR= <none>
##$CNST= (0..31)
1 1 145 1 1 1 1 1 1 1 1 1 1 1 1 1 1 1 1 1 1 1 1 1 1 1 1 1 1 1 1 1 
##$CPDPRG= <waltz16>
##$CPDPRG1= <>
##$CPDPRG2= <waltz16>
##$CPDPRG3= <>
##$CPDPRG4= <mlev>
##$CPDPRG5= <mlev>
##$CPDPRG6= <mlev>
##$CPDPRG7= <mlev>
##$CPDPRG8= <mlev>
##$CPDPRGB= <>
##$CPDPRGT= <>
##$D= (0..31)
0 1 0 0 0 0 0 0 0 0 0 0.03 2e-05 3e-06 0 0 0 0 0 0 0 0 0 0 0 0 0 0 0 0 
0 0 
##$DATE= 1632123043
##$DBL= (0..7)
120 120 120 11 120 120 24 19 
##$DBP= (0..7)
150 150 150 150 150 150 150 150 
##$DBP07= 0
##$DBPNAM0= <>
##$DBPNAM1= <>
##$DBPNAM2= <>
##$DBPNAM3= <>
##$DBPNAM4= <>
##$DBPNAM5= <>
##$DBPNAM6= <>
##$DBPNAM7= <>
##$DBPOAL= (0..7)
0.5 0.5 0.5 0.5 0.5 0.5 0.5 0.5 
##$DBPOFFS= (0..7)
$$ [...]
##$SUBNAM2= <"">
##$SUBNAM3= <"">
##$SUBNAM4= <"">
##$SUBNAM5= <"">
##$SUBNAM6= <"">
##$SUBNAM7= <"">
##$SUBNAM8= <"">
##$SUBNAM9= <"">
##$SW= 501.771253377433
##$SWIBOX= (0..15)
0 1 3 0 0 0 0 0 0 0 0 0 0 0 0 0 
##$SW_h= 40650.406504065
##$TD= 32768
##$TD0= 1
##$TE= 0
##$TE2= 300
##$TE3= 300
##$TEG= 300
##$TL= (0..7)
0 120 53 12 22 120 120 120 
##$TP= (0..7)
150 150 150 150 150 150 150 150 
##$TP07= 0
##$TPNAME0= <>
##$TPNAME1= <>
##$TPNAME2= <>
##$TPNAME3= <>
##$TPNAME4= <>
##$TPNAME5= <>
##$TPNAME6= <>
##$TPNAME7= <>
##$TPOAL= (0..7)
0.5 0.5 0.5 0.5 0.5 0.5 0.5 0.5 
##$TPOFFS= (0..7)
0 0 0 0 0 0 0 0 
##$TUNHIN= 0
##$TUNHOUT= 0
##$TUNXOUT= 0
##$USERA1= <user>
##$USERA2= <user>
##$USERA3= <user>
##$USERA4= <user>
##$USERA5= <user>
##$V9= 5
##$VALIST= <valist>
##$VCLIST= <CCCCCCCCCCCCCCC>
##$VD= 0
##$VDLIST= <DDDDDDDDDDDDDDD>
##$VPLIST= <PPPPPPPPPPPPPPP>
##$VTLIST= <TTTTTTTTTTTTTTT>
##$WBST= 1024
##$WBSW= 4
##$XGAIN= (0..3)
0 0 0 0 
##$XL= 0
##$YL= 0
##$YMAX_a= 3290
##$YMIN_a= -3725
##$ZGOPTNS= <>
##$ZL1= 120
##$ZL2= 120
##$ZL3= 120
##$ZL4= 120
##$ABSF1= 0
##$ABSF2= 0
##$ABSG= 0
##$ABSL= 0
##$ALPHA= 0
##$AQORDER= 0
##$ASSFAC= 0
##$ASSFACI= 0
##$ASSFACX= 0
##$ASSWID= 0
##$AUNMP= <proc_1d>
##$AZFE= 0.1
##$AZFW= 0.5
##$BCFW= 0
##$BC_mod= 2
##$BYTORDP= 0
##$COROFFS= 0
##$CY= -3
##$DATMOD= 1
##$DC= 0
##$DFILT= <>
##$DTYPP= 0
##$F1P= 0
##$F2P= 0
##$FCOR= 1
##$FTSIZE= 65536
##$FT_mod= 6
##$GAMMA= 0
##$GB= 0
##$INTBC= 1
##$INTSCL= 5.30512e-09
##$ISEN= 30
##$LB= 1
##$LEV0= 0
##$LPBIN= 0
##$MAXI= 10000
##$MC2= 0
##$MEAN= 0
##$ME_mod= 0
##$MI= 50
##$NCOEF= 0
##$NC_proc= -8
##$NLEV= 6
##$NOISF1= 182.463
##$NOISF2= 159.3651
##$NSP= 0
##$NTH_PI= 0
##$NZP= 0
##$OFFSET= 248.5645
##$PC= 4
##$PHC0= -8104.434
##$PHC1= 61.67024
##$PH_mod= 1
##$PKNL= yes
##$PPARMOD= 0
##$PSCAL= 0
##$PSIGN= 0
##$REVERSE= no
##$SF= 81.014009
##$SI= 65536
##$SIGF1= 159.3651
##$SIGF2= -187.1042
##$SINO= 113.3802
##$SIOLD= 16384
##$SREGLST= <1H.CDCl3>
##$SSB= 0
##$STSI= 65536
##$STSR= 0
##$SW_p= 40650.406504065
##$SYMM= 0
##$S_DEV= 0
##$TDeff= 32768
##$TDoff= 0
##$TI= <>
##$TILT= no
##$TM1= 0
##$TM2= 0
##$TOPLEV= 0
##$USERP1= <user>
##$USERP2= <user>
##$USERP3= <user>
##$USERP4= <user>
##$USERP5= <user>
##$WDW= 1
##$XDIM= 65536
##$YMAX_p= 129664694
##$YMIN_p= -437246598
$$ End of Bruker specific parameters
$$ ---------------------------------
##NTUPLES= NMR SPECTRUM
##VAR_NAME=  FREQUENCY,     SPECTRUM/REAL,   SPECTRUM/IMAG
##SYMBOL=    X,             R,               I
##VAR_TYPE=  INDEPENDENT,   DEPENDENT,       DEPENDENT
##VAR_FORM=  AFFN,          ASDF,            ASDF
##VAR_DIM=   65536,         65536,           65536
##UNITS=     HZ,            ARBITRARY UNITS, ARBITRARY UNITS
##FACTOR=    0.620285442955139, 1,           1
##FIRST=     20137.2065510759, 0,            0
##LAST=      -20513.1999529892, 0,           0
##MIN=       -20513.1999529892, -437246598,  0
##MAX=       20137.2065510759, 129664694,    0
$$ Real data points
##PAGE= N=1
##DATA TABLE= (X++(R..R)), XYDATA
$$ [...]
13029F011494j173583j446493p98367L99963J223913Q53617j568185n197290n849890
$$ 6011494 4837911 3391418 2593051 2993014 4216927 5070544 3502359 -1694931 -7544821
13020g544821k15940P627008Q934330J619220o091130o374881j396081J792976
$$ -7544821 -7760761 -133753 8800577 10419797 4328667 -2046214 -3442295 -1649319
13012a649319J337905L43967Q7084o15147j303897o68064q2952j421791k748382
$$ -1649319 -311414 32553 119637 -495510 -1799407 -2467471 -2550423 -3972214 -6720596
13003f720596j137089J779010K484085K149577M048223N552695P88059p918268
$$ -6720596 -7857685 -6078675 -3594590 -1445013 2603210 8155905 8943964 1025696
12995A025696j0050884j960379O078769L765171m598178o986004r98293M513954
$$ 1025696 -9025188 -10985567 -4906798 -1141627 -5739805 -12725809 -13724102 -9210148
12987i210148L841548J389103K435075M712675L547124m0596j766477j417179
$$ -9210148 -5368600 -3979497 -1544422 3168253 6715377 6674781 4908304 3491125
12979C491125k190518m160826l878496o79207J571525N54591q63382M31197K576309
$$ 3491125 1300607 -2860219 -6738715 -7417922 -5846397 -5291806 -6155188 -5723991 -3147682
12970c147682J918062o82602q06088K606979N019718K243798l719302o639133
$$ -3147682 -1229620 -1912222 -2718310 -111331 4908387 7152185 3432883 -3206250
12962c206250l151491L416792O575368L599461j747275l891958j931904L38508
$$ -3206250 -6357741 -2940949 3634419 7233880 5486605 1594647 -337257 1251
12954A251M39687J39829J223412J693061q29287m226110m220911n72089K765665
$$ 1251 440938 580767 1804179 3497240 2667953 -1558157 -5779068 -6351157 -3585492
12945c585492L353761K600257K189378J602823N8015j823700l134050l278912
$$ -3585492 -231731 2368526 4557904 6160727 6218742 4395042 1260992 -2017920
12937b017920j331291K530860M976625K532882k608369l868470O83338M514673
$$ -2017920 -3349211 -818351 4158274 6691156 4082787 214317 897655 5412328
12929E412328J221852n989223p926713j569971N865672O096768k69333n341416
$$ 5412328 6634180 644957 -7281756 -8851727 -2986055 3110713 2841380 -2500036
12921b500036l989471O64297K355309j76726k562149j449043J365542K324531
$$ -2500036 -6489507 -5825210 -3469901 -3646627 -6208776 -7657819 -6292277 -3967746
12913c967746R30066o42948q07178M61905K313696L074301J447340r55097r06258
$$ -3967746 -3037680 -3680628 -4487806 -4025901 -1712205 1362096 2809436 1854339 948081
12904I48081J058767M30186l461968m342752J548740P758563O278810P1248j605964
$$ 948081 2006848 2437034 -1024934 -5367686 -3818946 3939617 10218427 10289675 8683711
12895H683711K033683L081445j020163l811950j970736p09519l269704m652895
$$ 8683711 10717394 13798839 12778676 8966726 6995990 6286471 3016767 -1636128
12887a636128j125129K558131J634397m71476Q18351K787777J329650q18385L21233
$$ -1636128 -2761257 -203126 1431271 959795 1778146 4565923 5895573 5077188 5398421
12878E398421J536824j753800n798882m028552J040202J362576k975137l826502
$$ 5398421 6935245 5181445 -617437 -4645989 -3605787 -2243211 -5218348 -9044850
12870i044850J297955N370971L497554j99510m07854J692910K204216O00054j383403
$$ -9044850 -7746895 -2375924 1121630 922120 514266 2207176 4411392 5011446 3628043
12861C628043k885351l195348j294555J719987K772507R90823j078914j523274
$$ 3628043 742692 -2452656 -3747211 -2027224 745283 1736106 657192 -866082
12853h66082j320463j585795j630605q74218l6596L78648M79987j80536j587259
$$ -866082 -2186545 -3772340 -5402945 -6277163 -6313759 -5935111 -5455124 -5635660 -7222919
12844g222919j593844J436430M844851M367171L62851k678307k645032j416742
$$ -7222919 -8816763 -7380333 -2535482 1831689 2194540 -483767 -3128799 -4545541
12836d545541j34369K019854L857778K537380q00433j249850K023705L621578
$$ -4545541 -4679910 -2660056 1197722 3735102 2934669 1684819 3708524 7330102
12828G330102L05354l726565l552303p94826J37560q45056j007989m81602j358834
$$ 7330102 7635456 3908891 356588 -438238 -300678 -1145734 -2153723 -2635325 -3994159
12819c994159k732969j434948K629462N604076M381705j47341m385519n077723
$$ -3994159 -6727128 -8162076 -5532614 71462 4453167 4305826 -79693 -5157416
12811e157416j946014J557467J668572n92284m04626L333138N284761J576985
$$ -5157416 -7103430 -5545963 -3877391 -4469675 -4874301 -1541163 3743598 5320583
12803E320583l406991l042606J422527K839371p99863l825857k260673N06525
$$ 5320583 1913592 -1129014 293513 3132884 2333021 -1492836 -3753509 -3246984
12795c246984J41622j621592n45502K749904L610528L62496l399540l660933m37706
$$ -3246984 -3105362 -4726954 -5272456 -2522552 1087976 1450472 -1949068 -5610001 -6047707
12786f047707L049484L855508J630750j321026k223161q19372L91027k65610j182688
$$ -6047707 -2998223 857285 2488035 1167009 -1056152 -1875524 -1484497 -1750107 -2932795
12777b932795k99122J157825N78200j407448j884403r41034j523643l237301j558215
$$ -2932795 -3231917 -2074092 -1495892 -2903340 -4787743 -5728777 -7252420 -10489721 -12047936
12768a2047936M191597P390803L226973l121656l452313J518852M310110K742088
$$ -12047936 -7856339 -465536 2761437 -360219 -3812532 -2293680 2016430 4758518
12760D758518J513536K015697j15755n076431n774719O41626O231040L681261
$$ 4758518 6272054 8287751 8171996 3095565 -2679154 -2037528 4193512 7874773
12752G874773k407554l301587K01246P50573k487317l373419j34348K167249J101779
$$ 7874773 5467219 2165632 2366878 3117451 630134 -2743285 -2877633 -710384 391395
12743C91395M16765K341549L752051K465093Q18148K45924j565067m929484n463934
$$ 391395 808160 3149709 6901760 9366853 10185001 10430925 8865858 3936374 -1527560
12734a527560j137167L167243K748264L10231Q93801L194446J984998k746333
$$ -1527560 -2664727 502516 3250780 3561011 4454812 7649258 9634256 6887923
12726F887923n262847k667815J252151K085578N99737J85542J144234N74197k533673
$$ 6887923 1625076 -1042739 209412 2294990 2894727 3080269 4224503 4798700 2265027
12717B265027m788616k584122K325582M089183M05093l813478k904723J631273
$$ 2265027 -2523589 -5107711 -2782129 1307054 1712147 -2101331 -5006054 -3374781
12709c374781L635123J476110m34895K74404J58990l142215n526278k550714K766964
$$ -3374781 260342 1736452 1301557 1575961 1734951 -1407264 -6933542 -9484256 -6717292
12700f717292L915092P28723p68945J781516L469419L85344l642473k580147K602156
$$ -6717292 -2802200 -2073477 -2842422 -1060906 2408513 2793857 -848616 -3428763 -826607
12691h26607N063298J682535k955199l216659M52086L238279K447168l76632k419085
$$ -826607 4236691 5919226 2964027 -252632 199454 3437733 5884901 5508269 3089184
12682C089184j996857J107862M895407N377398P85795m687543n056586p12705
$$ 3089184 1092327 2200189 7095596 12472994 13258789 8571246 3514660 2801955
12674B801955J870900l06451k491655j45319L613090K993347j405007l681689
$$ 2801955 4672855 4366404 1874749 1729430 5342520 8335867 6930860 3249171
12666C249171j138448K872435L901200P73796m182539o746014m212514O83923
$$ 3249171 2110723 4983158 8884358 9658154 5475615 -1270399 -5482913 -4798990
12658d798990K087900m50676l63169N141587Q462710K546105o664093p861317
$$ -4798990 -2711090 -3161766 -3524935 1616652 10079362 12625467 5961374 -1899943
12650a899943j205931K905216N42089j540056P26690K453042J44250j909527l16736
$$ -1899943 -3105874 -200658 341431 -1198625 -471935 1981107 2125357 215830 -100906
12641a00906J148105p88874k714741j363883M82832K22756N49023K905705L038124
$$ -100906 1047199 258325 -2456416 -3820299 -3337467 -3114711 -2565688 340017 3378141
12632C378141q82942l061728Q8786K437013j266501m682728j19732O709088M480689
$$ 3378141 2495199 -566529 -477743 1959270 692769 -3989959 -4109691 2599397 7080086
12623G080086m926198q641255k853577K471095N56443k865243j337254J959992
$$ 7080086 2153888 -6487367 -9340944 -6869849 -6313406 -9178649 -10515903 -8555911
12615h555911J740692R3360J353470L572727K401789n24473j95865K966986L584814
$$ -8555911 -6815219 -6721859 -5368389 -1795662 606127 81654 -114211 2852775 6437589
12606F437589J39541k604448j151539J607379J430990n70826k00417K338574K017909
$$ 6437589 6577130 3972682 2821143 4428522 5859512 5288686 5088269 7426843 9444752
12597I444752k833959o531009l823049J750796K777770o65093j512357K311143
$$ 9444752 6610793 79784 -3743265 -1992469 785301 120208 -1392149 918994
12589I18994M238600L4834m968050m191551Q05474M528847N593659M895014J291877
$$ 918994 5157594 5192428 224378 -3967173 -3161699 1367148 6960807 11855821 13147698
12580A3147698m235800n459822L03134N164003J257102o149471o485426j116173
$$ 13147698 8911898 3452076 3755210 8919213 10176315 4026844 -2458582 -3574755
12572c574755m26259n358905n702262J716510O948074L547043j270031J45188
$$ -3574755 -4001014 -9359919 -15062181 -13345671 -6397597 -2850554 -4120585 -3975397
12564c975397L318632Q27179m529800n093431q70531K243279K520949K612237
$$ -3975397 -656765 170414 -4359386 -9452817 -10323348 -8080069 -5559120 -2946883
12556b946883K930515K080958J284327K025540J921396j185971l940146k251403
$$ -2946883 -16368 2064590 3348917 5374457 7295853 6109882 2169736 -81667
12548h1667J583104K658153J368433J075136Q63982k151119n672950m963886j066921
$$ -81667 1501437 4159590 5528023 6603159 7467141 5316022 -356928 -5320814 -6387735
12539f387735J189045J702163L596753M871906R25386n090977m779388J496469
$$ -6387735 -5198690 -3496527 100226 4972132 5897518 806541 -3972847 -2476378
12531b476378L846639j090378m400023k08752M121141Q27620m651160k922378
$$ -2476378 1370261 279883 -4120140 -4328892 -207751 619869 -4031291 -6953669
12523f953669L512422M898615L70873k073191K36883J742165L3538m72585J910290
$$ -6953669 -3441247 1457368 1828241 -244950 -8067 1734098 1767636 1295051 3205341
12514C205341K511507o33109k615129n09145J300641o68343k530625l85018K168840
$$ 3205341 5716848 5083739 2468610 1959465 3260106 2591763 61138 -323880 1844960
12505A844960M99629k280695n84569L340767K572832k885079n757920k610065
$$ 1844960 2344589 63894 -520675 2820092 5392924 2507845 -3250075 -5860140
12497e860140K027761L563644K758126J512561p00403l485401l626481J02131
$$ -5860140 -3832379 -268735 2489391 4001952 3301549 -183852 -3810333 -3708202
12489c708202L850815L579155L48904j904268j573115K1263J230814J140308l32165
$$ -3708202 142613 3721768 4070672 2166404 593289 614552 1845366 2985674 2653509
12480B653509j751342j227985O60708J099209o63100j816478m59170J112618m3313
$$ 2653509 902167 -325818 334890 1434099 770999 -1045479 -1504649 -392031 -435344
12471d35344k808439l543381r93574K736034N156160N266505L209064j884k612023
$$ -435344 -3243783 -6787164 -7780738 -5044704 111456 5377961 8587025 8585141 5973118
12462E973118l266993k029785J2368J562337J610072K18669j266542j863324k121793
$$ 5973118 2706125 676340 688708 2251045 3861117 4079786 2813244 949920 -1171873
12453a171873k272371q41010K295612L482341J02846l753000k057462L319351
$$ -1171873 -3444244 -4285254 -1989642 1492699 1595545 -2157455 -4214917 -895566
12445h95566M322354q19408m227925l37539N750877O307454J572285k767018m041180
$$ -895566 3426788 2607380 -1620545 -1958084 3792793 10100247 11672532 8905514 4864334
12436D864334l402490j873639k78279m3316n65136N82524K284890K38814m346120
$$ 4864334 1461844 -411795 -690074 -733390 -1298526 -716002 1568888 1807702 -2538418
12427b538418l840584L143592O615499R7157p605331n269429L331907O482918
$$ -2538418 -6379002 -3235410 3380089 3477246 -4128085 -9397514 -6065607 417311
12419D17311L085089R95489J172879j784196n403421j415877P333257P829658
$$ 417311 3502400 4497889 5670768 3886572 -1516849 -2932726 4400531 12230189
12411A2230189k145493r143715n238663M74833j178979m644592j529953M096312
$$ 12230189 10084696 940981 -4297682 -3822849 -5001828 -9646420 -11176373 -7080061
12403g080061L742664n99223j168510J920301K706812Q17829O96662K267206J529081
$$ -7080061 -3337397 -3936620 -5105130 -3184829 -478017 339812 1036474 3303680 4832761
12394D832761j400664k716627j755056o22480Q92973L537850M249982M98896l364258
$$ 4832761 3432097 715470 -1039586 -1662066 -769093 2768757 7018739 7517635 4153377
12385D153377j409904L908793M556380j140945o525796o519646k881197Q51341
$$ 4153377 2743473 6652266 11208646 10067701 3541905 -2977741 -5858938 -5007597
12377e007597L534267M550402L065850M35733p43906o11755j380252k783824k263146
$$ -5007597 -1473330 3077072 6142922 6578655 5834749 5222994 3842742 1058918 -1204228
12368a204228K27387J719699J034253L95108J526223L157860L116413P49312k786625
$$ -1204228 -976841 742858 1777111 2172219 3698442 6856302 9972715 10722027 7935402
12359G935402n002503l677709L17440L194718K889497J411289Q05026j39764k579437
$$ 7935402 2932899 -744810 -427370 2767348 5656845 7068134 7873160 7733396 5153959
12350E153959m451438l888932k432358j496234M14937L229014K924013j467817
$$ 5153959 702521 -3186411 -5618769 -7115003 -6700066 -3471052 -547039 -2014856
12342b014856l809007j04464L739692J367114k321168P70587O514346L913234
$$ -2014856 -5823863 -5928327 -2188635 -821521 -3142689 -2372102 4142244 8055478
12334H055478n826311r429511k184711N168413M227924P53288K166572M683260
$$ 8055478 2229167 -7200344 -9385055 -4216642 11282 764570 2931142 7614402
12326G614402J840279k990237k669310J168339J544346j768620k903834m61043
$$ 7614402 9454681 6464444 3795134 4963473 6507819 4739199 1835365 1374322
12318A374322J184559M12972N37631K819536L610243J81338m892895o911100m193575
$$ 1374322 2558881 2971853 3509484 6329020 9939263 10120601 5227706 -1683394 -5876969
12309e876969O93593L450403K084167p08417o49388K039351K690135l20845k413192
$$ -5876969 -5183376 -1732973 351194 -357223 -1006611 1032740 3722875 3402030 988838
12300I88838j94251K429023M62009l375189k459033K822448M892867K12336n580096
$$ 988838 794587 3223610 3685619 310430 -2148603 673845 5566712 5779048 198952
12291A98952n957756j994973Q17929R59357J847190N259568P619855M570117k444096
$$ 198952 -5758804 -7753777 -6935848 -5976491 -4129301 1130267 8750122 13320239 10876143
12282A0876143o809378m509148J011245L607119K119275J40998n22734j576353
$$ 10876143 4066765 -442383 568862 4175981 6295256 6436254 5913520 4337167
12274D337167l324478l176454o80814P95717j18686m4579K844823M468214J150965
$$ 4337167 1012689 -2163765 -2844579 -2048862 -2167548 -2212127 632696 5100910 6251875
12265F251875l812950n042891l126232k227001k503618j041304J715941K837979
$$ 6251875 2438925 -2603966 -5730198 -7957199 -10460817 -11502121 -9786180 -6948201
12257f948201K771592L830813M033057k28622n677452m533415L111632P459532
$$ -6948201 -4176609 -345796 3687261 3458639 -2218813 -6752228 -3640596 3818936
12249C818936K838891m043968m479097n8659J594136j092490k821715o55082K336665
$$ 3818936 6657827 2613859 -1865238 -1923897 -329761 -1422251 -4243966 -4899048 -2562383
12240b562383K578226L69210j877879k505017j179540J093804K269111J151740
$$ -2562383 15843 385053 -1492826 -3997843 -5177383 -4083579 -1814468 -662728
12232f62728j150695k656289k553091j079118J009486J980029M80515j422043
$$ -662728 -1813423 -4469712 -7022803 -8101921 -7092435 -5112406 -4631891 -6053934
12224f053934L19001N219007O903494J667665n155977o041980j507931K142813
$$ -6053934 -5734933 -515926 6387568 8055233 2899256 -3142724 -4650655 -2507842
12216b507842K888757L716780M311272M03325o936213r437215l119118M840616
$$ -2507842 380915 4097695 8408967 8812292 1876079 -7561136 -10680254 -5839638
12208e839638N822225J151340j939666j392025o04495m93103J289675L997133
$$ -5839638 -17413 1133927 -805739 -2197764 -2802259 -3295362 -2005687 1991446
12200A991446L645635q2694k811466k500626j820622j929427Q7376M570293N831872
$$ 1991446 5637081 5554387 2742921 242295 -1578327 -3507754 -3420378 1149915 6981787
12191F981787J96167o681567o377723O10078N571594L379732j928413m191785
$$ 6981787 7177954 496387 -5881336 -5271258 300336 3680068 1751655 -2440130
12183b440130k812817j046920k16473R07374K473175K624960N19550j906576k323120
$$ -2440130 -5252947 -6299867 -6516340 -5608966 -3135791 -510831 8719 -1897857 -4220977
12174d220977j079882m29822q99263k82970K690236N342043M030854n10298l687548
$$ -4220977 -5300859 -5730681 -6629944 -6912914 -4222678 1119365 5150219 4639921 952373
12165I52373l153433j354804r91881j213404l62986N35412L27n96219O24694K167839
$$ 952373 -2201060 -3555864 -4547745 -5761149 -6124135 -5588723 -5588396 -6184615 -5559921 -3392082
12155c392082J292679j256169k416384j728305j115470n13122J768935M423202
$$ -3392082 -2099403 -3355572 -5771956 -7500261 -8615731 -9128853 -7359918 -2936716
12147b936716L771556q8389k441048q75066J276069N30456j723117k425148j510559
$$ -2936716 834840 746451 -1694597 -2569663 -1293594 -763138 -2486255 -4911403 -6421962
12138f421962m12226J057759L194375M272875K993623R66938R4235k88319j081621
$$ -6421962 -6834188 -5776429 -2582054 1690821 4684444 5651382 5745617 5457298 4375677
12129D375677r35137Q19386J526720o96812k710774o60205L314892L629104l71939
$$ 4375677 3440540 4259926 5786646 5089834 2379060 1718855 5033747 8662851 8290912
12120H290912l511092k333461P97201J786890n00697m188179o234177m431981
$$ 8290912 4779820 2446359 3243560 5030450 4529753 341574 -5892603 -10324584
12112a0324584j09105K174175N44362o07934K755028O578683L995341l060105
$$ -10324584 -10433689 -8259514 -7715152 -8323086 -5568058 1010625 5005966 1945861
12104A945861n542415j151556K204459n38747l782554j387071L190704L627559
$$ 1945861 -3596554 -4748110 -2543651 -3082398 -6864952 -8252023 -5061319 -1433760
12096a433760J373747J707207L657048K243721j973885l790339k328656j460295
$$ -1433760 -60013 1647194 5304242 7547963 5574078 1783739 -544917 -2005212
12088b005212k116901j660140m96400j640638l462283q92534M893608O215647
$$ -2005212 -4122113 -5782253 -6278653 -7919291 -11381574 -12274108 -7380500 -1164853
12080a164853Q77101l511754j080900L704627M021222Q92849o18744l85438j735115
$$ -1164853 -287752 -3799506 -4880406 -1175779 2845443 3738292 3119548 2734110 998995
12071I98995m346050m888138k723610J07893K558187L917766K369027j182050
$$ 998995 -3347055 -8235193 -10958803 -10850910 -8292723 -4374957 -2005930 -3187980
12063c187980j368538L855528P410793K347151o135446o866619M50589M651993
$$ -3187980 -4556518 -700990 6709803 9056954 2921508 -3945111 -3494522 1157471
12055A157471M13779m187211j323072M566269M788451k78818l303813j458095
$$ 1157471 1571250 -2615961 -3939033 627236 5415687 5136869 1833056 374961
12047C74961J253659J208622j023251l182773l353584m78438L670635M513974
$$ 374961 1628620 2837242 1813991 -1368782 -4722366 -5200804 -1530169 2983805
12039B983805J47549m806231m527887K82001L877973L421749J320588L07044L99873
$$ 2983805 3131354 -1674877 -6202764 -5920763 -2042790 1378959 2699547 3006591 3406464
12030C406464R04518J725069K055324P08462j667359l053796k921049k434320
$$ 3406464 4310982 6036051 8091375 8799837 7132478 4078682 1157633 -1276687
12022a276687j991556r59666K61691L86589m40820o59253K87327J358369J524768
$$ -1276687 -3268243 -4227909 -3966218 -3579629 -4020449 -4679702 -4392375 -3034006 -1509238
12013a509238L84280k005836m147321l336827P82296M449631M342610K159756
$$ -1509238 -1124958 -3130794 -7278115 -10614942 -9832646 -5383015 -1040405 1119351
12005A119351J365326J476711M8926j539669o9982K598603J168859m028561o404773
$$ 1119351 2484677 3961388 4010314 2470645 2400663 4999266 6168125 2139564 -4265209
11996d265209l293962K5643n23257j318269J746379N388337M320464L48088n00457
$$ -4265209 -7559171 -7533528 -8056785 -9375054 -7628675 -2240338 2080126 2428214 1927757
11987A927757K450074M105136J715273k121593m274488m206504k405214J77458
$$ 1927757 4377831 8482967 10198240 8076647 3802159 -404345 -2809559 -2632101
11979b632101J296619j19906j135895J443902N010385L760611k281443o114102
$$ -2632101 -1335482 -1455388 -2591283 -1147381 3863004 7623615 5342172 -771930
11971g71930l264317K324935M411390K309009n28311k240945k946019j882171
$$ -771930 -4036247 -1711312 2700078 5009087 4480776 2239831 -706188 -2588359
11963b588359J403304M134418K807282j434111l646401j838751O32631N82768
$$ -2588359 -1185055 2949363 5756645 4322534 676133 -1162618 -529987 52781
11955E2781n52084l6474J325297J034863k60416K12983K155598K379013O87829
$$ 52781 -499303 -535777 789520 1824383 1563967 1776950 3932548 6311561 6999390
11946F999390R03745M040809N106661M89880n277551n423254j196355j1560m100863
$$ 6999390 7903135 11943944 17050605 17540485 12262934 6839680 5643325 5631765 1530902
11937A530902p646405o189126k417446j29088J531120L976885M609348J407915
$$ 1530902 -6115503 -12304629 -14722075 -14851163 -13320043 -9343158 -4733810 -3325895
11929c325895j892539q59334K201967J750910j914491l322152q81546J099623
$$ -3325895 -5218434 -6077768 -3875801 -2124891 -4039382 -7361534 -8243080 -7143457
11921g143457K07359l04767K219198M825874L619575N6131j135815J422279M409499
$$ -7143457 -6936098 -7240865 -5021667 -195793 3423782 3479913 2344098 3766377 8175876
11912H175876M407621J388597k331478m713601m997114l296529m72115J572475
$$ 8175876 12583497 13972094 11640616 6927015 1929901 -1366628 -1838743 -266268
11904b66268Q66181k038707l464721r22538K547013J820838k302044l352538P02889
$$ -266268 599913 -1438794 -4903515 -5826053 -3279040 -1458202 -3760246 -7112784 -6409895
11895f409895L318696m11109m980342k797193K999504L167123k181652l303047
$$ -6409895 -3091199 -3502308 -8482650 -11279843 -8280339 -5113216 -7294868 -10597915
11887a0597915K937975P293875K812393m258594m846750o43634Q62277p23010
$$ -10597915 -7659940 -366065 2446328 -1812266 -6659016 -7302650 -6440373 -7163383
11879g163383q0412K779231K480958j380513k779181N78208L303398J145874k546088
$$ -7163383 -7243795 -4464564 -1983606 -3364119 -6143300 -5565092 -2261694 -1115820 -3661908
11870c661908k613554M93860K730913K308305J46078k617761m330003k524057
$$ -3661908 -6275462 -5781602 -3050689 -742384 -596306 -3214067 -7544070 -10068127
11862a0068127K684816O735017N479230O53108k587457k445413j438419j327322
$$ -10068127 -7383311 -648294 4830936 5484044 2896587 451174 -987245 -2314567
11854b314567j010859P8179K64665j063117j527166M65830K280193L39806m316062
$$ -2314567 -3325426 -3247247 -2982582 -4045699 -5572865 -5107035 -2826842 -2487036 -6803098
11845f803098o753778m151198J476812O433534Q486104O659451J199192m799392
$$ -6803098 -13556876 -17708074 -16231262 -9797728 -1311624 5347827 6547019 1747627
11837A747627o602963k987207J807611L423535K619958K563819L092695J539395
$$ 1747627 -4855336 -7842543 -6034932 -2611397 8561 2572380 5665075 7204470
11829G204470j844314l605553k367412n05305O7980J17950K14100n35717j471341
$$ 7204470 5360156 1754603 -612809 -1118114 -1050134 -932184 -718084 -1253801 -2725142
11820b725142p6949L095251L166685k019959o966056n163963J378983M397711
$$ -2725142 -2802091 293160 3459845 1439886 -5526170 -10690133 -9311150 -4913439
11812d913439P58763l505857k059540K955599M197822p25370o003865n093039
$$ -4913439 -4154676 -7660533 -9720073 -6764474 -2566652 -3292022 -9295887 -14388926
11804a4388926J103919N766902N032291K170907J661286K402167N36426k991455
$$ -14388926 -13285007 -7518105 -2485814 -314907 1346379 3748546 4284972 1293517
11796A293517l150460P64604L300547J483682m36548J312009K872907q29700o287128
$$ 1293517 -1856943 -1092339 2208208 3691890 3255342 4567351 7440258 6610558 323430
11787C23430n395318J950748O636664K833830m479664o972835l128968K177625
$$ 323430 -5071888 -3121140 3515524 6349354 1869690 -5103145 -8232113 -6054488
11779f054488M801655M491182K725381N45333j509139k758666k118192R68213
$$ -6054488 -1252833 3238349 5963730 6509063 4999924 2241258 123066 1091279
11771A091279M626956M963454M79862m975022o391592l839427j289678j71230
$$ 1091279 5718235 10681689 11161551 6186529 -205063 -4044490 -5334168 -5505398
11763e505398J484266L613505L137729k19927k271000r64953J39783j666772k855742
$$ -5505398 -4021132 -407627 2730102 2510175 239175 -725778 -585995 -2252767 -5108509
11754e108509O28573N702161N736007J30248n013133n313432k470617L7264J289586
$$ -5108509 -4479936 1222225 6958232 7088480 2075347 -3238085 -5708702 -5671438 -4381852
11745d381852J844808J725485R87726J16810j004007k591339l166323p49010L501925
$$ -4381852 -2537044 -811559 176167 292977 -711030 -3302369 -6468692 -7217702 -3715777
11736c715777N430649K934236j224982l036905j838760J98950J436753J664386
$$ -3715777 1714872 4649108 3424126 387221 -1451539 -1252589 184164 1848550
11728A848550Q98369m48317p75883R93679K882675J470015l025433n571745k385318
$$ 1848550 2746919 2298602 1522719 2516398 5399073 6869088 3843655 -1728090 -4113408
11719d113408L266155M397013n79965n423479m255185Q61893L499809J873602
$$ -4113408 -847253 3549760 2969795 -2453684 -6708869 -5846976 -2347167 -473565
11711d73565J00008J018640K352191J303544r19691j585684o66803O9942K17936
$$ -473565 -373557 645083 2997274 4300818 3381127 1795443 1128640 1198582 1416518
11702A416518L84628K04340q27566j744564j589164j258463j638461j392718O84217
$$ 1416518 1801146 2005486 1177920 -566644 -2155808 -3414271 -5052732 -6445450 -5761233
11693e761233K548738J496614j067118j263167J040913J715103j082670l689718
$$ -5761233 -3212495 -1715881 -2782999 -4046166 -3005253 -1290150 -2372820 -6062538
11685f062538k191227K034032M377871K733514r61693l590519l381801n52029
$$ -6062538 -8253765 -6219733 -1841862 891652 -70041 -3660560 -7042361 -7594390
11677g594390K802782L923844J887907j190704k178672j4220L379847M793249
$$ -7594390 -4791608 -867764 1020143 -170561 -2349233 -2363453 1016394 5809643
11669E809643K467235j973286m525520k951980L77545J428784q0579p02032J078351
$$ 5809643 8276878 6303592 1778072 -1173908 -796363 632421 551842 -150190 928161
11660I28161K370119N99707k211564k505826m96255O87336P0232k05302J075058
$$ 928161 3298280 3897987 1686423 -819403 -1315658 -628322 -558090 -763392 311666
11651C11666K138301J067110j350333k695023j630632J136171L558992L441811
$$ 311666 2449967 3517077 2166744 -528279 -2158911 -1022740 2536252 5978063
11643E978063J23553m230057n905198l148690J962737N677189O088876M006475
$$ 5978063 6101616 1871559 -4033639 -7182329 -5219592 457597 6546473 10552948
11635A0552948J126330j363752k490358j461269R84203K173447J77772l183534
$$ 10552948 11679278 10315526 7825168 6363899 7348102 9521549 9699321 6515787
11627F515787l880655r07490J883327P06469k976422m546468k550255K5105P89727
$$ 6515787 2635132 1727642 3610969 4317438 1341016 -3205452 -5755707 -5730602 -4940875
11618d940875J040660K621905M448617M224532J886740o59254k027560j864805
$$ -4940875 -3900215 -1278310 3170307 7394839 9281579 8622325 6594765 4729960
11610D729960j13343K357471L365067J581725j538170l539816l814000l176290
$$ 4729960 4616617 6974088 10339155 11920880 10382710 6842894 3028894 -147396
11602a47396j962978o47408r58680l509880n250189k743394K207214L974854Q22476
$$ -147396 -2110374 -2757782 -3716462 -7226342 -12476531 -15219925 -13012711 -9037857 -8215381
11593h215381k606280k101362M87518J186915M15232J572911M560229N098543
$$ -8215381 -10821661 -12923023 -12435505 -11248590 -10833358 -9260447 -4700218 398325
11585C98325J149258l398630l403913Q77180L963521J830487l147068m982469
$$ 398325 1547583 -1851047 -5254960 -4377780 -414259 1416228 -1730840 -6713309
11577f713309j405598L247224L615635L44503j225966Q36525K164916p35679m146920
$$ -6713309 -8118907 -4871683 -1256048 -911545 -2137511 -1300986 863930 128251 -4018669
11568d018669k265353L289629M687081p94491o031193l605780L783593O865034
$$ -4018669 -6284022 -2994393 1692688 898197 -5132996 -8738776 -4955183 1909851
11560A909851J984116m857717o329367k167255K347576L465778K034003P70840
$$ 1909851 3893967 -963750 -7293117 -9460372 -7112796 -3647018 -1613015 -842175
11552h42175R30097J781451J912359N68917j582277k752979j619336J059072K689404
$$ -842175 87922 1869373 3781732 4350649 2768372 15393 -1603943 -544871 2144533
11543B144533J181584k685482n395605l906524P73357L946433K317316j756533
$$ 2144533 3326117 640635 -4754970 -8661494 -7888137 -3941704 -1624388 -3380921
11535c380921k923208J78467L080175J862256j275128j576136J014539K131245
$$ -3380921 -6304129 -6125662 -3045487 -1183231 -2458359 -4034495 -3019956 -888711
11527h88711J34645j418426K40577K560050J725279j615440l772049l183579j036858
$$ -888711 -754066 -2172492 -1931915 628135 2353414 737974 -3034075 -6217654 -7254512
11518g254512J689747M341116M822391J557662k974373m285984j759646Q63032
$$ -7254512 -5564765 -1223649 3598742 5156404 2182031 -2103953 -3863599 -3000567
11510c000567J176379O34300O95041M88802j65859N70170K662741K805031l31982
$$ -3000567 -1824188 -1189888 -494847 -6045 -171904 398266 3061007 5866038 5534056
11501E534056l190996l012082k568411m788649o298075k337607M260368O018787
$$ 5534056 2343060 -669022 -3237433 -8026082 -14324157 -16661764 -12401396 -6382609
11493f382609K063603p63345J132868L159002J015499k371378k303872M37382
$$ -6382609 -4319006 -5082351 -3949483 -790481 225018 -2146360 -4450232 -4012850
11485d012850K206761K354033K091106R23850j327834j947289O61265L066637
$$ -4012850 -1806089 547944 2639050 3562900 2235066 287777 949042 4015679
11477D015679J665734j163511j052813O11088p86107m282701m132362M97506L624487
$$ 4015679 5681413 4517902 3465089 4076177 3290070 -992631 -5124993 -4627487 -1003000
11468a003000J779416j137056q23471J198227J498874K14717p89490j422677j907183
$$ -1003000 776416 -360640 -1184111 14116 1512990 1727707 938217 -484460 -2391643
11459b391643j231250K05225n4820j971552j894263J127390K650019K47399j514826
$$ -2391643 -3622893 -3417668 -3472488 -5444040 -7338303 -6210913 -3560894 -3313495 -4828321
11450d828321J251262M081367J134135m111905l650690J749958L488185o41248
$$ -4828321 -3577059 504308 1638443 -2473462 -6124152 -4374194 -886009 -1527257
11442a527257k889680J263598N398856K565707l726958n375853j866057K31319
$$ -1527257 -4416937 -3153339 2245517 4811224 1084266 -4291587 -6157644 -5926325
11434e926325k247796n180889l688012J715180O253125O025849J745389j931916
$$ -5926325 -8174121 -13355010 -17043022 -15327842 -9074717 -3048868 -1303479 -3235395
11426c235395j588018O18894J69947k537356k470953J427486L452147J32531l413332
$$ -3235395 -4823413 -4204519 -4034572 -6571928 -9042881 -7615395 -4163248 -4030717 -7444049
11417g444049j256672L661773M176906K66899j542754J080576L430509J947611
$$ -7444049 -8700721 -5038948 -862042 -595143 -2137897 -1057321 2373188 4320799
11409D320799j349289l647316m573440l449748P03934M857466L843381j263608
$$ 4320799 2971510 -675806 -5249246 -8698994 -7995060 -3137594 705787 -557821
11401e57821l038767J049027M126219J076980k731817n01112M131772K942419
$$ -557821 -3596588 -2547561 1578658 2655638 -76179 -577291 3554481 6496900
11393F496900k877759m337011P82112M675236K239422j768025j588714R37184
$$ 6496900 3619141 -717870 64242 4739478 6978900 5210875 3622161 4559345
11385D559345J190703n90754j582185j923837k887477k833430q0703K725753K091386
$$ 4559345 5750048 5159294 3577109 1653272 -1234205 -4067635 -4148338 -1422585 668801
11376F68801m71135r85959K80663j2963j510729m70361L005695M036345Q00125
$$ 668801 197666 -788293 -507630 -520593 -2031322 -2501683 504012 4540357 5340482
11367E340482k158153j116043J060122j4705l088174l597904r28788J205625Q18761
$$ 5340482 3182329 2066286 3126408 3111703 23529 -3574375 -4503163 -3297538 -2478777
11358b478777q9484L53014J061425N45607l22842p641O99896l80401k977070l512969
$$ -2478777 -2568261 -2215247 -1153822 -608215 -931057 -938698 -238802 -619203 -3596273 -7109242
11348g109242M24421N646919N883684l23079o550660n760752Q53682N627838M433390
$$ -7109242 -6684821 -1037902 4845782 4522703 -2027957 -7788709 -6935027 -1307189 3126201
11339C126201Q09219n89120j40555m05726r59814J42587K105992K560002J720239
$$ 3126201 3935420 3346300 3205745 2800019 1840205 1982792 4088784 6648786 8369025
11330H369025J722068K481404J690502j151308l742694m254353l123805j433326
$$ 8369025 10091093 12572497 14262999 13111691 9368997 5114644 1990839 557513
11322E57513K51523J246986R06053m15859j854447k923876k725847N0258M242404
$$ 557513 809036 2056022 2962075 2546216 691769 -2232107 -4957954 -4907696 -665292
11313f65292N408111J147167m456471n565899k348128M54334J445062L385665
$$ -665292 4742819 5889986 1433515 -4132384 -6480512 -6026178 -4581116 -1195451
11305a195451O165552N344266m41219o172026p218625m749985j752947J558989
$$ -1195451 4970101 10314367 9873148 3701122 -3517503 -8267488 -10020435 -8461446
11297h461446M973519N450309J530560k659859k294992J469585L571806J874040
$$ -8461446 -3487927 1962382 3492942 833083 -1461909 7676 3579482 5453522
11289E453522j538801l981738l872559q13943K981876L610762P53653q92335J194735
$$ 5453522 3914721 -67017 -3939576 -4753519 -1771643 1839119 2592772 1700437 2895172
11280B895172K549160j044159n266155k987730M023609O847564K405784k995991
$$ 2895172 5444332 4400173 -865982 -3853712 169897 7017461 9423245 6427254
11272F427254m078908k976514k756427j643620K132238N328418M495259J793054
$$ 6427254 2348346 -628168 -3384595 -5028215 -2895977 2432441 6927700 8720754
11264H720754J108730J494307l89581l492090l587837n87322P31306j769986l880146
$$ 8720754 9829484 11323791 10934210 7442120 3854283 3266961 3998267 2228281 -1651865
11255a651865j181503M153951N904801K002209k889546l512065l48009J928098
$$ -1651865 -2833368 1320583 7225384 9227593 6338047 2825982 2477973 4406071
11247D406071R31944j156276j725583j131789o41395K37956J880098K160904o89942
$$ 4406071 5338015 4181739 2456156 1324367 682972 920928 2801026 4961930 4271988
11238D271988m102216l740113K71934L270538K333953q00721l363509m354722
$$ 4271988 169772 -3570341 -3298407 -27869 2306084 1505363 -1858146 -6212868
11230f212868l074187R67214N101301M626513o03104m397219k157866K671295
$$ -6212868 -9287055 -8319841 -3218540 1407973 804869 -3592350 -5750216 -3078921
11222c078921L783881Q07306j574297j339482q42375j397343j264050K31852J101308
$$ -3078921 704960 1512266 -62031 -1401513 -2243888 -3641231 -4905281 -4673429 -3572121
11213c572121P63486J703584M751462O136009K479326l521748n948136l157196
$$ -3572121 -2808635 -1105051 3646411 9782420 12261746 8739998 2791862 -365334
11205c65334Q16546J999246N24597j311686k052397j131921J433490L839439L232461
$$ -365334 451212 2450458 2975055 1663369 -389028 -1520949 -87459 3751980 6984441
11196F984441l41924k742429j060825J660682O53208k688381k013765L954373
$$ 6984441 6642517 3900088 2839263 4499945 5153153 2464772 451007 4405380
11188D405380P728320K869962o142621q890974k461338N310842O543358K378587
$$ 4405380 12133700 15003662 8861041 -29933 -2491271 2819571 9362929 11741516
11180A1741516r29574j042173o38752j442064j801434o40314J35133r42211k019115
$$ 11741516 10811942 9769769 9131017 7688953 5887519 5247205 5382338 4440127 2421012
11171B421012j177194l21006k132776m501069k752411K451368M904628K393592
$$ 2421012 1243818 922812 -1209964 -5711033 -8463444 -6012076 -1107448 1286144
11163A286144O60628L933296P077481L512540l362715m884898q67600P54012k363130
$$ 1286144 1946772 5880068 12957549 16470089 13107374 8222476 7354876 8108888 5745758
11154E745758l764917n91940J192296j732658l155179J651905O655911M767432
$$ 5745758 1980841 1388901 2581197 848539 -2306640 -654735 6001176 10768608
11146A0768608n00189k021064j353203l889345o808076l296251M209249O634636
$$ 10768608 10268419 8247355 6894152 3004807 -3803269 -7099520 -2890271 3744365
11138C744365K794146j4366N38124n51059l741697k804656K769760M861677L89648
$$ 3744365 6538511 6524145 7062269 6511210 2769513 -35143 2734617 7596294 7985942
11129G985942l133496j036359K77083m387617q409611m149743L506951M633024
$$ 7985942 4852446 3816087 4093170 -294447 -8704058 -12853801 -9346850 -4713826
11121d713826j60923j972253J841273N233085M250470J455400m51004j987444
$$ -4713826 -4874749 -6847002 -5005729 227356 4477826 5933226 5482222 3494778
11113C494778l074716j903576J219244L385878L083168J157327j751240m923492
$$ 3494778 420062 -1483514 -264270 3121608 6204776 7362103 5610863 687371
11105F87371n518457j343205M353251N308496L97190m280870k910989L006571
$$ 687371 -4831086 -6174291 -1821040 3487456 3884646 -396224 -3307213 -300642
11097c00642O757811M221531j795857n013757k835455J158545K538838J651825
$$ -300642 6457169 10678700 8882843 3869086 1033631 2192176 4731014 6382839
11089F382839J218648O20360k378820n325450l137600K859533N133390J272351
$$ 6382839 7601487 8221847 5843027 517577 -2620023 239510 5372900 6645251
11081F645251k313216j247859J93712j781432k811233J131489M715062J447845
$$ 6645251 4332035 3084176 3277888 1496456 -1314777 -183288 4531774 5979619
11073E979619m601541m807070K35847K713872P48680k84451J711351L099925K297266
$$ 5979619 1378078 -3428992 -3193145 -479273 269407 -15044 1696307 4796232 7093498
11064G093498J508077Q20593j496534l338779j524375P14430k004354o294534
$$ 7093498 8601575 9422168 7925634 4586855 3062480 3776910 1772556 -4521978
11056d521978l756092M111775O355746Q4710m507920j010093L124951J55468m846096
$$ -4521978 -8278070 -4166295 2189451 2274161 -2233759 -3243852 -118901 36567 -4809529
11047d809529l367920K341854M272173J900399O98421J588144J289001L53648
$$ -4809529 -8177449 -5835595 -1563422 336977 1035398 2623542 3912543 4266191
11039D266191J841843L634454O69420n615723p967020l953738R92946K187683
$$ 4266191 6108034 9742488 10411908 4796185 -3170835 -7124573 -6131627 -3943944
11031c943944J126586Q00366J057987P58573K79654j14600j085291k013783j098061
$$ -3943944 -2817358 -2016992 -959005 -200432 79222 -35378 -1120669 -3134452 -4232513
11022d232513J250518K201446P90161n87296j10790R26010P86957j95013j099311
$$ -4232513 -2981995 -780549 9612 -577684 -688474 237536 1024493 829480 -269831
11013b69831j878138k059962n81115J689574J974737j34082j235440P59902K845972
$$ -269831 -2147969 -4207931 -4789046 -3099472 -1124735 -1258817 -2494257 -1734355 1111617
11004A111617J376444k035829l004675j241425l89976j406538j033445K071242
$$ 1111617 2488061 452232 -2552443 -3793868 -4183844 -5590382 -6623827 -4552585
10996d552585M344493K821652j84983r49786K12541P90504P22330J191922Q84970
$$ -4552585 -208092 2613560 2428577 1478791 1691332 2481836 3204166 4396088 5281058
10987E281058j896435m649547l300690Q72980K209352q09972l310241j970882
$$ 5281058 3384623 -1264924 -4565614 -3692634 -1483282 -2293254 -5603495 -7574377
10979g574377j0090j195805l212829j164289M787799R148544P532023J028525
$$ -7574377 -7584467 -8780272 -11993101 -13157390 -8369591 778953 8310976 9339501
10971I339501n074160n843615j373731K770966J957230j135425l45753M152044
$$ 9339501 4265341 -1578274 -2952005 -181039 1776191 640766 295013 4447057
10963D447057N693592J882359j481526l71941P31572k691385o467773m440091
$$ 4447057 10140649 12023008 10541482 10169541 10901113 8209728 1741955 -2698136
10955b698136J032413L050076J188756N73489K167174J944200j095438l289401
$$ -2698136 -1665723 1384353 2573109 3146598 5313772 7257972 6162534 2873133
10947B873133k645771q59710O79234J679971Q81937j577984j679336K741385O271987
$$ 2873133 227362 -632348 46886 1726857 2608794 1030810 -648526 2092859 8364846
10938H364846K954969l463710m640069j034237m77975l950375l621166L122659
$$ 8364846 11319815 7856105 3216036 2181799 1703824 -2246551 -5867717 -2745058
10930b745058Q182941N199711j345913m196636l151001j939459j337273k59973
$$ -2745058 5437883 10637594 9291681 5095045 1944044 4585 -1332688 -1592661
10922a592661P19774P10361l2745j629497l666258k950974K105518N776513J692795
$$ -1592661 -872887 -162526 -195271 -1824768 -5491026 -8442000 -6336482 -559969 1132826
10913A132826n297311m256916L934120O187819j679317o950453l97910Q175051
$$ 1132826 -4164485 -8421401 -4487281 1700538 21221 -6929232 -7327142 847909
10905H47909N636285l616531n744172N31028M110214M37067l183911j234655K283394
$$ 847909 6484194 2867663 -2876509 -2345481 1764733 2201800 -982111 -2216766 66628
10896F6628J958735j293323l193666j723138J598098L055390J77572l874695k624824
$$ 66628 2025363 732040 -2461626 -4184764 -2586666 468724 646296 -3228399 -5853223
10887e853223L957390P170196J931825m571784l636458J408104J678460j920909
$$ -5853223 -1895833 5274363 7206188 2634404 -1002054 406050 2084510 163601
10879A63601j131984M196377N292996k60239m104621j170703J982426j824765
$$ 163601 -968383 3227994 8520990 8260751 4156130 2985427 4967853 3143088
10871C143088q731447r526419k442458N410218P302032L557874l43393j50935
$$ 3143088 -5588359 -15114778 -17557236 -12147018 -4844986 -1287112 -1630505 -1781440
10863a781440K882475M179681K143674j37125n96997j536174m151690m429342
$$ -1781440 1101035 5280716 7424390 7287265 6690268 5154094 1002404 -3426938
10855c426938J97542M321381J695334m267982n105929k56851L310064L229360
$$ -3426938 -3229396 1091985 2787319 -1480663 -6586592 -6843443 -3533379 -304019
10847c04019L905512O148024M658210j597323n708875l546391k98407j580479
$$ -304019 3601493 9749517 14407727 12810404 7101529 3555138 3256731 1676252
10839A676252m686726l903606O91497M716469N744191M004613M46046k624995
$$ 1676252 -3010474 -6914080 -6222583 -1506114 4238077 8242690 8688736 6063741
10831F063741k595708p99019j568290m911585n409037j193464K000682j61800
$$ 6063741 3468033 2669014 1100724 -3810861 -9219898 -10413362 -8412680 -8574480
10823h574480l465133k234951J650446K912098J690917J638507K544964J624065
$$ -8574480 -12039613 -14274564 -12624118 -9712020 -8021103 -6382596 -3837632 -2213567
10815b213567k63401k42547O54630k92894j170965J519056M698252J783928n630216
$$ -2213567 -2476968 -2719515 -2064885 -2357779 -3528744 -2009688 2688564 4472492 -1157724
10806a157724p767636j036653N574105L306445l683374n071505N05626M798655
$$ -1157724 -8925360 -9962013 -4387908 -1081463 -4764837 -9836342 -9330716 -4532061
10798d532061K972366m24164m4728K085070R72126k644194l139741J314136N508034
$$ -4532061 -1559695 -1983859 -2028587 56483 1028609 -1615585 -4755326 -3441190 2066844
10789B066844M056641j494050m905894l243371J44481Q59790p55144q25478K109176
$$ 2066844 6123485 4629435 -276459 -3519830 -3375349 -2515559 -3270703 -4096181 -1987005
10780a987005M775836L625573j36800k109932q62817J69188j871292m519149l559558
$$ -1987005 2788831 6414404 6277604 4167672 3304855 3474043 1602751 -2916398 -6475956
10771f475956J69240J534925j222300l797535k379129J010630K483620K165079
$$ -6475956 -6306716 -4771791 -5994091 -9791626 -12170755 -11160125 -8676505 -6511426
10763f511426K266965J975135q41895m206567l690781M77721L190410K305288
$$ -6511426 -4244461 -2269326 -3111221 -7317788 -11008569 -10530848 -7340438 -5035150
10755e035150J498111L246285M213029J269498k358688j993999O06540K07667
$$ -5035150 -3537039 -290754 3922275 5191773 2833085 839086 1445626 1653293
10747A653293k751454k621920J632022L924441P41062k868083j306801K538108
$$ 1653293 -1098161 -3720081 -2088059 1836382 2577444 -290639 -1597440 940668
10739I40668K186296j801653l105399l80290P81384k243947m353508j115559L959409
$$ 940668 3126964 1325311 -1780088 -2160378 -1378994 -3622941 -7976449 -9092008 -5132599
10730e132599N132290K957809J840850K322148J504556p98128k028581j998564
$$ -5132599 -309 2957500 4798350 7120498 8625054 7826926 5798345 3799781
10722C799781k599091k903108j44683M108027M373243p24893n741636n640723
$$ 3799781 1200690 -1702418 -1847101 2260926 6634169 5909276 167640 -5473083
10714e473083j584113K406525M558381M798574K732388r31179l435850k991918
$$ -5473083 -7057196 -4650671 -92290 4706284 7438672 6507493 3071643 79725
10706G9725j017805K12822K89949j15790o27175p02144R7818O78811m44338k188043
$$ 79725 -938080 -725258 -435309 -551099 -1178274 -1880418 -1782600 -1103789 -1548127 -3736170
10696c736170j835061O49929K295369J667684N68418N65251J014004J116434Q46716
$$ -3736170 -5571231 -4921302 -2625933 -958249 -389831 175420 1189424 2305858 3152574
10687C152574l51728k523378l306785j042647J131231o18441l539610j595477
$$ 3152574 2800846 277468 -3029317 -4071964 -2940733 -3559174 -7098784 -8694261
10679h694261M149283O063218J969039j485924N0685K242789N80131k174006j708910
$$ -8694261 -4544978 1518240 3487279 2001355 2052040 4294829 4874960 2700954 992044
10670I92044R75652K850621L275799J682290k727123n958346j928991O049129
$$ 992044 1967696 4818317 8094116 9776406 7049283 1090937 -838054 5211075
10662E211075O050229m511180j1967832n700341N407241O561967j052831m694413
$$ 5211075 11261304 6750124 -5217708 -10918049 -5510808 1051159 -1672 -4696085
10654d696085p28109K716971J137509j212651j318846j311697j542341O60179
$$ -4696085 -5424194 -2707223 -1569714 -2782365 -4101211 -5412908 -6955249 -6295070
10646f295070M159296M218469N71621j996746j675963j297020j720031n07394
$$ -6295070 -2135774 2082695 2654316 657570 -1018393 -2315413 -4035444 -4542838
10638d542838K182470K842254O71579j105514n78790Q65579J826005J991218Q36369
$$ -4542838 -2360368 481886 1153465 47951 -530839 334740 2160745 4151963 4988332
10629D988332r63946o92504K023156K961446l00197l678431l215806j606669k131179
$$ 4988332 4024386 3331882 5355038 8316484 8016287 4337856 1122050 -484619 -2615798
10620b615798j675257K567184N139902O05527n106576k693001M615085N164802
$$ -2615798 -4291055 -1723871 3416031 4021558 -1085018 -3778019 837066 6001868
10612F001868k602470p886229m274904K458246N150312L974388J831648n78642
$$ 6001868 3399398 -4486831 -8761735 -6303489 -1153177 2821211 4652859 4074217
10604D074217k289397j340097J266200K022157J61782j887179k516804j328669
$$ 4074217 1784820 444723 1710923 3733080 3894862 2007683 -509121 -1837790
10596a837790J997091M946910K661509l703566n365741O18384M253066j696681
$$ -1837790 159301 5106211 7767720 4064154 -1301587 -683203 3569863 1873182
10588A873182p846494k916343O000463M329398m801599n248407M796172J0018785
$$ 1873182 -5973312 -8889655 -2889192 1440206 -3361393 -8609800 -3813628 6205157
10580F205157L651554l269999k264955N96470j061558l327954k560629k849359
$$ 6205157 9856711 6586712 4321757 4918227 3856669 528715 -2031914 -4881273
10572d881273n772439m804400K826126R165849P182978M96244l944148m574703
$$ -4881273 -10653712 -15458112 -12631986 -3466137 3716841 4213085 268937 -4305766
10564d305766k407892K126430N863559M361670o31935k726090q59182N38051Q62993
$$ -4305766 -6713658 -4587228 1276331 5638001 5006066 2279976 1420794 1958845 2821838
10555B821838K977148M458851N55183m862038l630002J964882K031870l622992
$$ 2821838 5798986 10257837 10813020 5950982 2320980 4285862 6317732 2694740
10547B694740n240736m99509K583198J099896O88696K254559L00410m054403l389608
$$ 2694740 -2545996 -3045505 -462307 637589 1326285 3580844 3881254 -173149 -3562757
10538c562757J583392K940893R64100K625594N504760J075276o745030n852820
$$ -3562757 -1979365 961528 1925628 4551222 10055982 11131258 4386228 -1466592
10530a466592J676550K378550l699046l528979L124681K940774m437494m819901
$$ -1466592 209958 2588508 -1110538 -4639517 -1514836 1425938 -3011556 -7831457
10522g831457L055765N065353l61433J85884O461356L585683o518497n249172
$$ -7831457 -4775692 289661 -71772 114112 6575468 10161151 3642654 -1606518
10514a606518O234532N862010p653696r989826L367840P649838m132591p967053
$$ -1606518 4628014 10490024 2836328 -7153498 -3785658 3864180 -268411 -8235464
10506h235464L539640O322859n850842o445936R906630J1623120q368813j3250329
$$ -8235464 -4695824 1627035 -4223807 -10669743 -763113 10860007 2491194 -10759135
10498a0759135P630895J3422465r021938j2855212J7046893K2006428j9511683
$$ -10759135 -3128240 10294225 1272287 -11582925 5463968 27470396 7958713
10491G958713l0925602K3291450L3072436r0963310k21819743j57860542O8197142
$$ 7958713 -22966889 324561 33396997 -57566313 -279386056 -437246598 -369049456
10484c69049456K05967510J31718244k880977k4393358K9035995L0795883j6091861
$$ -369049456 -163081946 -31363702 -34244679 -58638037 -29602042 1193841 -14898020
10477a4898020k1807951J6276997K3999401p971665j8160835P429636J8425995
$$ -14898020 -36705971 -20428974 3570427 -4401238 -22562073 -15132437 3293558
10470C293558j588450j1956345L968382J3345191N07319q090686J004935N962805
$$ 3293558 1705108 -10251237 -6282855 7062336 7569655 -521031 483904 6446709
10462F446709l432897p056157L332658P722021k552766q592962n14827N512224
$$ 6446709 3013812 -4042345 -709687 7012334 4459568 -4133394 -4648221 864003
10454H64003n47864n660838r92540L032033K1272o09793M798689N344054k581881
$$ 864003 316139 -5344699 -6337239 -3305206 -3283934 -3893727 904962 6249016 3667135
10445C667135p245069l151625O53454M9368K286198P412338M899906n067983q133320
$$ 3667135 -3577934 -6729559 -6076105 -6026737 -3740539 3671799 8571705 3503722 -4629598
10436d629598k32461M915017j20585m705351m80293M949535L550069p1182K07732
$$ -4629598 -4862059 52958 -67627 -4772978 -5253271 -303736 3246333 3175151 3382883
10427C382883J682876R44502Q3348m63763l355157n492868p77184O103330L379476
$$ 3382883 5065759 6010261 6093609 5629846 2274689 -3218179 -3995363 2107967 5487443
10418E487443p548982j1366046k421968O837937O407657K121366J682628J856098
$$ 5487443 -2061539 -13427585 -15849553 -9011616 -2603959 -482593 1200035 3056133
10410C056133j979114n637286m018283L23122L282629N320592O368869L386825
$$ 3056133 1077019 -4560267 -8578550 -8255428 -4972799 347793 6716662 10103487
10402A0103487k525893n154992k980741j398305k491827j981400J143917K014497
$$ 10103487 7577594 2422602 -558139 -1956444 -4448271 -6429671 -5285754 -3271257
10394c271257l30809p99628J301538L90591l643435l106272L819452Q155364M246996
$$ -3271257 -3602066 -4401694 -3100156 -2709565 -6353000 -9459272 -5639820 2515544 6762540
10385F762540j453356j679525R00830O30355j558848j993668j099476o91468N1390
$$ 6762540 5309184 3629659 4530489 5160844 3601996 1608328 508852 -182616 -131226
10376a31226J453263J358769m37762j060316p8591l14495j572480l08437K941970
$$ -131226 1322037 2680806 2243044 1182728 1104137 789642 -782838 -1091275 1850695
10367A850695L268308K66443p71387J292084R05069l752383o296408k390012L016382
$$ 1850695 5119003 5385446 4614059 5906143 6811212 3058829 -3237579 -5627591 -2611209
10358b611209L523856K02494j921002j230402N94716J969426J847665K77924l52685
$$ -2611209 912647 1115141 -805861 -2036263 -1441547 527879 2375544 2653468 2300783
10349B300783J475965K460128q74687m690154k310471M281729O015495O80183
$$ 2300783 3776748 6236876 5362189 672035 -1638436 2643293 8658788 9338971
10341I338971l654941j461252K551346K020028k132322n172560n096827k559169
$$ 9338971 5684030 4222778 6774124 8794152 6661830 1489270 -3607557 -6166726
10333f166726Q12816K191083M07161o30704K966954P240898M969671k380520n901199
$$ -6166726 -5353910 -3162827 -2755666 -3386370 -419416 6821482 11791153 9410633 3509434
10324C509434k777691P02024P37190O50928J770905n884m858932o055215j070414
$$ 3509434 731743 1433767 2170957 2821885 4592790 4586906 -272026 -6327241 -7397655
10315g397655L167253J361011j986755j100611J774349J633279q86233k105347
$$ -7397655 -4230402 -2869391 -4856146 -5956757 -4182408 -2549129 -3435362 -5540709
10307e540709j321481M01798K713197L701933N05384m610851m819206J154572
$$ -5540709 -6862190 -6460392 -3747195 -45262 460122 -4150729 -8969935 -7815363
10299g815363N817252L658720j284153k854895j404838k16181P19438K142247
$$ -7815363 -1998111 1660609 376456 -2478439 -3883277 -4099458 -3380020 -1237773
10291a237773J996307m10526j417402J009629K847310L40454l502174l560128
$$ -1237773 758534 348008 -1069394 -59765 2787545 3127999 -374175 -3934303
10283c934303r5515K850662L332807J935993n01405k252016j016127K193750K922051
$$ -3934303 -4029818 -1179156 2153651 4089644 3588239 1336223 320096 2513846 5435897
10274E435897l25652l307499k315896P45963K349661K388500K146470R29026j902557
$$ 5435897 5110245 1802746 -513150 232813 2582474 4970974 7117444 8046470 6143913
10265F143913m322228l970744j182800J925281L492938K597586J86366j113647
$$ 6143913 1821685 -2149059 -3331859 -1406578 2086360 4683946 4870312 3756665
10257C756665n98534j017547l193812k746765K369413N561079J022740m784044
$$ 3756665 3158131 2140584 -1053228 -3799993 -1430580 4130499 5153239 369195
10249C69195k032295N169146M025709n090729p720344R24364P453906K138198
$$ 369195 -1663100 3506046 7531755 2441026 -5279318 -4354954 3098952 5237150
10241E237150n803536m408472K328676L567362n54840k387255o28643Q66822K282930
$$ 5237150 -566386 -4974858 -2646182 921180 366340 -2020915 -2649558 -1782736 500194
10232E00194N072167N178251n93322o156669m372452O86406K31965m373662m486080
$$ 500194 5572361 10750612 10157290 4000621 -371831 314575 546540 -3827122 -8313202
10223h313202P49152L787525K189621J492791L948435M791719J743244r27698
$$ -8313202 -7564050 -3776525 -1586904 -94113 3854322 8646041 10389285 9461587
10215I461587o31868p51912l328099m481334j389232J796941N6341m083553l511192
$$ 9461587 8829719 8077807 4749708 268374 -1120858 676083 732424 -3351129 -6862321
10206f862321L188817Q878935O560291j578616o492985l517074J956541K329370
$$ -6862321 -3673504 5205431 11765722 10187106 3694121 177047 2133588 4462958
10198D462958j656709l056138R5205K309096J88401k441551j807994l27794j241655
$$ 4462958 2806249 -249889 -154684 2154412 2342813 -98738 -1906732 -2234526 -3476181
10189c476181k418243n83979K371294K568786N74155k68670M37544N83435j67311
$$ -3476181 -5894424 -6478403 -4107109 -1538323 -964168 -1232838 -795294 -211859 -379170
10180c79170m96468l23370m58739r02348j635029k882595l024413L83887N673375
$$ -379170 -875638 -1199008 -1657747 -2560095 -4195124 -7077719 -10102132 -9718245 -4044870
10171d044870P302301L432730j164197k434232k259975l053374k660562P05010
$$ -4044870 3257431 6690161 5525964 3091732 831757 -2221617 -4882179 -4177169
10163d177169L456351J983262j144260j790120j207121k539624l775883o60037
$$ -4177169 -720818 1262444 118184 -1671936 -2879057 -5418681 -9194564 -9854601
10155i854601N373152Q173380M913345j367546o142400o676340k720007K560412
$$ -9854601 -4481449 3691931 8605276 7237730 1095330 -5581010 -8301017 -5740605
10147e740605M350392J953026J36225J870300L581529J455627j854503k006224
$$ -5740605 -1390213 562813 699038 2569338 6150867 7606494 5751991 3745767
10139C745767p19811k624832o804911p697881l373456K326969N359914N008224
$$ 3745767 3025956 401124 -6403787 -14101668 -17475124 -15148155 -9788241 -4780017
10131d780017K555401k9754q52973j47593k06106j474461j407162Q31925K260077
$$ -4780017 -2224616 -2254370 -3107343 -3254936 -3461042 -4935503 -6342665 -5510740 -3250663
10122c250663J253561N67096J971643K517196Q2781k110610j171012j7423j929203
$$ -3250663 -1997102 -1430006 541637 3058833 3141614 1031004 -140008 -157431 -2086634
10113b086634m155119k883799m05042p56735j818304J143935O584929Q398429
$$ -2086634 -6241753 -9125552 -9530594 -10287329 -12105633 -10961698 -4376769 4021660
10105D021660N055165P61005j408625k013987k008463j892940k830478m430720
$$ 4021660 9076825 9837830 8429205 6415218 4406755 2513815 -316663 -4747383
10097d747383l483057J073477M844827M070153J524497J328886J786146n89713
$$ -4747383 -8230440 -7156963 -2312136 1758017 3282514 4611400 6397546 5807833
10089E807833l610378k873742K34894J037269l27404k44027J079822O94455n45737
$$ 5807833 2197455 -676287 -441393 595876 268472 24445 1104267 1798722 1252985
10080A252985M63986K495887J799807q66998j611327l55218O674l90383K30835
$$ 1252985 1716971 4212858 6012665 5145667 3534340 3179122 3185796 2795413 3026248
10071C026248J14047k743941m580971j046400L897517L007871k107604l425812
$$ 3026248 3140295 396354 -4184617 -5231017 -1333500 1674371 -433233 -3859045
10063c859045J0579J354707j238455j871089J418573K879554J6090j677960Q61495
$$ -3859045 -3848466 -2493759 -3732214 -5603303 -4184730 -1305176 -1289086 -2967046 -2105551
10054b105551K406758p24784l290360M3333N221393N088557L16682k617763j182869
$$ -2105551 301207 -423577 -3713937 -3670604 1550789 6639346 6956028 4338265 3155396
10045C155396J361457J920523N84087j237161k273418j753554l13259N37336P68507
$$ 3155396 4516853 6437376 7021463 5784302 3510884 1757330 1444071 1981407 2749914
10036B749914J744101L247669L209519J063718j341557k629387k811171j359677
$$ 2749914 4494015 7741684 10951203 12014921 10673364 8043977 5232806 3873129
10028C873129K014191M579155K772792k270088n584749n328563m307161l918989
$$ 3873129 5887320 10466475 13239267 10969179 5384430 55867 -4251294 -8170283
10020h170283j945732J986250M221951L046910J877965L206976L932779P96961
$$ -8170283 -10116015 -8129765 -3907814 -860904 1017061 4224037 8156816 8953777
10012H953777l364603l605653n51607Q54629r45391k392009q48503J684984K158608
$$ 8953777 5589174 1983521 1431914 2286543 1341152 -1050857 -1899360 -214376 1944232
10003A944232Q49784J60549O70091P02610m90308j382007q54277k87661j156671
$$ 1944232 2794016 2954565 3624656 4327266 3836958 2454951 1600674 1313013 156342
9994A56342k064548q71163J196415J019948j106186j696339q5260K91374j964506
$$ 156342 -1908206 -2779369 -1582954 -563006 -1669192 -3365531 -3450791 -3159417 -5123923
9985e123923l459851j718961P94082J262139R47734J789826K539085J770802R94920
$$ -5123923 -8583774 -10302735 -9508653 -8246514 -7298780 -5508954 -2969869 -1199067 -204147
9976b04147J314491Q15473j314213k231604n17298P46321l86077j163785j31111
$$ -204147 1110344 1925817 611604 -1620000 -2137298 -1390977 -1777054 -2940839 -3071950
9967c071950n82812l303891k875289K589155N515079O43573m682022j845456M276304
$$ -3071950 -3654762 -6958653 -9833942 -7244787 -1729708 -1086135 -5768157 -7613613 -3337309
9958c337309L664203j389916q68983M505546M351175k599316n782575q08760L719896
$$ -3337309 326894 -1063022 -1932005 2573541 6924716 4325400 -1457175 -2265935 1453961
9949A453961J283532l027427l162665j536832j965044k190393N22137L530839
$$ 1453961 2737493 -289934 -3452599 -4989431 -6954475 -9144868 -8622731 -5091892
9941e091892L787052K573830J314548j225645m211119l688594L47082K267453
$$ -5091892 -1304840 1268990 2583538 1357893 -2853226 -6541820 -6194738 -3927285
9933c927285m40391l089293j794116Q01300J287885P76297Q06002o6313j916934
$$ -3927285 -4367676 -7456969 -9251085 -8449785 -7161900 -6385603 -5579601 -5645914 -7562848
9924g562848j377939K416971N143650M028828K115034K391786K663718j52110
$$ -7562848 -8940787 -6523816 -1380166 2648662 4763696 7155482 9819200 9667090
9916I667090m762558p499442o229076r92630N305840O910548J385530m625642
$$ 9667090 4904532 -2594910 -8823986 -9816616 -4510776 2399772 3785302 -840340
9908h40340k813816L853434M376372l146850p840478k788762M662976M878999
$$ -840340 -3654156 199278 4575650 1428800 -6411678 -9200440 -4537464 341535
9900C41535m54379l386458j577457J677484M143740N179153L476244o52385l875006
$$ 341535 -112844 -3499302 -5076759 -3399275 744465 5923618 9399862 8747477 4872471
9891D872471m187213l226298k063253P74470M934361O763295M315534m82001n275045
$$ 4872471 685258 -2541040 -4604293 -3829823 1104538 7867833 12183367 11701366 6426321
9882F426321p997377n392664K181645O587213K037403l209384J616169Q488744
$$ 6426321 -1571056 -6963720 -4782075 1805138 3842541 633157 2249326 10738070
9874A0738070r54763k3015808k9366455o787067K0402338K3189214O816963k448236
$$ 10738070 9783307 -13232501 -42598956 -49386023 -28983685 -5794471 1022492 -1425744
9866a425744K669562O284042m30769p450723n538624P30009M007751M508859M427300
$$ -1425744 1243818 7527860 7097091 -353632 -5892256 -5162247 -1154496 3354363 7781663
9857G781663K408688j826185m785147m286228j755481J404332M326697M168756
$$ 7781663 10190351 8364166 3579019 -707209 -2462690 -1058358 3268339 7437095
9849G437095p33819n923937n333237l9844L417057K323582m88595k575707l440046
$$ 7437095 6703276 779339 -4553898 -4593742 -1176685 1146897 658302 -1917405 -5357451
9840e357451k009927J290078K232482j125058l152693J162623O201100L081234
$$ -5357451 -7367378 -6077300 -3844818 -4969876 -8122569 -6959946 -758846 2322388
9832B322388n375785p566813n94019N750264M088570j106023k301055Q69497L961686
$$ 2322388 -3053397 -10620210 -11214229 -5463965 -1375395 -2481418 -4782473 -3912976 48710
9823D8710M253329J574445k773086n611056m279767n36014J708352K312152L854257
$$ 48710 4302039 5876484 3103398 -2507658 -6787425 -7323439 -5615087 -3302935 551322
9814E51322N363019L183392j697086l663718j043364J452384O51670n32843R39467
$$ 551322 5914341 9097733 7400647 3736929 2693565 4145949 4797619 4264776 5204243
9805E204243K864592J760789j452090l140422k225074j084392k044266m462169
$$ 5204243 8068835 9829624 8377534 5237112 3012038 1927646 -116620 -4578789
9797d578789n316943k763088J138576K814440K210945K314593L173019J186521
$$ -4578789 -9895732 -12658820 -11520244 -8705804 -6494859 -4180266 -1007247 179274
9789A79274l650999n494861j453740K928988K110418q46703l04136K267006J966460
$$ 179274 -3471725 -8966586 -10420326 -7491338 -5380920 -6227623 -6531759 -4264753 -2298293
9780b298293k71207q7436J774292J469576R675J026513K796714Q97071k979862
$$ -2298293 -2569500 -2656936 -882644 586932 596607 1623120 4419834 5316905 2337043
9771B337043l410880r56685p80845k787837k174289R72447J883468N03478J234760
$$ 2337043 -1073837 -2030522 -2811367 -5599204 -7773493 -6801046 -4917578 -4414100 -3179340
9762c179340L435645K072491j796311j642009K299771K359596k738220m616088
$$ -3179340 256305 2328796 532485 -1109524 1190247 3549843 811623 -3804465
9754c804465L66658M392232J329581l263430k064041K278392K737032q90850l343894
$$ -3804465 -3437807 954425 2284006 -979424 -3043465 -765073 1971959 1081109 -2262785
9745b262785k127293J113106L918026M036909R49895j593655K91166K987982n30893
$$ -2262785 -4390078 -3276972 641054 4677963 5627858 4034203 4325369 7313351 6782458
9736F782458p494193o411923M579022J1694143N165066n547909o292389P22901
$$ 6782458 -711735 -7123658 -2544636 9149507 14314573 8766664 2474275 3197176
9728C197176K683075k989212o988621m722532j531221j062231J277L410084N309759
$$ 3197176 5880251 2891039 -4097582 -8820114 -10351335 -11413566 -11412289 -8002205 -2692446
9719b692446L935329L235369N155663N263202L76361n044245m997500o56924J702716
$$ -2692446 1242883 4478252 9633915 14897117 15273478 10229233 5231733 4574809 6277525
9710F277525n80850l864026l571531L61134L628961K356962k123741m027188j10212
$$ 6277525 5696675 1832649 -1738882 -1377748 2251213 4608175 2484434 -1542754 -1652966
9701a652966N241647M980896j008606n457496l810355j92956m57115l295117l028425
$$ -1652966 3588681 8569577 7560971 2103475 -1706880 -1899836 -2356951 -5652068 -8680493
9692h680493R80976L411757J534667p74618L80929K753993J803281k188223m700623
$$ -8680493 -7699517 -4287760 -2753093 -3527711 -3146782 -392789 1410492 -777731 -5478354
9683e478354l131620J061939N139314O664809L725369k443169o125893l041451
$$ -5478354 -8609974 -7548035 -2408721 4256088 7981457 5538288 -587605 -3629056
9675c629056L027028M635098J291561o31945R85557P97224l488996n517404m39082
$$ -3629056 -602028 4033070 5324631 4692686 5678243 6475467 2986471 -2530933 -2970015
9666b970015O260647O793361K452433l45437q12238k403241m049430j694622K889536
$$ -2970015 3290632 10083993 12536426 12190989 11378751 8975510 4926080 3231458 6120994
9657F120994L367594j160320m923944m541265k440173q79609P34235J915033R18541
$$ 6120994 9488588 8328268 3404324 -1136941 -3577114 -4456723 -3722488 -1807455 -888914
9648h88914o96353N12370L213895K438687j744945l364041O6662L795562L691618
$$ -888914 -1585267 -1072897 2140998 4579685 2834740 -529301 -462639 3332923 7024541
9639G024541J777790J199684J096720m04233k402531l176432k570696q35237J621882
$$ 7024541 8802331 10002015 11098735 10694502 8291971 5115539 2544843 1709606 3331488
9630C331488K728588Q18708j737292j307432J054742J534967N57333J537213L313999
$$ 3331488 6060076 6878784 5141492 3834060 4888802 6423769 6981102 8518315 11832314
9621A1832314J391042l099696l952560m44768J364727m07249n98649K212679K158655
$$ 11832314 13223356 10123660 6171100 5726332 7091059 6683810 6085161 8297840 10456495
9612A0456495k405529m171984K54431K883286k174744p083055k481389O114935
$$ 10456495 8050966 3878982 4133413 7016699 4841955 -2241100 -4722489 1392446
9604A392446O181086k111381o625148k169621L274544K494298j192289j637995
$$ 1392446 7573532 5462151 -1162997 -3332618 -58074 2436224 1243935 -394060
9596c94060N93135J188600l42345p63658J399542L796671L223835p29194m916784
$$ -394060 199075 1387675 1045330 281672 1681214 5477885 8701720 7972526 3055742
9587C055742n532541k115047J907218K975545P25047k449443l537255q23540M011676
$$ 3055742 -2476799 -4591846 -2684628 290917 1015964 -1433479 -4970734 -5794274 -1782598
9578a782598N999562K218552l221723l602524Q81091L091496m70546m656684l695782
$$ -1782598 4216964 6435516 3213793 -388731 492360 3583856 3113310 -1543374 -5239156
9569e239156Q98052L726888K712328k27604k322785j486470J913098L588736o6888
$$ -5239156 -4341104 -614216 2098112 1870508 -452277 -1938747 -25649 3563087 3496199
9560C496199n344151n033612L85571K930063J56147j121639K374548M012737l69465
$$ 3496199 -1847952 -6881564 -6495993 -3565930 -3409783 -4531422 -2156874 1855863 1486398
9551A486398l692923M53225O008440M465354q80851j749868M59047r72098l979188
$$ 1486398 -2206525 -1753300 4255140 8720494 7839643 6089775 6548822 5576724 1597536
9542A597536j288666M678730M118820l372176p284878k784283L008182L619318
$$ 1597536 308870 4987600 9106420 5734244 -1550634 -4334917 -1326735 2292583
9534B292583J304589l49660j876366k697638J61605M633118L955066j833322l964017
$$ 2292583 3597172 3247512 1371146 -1326492 -1164887 3468231 7423297 5589975 1625958
9525A625958J081552N090584J444419m093720l423997Q23777J113697k033107
$$ 1625958 2707510 7798094 9242513 5148793 1724796 2548573 3662270 1629163
9517A629163k439050K47513J012478o21607k99678K027911J299525l212036n397752
$$ 1629163 -809887 -562374 450104 -171503 -471181 1556730 2856255 -355781 -5753533
9508e753533j822317K670442K394424j065136k240703J49451K680529K681468
$$ -5753533 -7575850 -4905408 -2510984 -3576120 -5816823 -5667372 -2986843 -305375
9500c05375L95700l064883o295412o642031k244852M416807P904473N793253J160409
$$ -305375 90325 -2974558 -9269970 -15912001 -18156853 -13740046 -5835573 -42320 1118089
9491A118089j671351j660159l93170O11932M46695j094341k347392j088419J370403
$$ 1118089 -553262 -2213421 -2606591 -1994659 -1547964 -2642305 -4989697 -6078116 -4707713
9482d707713O10938l905232o206211k166544L457604L987199J277772J821362
$$ -4707713 -4096775 -8002007 -14208218 -16374762 -12917158 -8929959 -7652187 -5830825
9474e830825M915380L881206j453312l552850j03827J932023j339551m148385
$$ -5830825 -915445 2965761 1512449 -2040401 -2144228 -212205 -1551756 -5700141
9466e700141j859318R98621J1981o51327K956376N437167J338252l356061j17379
$$ -5700141 -7559459 -6560838 -6548857 -7200184 -4243808 1193359 2531611 -824450 -941829
9457i41829O880834O511033j266642n512776j798041K346867Q93769k495650k714562
$$ -941829 5939005 12450038 11183396 5670620 3872579 6219446 7113215 4617565 1903003
9448A903003p10755P71294J689975J706794j074846n471825o757960l217621J607888
$$ 1903003 1192248 1963542 3653517 5360311 4285465 -1186360 -7944320 -11161941 -9554053
9439i554053M514597N388645L844099o78778m506579k275379M295506O928285
$$ -9554053 -5039456 349189 4193288 3514510 -992069 -3267448 1028058 7956343
9431G956343K380121l222348m339472l291546l839081m257170j833767J237829
$$ 7956343 10336464 7114116 2774644 -516902 -4355983 -8613153 -10446920 -9209091
9423i209091J850423J535600K901883M256859K860938M00368J29340J001508l60404
$$ -9209091 -7358668 -5823068 -2921185 1335674 4196612 4596980 4726320 5727828 5367424
9414E367424l512281m714193k769243k72650O93161P37031R12285R76178M67392
$$ 5367424 1855143 -2859050 -5628293 -5900943 -5207782 -4470751 -3558466 -2582288 -2114896
9405b114896j11400J84752J531963K780666K361515K32517j698909j957608j253206
$$ -2114896 -2226296 -2041544 -509581 2271085 4632600 4865117 3166208 1208600 -44606
9396d4606o66998K09786J452903J285707q84446k212504n87327J501832J373318
$$ -44606 -711604 -501818 951085 2236792 1352346 -860158 -1447485 54347 1427665
9387A427665J320492L839392M900865m45376p781857p588363M24132O412273M842910
$$ 1427665 2748157 6587549 11488414 11043038 3261181 -4327182 -3903050 2509223 7352133
9378G352133N94488j256628k068393k862388o97614L539011L039355l568380p685635
$$ 7352133 7946621 6689993 4621600 1759212 1061598 4600609 7639964 4071584 -3614051
9369c614051l996676O70461o25147k973070P17829O065244M720199n94997j106664
$$ -3614051 -7610727 -6940266 -7565413 -10538483 -9820654 -3755410 964789 369792 -736872
9360g36872K209650J158342l640810l214824L043928N052683o57753m427067K54307
$$ -736872 1472778 2631120 -1009690 -4224514 -1180586 3872097 3214344 -1212723 -958416
9351i58416N515715K039821n783608p021445o55030M695428M467718K534642K376765
$$ -958416 4557299 6597120 813512 -6207933 -6862963 -2167535 2300183 4834825 7211590
9342G211590J835231j321168m279843l049451J383274L942916J813476k294083
$$ 7211590 9046821 7725653 3445810 396359 1779633 5722549 7536025 5241942
9334E241942l700300j358341J310195R42079j911944m098334l612503q93953K308994
$$ 5241942 1541642 183301 1493496 2435575 523631 -3574703 -7187206 -8081159 -5772165
9325e772165L911438K657661N6280k83885K626752M715703J978168l362839n441390
$$ -5772165 -1860727 796934 853214 569329 3196081 7911784 9889952 6527113 1085723
9316A085723k724400O22116J265542L14201l74232j175358k222803j774145M86878
$$ 1085723 -1638677 -1016561 248981 563182 188950 -986408 -3209211 -4983356 -4496478
9307d496478J640519j81494k227131q98559K779283M627535L045822K14362j734038
$$ -4496478 -2855959 -3037453 -5264584 -6163143 -3383860 1243675 4289497 4503859 2769821
9298B769821k729663l038319k285987p49660M66762J083300J737705K153570J218101
$$ 2769821 40158 -2998161 -5284148 -6033808 -5567046 -4483746 -2746041 -592471 625630
9289F25630n84052j026947N13113J745528J027817J6313M92255P48821j355288
$$ 625630 41578 -985369 -472256 1273272 2301089 2317402 2809657 3558478 2203190
9280B203190l306802p90270M326909M538081k427575q542091n742718K638591
$$ 2203190 -1103612 -1893882 2433027 6971108 4543533 -3998558 -9741276 -7102685
9272g102685O510316K879985j483884r64117J984931K588658O97570j158989k365938
$$ -7102685 -592369 2287616 803732 -160385 1824546 4413204 5110774 3951785 1585847
9263A585847l251026k557628N20418L732507M220353K144850l85953k309849l383372
$$ 1585847 -1665179 -4222807 -3702389 30118 4250471 6395321 6009368 3699519 316147
9254C16147k830097n59555J819541L141864L999115M223037J808807l108043o145384
$$ 316147 -2513950 -3073505 -1253964 1887900 5887015 10110052 11918859 8810816 2665432
9245B665432m113661j38727P33368r99909j009428J070647J190175j584490k693308
$$ 2665432 -1448229 -1586956 -853588 -1853497 -2862925 -1792278 -602103 -2186593 -4879901
9236d879901P90458N079491M685158k81135m755419n081509k163907R56839K389066
$$ -4879901 -4089443 990048 5675206 5394071 638652 -4442857 -6606764 -5649925 -3260859
9227c260859K025374M81377j462470k604375j764269N37390J697526R2502j980142
$$ -3260859 -1235485 -754108 -2216578 -4820953 -6585222 -6047832 -4350306 -4257804 -6237946
9218f237946r77998K318439L406139J078158m20519J525545L193406O88297l290772
$$ -6237946 -7215944 -4897505 -1491366 -413208 -833727 691818 3885224 4573521 1282749
9209A282749l925017k126417j855797k236231N15403M725363M771199J029469
$$ 1282749 -2642268 -4768685 -6624482 -8860713 -8345310 -3619947 1151252 2180721
9201B180721Q5366L454234M473720k55737m402211k070083K472234J839648k982059
$$ 2180721 2266087 5720321 10194041 9938304 5536093 3466010 5938244 7777892 4795833
9192D795833n496102m294923l180977k948798o97689L333661N252692M112644
$$ 4795833 -700269 -4995192 -8176169 -11124967 -11822656 -8488995 -3236303 876341
9184H76341K836131K107814m23989l863696l519999J092375L826818Q87455l145657
$$ 876341 3712472 5820286 5396297 1532601 -1987398 -895023 2931795 3819250 673593
9175F73593k558415Q57185J662607k05039l27491K118483L369600J939863P47745
$$ 673593 -1884822 -1027637 634970 429931 102440 2220923 5590523 7530386 8278131
9166H278131J365774J218101j457277m080057l893289k364273k297185k984052
$$ 8278131 9643905 10862006 9404729 5324672 1431383 -932890 -3230075 -6214127
9158f214127j660105J627836L925413L601337J897209M62290k68777l54896j92197
$$ -6214127 -7874232 -6246396 -2320983 1280354 3177563 3639853 3371076 3016180 2823983
9149B823983r40820k948138l985128j592177K719313M384451J596522k352940
$$ 2823983 1883163 -1064975 -5050103 -6642280 -3922967 461484 2058006 -294934
9141b94934l496519j546761J237297L042498K919230N85790k403943l302473j605941
$$ -294934 -3791453 -5338214 -4100917 -1058419 1860811 2446601 42658 -3259815 -4865756
9132d865756J87736O14270J243118K793072K774413J43926j211795J825331N298063
$$ -4865756 -4678020 -4063750 -2820632 -27560 2746853 2890779 1678984 3504315 8802378
9123H802378L263281k568612m767899j403650J454736m44065l817763m363629
$$ 8802378 12065659 9497047 4729148 3325498 4780234 4336169 518406 -3845223
9115c845223k940424j851974l11009K317545L439926J896806J409405M336868
$$ -3845223 -6785647 -8637621 -8948630 -6631085 -3191159 -1294353 115052 4451920
9107D451920O039774J547479n361715o723720k126208J467690R41404L72247K279145
$$ 4451920 10491694 12039173 6677458 -46262 -2172470 -704780 236624 608871 2888016
9098B888016L126912L06996k866056k905350j678793k044175k348783N7133L148605
$$ 2888016 6014928 6321924 3455868 550518 -1128275 -3172450 -5521233 -5464100 -2315495
9089b315495K982044L8119j715499q03199P21067J278611J119422K94573j306736
$$ -2315495 666549 704668 -1010831 -1814030 -1092963 185648 1305070 1599643 292907
9080B92907k214675p37860K077985L467550K620013R32274p63107k539978l541079
$$ 292907 -1921768 -2659628 -581643 2885907 5505920 6438194 5675087 3135109 -405970
9071d05970k704092j030663l86395m23818M77475J788221J634909N50753O13400
$$ -405970 -3110062 -4140725 -4527120 -4950938 -4473463 -2685242 -1050333 -499580 113820
9062A13820R87822j219459n021214n350474o86655L713365L127162n3423p30297
$$ 113820 1101642 -117817 -5139031 -10489505 -11176160 -7462795 -4335633 -4389056 -5119353
9053e119353J140763J623522l71288j989903j550047n52600j50103R37178L670461
$$ -5119353 -3978590 -2355068 -2726356 -4716259 -6266306 -6818906 -6969009 -6031831 -2361370
9044b361370O087406N105542L54638m639023n529417j875618J830850J496873
$$ -2361370 3726036 8831578 9186216 4547193 -982224 -2857842 -1026992 469881
9036D69881q04586L79791M939557N750757j030607q754116q432678j142992L923820
$$ 469881 -334705 45086 4984643 10735400 9704793 950677 -7482001 -8624993 -4701173
9027d701173K480909n70197l47867J386483J357852O11951J172232J273966j352345
$$ -4701173 -2220264 -2790461 -3138328 -1751845 -393993 217958 1390190 2664156 1311811
9018A311811m425363m170394j538408n80097j644808j087762K201917M719139
$$ 1311811 -3113552 -7283946 -8822354 -9402451 -11047259 -12135021 -9933104 -5213965
9010e213965L993510K225671K222300L004315K121684p3572j438792j786941k603775
$$ -5213965 -1220455 1005216 3227516 6231831 8353515 8279943 6841151 5054210 2450435
9001B450435l759115l361503q70486J985122L527803L388192J606511j196570
$$ 2450435 -1308680 -4670183 -5540669 -3555547 -27744 3360448 4966959 3770389
8993C770389k812786j397784J200871J157076j511032k411521L96295L079578
$$ 3770389 957603 -440181 760690 1917766 406734 -2004787 -1608492 1471086
8985A471086K243892L23811O09594O92541l259207q193393p160861J7805O070881
$$ 1471086 3714978 4038789 4648383 5340924 2081717 -6111676 -13272537 -13254732 -7183851
8976g183851O817846N411983M582181K059006l018438o009185l770297j41331
$$ -7183851 -366005 5045978 9628159 11687165 8668727 2659542 -1110755 -1252086
8968a252086N18634R3657J612879K543349k00304k932047n57197L924444L534078
$$ -1252086 -733452 -639795 973084 3516433 3316129 384082 -173115 3751329 7285407
8959G285407j104970l006847p51291N0823k196157k171442J610653K497265k952591
$$ 7285407 6180437 3173590 2422299 2473122 276965 -1894477 -283824 2213441 -739150
8950g39150p380575l196011N224124P668889K687194k001496j997137r71298k152311
$$ -739150 -8119725 -11315736 -6091612 1577277 4264471 2262975 265838 -705460 -2857771
8941b857771k506568J102116N181453M061270j364041m439577k035790J687505
$$ -2857771 -5364339 -4262223 919230 4980500 3616459 -823118 -2858908 -1171403
8933a171403K269539J262548J947697K207128k353190r162520r651168j473876
$$ -1171403 1098136 2360684 4308381 6515509 4162319 -5000201 -14651369 -16125245
8925a6125245O659446O375967N03488k614011j064472P96192J069935J548763
$$ -16125245 -9465799 -3089832 -2586344 -5200355 -6264827 -5468635 -4398700 -2849937
8917b849937J958510K08964k201113j680100R49037J876802J485843K894665M058770
$$ -2849937 -891427 -682463 -2883576 -4563676 -3614639 -1737837 -251994 2642671 6701441
8908F701441J3592o543342o690491L65037M412838m0014m995837k138874M218160
$$ 6701441 6715033 171691 -6518800 -6153763 -1740925 -1780939 -6776776 -8915650 -4697490
8899d697490N446184K373008J341562K136102L0501l648090l208862P98153K205647
$$ -4697490 748694 3121702 4463264 6599366 6629867 2981777 -227085 571068 2776715
8890B776715l0058p43488J361394J410155k096616l716111k14733L770294L200866
$$ 2776715 2746657 2003169 3364563 4774718 2678102 -1038009 -1252742 2517552 5718418
8881E718418n0089j698162j894623k662884k509641O73627L778338J720218l938134
$$ 5718418 5668329 3970167 2075544 -587340 -3096981 -2423354 1354984 3075202 -862932
8872h62932n484698K66537O656358N758599r92785n039200k118585L258073N070088
$$ -862932 -6347630 -6081093 575265 6333864 5341079 301879 -1816706 1441367 6511455
8863F511455K846061m68996l369016n061628l457228J465781M778509K347172
$$ 6511455 9357516 8888520 5519504 457876 -2999352 -1533571 3244938 5592110
8855E592110k252703k385681J260216J829731k117812l973954j39934L799639
$$ 5592110 3339407 953726 2213942 4043673 1925861 -2048093 -2188027 1611612
8847A611612J947886l080911n034761k879038L5059J760898K294210J658916J109810
$$ 1611612 3559498 478587 -4556174 -7435212 -7400153 -5639255 -3345045 -1686129 -576319
8838e76319K717045M814894K607035l358789n301033L48371N835674L041215m014053
$$ -576319 2140726 6955620 9562655 6203866 902833 1251204 7086878 10128093 6114040
8829F114040n641866j140108J978243P17768o26048M59875J272668q2057k034704
$$ 6114040 472174 -667934 1310309 2028077 1402029 1861904 3134572 3052515 1017811
8820A017811l166613k908581L51581O076911Q473852L421208l582644m231533
$$ 1017811 -2148802 -5057383 -4705802 1371109 9844961 13266169 9683525 5451992
8812E451992j27019N02889k708784k091601L287525M694498j182329n721702k535193
$$ 5451992 5324973 5827862 3119078 1027477 4315002 9009500 7827171 2105469 -429724
8803d29724K063047J15574m922856m865368k59791K051660Q79349J109753L867903
$$ -429724 1633323 1748897 -3173959 -8039327 -8299118 -6247458 -5368109 -4258356 -390453
8794c90453M466449O01218l749510m141581j175840J396134J567270O99777J046618
$$ -390453 4075996 4677214 927704 -3213877 -4389717 -2993583 -1426313 -726536 320082
8785C20082K269468J417385k273024m239662j15356O339572O452193j027070o951929
$$ 320082 2589550 4006935 1733911 -2505751 -2621107 3718465 10170658 9143588 2191659
8776B191659m266855K306612L876416k0825k537526m02652K718169K960466Q57665
$$ 2191659 -2075196 231416 4107832 4087007 1549481 1146829 3864998 6825464 7683129
8767G683129j297333k574615k951777k503713j772830j204913k01712J796023
$$ 7683129 6385796 3811181 859404 -1644309 -3417139 -4622052 -4823764 -3027741
8759c027741L712380L809628J878715o07311j940596j170802J213889L042361
$$ -3027741 684639 4494267 6372982 5765671 3825075 2654273 3868162 6910523
8751F910523K341357j19520j877096k325014k605465k086488J052517M888394
$$ 6910523 9251880 9132360 7255264 4930250 2324785 238297 1290814 6179208
8743F179208M305846j127180m737011k014132K171548Q70406l943200m326424
$$ 6179208 10485054 9357874 4620863 2606731 4778279 5648685 1705485 -2620939
8735b620939J191559N256147K697154k357076l203675J33667K223512L99057k425116
$$ -2620939 -1429380 3826767 6523921 4166845 963170 1096837 3320349 3719406 1294290
8726A294290k725567q98593L61454L11781P55894K639854M009805K473340j371619
$$ 1294290 -1431277 -2329870 -1968416 -1656635 -900741 1739113 5748918 8222258 6850639
8717F850639m365569m178615j220146K109063K956785N7434m058653m392816M91417
$$ 6850639 2485070 -1693545 -2913691 -804628 2152157 2209591 -1849062 -6241878 -5750461
8708e750461N265339M042469j429510m113092j684741J001243J84691j557472
$$ -5750461 -485122 3557347 2127837 -1985255 -3669996 -2668753 -2484062 -4041534
8700d041534o53029J655340K160982Q22328l10097o61620p24101l53606J04607
$$ -4041534 -4694563 -3039223 -878241 -55913 -366010 -1027630 -1751731 -2105337 -2000730
8691b000730o71100k203300j598916K033101N274503M899120K023707n18829k046834
$$ -2000730 -2671830 -4875130 -6474046 -4440945 833558 5732678 7756385 7237556 5190722
8682E190722k836336k155300k60374N68059l55533o00727P54903Q84600j309732
$$ 5190722 2354386 199086 -61288 506771 151238 -449489 305414 1190014 -119718
8673a19718k041676P81946K547159q00006m705606k405029L596321M645987n68865
$$ -119718 -2161394 -1379448 1167711 367705 -4337901 -6742930 -3146609 1499378 930513
8664I30513m101246j211221L034141K296448k144482m610073k757384J297710
$$ 930513 -3170733 -4381954 -1347813 948635 -1195847 -5805920 -8563304 -7265594
8656g265594M598575N342522L330453K86930j743751k787758l772759l541571
$$ -7265594 -2667019 2675503 6005956 6292886 4549135 1761377 -2011382 -5552953
8648e552953m41609L339414L466436K65766r06132K074541M205842Q31746n030546
$$ -5552953 -5994562 -2655148 811288 1077054 170922 2245463 6451305 7283051 2252505
8639B252505o967703l975977m37958J100695K282425M092381M240091J184608
$$ 2252505 -4715198 -8691175 -9129133 -8028438 -5746013 -1653632 2586459 3771067
8631C771067k367261k681088j94850J271438J78874o74821J230334L929257L693751
$$ 3771067 1403806 -1277282 -1472132 -200694 -21820 -696641 533693 4462950 8156701
8622H156701M48364k540015l684136m179943l962087r39293M065501O020500K540393
$$ 8156701 8605065 6065050 2380914 -1799029 -5761116 -6700409 -2634908 3385592 5925985
8613E925985j681532j480609Q45891n13628n059348o355210k026339K756655L205225
$$ 5925985 4244453 2763844 3609735 3096107 -1963241 -8318451 -10344790 -7588135 -4382910
8604d382910J059393N04725K289513M638311O396217O283504K252787m786942
$$ -4382910 -3323517 -2818792 -529279 4109032 10505249 16788753 19041540 14254598
8596A4254598r031144n791182J576906M855361J259454l234217k335624J953130
$$ 14254598 5223454 -567728 1009178 5864539 7123993 3889776 1554152 3507282
8588C507282K397728k994805p597177m865726K616816O431295L478256p93539
$$ 3507282 5905010 2910205 -4686972 -9552698 -6935882 -504587 2973669 2180130
8580B180130j190422J78560j048151l493690k433762J858040M089549K181226
$$ 2180130 989708 1168268 120117 -3373573 -5807335 -3949295 140254 2321480
8572B321480m8782M26661J568746Q17794n66805o06079l35290j161460j607667
$$ 2321480 2272698 2699359 4268105 5085899 4519094 3913015 3577725 2416265 808598
8563H08598k82678O04982j211607l179136j317427K809817L791474R05950o87698
$$ 808598 525920 1130902 -80705 -3259841 -4577268 -1767451 2024023 2929973 2242275
8554B242275J309833K147716j900470o069581l350468M272140P347002J937044
$$ 2242275 3552108 5699824 3799354 -2270227 -5620695 -1348555 5998447 7935491
8546G935491m967027n371445p08233J698227n56223k690188m97542M131591O431761
$$ 7935491 2968464 -2402981 -3111214 -1412987 -1969210 -4659398 -5156940 -1025349 5406412
8537E406412M515944N20195k294984k502025j340572q58306r70291L84225L180320
$$ 5406412 9922356 10442551 8147567 5645542 4304970 3446664 2476373 2860598 6040918
8528F040918L786144K02025l468141k074955K440857L325359q01041m092195k957347
$$ 6040918 9827062 10029087 6560946 4485991 6926848 10252207 9451166 5358971 2401624
8519B401624r47659j406612j617079J116687L068531m8730m730426m140070J203881
$$ 2401624 1453965 47353 -1569726 -453039 2615492 2566762 -2163664 -6303734 -5099853
8510e099853M159058J742830j416293j050990J279247K401510K197332J629742
$$ -5099853 -940795 802035 -614258 -1665248 -386001 2015509 4212841 5842583
8502E842583K0523k859845m639005l060621N65097K758157K007986P2458n60360
$$ 5842583 5863106 3003261 -1635744 -4696365 -4131268 -1373111 634875 707333 146973
8493A46973M19762J050128j23668j770685j492811M14544J122488k90342j327410
$$ 146973 566735 1616863 1493195 -277490 -1770301 -1355757 -233269 -523611 -1851021
8484a851021l41581P51013J89181l27345R71231K151519Q22853j417445j812394
$$ -1851021 -2192602 -1441589 -1252408 -1579753 -608522 1542997 2365850 948405 -863989
8475h63989j370020k491533l762224k098567J423110K995771K157376J319992
$$ -863989 -2234009 -4725542 -8487766 -10586333 -9163223 -6167452 -4010076 -2690084
8467b690084M88341j876622l704828j357301L410907M974797K525689N80972M14099
$$ -2690084 -2201743 -4078365 -7783193 -9140494 -5729587 -754790 1770899 2351871 2765970
8458B765970j486716m975760m490413J046266M450575J228742k644370L4303O266983
$$ 2765970 1279254 -3696506 -8186919 -7140653 -2690078 -1461336 -4105706 -4071403 2195580
8449B195580P553688K223626l708751n684890m439903k064873L38464J669449
$$ 2195580 9749268 11972894 8264143 2579253 -1860650 -3925523 -3587059 -1917610
8441a917610J744241K446852M508281M721407K91607n608329p071420l340981
$$ -1917610 -173369 2273483 6781764 11503171 11794778 6186449 -884971 -4225952
8433d225952Q39188K176079J743545R83872o69798k952678l252795j31149L674049
$$ -4225952 -3386764 -1210685 532860 1516732 846934 -2105744 -5358539 -5489688 -1815639
8424a815639L843939m46244n243414n930867k376308R55308Q16321m32649J247416
$$ -1815639 2028300 1582056 -3661358 -9592225 -11968533 -11013225 -10196904 -10629553 -9382137
8415i382137M597503M498047N21726j524256J292927M026250J832295k105706
$$ -9382137 -4784634 -286587 235139 -1289117 3810 4030060 5862355 3756649
8407C756649k013092J030398J406258j695178l726912k475676k62801J116355
$$ 3756649 1743557 2773955 4180213 2485035 -1241877 -3717553 -3980354 -2863999
8399b863999K056672J923223l61855k459498q47728K793927L186037J09822q19391
$$ -2863999 -807327 1115896 754041 -1705457 -2553185 240742 3426779 3536601 2717210
8390B717210K264602L662486p59549o326211o113613o98583L567069L406919J116233
$$ 2717210 4981812 8644298 7884749 1558538 -4555075 -5253658 -1686589 1720330 2836563
8381B836563k91368l33717R8293K09721l01162p41638m5969J210656J051061p81321
$$ 2836563 2545195 2211478 2309771 2519492 2218330 1476692 1430723 2641379 3692440 2911119
8371B911119k235658k463757k866725l252810q84517M093226O457194L017354
$$ 2911119 675461 -1788296 -4655021 -7907831 -8792348 -4699122 1758072 4775426
8363D775426j816111k356605j61925l89431k414785j344396K348522K787969r36086
$$ 4775426 2959315 602710 440785 51354 -2363431 -3707827 -1359305 1428664 492578
8354D92578k399770J498214M914581K373471k610126l704499j573071j185241
$$ 492578 -1907192 -408978 4505603 6879074 4268948 564449 -1008622 -2193863
8346b193863k786151k326657P77349K681574J561191l47641j210200j403224q39091
$$ -2193863 -4980014 -7306671 -6529322 -3847748 -2286557 -2634198 -3844398 -5247622 -6086713
8337f086713R85853K208750M67862k281498j682428J892069L458965J596976N40815
$$ -6086713 -5100860 -2892110 -2424248 -4705746 -6388174 -4496105 -1037140 559836 1100651
8328A100651K121254K018181k200168n289252k135961L204757K952278k618513
$$ 1100651 3221905 5240086 3039918 -2249334 -4385295 -1180538 1771740 -846773
8320h46773n793280k880755J647422L140833K800060L446795M007641J728977
$$ -846773 -6640053 -9520808 -7873386 -4732553 -1932493 1514302 5521943 7250920
8312G250920k579214m850083k847273J069543K753199J215113j61820J713349
$$ 7250920 4671706 -178377 -3025650 -1956107 797092 2012205 1850385 3563734
8304C563734M564401L114577k870471o685411l482460K466071L519938p72085
$$ 3563734 8128135 11242712 8372241 1686830 -1795630 670441 4190379 3418294
8296C418294m086716l066659q23624l68191k54345J293282K599838J662073k92102
$$ 3418294 -668422 -3735081 -4558705 -4926896 -5181241 -3887959 -1288121 373952 81850
8287H1850j045318p19660n66019m90019J62604J023582J528256J795242J588404
$$ 81850 -963468 -1683128 -2249147 -2739166 -2576562 -1552980 -24724 1770518 3358922
8278C358922K64073j288545r48049J157561J950973j16051k288707j448117J133403
$$ 3358922 3622995 2334450 1386401 2543962 4494935 4378884 2090177 642060 1775463
8269A775463J621261r07779l391404k996151m90086J030745p9010k025253j670286
$$ 1775463 3396724 2488945 -902459 -3898610 -4388696 -3357951 -3436961 -5462214 -7132500
8260g132500J328461L672975K814350O30854M25307J626871R56911j672701k579333
$$ -7132500 -5804039 -2131064 683286 1314140 1739447 3366318 4323229 2650528 71195
8251G1195k22503K350605K331287P51322l67554r26649r70375M36762K383117
$$ 71195 -151308 2199297 4530584 5281906 4914352 3987703 3017328 3454090 5837207
8242E837207J765127j662900l564142j466002Q07718p83835l408527j653564L284978
$$ 5837207 7602334 5939434 2375292 909290 1717008 933173 -2475354 -4128918 -843940
8233h43940M747273O15991l525287k551782J467217L050063P44946j955217j749171
$$ -843940 3903333 4519324 994037 -1557745 -90528 2959535 3704481 1749264 93
8224I3P35288K357869J414086n97238j307945p69985r54406k119100j981571N06943
$$ 93 735381 3093250 4507336 3910098 2602153 1832168 877762 -1241338 -3222909 -2715966
8214b715966K863228K407433J11343j096587n63539o6153m72571n68076P83590
$$ -2715966 147262 2554695 2666038 1569451 1005912 939759 467188 -100888 682702
8205F82702K891147L892937K587191j58132j925530j654553j404843l088204m267664
$$ 682702 3573849 7466786 10053977 9895845 7970315 6315762 4910919 1822715 -2444949
8196b444949j150718M024271L976904k902013q319570n007158K665335M928600
$$ -2444949 -3595667 428604 4405508 1503495 -6816075 -11823233 -9157898 -4229298
8188d229298L67218l382578j397901K926660M486278K662553n25786l501148m584880
$$ -4229298 -3862080 -7244658 -8642559 -5715899 -1229621 1432932 907146 -2594002 -7178882
8179g178882k465904J111528K600282J710434J532504K727865K167330q58551
$$ -7178882 -9644786 -8533258 -5932976 -4222542 -2690038 37827 2205157 1346606
8171A346606j990165J437249N283157M525230R21955l82960L20307j940522p300351
$$ 1346606 -643559 793690 6076847 10602077 11524032 11141072 11461379 9520857 2220506
8162B220506q614596j418804Q099234R671375J813044o415950o858140j449958
$$ 2220506 -6394090 -7812894 286340 9957715 11770759 5354809 -1503331 -2953289
8154b953289K116247Q43508j217815k5350L196240M767579L435869N74714k191312
$$ -2953289 -837042 6466 -1211349 -1236699 1959541 6727120 10162989 10737703 8546391
8145H546391l436157j793775K210263N253486M392670N72534k757835l739651
$$ 8546391 5110234 3316459 5526722 10780208 15172878 15745412 12987577 9247926
8137I247926l080360j865297n16012M51612M78567k50154j107349j607094j096061
$$ 9247926 6167566 4302269 3786257 4237869 4716436 4466282 3358933 1751839 655778
8128F55778P24629K196484Q80840k248271k655689J316351M950052L584350m36976
$$ 655778 1380407 3576891 4457731 2209460 -446229 870122 5820174 9404524 8967548
8119H967548j895006j136998k267742m391783k143424M201091O641837P19740
$$ 8967548 7072542 5935544 3667802 -723981 -2867405 1333686 7975523 8695263
8111H695263p184783q257497k529284K989296M141213K517886N48310j151312
$$ 8695263 1510480 -6747017 -9276301 -6287005 -2145792 372094 920404 -230908
8103b30908j911314p59554J327423J830426K0036k076316k363663q36264R51263
$$ -230908 -2142222 -2901776 -1574353 256073 276109 -1800207 -4163870 -5000134 -4048871
8094d048871J316474k97781k269327j673329K204230N807292M676824j098450
$$ -4048871 -2732397 -3030178 -5299505 -6972834 -4768604 1038688 5715512 4617062
8086D617062o380431o263567r21403M810189N930639J726480l406319m135165
$$ 4617062 -1763369 -8026936 -8948339 -4138150 1792489 3518969 112650 -4022515
8078d022515q5845L418774J932231k077758k370261K395765O548326M978987l47046
$$ -4022515 -4108360 -689586 1242645 -835113 -3205374 -809609 5738717 10717704 10370658
8069A0370658l734970l214548j517223r88246j179135j369687j889882k103967
$$ 10370658 6635688 3421140 1903917 915671 -263464 -1633151 -3523033 -5627000
8061e627000l74622K555399L335795J125412l46421J360301K833316K13899l755926
$$ -5627000 -6001622 -3446223 -110428 1014984 668563 2028864 4862180 5076079 1320153
8052A320153l619603k90061M06337k114983j965063K760390N891182L104501r72547
$$ 1320153 -2299450 -2589511 -2183174 -4298157 -6263220 -3502830 2388352 5492853 4520306
8043D520306o21569J983440J734161n83485j390288j919593m774840o273782j316021
$$ 4520306 3898737 5882177 7616338 7032853 5642565 3722972 -1051868 -7325650 -8641671
8034h641671N985863O341288k42257m086123j284818R55472k168532m693635j145611
$$ -8641671 -2655808 3685480 3443223 -642900 -1927718 -972246 -3140778 -7834413 -8980024
8025h980024L079503J004114l282063j070212O267526R185567M646183p74985
$$ -8980024 -5900521 -4896407 -8178470 -9248682 -2981156 6204411 10850594 10075609
8017A0075609k382451k887227m761669n170277j909665J815414K418154J099080
$$ 10075609 7693158 4805931 44262 -5126015 -7035680 -5220266 -2802112 -1703032
8009a703032M31993k10372k087460l284373j542663J375098K061532P38859M81482
$$ -1703032 -1271039 -1481411 -3568871 -6853244 -8395907 -7020809 -4959277 -4220418 -3738936
8000c738936J944553K361737O05l091543l615352q39919K644955L427453P12792
$$ -3738936 -1794383 567354 567959 -2523584 -6138936 -6978855 -4333900 -906447 -193655
7991a93655k495103k554497L34531K569964K398884J839429K032180M48578m016292
$$ -193655 -2688758 -5243255 -4908724 -2338760 60124 1899553 3931733 4380311 364019
7982C64019o636667k624062M748016P630613M415503Q57671K97707k23196k408602
$$ 364019 -6272648 -8896710 -4148694 3481919 7897422 8755093 9052800 8829604 6421002
7973F421002k678462N38637K212943j249185n025196l227567J499751K816430
$$ 6421002 3742540 4281177 6494120 5244935 219739 -3007828 -1508077 1308353
7965A308353J119576J058732J659875j749315p010410o429191N73093N557558
$$ 1308353 2427929 3486661 5146536 3397221 -3613189 -10042380 -9469287 -3911729
7957c911729M025338J254031J827579K162069j445471n052583l726936j299Q11690
$$ -3911729 113609 1367640 3195219 5357288 3911817 -1140766 -4867702 -4869001 -4057311
7948d057311r15311j456792m88356L30424J817875M604295N490644K124002k004287
$$ -4057311 -4972622 -6429414 -6917770 -6587346 -4769471 -165176 5325468 7449470 5445183
7939E445183k701414j604236j915937j818306J109435L050660l12417m487643
$$ 5445183 2743769 1139533 -776404 -2594710 -1485275 1565385 1252968 -3234675
7931c234675j842644N244261O701283J25291n789683m596859R6068K712711L377729
$$ -3234675 -5077319 166942 6868225 6993516 1203833 -3393026 -3296958 -584247 2793482
7922B793482L827368K652510r25275l730043l135827r44000K57252Q12259J515240
$$ 2793482 6620850 9273360 8348085 4618042 1482215 538215 795467 1607726 3122966
7913C122966J172796q04795k581544k655899j549580K89330K840348M151062J780595
$$ 3122966 4295762 3490967 909423 -1746476 -3296056 -3006726 -166378 3984684 5765279
7904E765279k560262m177268k039254L16168J074368J925099K709533O63431l038238
$$ 5765279 3205017 -972251 -3011505 -2695337 -1620969 304130 3013663 3677094 638856
7895F38856k666639K852612O396918K680918l591132m707161p91255J790709P635
$$ 638856 -2027783 824829 7221747 9902665 6311533 1604372 813117 2603826 2611461
7886B611461l008433l309546l98486L161754M141993J647196j300204j040849
$$ 2611461 -396972 -3706518 -4105004 -943250 3198743 4845939 3545735 2504886
7878B504886J667200K870119J608942O85771J026646L81731j548535k216300j538898
$$ 2504886 4172086 7042205 8651147 9336918 10363564 10745295 9196760 6980460 5441562
7869E441562k116921l007984l23951M207697L481656l068310o567838k386831
$$ 5441562 3324641 316657 -7294 4200403 7682059 4613749 -1954089 -4340920
$$ [...]
##END NTUPLES=NMR SPECTRUM
##END=
