##TITLE=31Pdec_SR89_k
 CDCl3, 124 sc
 29.09.2021
##JCAMPDX= 6.0         $$ Bruker NMR JCAMP-DX V2.0
##DATA TYPE= NMR SPECTRUM
##DATA CLASS= NTUPLES
##ORIGIN= UXNMR, Bruker Analytische Messtechnik GmbH
##OWNER= root
$$ XWIN-NMR		Version 3.5
$$ Wed Sep 29 12:09:57 2021 Russian Standard Time (UT+4h)  she@DPX200
##.OBSERVE FREQUENCY= 81.013821
##.OBSERVE NUCLEUS= ^31P
##.ACQUISITION MODE= SIMULTANEOUS
##.ACQUISITION SCHEME= undefined
##.AVERAGES= 124
##.DIGITISER RES= 16
##SPECTROMETER/DATA SYSTEM= spect
##.PULSE SEQUENCE= zgpg30
##.SOLVENT NAME= D2O
##.SHIFT REFERENCE= (INTERNAL, D2O, 0, 248.564)
##AUDIT TRAIL= $$ (NUMBER, WHEN, WHO, WHERE, WHAT)
$$ ##TITLE= Audit trail, XWIN-NMR		Version 3.5
$$ ##JCAMPDX= 5.01
$$ ##ORIGIN= Bruker BioSpin GmbH
$$ ##OWNER= she
$$ F:/spectra/data/she/nmr/P31/1/pdata/1/auditp.txt
$$ ##AUDIT TRAIL=  $$ (NUMBER, WHEN, WHO, WHERE, WHAT)
(   1,<2021-09-29 12:08:50.07 +0400>,<she>,<DPX200>,
      <continue with go, POWCHK disabled, PULCHK disabled
       configuration hash MD5:
       00 E9 B6 7A A2 85 ED C7 34 08 36 98 17 FE 4E 26
       data hash MD5: 32K
       B1 C7 92 8A A9 9A 77 C0 3B C0 DF 06 65 80 2A 89>)
(   2,<2021-09-29 12:09:05.23 +0400>,<she>,<DPX200>,
      <Start of raw data processing
       efp BC_mod = 2 LB = 1 FT_mod = 6 PKNL = 1 PHC0 = -8513.296 PHC1 = 190.2688 SI = 64K 
       data hash MD5: 64K
       33 0C 4C D8 DA 70 E1 20 38 DA CF EB 53 5C DE DB>)
$$ ##END=
$$ 
$$ hash MD5
$$ 8E 03 B4 E3 9A 49 63 11 FF 08 0A 49 50 16 74 EA
##$RELAX= 
##$RELAX= 
##$RELAX= 
##$RELAX= 
##$RELAX= 
##$RELAX= 
##$RELAX= 
##$RELAX= 
$$ Bruker specific parameters
$$ --------------------------
##$DU= <F:/spectra>
##$EXPNO= 1
##$NAME= <P31>
##$PROCNO= 1
##$TYPE= <nmr>
##$USER= <she>
##$AMP= (0..31)
100 100 100 100 100 100 100 100 100 100 100 100 100 100 100 100 100 100 
100 100 100 100 100 100 100 100 100 100 100 100 100 100 
##$AQSEQ= 0
##$AQ_mod= 1
##$AUNM= <au_zg>
##$AUTOPOS= <>
##$BF1= 81.014009
##$BF2= 200.13
##$BF3= 200.13
##$BF4= 200.13
##$BF5= 200.13
##$BF6= 200.13
##$BF7= 200.13
##$BF8= 200.13
##$BYTORDA= 1
##$CFDGTYP= 0
##$CFRGTYP= 5
##$CHEMSTR= <none>
##$CNST= (0..31)
1 1 145 1 1 1 1 1 1 1 1 1 1 1 1 1 1 1 1 1 1 1 1 1 1 1 1 1 1 1 1 1 
##$CPDPRG= <waltz16>
##$CPDPRG1= <>
##$CPDPRG2= <waltz16>
##$CPDPRG3= <>
##$CPDPRG4= <mlev>
##$CPDPRG5= <mlev>
##$CPDPRG6= <mlev>
##$CPDPRG7= <mlev>
##$CPDPRG8= <mlev>
##$CPDPRGB= <>
##$CPDPRGT= <>
##$D= (0..31)
0 1 0 0 0 0 0 0 0 0 0 0.03 2e-05 3e-06 0 0 0 0 0 0 0 0 0 0 0 0 0 0 0 0 
0 0 
##$DATE= 1632902754
##$DBL= (0..7)
120 120 120 11 120 120 24 19 
##$DBP= (0..7)
150 150 150 150 150 150 150 150 
##$DBP07= 0
##$DBPNAM0= <>
##$DBPNAM1= <>
##$DBPNAM2= <>
##$DBPNAM3= <>
##$DBPNAM4= <>
##$DBPNAM5= <>
##$DBPNAM6= <>
##$DBPNAM7= <>
##$DBPOAL= (0..7)
0.5 0.5 0.5 0.5 0.5 0.5 0.5 0.5 
##$DBPOFFS= (0..7)
0 0 0 0 0 0 0 0 
##$DE= 6
##$DECBNUC= <off>
##$DECIM= 3
##$DECNUC= <off>
##$DECSTAT= 4
##$DIGMOD= 1
##$DIGTYP= 9
##$DL= (0..7)
0 0 52 120 120 21 21 25 
##$DP= (0..7)
$$ [...]
##$SUBNAM2= <"">
##$SUBNAM3= <"">
##$SUBNAM4= <"">
##$SUBNAM5= <"">
##$SUBNAM6= <"">
##$SUBNAM7= <"">
##$SUBNAM8= <"">
##$SUBNAM9= <"">
##$SW= 501.771253377433
##$SWIBOX= (0..15)
0 1 3 0 0 0 0 0 0 0 0 0 0 0 0 0 
##$SW_h= 40650.406504065
##$TD= 32768
##$TD0= 1
##$TE= 0
##$TE2= 300
##$TE3= 300
##$TEG= 300
##$TL= (0..7)
0 120 53 12 22 120 120 120 
##$TP= (0..7)
150 150 150 150 150 150 150 150 
##$TP07= 0
##$TPNAME0= <>
##$TPNAME1= <>
##$TPNAME2= <>
##$TPNAME3= <>
##$TPNAME4= <>
##$TPNAME5= <>
##$TPNAME6= <>
##$TPNAME7= <>
##$TPOAL= (0..7)
0.5 0.5 0.5 0.5 0.5 0.5 0.5 0.5 
##$TPOFFS= (0..7)
0 0 0 0 0 0 0 0 
##$TUNHIN= 0
##$TUNHOUT= 0
##$TUNXOUT= 0
##$USERA1= <user>
##$USERA2= <user>
##$USERA3= <user>
##$USERA4= <user>
##$USERA5= <user>
##$V9= 5
##$VALIST= <valist>
##$VCLIST= <CCCCCCCCCCCCCCC>
##$VD= 0
##$VDLIST= <DDDDDDDDDDDDDDD>
##$VPLIST= <PPPPPPPPPPPPPPP>
##$VTLIST= <TTTTTTTTTTTTTTT>
##$WBST= 1024
##$WBSW= 4
##$XGAIN= (0..3)
0 0 0 0 
##$XL= 0
##$YL= 0
##$YMAX_a= 2334
##$YMIN_a= -5555
##$ZGOPTNS= <>
##$ZL1= 120
##$ZL2= 120
##$ZL3= 120
##$ZL4= 120
##$ABSF1= 0
##$ABSF2= 0
##$ABSG= 0
##$ABSL= 0
##$ALPHA= 0
##$AQORDER= 0
##$ASSFAC= 0
##$ASSFACI= 0
##$ASSFACX= 0
##$ASSWID= 0
##$AUNMP= <proc_1d>
##$AZFE= 0.1
##$AZFW= 0.5
##$BCFW= 0
##$BC_mod= 2
##$BYTORDP= 0
##$COROFFS= 0
##$CY= -3
##$DATMOD= 1
##$DC= 0
##$DFILT= <>
##$DTYPP= 0
##$F1P= 0
##$F2P= 0
##$FCOR= 1
##$FTSIZE= 65536
##$FT_mod= 6
##$GAMMA= 0
##$GB= 0
##$INTBC= 1
##$INTSCL= 5.30512e-09
##$ISEN= 30
##$LB= 1
##$LEV0= 0
##$LPBIN= 0
##$MAXI= 10000
##$MC2= 0
##$MEAN= 0
##$ME_mod= 0
##$MI= 50
##$NCOEF= 0
##$NC_proc= -7
##$NLEV= 6
##$NOISF1= 182.463
##$NOISF2= 159.3651
##$NSP= 0
##$NTH_PI= 0
##$NZP= 0
##$OFFSET= 248.5645
##$PC= 4
##$PHC0= -8513.296
##$PHC1= 190.2688
##$PH_mod= 1
##$PKNL= yes
##$PPARMOD= 0
##$PSCAL= 0
##$PSIGN= 0
##$REVERSE= no
##$SF= 81.014009
##$SI= 65536
##$SIGF1= 159.3651
##$SIGF2= -187.1042
##$SINO= 113.3802
##$SIOLD= 16384
##$SREGLST= <1H.CDCl3>
##$SSB= 0
##$STSI= 65536
##$STSR= 0
##$SW_p= 40650.406504065
##$SYMM= 0
##$S_DEV= 0
##$TDeff= 32768
##$TDoff= 0
##$TI= <>
##$TILT= no
##$TM1= 0
##$TM2= 0
##$TOPLEV= 0
##$USERP1= <user>
##$USERP2= <user>
##$USERP3= <user>
##$USERP4= <user>
##$USERP5= <user>
##$WDW= 1
##$XDIM= 65536
##$YMAX_p= 83519882
##$YMIN_p= -490217631
$$ End of Bruker specific parameters
$$ ---------------------------------
##NTUPLES= NMR SPECTRUM
##VAR_NAME=  FREQUENCY,     SPECTRUM/REAL,   SPECTRUM/IMAG
##SYMBOL=    X,             R,               I
##VAR_TYPE=  INDEPENDENT,   DEPENDENT,       DEPENDENT
##VAR_FORM=  AFFN,          ASDF,            ASDF
##VAR_DIM=   65536,         65536,           65536
##UNITS=     HZ,            ARBITRARY UNITS, ARBITRARY UNITS
##FACTOR=    0.620285442955139, 1,           1
##FIRST=     20137.2065510759, 0,            0
##LAST=      -20513.1999529892, 0,           0
##MIN=       -20513.1999529892, -490217631,  0
##MAX=       20137.2065510759, 83519882,     0
$$ Real data points
##PAGE= N=1
##DATA TABLE= (X++(R..R)), XYDATA
$$ [...]
13019F204267r52637k457581k502304n56755j70910k929201l349915K148538O833661
13010B267163L574903k544147k320459K040961J669000k801247l167504O81137
13002f00193J031110k446424j952483K995559L590693k023203m489165J47450
12994c746656K966011k009070o845878l326789K923377K318712k675659k696014
12986a3091966K631063N329875K990871J255986K585711K263026k233083n703065
12978c971582l018122K744100M481771P54527k953120k139816J078033J691485
12970a332724r81769k724978r96767J265737M46945j877612j451072J791301L690874
12961b170065K498977J031641J240356J047238j166955k697480n69844K926941
$$ plain form
13019 6204267 5251630 2794049 291745 -265010 -435920 -3365121 -6715036 -4566498 2267163
13010 2267163 5842066 3297919 977460 3018421 4687421 1886174 -1281330 -600193
13002 -600193 430917 -2015507 -3967990 -972431 2618262 595059 -3894106 -3746656
12994 -3746656 -780645 -2789715 -9635593 -12962382 -10039005 -7720293 -10395952 -13091966
12986 -13091966 -10460903 -5131028 -2140157 -884171 1701540 3964566 1731483 -3971582
12978 -3971582 -6989704 -4245604 236167 990694 -1962426 -4102242 -3024209 -1332724
12970 -1332724 -2314493 -5039471 -6036238 -4770501 -4323556 -6201168 -7652240 -5860939 -2170065
12961 -2170065 328912 1360553 2600909 3648147 2481192 -216288 -786132 2140809
12953B140809K754824j397275l814883j71648O076762P121378L79606p670257
12945E419316q747941k406578M176927N484601L153643J313976M41380j286216
12937G549108l434668l864872k381078n89705Q35616J940731J760891k59710k189478
12928f33165j863551k48215K12631n19046o95275m1371N99901J524699K819807
12919A156415K234832j753251n790056m737752J255036O386040N974619P96270
12911E522153m821463o522917k613701L818831O753315M071190N05974N10423
12903G223805J373039j540265n814805n211565j66069K729948J544484J175860
12895A314432L413649L089672k464863p295456n140073J239000M283431J886426
$$ plain form
12953 2140809 4895633 3498358 -316525 -488173 5588589 12709967 13089573 5419316
12945 5419316 -3328625 -5735203 -1558276 3926325 7079968 8393944 8835324 7549108
12937 7549108 4114440 249568 -2131510 -2721215 -1885599 55132 1816023 1556313 -633165
12928 -633165 -2496716 -2744931 -2532300 -3051346 -3746621 -3787992 -3188091 -1663392 1156415
12919 1156415 3391247 1637996 -4152060 -8889812 -7634776 -1248736 4725883 5522153
12911 5522153 700690 -5822227 -8435928 -4617097 2136218 6207408 6713382 7223805
12903 7223805 8596844 7056579 1241774 -3969791 -4135860 -1405912 138572 1314432
12895 1314432 4728081 7817753 5352890 -1942566 -7082639 -5843639 -1560208 326218
12887C26218j429320j693829L08333J557499Q07876l53622J15929J397025L34838
12878A370947l300324m647157l18820N327327N624628J486913n77557O21865j50021
12869E437801m023696m915406M3671M802045L627061o30696k580915k443126k336139
12860c019400k62060M888451O952568p5747j0454261j1678567j507283Q278718
12852f877581P640771O82536k231254O30311K041108j598529m712128j718986
12844f143752L952366N094255J858674Q83530L572017L077129l811951r187005
12836g04737m941727M225003P184479K592057q19286Q39443J769098j585906l717488
12827D840936J45825N339029M941997J13116k844449j959540n49149j101892k821251
$$ plain form
12887 326218 -1103102 -2796931 -2488598 -931099 -123223 -476845 -360916 1036109 1370947
12878 1370947 -1929377 -6576534 -6895354 -1568027 4056601 5543514 4965957 5587822 5437801
12869 5437801 1414105 -3501301 -3457630 1344415 4971476 4340780 1759865 -683261 -3019400
12860 -3019400 -3281460 1606991 8559559 8483812 -1970449 -13649016 -15156299 -6877581
12852 -6877581 763190 1445726 -785528 -155217 1885891 287362 -4424766 -6143752
12844 -6143752 -2191386 2902869 4761543 5645073 9217090 12294219 8482268 -704737
12836 -704737 -5646464 -1421461 5763018 8355075 7535789 8375232 10144330 8558424 4840936
12827 4840936 4986761 10325790 15267787 15380903 12536454 10576914 10027765 8925873 6104622
12818F104622l816978k648445P27681L628733K697263j166962l120351j211501
12810A194062Q96624m3832k244361k646993j282103N32652K311010K588962m22993
12801H83028m222009l431572J478036L052064j773399n686457j735820N934283
12793e501846Q645048N515412J964453k30136l451354o930080o508776j513337
12785h010616L763327N421830L043353j269435l685424r93440M451520N617136
12777H338251M11896m137659k123673K160918J763105j718420k543755j575185
12769E75478k944892l870104J025885P468731N836248k511736n858844r05210
12761a184444J984866l322983q034491l072138N826786P177408Q66275l636329
$$ plain form
12818 6104622 2287644 -360801 366880 3995613 6692876 5525914 2405563 1194062
12810 1194062 2090686 2046854 -197507 -2844500 -4126603 -3593951 -1282941 1306021 883028
12801 883028 -3338981 -6770553 -5292517 -2240453 -4013852 -9700309 -11436129 -5501846
12793 -5501846 3143202 8658614 10623067 10392931 6941577 11497 -6497279 -8010616
12785 -8010616 -4247289 1174541 4217894 2948459 -736965 -1730405 2721115 8338251
12777 8338251 8750147 4612488 2488815 4649733 6412838 4694418 2150663 575478
12769 575478 -2369414 -6239518 -5213633 2255098 8091346 5579610 -279234 -1184444
12761 -1184444 800422 -2522561 -10557052 -13629190 -7802404 -624996 241279 -3395050
12753c395050j949091J428757J885860l78935l199183m218879r94707N439032
12745e382196Q773675M668000j914900k719137J699642K934191k044208o212705
12737a97638l534920K076064L279605j15323k506817j508954O881j56557o13238
12728c270897J85509J524924K224087J879643l5911l193246m395423n69407N424933
12719b25788O711729K061488j585541L18103K410876j747419q053859p282295
12711g392706J87418M352837P71101l293045p77160M997763O658211L269822o84510
12702H089731k545782k827168k369110k174847l533742n266411l821521J133583
12694a3315267M715959L400323j0984j056140M87307K470655M088273M425510
$$ plain form
12753 -3395050 -5344141 -3915384 -2029524 -2408459 -5607642 -9826521 -10821228 -5382196
12745 -5382196 3391479 8059479 6144579 3425442 5125084 8059275 6015067 -197638
12737 -197638 -3732558 -1656494 1623111 1507788 -999029 -2507983 -2501102 -2657659 -3270897
12728 -3270897 -3085388 -1560464 663623 2543266 2507355 -685891 -5081314 -5650721 -225788
12719 -225788 6485941 8547429 6961888 7279991 9690867 7943448 -110411 -7392706
12711 -7392706 -7205288 -2852451 -2081350 -5374395 -6151555 -1153792 5504419 8774241 8089731
12702 8089731 5543949 2716781 347671 -1827176 -5360918 -10627329 -14448850 -13315267
12694 -13315267 -8599308 -5198985 -5209969 -6266109 -5778802 -3308147 780126 5205636
12686E205636J676117k581527l064322J248840M047020J271833k022507m12490
12678E368600K168188p36218o370864o910320k121429J383486J565623K323001
12670c329933M317481L662528J81283j472842o706Q07504l16944l00314J325616
12661D867673P99835k643889m608676k712209L3079Q82342P10596J22890j953833
12652d502192m041314k260153L185713O909132N653585J900721j123602k957238
12644B764652l350572j636420K41564m92279k013811l34604K539157M28040n863086
12635g717359p734112j868158M402391M727988K385362K259082K318587m25394
12627a651613k671390j007565P82260j372820l044397J443751P192970M653816
$$ plain form
12686 5205636 6881753 4300226 1235904 2484744 6531764 7803597 5781090 5368600
12678 5368600 7536788 6800570 429706 -6480614 -8602043 -7218557 -5652934 -3329933
12670 -3329933 987548 4650076 4831359 3358517 3351811 4159315 3842371 3542057 4867673
12661 4867673 5667508 3023619 -1585057 -4297266 -4264187 -3381845 -2671249 -2548359 -4502192
12652 -4502192 -8543506 -10803659 -7617946 -708814 4944771 6845492 5721890 2764652
12644 2764652 -585920 -2222340 -1980776 -2473055 -4486866 -4821470 -2282313 -1854273 -7717359
12635 -7717359 -15451471 -17319629 -12917238 -8189250 -5803888 -3544806 -1226219 -1651613
12627 -1651613 -4323003 -5330568 -4548308 -5921128 -8965525 -7521774 -328804 4325012
12619D325012m385521p638543m20590P030345M386284m403541p634613k007528
12611a0748695M491080M424700m12288l437693k104995P34890K149792K156784
12603b746425J636991O63344k1988J085428L115913K593928j195378l671081j251538
12594B09194K586228J968941k699674n658584m075922l97115K701569M554732
12586h10631M172775Q44984k889621l523963j629021l11723K15103J527584K172935
12577b31578J13722j658294Q25823M217321J987173l902055n058713p38357Q26985
12568c617973k783463l405615L248519R083663O185720r42599l086991O93702
12560E374963M797327N916011L768275j575883p246701p709356k623186J000840
$$ plain form
12619 4325012 -60509 -7699052 -8119642 -1089297 3296987 -1106554 -8741167 -10748695
12611 -10748695 -6257615 -1832915 -2245203 -5682896 -7787891 -7053001 -4903209 -2746425
12603 -2746425 -1109434 -446090 -468078 617350 3733263 6327191 5131813 1460732 209194
12594 209194 2795422 4764363 2064689 -3593895 -7669817 -8066932 -5365363 -810631
12586 -810631 3362144 4207128 1317507 -2206456 -3835477 -4147200 -3932097 -2404513 -231578
12577 -231578 -117856 -1776150 -950327 3266994 5254167 1352112 -3706601 -4444958 -3617973
12568 -3617973 -6401436 -9807051 -6558532 2525131 8710851 7768252 4681261 5374963
12560 5374963 10172290 16088301 19856576 18280693 11033992 3324636 701450 1702290
12552A702290o48241k086566J451443N155139K870489k345140l785068j753917
12544E60429p97809j053678n9767J024402K13429l86890J011739J276076j465271
12535C22660k716520L53906K294511j080035l513730J395011P299148M248556
12527H603507m399333o954977j812140K138873J415819J087408K661469J792348
12519D532974j154900m99343L193512K572839l232301o002721k117386J705371
12511a001955J33387k955579k615024k19828J513840L180404M418959K258219
12503D712423k490415m046558n01567K637357J131691k025125k527013n72649
12495c681856K142376N154906O242938K087379n030699p401673k062216M805628
$$ plain form
12552 1702290 1054049 -1032517 418926 5574065 8444554 6099414 2314346 560429
12544 560429 -237380 -1291058 -1350825 -326423 -112994 -499884 511855 1787931 322660
12535 322660 -2393860 -2039954 254557 -825478 -4339208 -2944197 4354951 8603507
12527 8603507 4204174 -2750803 -4562943 -2424070 -1008251 79157 2740626 4532974
12519 4532974 3378074 2878731 6072243 8645082 5412781 -589940 -2707326 -1001955
12511 -1001955 -868568 -3824147 -6439171 -6658999 -5145159 -1964755 2454204 4712423
12503 4712423 2222008 -1824550 -2326117 311240 1442931 -582194 -3109207 -3681856
12495 -3681856 -1539480 3615426 9858364 11945743 6915044 -486629 -2548845 2256783
12487B256783O519126L428348o00047l328419l287238K22723L676166J745380
12479A0632822m502344p857882n370994j809166p23645L64128L021738L983863
12471b261480J890536N18657J382888N69855k895070l340699J861762O424482
12463D150931M636739j70494k390836k578023l057422j809974K516821N446253
12455F743995L321778k09116o51730m4435j578807k769450q39186R42683n20065
12446D395667j582071Q71548J999807k305219n659733p03966O840943N596505
12438I453481l292152p859384l882713O07504j0096j503050M49709L209877L578983
12429G52159L019076K769489O82236l471213n452947k826511R78606J814392Q6612
$$ plain form
12487 2256783 8775909 12204257 11604210 8275791 4988553 5211276 8887442 10632822
12479 10632822 6130478 -1727404 -7098398 -8907564 -9631209 -9267081 -6245343 -2261480
12471 -2261480 -370944 147713 1530601 2100456 -794614 -4135313 -2273551 4150931
12463 4150931 8787670 8617176 6226340 3648317 590895 -1219079 1297742 6743995
12455 6743995 10065773 9856657 9204927 9160492 7581685 4812235 3973049 4915732 4395667
12446 4395667 2813596 3685144 5684951 3379732 -2280001 -2983967 3856976 9453481
12438 9453481 6161329 -1698055 -5580768 -4973264 -4983360 -6486410 -6036701 -2826824 752159
12429 752159 3771235 6540724 7222960 3751747 -1701200 -4527711 -3549105 -1734713 -1648101
12420a648101j378586j302095r3987J141038R57464o42022j314955L8903P12265
12411c530076j054124j551431K751348P719204O575118N36510l240507l114368
12403E091674l740790n618790l447111L246746P095732M032403o06514j241034
12395D812316j8986q69365k115044o42718J529423N58020k594458l605940q47733
12386c794485L159170M631716J567238l640641m814032P39015O544384M684312
12378I076677j790680k839080K001772K288456n033392q704697j534450O439722
12370i5672L801338l454729k442891M779252N478592j494424m158441J702252
12362D115277N821396J346207m386509l229770J023484J090412j492753j152974
$$ plain form
12420 -1648101 -3026687 -4328782 -4422769 -3281731 -2324267 -2966289 -4281244 -4242341 -3530076
12411 -3530076 -4584200 -6135631 -3384283 4334921 10910039 11446549 8206042 5091674
12403 5091674 1350884 -4267906 -7715017 -4468271 2627461 6659864 6053350 4812316
12395 4812316 4793330 3923965 1808921 1166203 2695626 3253646 659188 -2946752 -3794485
12386 -3794485 -635315 3996401 5563639 1922998 -2891034 -2152019 4392365 9076677
12378 9076677 7285997 4446917 6448689 8737145 3703753 -5000944 -6535394 -95672
12370 -95672 3705666 250937 -2191954 2587298 8065890 6571466 2413025 4115277
12362 4115277 9936673 11282880 6896371 3666601 4690085 5780497 4287744 3134770
12354C134770J017418J08212l069623l399277k29115K231793K092709J350455
12346C237342Q98027o31838k920116l426019j419366R50591K068815K352011K056876
12337C166323M95950j919388l219818k223107K78174K884856M559402M315304
12329H337696J842302j336127l060323l183842l418758m272560l967184j225231
12321a0284027K356149L933368K682837M61639m32548N43530K019470K202964
12313C483382N62308j670748k708202k108945j316382j833010k830409j527055
12305i949061L016605P152084N872322n54846n569618l951742J462917L755508
12297A234169J350632p06735R09340K859450P83967l776249n596703k943183Q64732
$$ plain form
12354 3134770 4152188 4260400 1190777 -2208500 -2437615 -205822 1886887 3237342
12346 3237342 4135369 3503531 583415 -2842604 -4261970 -3311379 -1242564 1109447 3166323
12337 3166323 3662273 1742885 -1476933 -3700040 -3421866 -537010 4022392 8337696
12329 8337696 10179998 8843871 5783548 2599706 -819052 -5091612 -9058796 -10284027
12321 -10284027 -7927878 -3994510 -1311673 -850034 -1282582 -739052 1280418 3483382
12313 3483382 4045690 2374942 -333260 -2442205 -3758587 -5591597 -8422006 -9949061
12305 -9949061 -6932456 219628 6091950 5537104 -32514 -3984256 -2521339 1234169
12297 1234169 2584801 1878066 2787406 5646856 6430823 2654574 -2942129 -5885312 -5020580
12288e020580K298066J276247P7572M51242J917694K244771K20434k040127j419239
12279F080J425781K614323J112685K14990J203079N20533l249567m925376q24040
12270a901512L518896J356686l214875q42296P014610Q726175P55830n979117
12262I434397k800607L692864K750601m125153p089337l402403O17988R44398
12254B2748J49053K97171o93543l732738n385168k663016K489392N535043M206033
12245B24975K18426k416000r73800K740934L767521R5428m368506m892878j734409
12236g338309J663891L726211M679039L839121R55112j480218j130438M79199
12228E393608O24034l01672p98564j918176m417324n111025j513746K505945J959756
$$ plain form
12288 -5020580 -2722514 -1446267 -1368695 -917453 1000241 3245012 3465446 1425319 6080
12279 6080 1431861 4046184 5158869 5373859 6576938 7097471 3847904 -1077472 -1901512
12270 -1901512 1617384 2974070 -240805 -1083101 5931509 14657684 15413514 9434397
12262 9434397 6633790 10326654 13077255 8952102 1862765 -1539638 -921650 22748
12254 22748 171801 468972 -224571 -3957309 -9342477 -12005493 -9516101 -3981058 224975
12245 224975 443401 -1972599 -2946399 -205465 3562056 3657484 -711022 -5603900 -7338309
12236 -7338309 -5674418 -1948207 2730832 6569953 7525065 6044847 4914409 5393608
12228 5393608 6017642 5715970 4917406 2999230 -1418094 -6529119 -8042865 -5536920 -3577164
12219c577164p42925K73733L759793L115767j746182l435969O94054M159161J978339
12210D478607k168591l044627j294050O3957O08669L78481j676117l902061k338406
12201h894138K075932L014072j096590l372056O20470N255005L910950o68111
12193H45534j756473Q13510K405480J674681L26007j459687l169184j480876M022964
12184B221956O863827K353945l837005l563163J122542J941159j852148l356851
12176A894262l78969J893515Q82558J23785J345890J360313r76923k081307m30711
12167C632413M50521j661177m075761m158008k660829m35605K762597M793234
12159a352615K422586k184293k542441K362460N813023L666574J76820l16096
$$ plain form
12219 -3577164 -4320089 -4046356 -286563 2829204 1083022 -2352947 -1658893 2500268 4478607
12210 4478607 2310016 -734611 -2028661 -1964704 -1356035 -977554 -2653671 -6555732 -8894138
12201 -8894138 -6818206 -3804134 -4900724 -8272780 -7652310 -2397305 1513645 845534
12193 845534 -910939 -97429 2308051 3982732 4308739 2849052 -320132 -1801008 2221956
12184 2221956 9085783 11439728 7602723 4039560 5162102 7103261 5251113 1894262
12176 1894262 1515293 3408808 4291366 4415151 5761041 7121354 6144431 4063124 3632413
12167 3632413 4082934 2421757 -1654004 -5812012 -8472841 -8908446 -6145849 -1352615
12159 -1352615 1069971 -1114322 -3656763 -1294303 4518720 8185294 8362114 8046018
12151H046018p46623m829631q753365o188626J599130P025896O040130J540751
12143C733680k010166k883086j475117P71315J683467J70758k190108k888523
12135e087780j319089J056478K391028J716347q5053m71146J661561L579120K413384
12126E854850M25737J934874N299389M256266j542070m591447j283808J856337
12118A2210128j140271n721715m643683L0376J385864j55722J065717M050771
12110G081465K056408m484148o620964j077216L885910J320692m036019m324237
12102f198109p13527M49315j057788j95631L276236L799904m06261l711186j418754
12093f175801L311854M268094P92460k042808o92856K534272K894825p56770m567288
$$ plain form
12151 8046018 7299395 2469764 -6283601 -12472227 -10873097 -3847201 2192929 3733680
12143 3733680 1723514 -1159572 -2634689 -1863374 -179907 -9149 -2199257 -5087780
12135 -5087780 -6406869 -5350391 -2959363 -1243016 -1328069 -1799215 -137654 3441466 5854850
12126 5854850 6280587 8215461 13514850 17771116 16229046 11637599 10353791 12210128
12118 12210128 11069857 5348142 704459 734835 2120699 1964977 3030694 7081465
12110 7081465 9137873 4653725 -1967239 -3044455 841455 2162147 -1873872 -6198109
12102 -6198109 -6911636 -6462321 -7520109 -7715740 -4439504 -639600 -1045861 -4757047 -6175801
12093 -6175801 -2863947 1404147 2196607 153799 -539057 1995215 4890040 4133270 -434018
12084d34018m283984m09315K428551J457617o03445M91703M202144N659871K493383
12075A1002507j872666l165552j894324j466412k355493j594857J921778M872911
12067E447892L712736n70586l727126l281938o68733J259138J395945P96963P08833
12058E073124P47478o44718l702599n948627m561455r4186L751264M541514L596578
12049B758373L116188K737375Q94034j698433k491097q82005P11325J42789j716630
12040C571919k381702r06412J261025K202695J592300N76307j42646j213827k859573
12031A700086l152569j42936M364454N860706K998086l30807o99186j80542k486423
12022G930869o132248n886623p70752L800089L282096k0676p02236K097005L844713
$$ plain form
12084 -434018 -4718002 -5127317 -2698766 -1241149 -1844594 -1352891 2849253 8509124 11002507
12075 11002507 9129841 5964289 4069965 2603553 248060 -1346797 574981 5447892
12067 5447892 9160628 8590042 4862916 1580978 912245 2171383 3567328 4364291 5073124
12058 5073124 5820602 5175884 1473285 -4475342 -9036797 -9130983 -5379719 -838205 2758373
12049 2758373 5874561 8611936 9505970 7807537 5316440 4434435 5145760 5288549 3571919
12040 3571919 1190217 283805 1544830 3747525 5339825 5916132 5773486 4559659 1700086
12031 1700086 -1452483 -1595419 2769035 8629741 11627827 11297020 10597834 10417292 7930869
12022 7930869 1798621 -4088002 -4858754 -1058665 2223431 2202755 1500519 3597524 7442237
12013G442237J295641k557612k072086L124897O390924K086057o357382r874617
12005e21941n177412J450206L206750J172812L98656J495547J131618j224785
11997A931451k462958j262058L15087Q59623J213867J617284Q81506r63501k215233
11988h4932k063795j073626M87640J990964J153605k885711o099042l628483K929172
11979i274208O839277M962021O80552k045549k721618j929543O3553J333905k24665
11970b316275k473614j040959L248816M387487J35999m525642m823517j753190
11962i160895J650452M043678L866931j77917m436546k690223L930918O577575
11954C603973J816189k696489o33299L040985J380267k768679k836300k31717
$$ plain form
12013 7442237 8737878 6180266 4108180 7233077 13624001 15710058 9352676 -521941
12005 -521941 -5699353 -4249147 -1042397 130415 529071 2024618 3156236 1931451
11997 1931451 -531507 -1793565 -1478478 -618855 595012 2212296 3093802 2130301 -84932
11988 -84932 -2148727 -3222353 -2734713 -743749 409856 -2475855 -8574897 -12203380 -9274208
11979 -9274208 -2434931 2527090 3207642 1162093 -1559525 -3489068 -3425515 -2091610 -2316275
11970 -2316275 -4789889 -5830848 -2582032 1805455 1941454 -2584188 -7407705 -9160895
11962 -9160895 -7510443 -3466765 400166 222249 -4214297 -6904520 -2973602 3603973
11954 3603973 5420162 2723673 2090374 5131359 6511626 3742947 906647 674930
11946F74930m17220j907375O76353N501291N545891K95814l891660m311972l955782
11937a789730l592167q32585K680684K114604j437710j301483L528336N815590
11929E185539J472313m100807m507605p25321K479425K935506P87821l018152
11921E08719n244958k354733L554343N812850K355590j524676j712050m78096
11913I16989m04419L19030K521627K322689k029919n103130k068643K902396K542593
11904A919213k454800m979064k220205J570401K451457J276736L89605L21977
11896a724680P30364J501860K144635K007821J130077l73118k631309m319536
11888a533886k725806K140295N657141L968117m35622k085892k71232O84905j385281
$$ plain form
11946 674930 257710 -1649665 -973312 4527979 10073870 10369684 6478024 2166052 -1789730
11937 -1789730 -5381897 -6214482 -3533798 -1419194 -2856904 -4158387 -630051 5185539
11929 5185539 6657852 2557045 -1950560 -2675881 -196456 2739050 3526871 508719
11921 508719 -4736239 -7090972 -3536629 2276221 4631811 3107135 1395085 916989
11913 916989 512570 831600 3353227 5675916 3645997 -1457133 -3525776 -623380 1919213
11904 1919213 -535587 -5514651 -7734856 -6164455 -3712998 -2436262 -2046657 -1724680
11896 -1724680 -994316 507544 2652179 4660000 5790077 5416959 2785650 -1533886
11888 -1533886 -4259692 -2119397 3537744 7505861 7070239 4984347 4713115 5398020 4012739
11879D012739l273583j568158K249661L938925J902712j443629k896035j623273
11871A299359O63902J693289N71967j690877l117663k343404J78108K390657K557991
11862B203329J055296m04809j061880j227329m88212J582788K718123j62690m885449
11853f70833m633828K047676O901056K967996m598840n969186j261692J261071
11845c956580n18130o52273K397251K663423j374789k791897J297667L794834
11837H59506L03660k403697J368767N031276R81876m914266k468799M700896L930911
11828G390130n707996j1048291m528960N678572Q714001M520406j87819j853778
11820B976265r92213J479241M173569M647167J979146k022223n157288o109453
$$ plain form
11879 4012739 739156 -829002 1420659 5359584 7262296 5818667 2922632 1299359
11871 1299359 1963261 3656550 4228517 2537640 -580023 -2923427 -2745319 -354662 2203329
11862 2203329 3258625 2853816 1791936 564607 76395 1659183 4377306 4214616 -670833
11853 -670833 -5304661 -3256985 3644071 6612067 2013227 -3955959 -5217651 -3956580
11845 -3956580 -4474710 -5126983 -2729732 -66309 -1441098 -4232995 -2935328 859506
11837 859506 1163166 -1240531 128236 5159512 6141388 1227122 -1241677 3459219 7390130
11828 7390130 1682134 -9366157 -13895117 -8216545 497456 5017862 4830043 2976265
11820 2976265 1984052 3463293 7636862 12284029 14263175 12240952 7083664 974211
11812I74211l923080M63895L182412J922891l3492J049043K500058j63975m092130
11803A879833k839307J921860K154445k622417l819722J382547M720095J033427
11795C810761k927988p02039K681876N05351k943034k4332N981689N728716o86075
11786A1424925m486946k910780k012224m437912m946667o23574L416293K421108
11778b155777q02657j254525R00038K268559J679750L37956o33023m20738J187339
11769A106922K283203M45435l041843l854521o99691K739255L260978J959814
11761D199552J002134K18010j106921k271653k880221l510430l305580n14805
11753h169914L187245L352403k67774k339613k58736J703738M34145j9388L579200
$$ plain form
11812 974211 -2948869 -2484974 697438 2620329 2586837 3635880 6135938 5971963 1879833
11803 1879833 -959474 962386 3116831 494414 -3325308 -1942761 2777334 3810761
11795 3810761 882773 180734 2862610 3367961 424927 400595 6382284 12111000 11424925
11786 11424925 6937979 4027199 2014975 -2422937 -7369604 -7993178 -4576885 -2155777
11778 -2155777 -2958434 -4212959 -3312921 -1044362 635388 973344 340321 -80417 1106922
11769 1106922 3390125 3835560 793717 -3060804 -3760495 -1021240 2239738 4199552
11761 4199552 5201686 5419696 4312775 2041122 -839099 -4349529 -7655109 -8169914
11753 -8169914 -4982669 -1630266 -1898040 -4237653 -4496389 -2792651 -2358506 -2377894 1201306
11744A201306N585796j53737q071274p306189J323397N853693J544614k576032
11736b598426Q13875O014001M931288O9613j578237q45171k909998o066259m382959
11727f552273O04004J293167k988304m416225K51048M527540L440268J111221
11719b729554K162541L358153M23903k990965r68396M170143N080719Q74368k370164
11710G010748j579813L11934J350006L031683M449560J351880n797400r230282
11702H98316l968514M248627O288527J484188l209218l527862j476046M39744
11694A177762K354778L496720J212057l743003n496798o76104N345359M718076
11686H388847j759513n249658j242043M122532L097102k607571m856899j144738
$$ plain form
11744 1201306 6787102 6633365 -1437909 -8744098 -7420701 -1567008 -22394 -2598426
11736 -2598426 -1784551 4229450 9160738 9230351 7652114 6806943 3896945 -2169314 -6552273
11727 -6552273 -5948269 -4655102 -7643406 -12059631 -11808583 -7281043 -3840775 -2729554
11719 -2729554 -567013 2791140 3215043 224078 -744318 3425825 8506544 9380912 7010748
11710 7010748 5430935 5742869 7092875 10124558 14574118 15925998 10128598 898316
11702 898316 -3070198 1178429 7466956 8951144 5741926 2214064 738018 1177762
11694 1177762 3532540 7029260 8241317 4498314 -998484 -1674588 3670771 8388847
11686 8388847 6629334 1379676 137633 4260165 7357267 4749696 -107203 -1251941
11678a251941K350114M02318m007800m909814j858260Q12572J045507R10559J836669
11669d670076K108273K11624k310387l098489k203303j256701n79011Q67638K854116
11660h076316L222487R20166j499694m14014L658800N577884J907779l946052
11652A351040n549775j584515K950958L663280J423908p19529j711411j836031
11644b012075j106715m25553j388286k802253q12985M746510P913904M374543
11636H487090j831245m116858k636414k015200k539713p09183K709071K876485
11628B24033m66012j918023N36215K382996P08688j237435o09324K53227p29704
11619h55339j102135P40030J502830q96055k515862j05288K462739P74267j751579
$$ plain form
11678 -1251941 1098173 1500491 -2507309 -7417123 -9275383 -8462811 -7417304 -6506745 -4670076
11669 -4670076 -2561803 -2350179 -4660566 -7759055 -9962358 -11219059 -11798070 -10930432 -8076316
11660 -8076316 -4853829 -3933663 -5433357 -5847371 -2188571 3389313 5297092 1351040
11652 1351040 -4198735 -5783250 -2832292 830988 2254896 1535367 -176044 -2012075
11644 -2012075 -3118790 -3544343 -4932629 -7734882 -8547867 -3801357 4112547 8487090
11636 8487090 6655845 2538987 -97427 -2112627 -4652340 -5361523 -2652452 224033
11628 224033 -241979 -2160002 -1623787 759209 1467897 230462 -378862 -125635 -855339
11619 -855339 -1957474 -1217444 285386 -610669 -3126531 -3231819 -769080 5187 -1746392
11610a746392M31452M502117L081125l192413n745921j045176M573491M684856
11602E543139M48637l708417n869611n317551r55783N510820R013865O953328
11594A1618427K344298j098453l310862n050337m954020k654098j090046k009517
11586f204608k371600P72483M596064M127841m07523m281045m859434l199530
11578a1827352k78137L582829N957596L996575m09250j681742J769900M916621
11570F027040L087250j951640n287036n172222l173028m90118K393690L775260
11562g90804J974931j601511l348283j751688J066674K296814J426609J49479
11554e77779L78850K159064K798600q09180p588953j1497715p841067N46310O353910
$$ plain form
11610 -1746392 -1314940 3187177 6268302 3075889 -2670032 -3715208 858283 5543139
11602 5543139 5991776 2283359 -3586252 -8903803 -9859586 -4348766 4665099 11618427
11594 11618427 13962725 12864272 9553410 4503073 -450947 -3105045 -4195091 -6204608
11586 -6204608 -8576208 -7803725 -3207661 920180 512657 -3768388 -8627822 -11827352
11578 -11827352 -12105489 -8522660 -2565064 1431511 1022261 -659481 1110419 6027040
11570 6027040 9114290 7162650 1875614 -3296608 -6469636 -6959754 -4566064 -790804
11562 -790804 1184127 -417384 -3765667 -5517355 -4450681 -2153867 -727258 -577779
11554 -577779 -198929 1960135 4758735 3949555 -3639398 -15137113 -22978180 -22431870 -16077960
11545a6077960O476593M228139K983708J927014l76662k213987j467929N56895
11537c964189J146871K63575j98575J09442o9845j100893k144693k506422j577184
11528a0041913J132085M066438L798225k95083l660906k228246J487672K031443
11520c710285p49428k063223k13253J245506J92519o60324Q30682K300942J444610
11511a382254M14581J694759K779110j32189m844438n057823R9190L641617M10151
11502b377296m850775l737165L295869O683034J367120n365611m279558K288741
11494f975641M623823Q20892j605542L80735N72710l549062m147468L106163Q447020
11485A673630K392661o960792m838188O480379J0241219Q01659q884169q017769
$$ plain form
11545 -16077960 -9601367 -5373228 -2389520 -462506 -839168 -3053155 -4521084 -3964189
11537 -3964189 -2817318 -2553743 -2752318 -2642876 -2712721 -3813614 -5958307 -8464729 -10041913
11528 -10041913 -8909828 -4843390 -1045165 -1340248 -5001154 -7229400 -5741728 -3710285
11520 -3710285 -4459713 -6522936 -6736189 -5490683 -5298164 -5958488 -5127806 -2826864 -1382254
11511 -1382254 -967673 727086 3506196 3374007 -1470431 -6528254 -6429064 -2787447 -2377296
11502 -2377296 -7228071 -10965236 -7669367 -986333 380787 -4984824 -9264382 -6975641
11494 -6975641 -2351818 -1530926 -3136468 -2755733 -2183023 -5732085 -9879553 -6773390 1673630
11485 1673630 4066291 -2894501 -7732689 -1252310 8988909 9790568 906399 -7111370
11477g111370j684877J412940J919334L213484K808032j209067l742624q37628
11469e231776K926477K463130N50563J109965J392483j519258l499083q06472
11461b613971K000873O2960k458152p5439L431473J942011j480247n38119K290688
11452B562077R72345j751421N83232M778432K652019l622928m344901Q96381K893008
11443E618244o82042k116575J528203L707976J276844m58157P22509p28816o497135
11434B371051r009446l341267M696141P719376N873479K345989j899482m596832
11426D159009j915071L622052L372101m317825r566897m962121L872851P530055
11418A794154N114660J200465k419480n398309n314796j768976J067440J015030
$$ plain form
11477 -7111370 -8796247 -7383307 -5463973 -2250489 557543 -651524 -4394148 -5231776
11469 -5231776 -2305299 157831 708394 1818359 3210842 1691584 -1807499 -2613971
11461 -2613971 -613098 -550138 -3008290 -3083729 347744 2289755 809508 271389 2562077
11452 2562077 3534422 1783001 2366233 7144665 9796684 6173756 1828855 2725236 5618244
11443 5618244 4936202 2819627 4347830 8055806 9332650 8874493 9597002 8868186 2371051
11434 2371051 -6638395 -9979662 -5283521 2435855 8309334 10655323 8755841 4159009
11426 4159009 2243938 5865990 9238091 4920266 -4646631 -9608752 -5735901 1794154
11418 1794154 6908814 8109279 5689799 291490 -5023306 -6792282 -5724842 -4709812
11410d709812J572768M697809O273959L552424M93821N52969P58924j699181l685411
11401G808270k436706j006973j910176k194177k74509j57292l053622l032376
11393f257561K319496N599070J587923l404419k873101j427069m422763n671707
11385a4550131J768755J0508769Q936621M24309k671412K38850p57838o400064
11377b502141o471731J546167P415058M617316j283953m008535m373545l469903
11369h531267O10722N486148M524170j827059m626084k78416L917935K278147
11361A554296q86985m69305R00323n96988k688049k240092j044733r20912M99223
11352e893222L754854L830912j565569n898364k655229M306307O130098J562891
$$ plain form
11410 -4709812 -3137044 1560765 7834724 11387148 11880969 12433938 13192862 11493681 7808270
11401 7808270 5371564 4364591 2454415 260238 -14271 -171563 -3225185 -6257561
11393 -6257561 -3938065 1661005 3248928 -155491 -3028592 -4455661 -8878424 -14550131
11385 -14550131 -12781376 -2272607 6664014 7088323 4416911 4655761 3897923 -2502141
11377 -2502141 -8973872 -7427705 -12647 4604669 3320716 -687819 -5061364 -8531267
11369 -8531267 -7920545 -2434397 2089773 262714 -4363370 -4641786 -723851 1554296
11361 1554296 667311 198006 1098329 501341 -2186708 -4426800 -5471533 -6392445 -5893222
11352 -5893222 -2138368 1692544 126975 -5771389 -8426618 -4120311 2009787 3572678
11344C572678k395133j029092K510320K550029j560198m503681j360414N315709
11336C100218P108736O24576o639300o057823m3989K651378Q31712M93169K112092
11327D180769K3341m537426k723060N627383Q047099j194212r975962o354081
11319f906149K835979L662335k622804l257202M270242Q796869L865611l294945
11311G349936m117513o0718K553800J793122k13781j954900l024767k910585j819671
11302b405077o55557Q83145L769172O567093N715103K08474n988485p624808l508939
11293c039879K352745M707459K326196q85601r78820P79224L48875k127948k298883
11284A183368P92440K510069M95660q30848K163058N293788K890868k589511m037115
$$ plain form
11344 3572678 1177545 148453 2658773 5208802 3648604 -855077 -2215491 3100218
11336 3100218 10208954 10833530 4194230 -1863593 -1907582 743796 1575508 2068677 4180769
11327 4180769 4204110 -333316 -3056376 2571007 10618106 9423894 -552068 -6906149
11319 -6906149 -4070170 -407835 -3030639 -6287841 -2017599 6779270 10644881 7349936
11311 7349936 3232423 3171705 5725505 7518627 7304846 5349946 2325179 -585406 -2405077
11302 -2405077 -3060634 -2177489 1591683 8158776 13873879 14082353 8093868 469060 -3039879
11293 -3039879 -687134 4020325 6346521 5460920 4482100 5261324 5610199 3482251 1183368
11284 1183368 1975808 4485877 4981537 4150689 6313747 11607535 14498403 11908892 7871777
11275G871777o90333J306005j111299l991660l471718j152731k03879l01284Q12872
11266i32250L120502M023871J538286l039293n500391k656998L243809N762218
11258E559754J688728m636434o772015l946000l08571J655392K854709L680446
11250b23991K830399L98735j554304k214867k738337l285812k450090l15444J006668
11241h547043Q87075J213385K598614K630123O1951j891408L88203M968970O022220
11232H332090J558442l715584m670268k204568p31700r61787O27915M736068O262176
11223I232784J422328n397777o425739q43175M321944L766799J263j429401P85968
11214E434994L286400K621719j422145n728478o369586k526352K187364L816806
$$ plain form
11275 7871777 7181444 8487449 7376150 3384490 -87228 -1239959 -1443838 -1745122 -932250
11266 -932250 2188252 6212123 7750409 4711116 -789275 -3446273 -202464 5559754
11258 5559754 7248482 2612048 -4159967 -8105967 -8414538 -6759146 -3904437 -223991
11250 -223991 2606408 3005143 1450839 -764028 -3502365 -6788177 -9238267 -9553711 -8547043
11241 -8547043 -7659968 -6446583 -3847969 -1217846 -1155895 -3047303 -2659100 2309870 8332090
11232 8332090 9890532 6174948 1504680 -699888 -1431588 -2393375 -1765460 2970608 9232784
11223 9232784 10655112 5257335 -1168404 -2011579 2310365 6077164 6078427 4649026 5434994
11214 5434994 8721394 11343113 9920968 4192490 -2177096 -4703448 -2516084 1300722
11206A300722K549032J009675j16397j335111j164442J491301L304302O83601
11198G722683l123544k051107K160129J783614l566586n113999M57133M555540
11190B823863M39562n811790n589664j038641Q13906N42490K846263N521072K789567
11181C336628l098492m228035P4234K578936L42435j799010p82446M51292P3821
11172c050637O78906K933872L007266n86803l497625k034525J637682L490690
11164B578826K700404N67239j810504k943687j480945J258172K322159J225668
11156D417332j98003j623605l712443m370008r10353L883560L769542j715494
11148d59472n701774l456568J791508M442487L055316o18444m316002n055126
$$ plain form
11206 1300722 3849754 4859429 4743032 3407921 2243479 3734780 7039082 7722683
11198 7722683 4599139 2548032 4708161 6491775 2925189 -2188810 -1731677 2823863
11190 2823863 3263425 -2548365 -8138029 -9176670 -8362764 -7820274 -4974011 547061 3336628
11181 3336628 238136 -3989899 -3915665 -1336729 -994294 -2793304 -3575750 -3124458 -3050637
11172 -3050637 -2371731 562141 3569407 2982604 -515021 -2549546 -911864 2578826
11164 2578826 5279230 5846469 4035965 1092278 -388667 869505 3191664 4417332
11156 4417332 4219329 2595724 -1116719 -5486727 -6397080 -2513520 1256022 -459472
11148 -459472 -6161246 -9617814 -7826306 -3383819 -328503 -946947 -5262949 -10318075
11140a0318075j061282M170771M647992M98195j699570P08219K244182r74053
11132a783621l944770p69803N363653O850069K912900m94636k14085R27999P8918
11123H926624j672498j965992l80906J592993J891553l25926k934255k628133
11115B503460J73379J128253j167965k003853J971419N989107L610206k712794
11107I491212m547940k14961K902598J70744l447258k086143J493798Q45001l355401
11098A251650m181572O59545N152152L760552j106310l531482k500075j698893
11090b194433k620875k544455K41749L280252L782065K573614J830220J196989
11082E545126q74311l371786l609646j527387q3168q91779j954726p35825K248607
$$ plain form
11140 -10318075 -11379357 -7208586 -2560594 -2062399 -3761969 -3053750 -809568 -1783621
11132 -1783621 -5728391 -6498194 -1134541 5715528 8628428 8133792 7919707 8847706 8926624
11123 8926624 7254126 5288134 4907228 6500221 8391774 8065848 5131593 2503460
11115 2503460 2676839 3805092 2637127 633274 2604693 8593800 12204006 9491212
11107 9491212 4943272 4728311 7630909 7801653 4354395 2268252 3762050 4607051 1251650
11098 1251650 -2929922 -2270377 2881775 6642327 5536017 2004535 -495540 -2194433
11090 -2194433 -4815308 -7359763 -7118014 -3837762 -55697 2517917 4348137 5545126
11082 5545126 4670815 1299029 -2310617 -3838004 -3921172 -4812951 -6767677 -7503502 -5254895
11073e254895M111073L027903J77646j547980o30159J355370J729057K88634p20818
11064B535831n51409j262306l543533m176075p41251L489742L585301N68847J06388
11055A1535L549659N471088J931393l305455m142492p49759J333063l70650j968985
11046A759397M52591M365521L972616j011619l995617r11440K952287L36381o155469
11037A764648o756072O10979O405974L754787j509627j329447J336353j141027
11029C136568o601346o122937N26794M063299J057478j022509K776393O629605
11021D443345M177350j453631l985805l470108k937692j391027K733413N536420
11013C652265K587495k883947l861583n5432K117754m72925l879528l832586r87724
$$ plain form
11073 -5254895 -1143822 1884081 2061727 513747 -116412 1238958 2968015 3256649 2535831
11064 2535831 1984422 722116 -2821417 -6997492 -7738743 -4249001 -663700 -94853 11535
11055 11535 3561194 9032282 10963675 7658220 3515728 2765969 4099032 3728382 1759397
11046 1759397 2211988 6577509 10550125 9538506 5542889 4631449 7583736 7920117 1764648
11037 1764648 -4991424 -4380445 2025529 5780316 4270689 2941242 4277595 3136568
11029 3136568 -3464778 -9587715 -9060921 -4997622 -3940144 -4962653 -2186260 4443345
11021 4443345 8620695 7167064 3181259 -288849 -3226541 -4617568 -1884155 3652265
11013 3652265 6239760 3355813 -505770 -561202 1556552 1083627 -2795901 -6628487 -7616211
11004g616211J925168L887382M637109L188203l74238l499419l709608j716725
10996c278339k41823R8055J739614N737119Q101441M009662m172202p689537k838202
10987A465788L016354J633999m106248n452207j886821o54119l106935k394390
10979a1484579L205426N828777J750642j070771L443140P953572L539836m648408
10971H517635n336049M91624K077312k641254m442874N61326M429633J154223
10963D811576l897238l748982l72053P80164j589M53323J232292q8153j568300
10954b398960n0520K310036Q62264l575421n403890k574727R90246J768576Q26517
10945g245879N53264J173576K113071L522032M519200K799596j585328m385591
$$ plain form
11004 -7616211 -5691043 -1803661 2833448 6021651 5647413 2147994 -1561614 -3278339
10996 -3278339 -3520162 -3422107 -1682493 4054626 12156067 16165729 11993527 4303990 1465788
10987 1465788 4482142 6116141 2009893 -3442314 -5329135 -5983254 -9090189 -11484579
10979 -11484579 -8279153 -2450376 -699734 -1770505 1672635 9626207 13166043 8517635
10971 8517635 3181586 3673210 5750522 3109268 -1333606 -772280 3657353 4811576
10963 4811576 914338 -2834644 -3206697 -2426533 -2428122 -1974799 -742507 -830660 -2398960
10954 -2398960 -2449480 -139444 722820 -2852601 -8256491 -10831218 -9840972 -8072396 -7245879
10945 -7245879 -6692615 -5519039 -3405968 116064 4635264 7434860 5849532 1463941
10937A463941k119911K499361L422164q14766n278603n273756j682309J667459
10929f116420L083414L147380K026921k55459k053172j741241o55681j408856
10921c973114l436620l300526K48776M397330N959315M278840L04883l994415
10913D84469n130490j211371L536086K314798m137805o572932j80443P098160
10905c799528N417203k163408m076484K313502P067333L011139m083322n252288
10897a565853j452699j91164k979491l784364N52107N114768M299090j94628k155504
10888b357738N67566L701829K534278k234677n607153m127232N89088M108997
10880b825042M075321K140272J206131J707175J382846j552835n839270p981998
$$ plain form
10937 1463941 -655970 1843391 5265555 4450789 -827814 -6101570 -7783879 -6116420
10929 -6116420 -3033006 114374 2141295 1885836 -167336 -1908577 -2564258 -3973114
10921 -3973114 -7409734 -10710260 -10461484 -6064154 -104839 4174001 4478884 484469
10913 484469 -4646021 -5857392 -2321306 -6508 -4144313 -10717245 -10897688 -3799528
10905 -3799528 1617675 -545733 -4622217 -2308715 4758618 7769757 3686435 -1565853
10897 -1565853 -3018552 -3209716 -6189207 -9973571 -9421464 -4306696 -7606 -202234 -2357738
10888 -2357738 -1790172 1911657 4445935 2211258 -3395895 -7523127 -6934039 -2825042
10880 -2825042 1250279 3390551 4596682 6303857 7686703 6133868 294598 -7687400
10872g687400n369850J144068P196400P999583K935676k886660l511316P64579
10864E85080L356374l6367n343517n654159r04326K460641J084597j205332k84506
10855e941515K245067K872914J922168J516473R15492j504258l615567j858030
10847c447256K505640M122564Q74804l460017m640453k708100k63414J164731
10839e851501J614945J473443J064479O07420J72441Q4846O70585R96109n06474
10830C26293k949782k800447J080342M555074L318809j148674m064181l872420
10822e554986k552143j096813J038900K968842K940501J322578k52770j507030
10814b692921k185352n23340K981521L384518j739787o260055l191041M185633
$$ plain form
10872 -7687400 -13057250 -11913182 -4716782 3282801 6218477 3331817 -179499 585080
10864 585080 3941454 3905087 -1438430 -7092589 -7996915 -5536274 -4451677 -5657009 -5941515
10855 -5941515 -3696448 -823534 1098634 2615107 3530599 2026341 -1589226 -3447256
10847 -3447256 -941616 3180948 4055752 595735 -4044718 -6752818 -7016232 -5851501
10839 -5851501 -4236556 -2763113 -1698634 -1091214 -918773 -833927 -163342 832767 326293
10830 326293 -2623489 -5423936 -4343594 211480 3530289 2381615 -1682566 -5554986
10822 -5554986 -8107129 -9203942 -8165042 -5196200 -2255699 -933121 -1185891 -2692921
10814 -2692921 -4878273 -5401613 -2420092 964426 -775361 -7035416 -10226457 -6040824
10806f040824O877021L905729K171043L315159J372793m825085p591493k791930
10798c607587K924622K470892j827282m020587l323881j773658P20648L703669
10790d733164M111888J658794P33192K669959K556734j572546l702107o5194L039049
10781D696605n67960n596392l376090L780284O273883K023676k308839l106054
10773A819113l228047m002171k649122J163966L420651J953950q98572k575940
10765d996172k556408o08755K437054L031715p44371m255260j638661M774757
10757d556101O929855K775856j494437j780614j345699l301552m595610j731164
10749i099466K478775K871075j69825j456085J355350M621301L696537j150502
$$ plain form
10806 -6040824 836197 4741926 6912969 10228128 11600921 6775836 -815657 -3607587
10798 -3607587 -682965 1787927 -39355 -4059942 -7383823 -9157481 -8436833 -4733164
10790 -4733164 -621276 1037518 1770710 4440669 6997403 5424857 1722750 1657556 4696605
10781 4696605 4128645 -1467747 -4843837 -1063553 5210330 7234006 4925167 1819113
10773 1819113 -1408934 -5411105 -8060227 -6896261 -3475610 -1521660 -2420232 -4996172
10765 -4996172 -7552580 -8161335 -5724281 -2692566 -3436937 -7692197 -9330858 -4556101
10757 -4556101 2373754 5149610 3655173 1874559 528860 -2772692 -7368302 -9099466
10749 -9099466 -6620691 -3749616 -3919441 -5375526 -4020176 601125 4297662 3147160
10741C147160m979303l877411N19891L027586J116374k473982l702797j742329
10733h964811J582387M577575N971681M489920P19535k046367j505689J66087
10725D990318p30385l670904m157989j13122M546854M311863r28726n147066l316850
10716d216007J868369L000826j912798o037381l136872L237845M978330J374835
10708h42853p18458J911205M559494K958699n38641j895571j357027j309687j952979
10699H14182j848648k22382K621940M900168L768926p06700l609484j547159J541323
10690E712166P96516p67078J905650M798417O77307o178258m702075L540187M984561
10681A0767393l229794p518918n84553O390609L129887l300951k756937O58680
$$ plain form
10741 3147160 -1832143 -5709554 -5189663 -2162077 -1045703 -3519685 -7222482 -8964811
10733 -8964811 -7382424 -2804849 3166832 7656752 8376287 6329920 4824231 4990318
10725 4990318 4259933 589029 -3568960 -3682082 864772 5176635 4247909 -899157 -4216007
10716 -4216007 -2347638 653188 -1259610 -7296991 -10433863 -7196018 -2217688 -842853
10708 -842853 -1561311 349894 4909388 7868087 7329446 5433875 4076848 2767161 814182
10699 814182 -1034466 -1256848 1365092 6265260 10034186 9327486 5718002 4170843 5712166
10690 5712166 6508682 5741604 7647254 12445671 13122978 6944720 2242645 5782832 10767393
10681 10767393 7537599 18681 -565872 5824737 8954624 5653673 2896736 3555416
10673C555416j432907n578343m149180j13J25041j023325K182041N307627J127518
10664A13775n981592o076664O42217O066912P228231N982283J473498n627350
10656C821310p605668l76082O775682M311214j987920j801424J523095r29689
10648C730518n059661j233769N601988K884111o095564o035137M119718R092817
10640G005021K901748k964324p02227K464131l61651m625480m723968k588297
10632c595047o05170K651378N640940L607948j918765l771156j041129K46950
10624A215949j045954k44513K028023L49191l484333k103029L166107L436910
10616C318351j459694k331559K216164L053651k408417n423765j825027J556728
$$ plain form
10673 3555416 2122509 -3455834 -7605014 -7605127 -7480086 -8503411 -6321370 -1013743 113775
10664 113775 -5867817 -11944481 -11302264 -5235352 1992879 7975162 9448660 3821310
10656 3821310 -3784358 -4160440 2615242 6926456 4938536 3137112 4660207 3730518
10648 3730518 -1329143 -2562912 3039076 5923187 -172377 -6207514 -2087796 7005021
10640 7005021 9906769 6942445 6240218 8704349 8342698 3717218 -1006750 -3595047
10632 -3595047 -4200217 -1548839 4092101 7700049 5781284 2010128 968999 1215949
10624 1215949 169995 -74518 1953505 2302696 -1181637 -3284666 -118559 3318351
10616 3318351 1858657 -472902 1743262 4796913 2388496 -3035269 -4860296 -3303568
10608c303568L75286q96057J25098l12764j957203L82837M963067M073127r91403
10599B458420q76514L839108K283094n921598p599332J019559O675109J718121
10591C595967l540450k52514M122681J181298l399394j886286J544324M46717
10583A812343j657963L57374K717137P23597j816684j85158K587154K348575R86059
10574G872434O74393n50111k328388k83236M752994N580745N70137l437075l095757
10565I756136k403411k619916p52644N65684m121360r258345l531265R187748
10557c177373J2198204K331458n307659l120338r00980m057285l616141L507235
10549b142879N444426k839999q286989j554646P882045R184084N514206K294209
$$ plain form
10608 -3303568 -2928282 -3824339 -3699241 -4012005 -5969208 -5586371 -623304 3449823 2458420
10599 2458420 1581906 5421014 7704108 1782510 -5816822 -4797263 1877846 3595967
10591 3595967 55517 -196997 3925684 5106982 1707588 -178698 1365626 1812343
10583 1812343 154380 511754 3228891 3952488 2135804 1950646 4537800 6886375 7872434
10574 7872434 8546827 7996716 5668328 5385092 10138086 15718831 16288968 12851893 9756136
10565 9756136 7352725 4732809 3980165 4545849 424489 -8833856 -12365121 -3177373
10557 -3177373 9020831 11352289 6044630 2924292 2023312 -2033973 -5650114 -2142879
10549 -2142879 3301547 461548 -7825441 -9380087 -1498042 7686042 13200248 15494457
10541A5494457k448462p102827l916111M398526M502276l906713n393805L150951
10533D778292N699248l031066o886843J486956O495121j140799p630755l084013
10525c313859J368543j549120m89308Q587429R792926k432464r057503j17344
10517B789300O818204K1411n485467M40426L040403n394402p591312L446490P336825
10508E421878l617036o567093O565437R666057o088044j0162855Q476273J4819253
10500A8513870n318634j2552126J0486177J8798377q629452j8498587J5790938
10493A8590563K8521336j6836112l5144170L0330967N8057298q1047364k62852450
10486b60379932k29837699K8009190K26320171J74998402J4352208l4899773K1873664
$$ plain form
10541 15494457 13045995 5943168 2027057 6425583 10927859 7021146 1627341 4778292
10533 4778292 10477540 7446474 559631 2046587 8541708 7400909 -229846 -3313859
10525 -3313859 -1945316 -3494436 -3983744 4603685 14396611 11964147 2906644 2789300
10517 2789300 9607504 9628915 4143448 4583874 7624277 2229875 -5361437 -1914947 5421878
10508 5421878 1804842 -4762251 1803186 11469243 5381199 -4781656 3694617 18513870
10500 18513870 13195236 643110 11129287 29927664 21298212 2799625 18590563
10493 18590563 47111899 30275787 -4868383 25462584 83519882 2472518 -260379932
10486 -260379932 -490217631 -462208441 -235888270 -60889868 -46537660 -81437433 -59563769
10479e9563769M0492885m296043k1448999J0237587K3010145j352848j0696635
10472b3617677Q181382J2241519o590689r135495R960570J3198884m624829q357860
10464h744195P021887Q407164q772977j2191296L652059P826138o318116r959800
10456a9079136M037230R034697j721829l287384R365257R921401p483057j4633929
10448a3846750p65243Q945396P75528n769161J159308M899183l360640o497176
10440a4459555L336503P866558j980199q182667O9701O685755K71293n403183
10432a1795794K62435M938710p11429m558525K203489P101407K89778o980388
10424i250317m088025O96788j050325k065835L081321N177354p08086l465970
$$ plain form
10479 -59563769 -19070884 -23366927 -44815926 -34578339 -11568194 -12921042 -23617677
10472 -23617677 -15436295 -3194776 -9785465 -18920960 -8960390 4238494 -386335 -8744195
10464 -8744195 -1722308 6684856 -2088121 -14279417 -10627358 -2801220 -9119336 -19079136
10456 -19079136 -15041906 -6007209 -7729038 -11016422 -1651165 8270236 787179 -13846750
10448 -13846750 -14611993 -5666597 -4891069 -10660230 -9500922 -4601739 -7962379 -14459555
10440 -14459555 -11123052 -3256494 -5236693 -13419360 -13349659 -6663904 -6392611 -11795794
10432 -11795794 -11533359 -6594649 -7306078 -11864603 -9661114 -2559707 -2269929 -9250317
10424 -9250317 -13338342 -12641554 -13691879 -15757714 -12676393 -7499039 -8207125 -11673095
10416a1673095L001978O684406n45237p060825k202637N232545M068664l95500
10408b889701O04510K638697j137273n931548n179892k323556j537551J096140
10400a4660174P115727Q890214K798351l033805k538200p17519j616968r22070
10392d684444K374393J415815m173211m432084L077657P211025K635330j195940
10384B228541J258249J335558n584817q964878j841125N599136L520355j686085
10376d135066j465389j92866l240753m318710J536292N702778P18990n255766
10368a0650490k795890K109423L23108l109452M24971N376306J502692o726561
10360a3545893o550948K446274Q803535O766054J032911l014484l510576J93365
$$ plain form
10416 -11673095 -8671117 -1986711 -2531948 -9592773 -11795410 -6562865 -2494201 -2889701
10408 -2889701 -2285191 353506 -783767 -6715315 -11895207 -14218763 -15756314 -14660174
10400 -14660174 -7544447 1345767 4144118 1110313 -1427887 -2145406 -3762374 -4684444
10392 -4684444 -2310051 -894236 -5067447 -9499531 -6421874 789151 3424481 2228541
10384 2228541 3486790 4822348 -762469 -9727347 -11568472 -5969336 -2448981 -4135066
10376 -4135066 -5600455 -5793321 -9034074 -13352784 -11816492 -6113714 -5394724 -10650490
10368 -10650490 -13446380 -11336957 -11013849 -14123301 -13698330 -8322024 -6819332 -13545893
10360 -13545893 -20096841 -17650567 -8847032 -2080978 -1048067 -4062551 -7573127 -7379762
10352g379762N497954O218798J186338k405049m01229J281706j973353m160589
10344b135186M41904N766151L539106l004185n244542k705805o82530J63J591291
10335b433633K700217J196053o71418n71173l49099r41197J79973K053179m68275
10326F94627n718885m337888M535772Q394352P20722p497507n556675M43598Q06681
10317g515203n07172L805666P788131K279221o714719o473164J514821N273450
10309e48969K531051J340167L498171K719795j850934m214566l236084l483601
10301c244970m774244k306323L116503N517687L875401K177758P05847k978684
10293B088975n980421l204082K613213L973777P69181l89006J956945K817466
$$ plain form
10352 -7379762 -1881808 4336990 5523328 3118279 2717050 3998756 2025403 -2135186
10344 -2135186 -1693282 4072869 7611975 4607790 -636752 -3342557 -4025087 -4024924 -2433633
10335 -2433633 266584 1462637 791219 220046 -129053 -1070250 -890277 1162902 694627
10326 694627 -5024258 -9362146 -4826374 3567978 4288700 -3208807 -8765482 -8321884 -7515203
10317 -7515203 -8022375 -4216709 3571422 5850643 -864076 -7337240 -5822419 -548969
10309 -548969 1982082 3322249 6820420 9540215 7689281 3474715 238631 -3244970
10301 -3244970 -8019214 -10325537 -7209034 -1691347 2184054 4361812 5067659 2088975
10293 2088975 -3891446 -7095528 -4482315 -508538 260643 -128363 1828582 4646048
10285D646048Q75664R9923J079595P1058k728915k715932M69864J924741K9925
10276C751971j475481p97812l83781j061502n25926J355570J707391L8853p43152
10267A866131O10809K025997J667858l75722l185707m762326k762762J423552
10259c492170K605212o48850k674295O18978M683760L553555p90434k749429k172757
10250a066430k066964j627771Q98020K369851l91162l469465j462707L112948
10242c703680L917337J016795r36146j403290k607769k868248K7506K056516j202422
10233e703401m983496j569159O136516P806874J486975m208969l886158j528151
10225f448969j614016k802821k505518q89830J234049L240001L319554R66280
$$ plain form
10285 4646048 5521712 5621635 6701230 6772288 4043373 1327441 1797305 3722046 3751971
10276 3751971 2276490 1478678 1094897 33395 -492531 863039 2570430 2609283 1866131
10267 1866131 2476940 4502937 6170795 5795073 2609366 -2152960 -4915722 -3492170
10259 -3492170 -886958 -1535808 -4210103 -3591125 1092635 4646190 3855756 1106327 -1066430
10250 -1066430 -3133394 -4761165 -3863145 -1493294 -1884456 -5353921 -6816628 -3703680
10242 -3703680 213657 1230452 294306 -1108984 -3716753 -6585001 -6557495 -4500979 -5703401
10233 -5703401 -10686897 -12256056 -6119540 1687334 3174309 -1034660 -4920818 -6448969
10225 -6448969 -8062985 -10865806 -13371324 -14261154 -13027105 -9787104 -6467550 -5501270
10217e501270p44830j37586q37810m826329o316078n03032O367356N454762l04494
10208g349311j394587K107814K111545j758621j682707L104032M459303N94967
10200A92435m28996M001461N491964j80267m527114l90237N652306L550539m984687
10191H377404j0029146p240665p27269M412876O178063M474915O94014k532522
10183C607670l660504l074770j095794K148003M774380M583638K453931P63954
10175A0500508o75825k833646l304550K58956L995797J980683m213550p356147
10167a647774n503566l238625k096498J341613O605454P720678L116758j093744
10159E204296q56556M36552n34817j637263r91827r22015k395052k247018K92491
$$ plain form
10217 -5501270 -6246100 -6383686 -7221496 -12047825 -18363903 -18866935 -12499579 -7044817 -7349311
10208 -7349311 -8743898 -6636084 -4524539 -6283160 -7965867 -4861835 -402532 192435
10200 192435 -236561 3764900 9256864 9076597 4549483 4159246 9811552 13362091 8377404
10191 8377404 -1651742 -8892407 -9619676 -5206800 971263 5446178 6140192 3607670
10183 3607670 -52834 -3127604 -4223398 -2075395 2698985 7282623 9736554 10500508
10175 10500508 9824683 6991037 3686487 3945443 7941240 9921923 5708373 -1647774
10167 -1647774 -7151340 -10389965 -12486463 -11144850 -4539396 3181282 6298040 5204296
10159 5204296 4347740 4784292 4249475 2612212 1620385 698370 -1696682 -3943700 -3651209
10150c651209R85458j639758k691487N34976L071754M48168l637183l346352N96070
10141i329563L561595M026395K992149N24582k356339k235125J534854L877231
10133B595779Q98205l623297l469416J064837M204491K748597j096468l679303
10125c56575l418181j234416M36502N9175p98521M34182L011026L728803K033271
10116C895266K76904j056218l416163n290899l264960J050558J800617j575577
10108g580472k673075J292048M676389L070302K82219N67902J129707j222245
10100d57225k604178R46577M511859J210903n724601p081992j760913K489873
10092h469697J796988N11959J718788J945863j492718m746627l396917N24531
$$ plain form
10150 -3651209 -2665751 -4305509 -6996996 -6462020 -3390266 -2942098 -6579281 -9925633 -9329563
10141 -9329563 -5767968 -1741573 1250576 1775158 -581181 -2816306 -1281452 2595779
10133 2595779 3493984 -129313 -3598729 -2533892 1670599 4419196 3322728 -356575
10125 -356575 -3774756 -5009172 -4572670 -4513495 -5312016 -4877834 -1866808 1861995 3895266
10116 3895266 4172170 3115952 -300211 -5591110 -8856070 -7805512 -6004895 -7580472
10108 -7580472 -10253547 -8961499 -4285110 -1214808 -932589 -364687 765020 -457225
10100 -457225 -3061403 -2114826 2397033 3607936 -2116665 -9198657 -10959570 -8469697
10092 -8469697 -6672709 -6160750 -4441962 -2496099 -3988817 -8735444 -12132361 -11607830
10084a1607830J972190L93221m04303J550463L892775L545149N78196k015434
10076b095573j582033J184860K541261r066l747934l246474K035044N375087J209744
10067A664916n967071o335179J287974O555393K088735n231838m163768M050544
10059f050294P950224L412001j577353j116728M57896j167456k219178L26567
10051A5679J170654l492342o714763j506351N917980N025396k031704m537806
10043f153257o69201K063634J569394K780690M976789J439208o507189q409362
10035h909294j070705N940589N171808O19166j889357k757674k620845Q89598
10027d626714N389288L479158m298872p129251p07916M899920J683464l361139
$$ plain form
10084 -11607830 -9635640 -9242419 -9646722 -8096259 -4203484 -658335 -80139 -2095573
10076 -2095573 -3677606 -2492746 48515 39449 -3708485 -6954959 -4919915 455172 1664916
10067 1664916 -4302155 -10637334 -9349360 -2793967 -705232 -5937070 -10100838 -6050294
10059 -6050294 1899930 5311931 3734578 2617850 3075746 1908290 -310888 15679
10051 15679 1186333 -2306009 -9020772 -10527123 -4609143 416253 -1615451 -6153257
10043 -6153257 -6822458 -4758824 -3189430 -408740 4568049 6007257 -499932 -8909294
10035 -8909294 -9979999 -4039410 1132398 1751564 -137793 -2895467 -5516312 -4626714
10027 -4626714 762574 4241732 -57140 -7186391 -7894307 -2994387 -1310923 -4672062
10019d672062j142526M087582L460818r13867j276935J335719K56516l792232
10011b656987m553417j881052p13538j007389J049030L930086K864186n37396
10003c506477l01810L346864M515781J851076n10110j332590k845416l604433
9995b387115L0575N223963M741995j295289m744346k281117k9923k447043n017987
9986h206287k502334K471692M268319K499092K80387j709624m159558m882119
9978a1940432j117782M752019O580027K439091k228738j501416L089300M654750
9970D726819O60652l408536k204549J482598J489954j593620j689109K045188
9962A509397L388253n32062m575182m324888k216338j062198J109968M726356
$$ plain form
10019 -4672062 -5814588 -1727006 1733812 819945 -456990 878729 1135245 -2656987
10011 -2656987 -7210404 -9091456 -9804994 -10812383 -9763353 -5833267 -2969081 -3506477
10003 -3506477 -3808287 -461423 4054358 5905434 5395324 4062734 1217318 -2387115
9995 -2387115 -2356540 2867423 7609418 6314129 1569783 -711334 -741257 -3188300 -8206287
9986 -8206287 -10708621 -8236929 -3968610 -1469518 -1189131 -2898755 -7058313 -11940432
9978 -11940432 -13058214 -8306195 -1726168 712923 -1515815 -3017231 72069 4726819
9970 4726819 5387471 1978935 -225614 1256984 2746938 1153318 -535791 1509397
9962 1509397 4897650 4365588 -209594 -4534482 -6750820 -7813018 -6703050 -1976694
9954a976694M745675m06326l290759J090099N140250k3621q673822p809635K605782
9945h599051R366287N756160o37593k017627j010029k588219m589748k740680
9937g060500Q82380R29777k722471m721613j491962M391912P048836L564230k450797
9928a630208m417526p34695L029202J875248j712052k189961M83988J611805n55973
9919d240172k950465k921570j007160J253845K799363K823828J664459P09076
9911a868796k48342k713171m959498k660547L206414N270562Q24054k977624o54572
9902f781520K507258L98221k812104r91581K148684O53236j603900R08984K436929
9893c135793m016015j0527027n454913M900206N464168j329096q63873N005529
$$ plain form
9954 -1976694 2768981 2362655 -928104 161995 5302245 5278624 -3395198 -11204833 -8599051
9945 -8599051 767236 6523396 5885803 3868176 2858147 269928 -4319820 -7060500
9937 -7060500 -6178120 -5248343 -7970814 -12692427 -14184389 -9792477 -2743641 820589 -1630208
9928 -1630208 -6047734 -6782429 -3753227 -1877979 -3590031 -5779992 -5296004 -3684199 -4240172
9919 -4240172 -7190637 -10112207 -11119367 -9865522 -7066159 -4242331 -2577872 -1868796
9911 -1868796 -2117138 -4830309 -9789807 -12450354 -9243940 -3973378 -3149324 -6126948 -6781520
9902 -6781520 -4274262 -3876041 -6688145 -7679726 -5531042 -4877806 -6481706 -5572722 -3135793
9893 -3135793 -7151808 -17678835 -23133748 -18233542 -12769374 -14098470 -14962343 -9956814
9885i956814Q06604j0755510r562720M345921O470597q372508j3594191o14114
9877d1232735k612267l6552383n6533056j2733874O3891350R1047573M5475355
9870E0749963j0007494j8916357J047961N364178p206156q846191K609276N124926
9862A9920106m639464p744261Q75540M732613l136353q516164k115626N052925
9854D429316J963571m419897k716758M282516O285703K020234j740218k138800
9846G965667j760390j411010O04838L303054L279403J662l207467l432556j002824
9837D340377J414508J193051j691869l909769k472114P60473J325659q61211r82069
9828h82964L009646O792090O082180K361692p09617k589582m132945m217404j994154
$$ plain form
9885 -9956814 -9150210 -19905720 -29468440 -25122519 -18651922 -27024430 -40618621 -41232735
9877 -41232735 -43845002 -80397385 -136930441 -149664315 -85772965 5274608 50749963
9870 50749963 40742469 21826112 22874073 28238251 21032095 12185904 14795180 19920106
9862 19920106 15280642 7536381 8411921 13144534 10008181 1492017 -623609 4429316
9854 4429316 6392887 1972990 -743768 3538748 9824451 11844685 10104467 7965667
9846 7965667 6205277 4794267 5399105 8702159 11981562 11983224 8775757 5343201 4340377
9837 4340377 5754885 6947936 5256067 1346298 -1125816 -365343 960316 99105 -882964
9828 -882964 2126682 8918772 15000952 17362644 16653027 14063445 9930500 5713096 3718942
9819C718942L38763N68028l76492j205635k727623m412511k978562J468965K958852
9810b647273j184800m051094O54561P144625N771114j016166k309688L194147
9802E555426N292575l66935n584557m033497o59402r20761j288337K075023M364643
9793D434178N96386m355333l355025J180099K225478J29261L34907K754874K670098
9784F614923j45983j751059j627722k104142k157322M37249K832614J017187k019298
9775A096447m99131L589351L305610j131191k822054l89825M93416j606921j512578
9766E23124J872229K812927m53240k095067N72630K441457Q89589Q62080M397228
9757A1822957M935770j035121n890604k870686J905643o85151p240088p195700
$$ plain form
9819 3718942 4057705 4625733 4249241 3043606 315983 -4096528 -7075090 -5606125 -2647273
9810 -2647273 -3832073 -7883167 -7228606 -83981 5687133 4670967 2361279 5555426
9802 5555426 10848001 10481066 4896509 863012 203610 -717151 -2005488 69535 4434178
9793 4434178 5030564 675231 -2679794 -1499695 725783 855044 1189951 3944825 6614923
9784 6614923 6468940 4717881 3090159 986017 -1171305 -734056 2098558 3115745 1096447
9775 1096447 597316 4186667 7492277 6361086 3539032 3149207 3642623 2035702 523124
9766 523124 2395353 5208280 4755040 2659973 3232603 5674060 6563649 7425729 11822957
9757 11822957 16758727 15723606 9833002 6962316 8867959 8182808 942720 -6252980
9749f252980J23676M896674J994280l062902l811915m74466L196325M287393J177642
9740B073727m815790p958071l717433L903575O128741R55687m510869m099370
9732a2039803N05660M380505N712948N131307K957993M8870j564557j340796j288212
9723B503915k552695l297967j854234K90351Q57234L28911O60341J573196Q14036
9714f76912j929469l689421j807167K445766N175075M268746J062508k272811
9706B576315m958973o296983m488292O41908N174123M741570L29621k897286k504977
9697g682974p52103O33766K888589N745657N459629O13769m067932l729712j28973
9688a020284J761394J109052N40496M48452o91381j747541l24959J788706L82897
$$ plain form
9749 -6252980 -6129304 -1232630 761650 -2301252 -6113167 -6587633 -3391308 896085 2073727
9740 2073727 -2742063 -10700134 -14417567 -10513992 -4385251 -3429564 -7940433 -12039803
9732 -12039803 -11534143 -7153638 -1440690 3690617 6648610 6697480 5132923 3792127 2503915
9723 2503915 -48780 -3346747 -5200981 -4910630 -4053396 -3724485 -3064144 -1490948 -676912
9714 -676912 -2606381 -6295802 -8102969 -5657203 -482128 3786618 4849126 2576315
9706 2576315 -2382658 -8679641 -13167933 -12526025 -7351902 -2610332 -2280711 -5177997 -7682974
9697 -7682974 -8435077 -7801311 -4912722 832935 6292564 6906333 2838401 -891311 -1020284
9688 -1020284 741110 1850162 2390658 2839110 2147729 400188 75229 1863935 2246832
9679B246832l575345m115301L47098L774636J816503j130516Q78375N191397M204742
9670I638421k486138o679993l457106J912037K416034l74848M4001L980900M931952
9661I925260K47483m275866l220607N35242J199546p64069o70321J530439J045756
9652E552863l187797n883658l056458K443231N207031L465778q26254m731124
9644a016388n376610j609024L405057M332090M44182k828806j249134K535553
9636a363080L365909P84013j407028r04341R46639J891685J353178O23339J383786
9627F674100L252266L152165o74809m658249l651311J294827L683186J008593
9619A0080768k055299j901954j330462k997085l509779L83174M383357K175546
$$ plain form
9679 2246832 -1328513 -5443814 -5096716 -1322080 494423 -636093 242282 5433679 9638421
9670 9638421 7152283 472290 -2984816 -1072779 1343255 968407 1012408 4993308 9925260
9661 9925260 10172743 5896877 2676270 3211512 4411058 3646989 2976668 4507107 5552863
9652 5552863 2365066 -3518592 -6575050 -4131819 1075212 4540990 3714736 -1016388
9644 -1016388 -6392998 -8002022 -4596965 -264875 179307 -2649499 -3898633 -1363080
9636 -1363080 2002829 2786842 1379814 475473 1422112 3313797 4666975 5290314 6674100
9627 6674100 9926366 13078531 12403722 7745473 4094162 5388989 9072175 10080768
9619 10080768 8025469 6123515 4793053 1795968 -1713811 -1330637 3052720 5228266
9611E228266m303429o874787k523004L098603L937219O79638j592991m4805K945911
9602E50621K861316r45447l449343o10242L676373K463322k950772m090300R06159
9593a588313L599501n66551l941343M82117O700319N599373j6760j259322J539301
9584A0548322J301609j938049k269713o82444l532876q882386p633121N06653
9576a2582005N162364K147749l26315L354495O746442L037000l649432n560037
9568a669739k337630J428897L275267K450345j353639m703795k458364L349832
9560b018826M308716r72287l273601K262076P209917L285249m106128m814681
9552A880435N53661L711266K021894n44684j821352k328233j149439J559696J630590
$$ plain form
9611 5228266 924837 -5949950 -8472954 -5374351 -1437132 -757494 -2350485 -2395290 550621
9602 550621 3411937 2466490 -982853 -1593095 2083278 4546600 1595828 -2494472 -1588313
9593 -1588313 2011188 1444637 -2496706 -2014589 4685730 10285103 10268343 9009021 10548322
9584 10548322 11849931 9911882 7642169 6959725 3426849 -5455537 -13088658 -12582005
9576 -12582005 -7419641 -5271892 -5598207 -2243712 4502730 7539730 3890298 -1669739
9568 -1669739 -4007369 -2578472 696795 3147140 1793501 -2910294 -5368658 -2018826
9560 -2018826 2289890 1317603 -1955998 306078 7515995 10801244 6695116 1880435
9552 1880435 2434096 6145362 8167256 7622572 5801220 3472987 2323548 3883244 5513834
9543E513834k517131m820212n53482M709781L511691j318575k427405q13040j958707
9534f73246l423305J081203P771392O453459k289011o920164l195735N36166r66121
9525a625362j747636K883463P343529N488602o1408m271513o866258p678370l601650
9516a0136603L661604N478629r79868o068273j741646N405308M550961k429979
9508b259867n110023j065087K787442L014434L043007M126399K788856j465525
9500E859636m040328k594172R6598J864476L536687M531006K347480j983330l850344
9491E767709k277827j574046l759109n015396k457692Q52766J247063L62044J607406
9482e247082M057299M161617J526341q59169j161801m49555k74127n71680k2110
$$ plain form
9543 5513834 2996703 -1823509 -2376991 2332790 5844481 4525906 2098501 1285461 -673246
9534 -673246 -4096551 -3015348 4756044 11209503 8920492 2000328 -1195407 -659241 -1625362
9525 -1625362 -3372998 -489535 6853994 12342596 12281188 8009675 1143417 -6534953 -10136603
9516 -10136603 -6474999 -996370 -1976238 -8044511 -9786157 -4380849 170112 -2259867
9508 -2259867 -7369890 -8434977 -5647535 -2633101 409906 4536305 7325161 5859636
9500 5859636 1819308 -774864 -678266 1186210 4722897 9253903 11601383 9618053 5767709
9491 5767709 3489882 1915836 -1843273 -6858669 -9316361 -8463595 -7216532 -6854488 -5247082
9482 -5247082 -1189783 2971834 4498175 3639006 2477205 2027650 1753523 1181843 1159733
9473A159733K161366M468103L780368m99559m099001k800674J054486J423114
9465F647936k107025l500318k27351K350874M1113k847610p00159L769540L914459
9456G341459k9692j947982j05321J069732o18233k081777j428163r07755j341398
9447d9130L25362M870689P462114M320132j328695l954576l229530k785912l831361
9438A799093m150386k297597P18852L442005N020122M665920K152285j377657
9430I972637m312157n664980m771841j583092J926929K839477J056345k46194
9422g82876P66250K136344J849960R42788O82410j07319k038882k691512o55334
9413A01829J031676l59231j958082K22054L867163L301294j384645m278438k614836
$$ plain form
9473 1159733 3321099 7789202 11569570 11070011 6971010 4170336 5224822 6647936
9465 6647936 4540911 1040593 813242 3164116 3205229 357619 -342540 3427000 7341459
9456 7341459 7311767 5363785 5258464 6328196 5709963 3628186 2200023 1292268 -49130
9447 -49130 276232 5146921 12609035 16929167 15600472 11645896 8416366 5630454 1799093
9438 1799093 -2351293 -4648890 -3930038 -488033 4532089 9198009 11350294 9972637
9430 9972637 5660480 -4500 -4776341 -6359433 -4432504 -1593027 -536682 -782876
9422 -782876 -16626 2119718 3969678 4912466 5594876 5487557 3448675 757163 101829
9413 101829 1133505 774274 -1183808 -961754 2905409 6206703 4822058 543620 -2071216
9404b071216J25285P66890L98303L32314n74393k369908k361269M13657K838165
9395b502172K298252L08896o92865r68193j494703j328586L84873K042924J703408
9386b48166m6537j137431n48536J183122K405181J154899k211030l664339k40589
9377c353426M420142M141898j83318j459006J731590J759919n477326j2025549
9369a0445076q671682J191420O578735M427737J565139K565592M237223L085867
9361D534955P61910l50295j084181k152354j592617J262844K972815N84504l470046
9352A467535m378180j357211J892410K459344J286248O86874Q90881M01366j060941
9343B288326j783958p87966K78269m20509j756782j356634K94654O58497j71239
$$ plain form
9404 -2071216 -1945931 -1179041 -780738 -448424 -1022817 -3392725 -5753994 -5340337 -2502172
9395 -2502172 -203920 104976 -587889 -1556082 -3050785 -4379371 -3994498 -1951574 -248166
9386 -248166 -294703 -1432134 -1980670 -797548 1607633 2762532 551502 -3112837 -3353426
9377 -3353426 1066716 5208614 5025296 3566290 5297880 7057799 1580473 -10445076
9369 -10445076 -19116758 -17925338 -11346603 -6918866 -5353727 -2788135 1449088 4534955
9361 4534955 5296865 4946570 3862389 1710035 117418 1380262 4353077 4937581 1467535
9352 1467535 -2910645 -4267856 -2375446 83898 1370146 2057020 2947901 3349267 2288326
9343 2288326 504368 -283598 -5329 -425838 -2182620 -3539254 -3244600 -2586103 -2757342
9334b757342M33289K311680K004731p83349j413368J892062L672693n93444o304657
9325a537705n716256Q48887O044259N839418K572852r99007m139252m988833j563817
9316c639454L326617L983265j92273l802158l534817j767359p53340J101469M637135
9307f40915O599200M292916J14212j616090N8539K685535L453141R88914l548577
9298A2386875o481723n385664k916978l364187n548070m027139J898808O013193
9290g424885M184115K44811l23735J997477L295300K649857J865589J318593q7930
9281G719192k265993l907465l892821j489632K671225N107950K446544k966325
9273C422675m590920o18487L234571K276153q18505j619165r02131j443971k146337
$$ plain form
9334 -2757342 -2324053 -12373 1992358 1209009 -204359 1687703 5360396 4766952 -1537705
9325 -1537705 -7253961 -6405074 -360815 5478603 8051455 7052448 2913196 -2075637 -3639454
9316 -3639454 -312837 3670428 3478155 -324003 -3858820 -5626179 -6379519 -5278050 -640915
9307 -640915 5958285 10251201 10365413 8749323 8807862 11493397 14946538 15935452 12386875
9298 12386875 5905152 519488 -2397490 -5761677 -11309747 -15336886 -13438078 -7424885
9290 -7424885 -3240770 -2995959 -3319694 -1322217 1973083 4622940 6488529 7807122 7719192
9281 7719192 5453199 1545734 -2347087 -3836719 -1165494 3942456 6389000 3422675
9273 3422675 -1168245 -1786732 1447839 3723992 2905487 1286322 384191 -1059780 -3206117
9264c206117o15426J649829J825013Q31768R46166J000916r43450k654767r25023
9255b091091K297837K538252L0698j150341J3408Q78600M76045J03594n92715
9246B504287k734188m140682j804786K023738K188044r60229j788609J283042
9238c429383L214192R13565j887813j314050M77750l93482l070152l771791j462320
9229a0723484J628517L355164L034116J020979j154399j531144J40774K212520
9221b016957L417796L549753K079475j131532l733726k865781L51464J898760
9213A549252J015108J089016L220026L608569j52616m486729m957939k560009
9205a675322j086840r35655K81111K617444L442261J702827p84839k249513k623421
$$ plain form
9264 -3206117 -3821543 -2171714 -346701 485067 1431233 2432149 1488699 -1166068 -2091091
9255 -2091091 206746 2744998 2775696 1625355 1638763 2517363 2993408 3097002 2504287
9246 2504287 -229901 -4370583 -6175369 -4151631 -1963587 -2923816 -4712425 -3429383
9238 -3429383 -215191 698374 -1189439 -2503489 -2025739 -2419221 -5489373 -9261164 -10723484
9229 -10723484 -9094967 -5739803 -2705687 -1684708 -2839107 -4370251 -4229477 -2016957
9221 -2016957 1400839 4950592 7030067 5898535 2164809 -700972 -349508 1549252
9213 1549252 2564360 3653376 6873402 10481971 10329355 5842626 884687 -1675322
9205 -1675322 -2762162 -3697817 -3416706 -799262 2642999 4345826 3560987 1311474 -1311947
9196a311947k376156j861987j785771k428575k372244K84849N031291Q438505
9188A617965P255914J880897l455630m433555j073059K184158J690812j130106
9180D537396k350516j143336k9400j70102l331J046686J196793j39215q41272
9171B103703J72574Q18575n55426k343695k636764k265407k501857k300010m67926
9162i976233J671635K397654K197739J810959L00925j945290j259390M054364
9154g47637Q775486O186331k449953q800242p811265k423170K431693N341372
9146E02615O156455L261455l073683p710195n487561J805698O892102N512939
9138G859825N41552k978092l932956m281476m187704j483432L790308P476695
$$ plain form
9196 -1311947 -3688103 -5550090 -7335861 -9764436 -12136680 -11851831 -6820540 1617965
9188 1617965 8873879 10754776 7299146 2865591 1792532 3976690 5667502 4537396
9180 4537396 2186880 1043544 1014144 844042 840711 1887397 3084190 2944975 2103703
9171 2103703 2276277 3094852 2539426 195731 -2441033 -4706440 -7208297 -9508307 -9976233
9162 -9976233 -8304598 -5906944 -3709205 -1898246 -1597321 -3542611 -4802001 -747637
9154 -747637 8027849 14214180 11764227 2963985 -4847280 -7270450 -4838757 502615
9146 502615 6659070 9920525 6846842 -863353 -6350914 -4545216 2346886 7859825
9138 7859825 8401377 5423285 1490329 -2791147 -6978851 -8462283 -4671975 2804720
9130B804720N987726J164075j936608j231868Q15812J353566K39292j124879j569784
9121F502052l89962J873658K636463r5482l991055m466607j146994J443603Q66650
9112C232326J19997J665548K688826K68413k617317j451809K091405K563671n17963
9103H043097k396941j379801j225596l806732n087972j595863L224954L184936
9095a039918k087821o340386m135457L094571Q634027P244738M12397n094036
9087F88115m439505N6927K311685L39083j979608j245250P25221N98446o45587
9078c590473Q76579N306984P414083L134588m450587q212799n510726r73999O7678
9069e938672j640532j476047J835349M863345N102975L901396K635463O3516l952522
$$ plain form
9130 2804720 8792446 9956521 8019913 6788045 7603857 8957423 9196715 8071836 6502052
9121 6502052 6112090 7985748 10622211 10526729 6535674 2069067 922073 2365676 3232326
9112 3232326 3352323 5017871 7706697 7975110 5357793 3905984 5997389 8561060 8043097
9103 8043097 5646156 4266355 3040759 -765973 -5853945 -7449808 -4224854 -1039918
9095 -1039918 -3127739 -9468125 -13603582 -10509011 -1874984 5369754 5782151 688115
9087 688115 -3751390 -3694463 -1382778 -1043695 -3023303 -4268553 -3543332 -2944886 -3590473
9078 -3590473 -2713894 2593090 10007173 13141761 8691174 478375 -5032351 -6006350 -5938672
9069 -5938672 -7579204 -9055251 -7219902 -2356557 2746418 6647814 9283277 9346793 5394271
9060E394271n675229k308600K733924L652161J63859k604714j753175o2865j218852
9051a679220m821076p140760m790685K404123J0066650J1509475M458595m748411
9043E258691p277732k383270J950519j55952n113379n600728m15336M641018M349941
9034d746228n7178k620364O14193O501799P302754q0707q607498q335196R45606
9025i082819Q653830O421522k079090p050043m703744M06526K919109K134976
9017b379733M30356j59705R25942K856700L907559K976917P38116j329572k467120
9008E499460k521122j389634L20628J123705M03609n54487m05959M45756J054946
8999C976902J595874K249978J817118m67528k814220l047125k188868k983203
$$ plain form
9060 5394271 -280958 -2589558 144366 3796527 3960386 1355672 -397503 -460368 -1679220
9051 -1679220 -6500296 -13641056 -18431741 -16027618 -5960968 5548507 10007102 5258691
9043 5258691 -2019041 -4402311 -2451792 -2607744 -7721123 -13321851 -13737187 -9096169 -4746228
9034 -4746228 -4803406 -7423770 -6809577 -307778 6994976 6914269 -1693229 -10028425 -9082819
9025 -9082819 -428989 5992533 3913443 -3136600 -7840344 -7433818 -4514709 -2379733
9017 -2379733 -1949377 -2109082 -1183140 1673560 5581119 8558036 9296152 7966580 5499460
9008 5499460 2978338 1588704 1909332 3033037 3436646 2882159 2476200 2921956 3976902
8999 3976902 5572776 7822754 9639872 9172344 6358124 3310999 1122131 -1861072
8991a861072m905830m032675Q36656N059888L936460l46132j352114K281180M461415
8982D077776N64573n028214m621597J473693N018358J804400k512822j670018
8974h93851J579771P18624l399394m030193R5972K793225R19734q27435J128677
8965a914870K512915j118853n405594l103968L920834O361799Q60141n335427
8957c223023m878652K96264L315124J863459p73999j796775j644735j138704L30333
8948g650708K709158M020525K913896Q76247M6838k329r66882j971227k36876
8939b61358L782112N402817K022931k507873l076677o32092j41725k474515l249179
8930a135559j15191L534608L765413J266244p44432r10561p9652N17690k5653
$$ plain form
8991 -1861072 -6766902 -10799577 -9962921 -4903033 -966573 -1312705 -2664819 -383639 4077776
8982 4077776 4642349 -385865 -5007462 -3533769 1484589 3288989 776167 -893851
8974 -893851 685920 1404544 -1994850 -6025043 -5929071 -3135846 -2216112 -3043547 -1914870
8965 -1914870 598045 -520808 -5926402 -9030370 -5109536 1252263 2112404 -3223023
8957 -3223023 -8101675 -7805411 -4490287 -2626828 -3400827 -5197602 -6842337 -7981041 -7650708
8948 -7650708 -4941550 -921025 1992871 2869118 2915956 2913627 1946745 -24482 -261358
8939 -261358 3520754 8923571 10946502 8438629 5361952 4729860 4588135 2113620 -1135559
8930 -1135559 -1250750 2283858 6049271 7315515 6571083 5660522 5580870 6098560 6072907
8921F072907j430513j498214J131878L403849J006249m213995n127335K34417
8913d20757M524289J271635n434337o655620q49561N055172N100952K2758n369379
8904b754848o540734k168396L772280M584365r79075n586866k678864L890118
8896h462020N309183P20913k406113k32074K677507J943025j58511J43216J825198
8887A360324J653395m93816k101215j496646J164706M196337M599434Q17650l873591
8878E826578m213173l09101J860031r16255m226505k740281K015748M441264K769088
8869D507394O6665j122454j097310m04863J403908L621536L559979m70726o174776
8860C889353q638810n279319R58723M397693K825373n36583j802295q88574K83264
$$ plain form
8921 6072907 4642394 3144180 4276058 7679907 8686156 4472161 -655174 -420757
8913 -420757 4103532 5375167 -59170 -6714790 -7564351 -2509179 2591773 2614531 -2754848
8904 -2754848 -9295582 -11463978 -7691698 -3107333 -4086408 -9673274 -12352138 -8462020
8896 -8462020 -3152837 -2431924 -4838037 -5070111 -2392604 -449579 -608090 -464874 1360324
8887 1360324 3013719 2519903 418688 -1077958 86748 4283085 8882519 9700169 5826578
8878 5826578 1613405 1304304 3164335 2248080 -1978425 -4718706 -2702958 1738306 4507394
8869 4507394 4574059 3451605 2354295 1949432 3353340 6974876 10534855 10064129 3889353
8860 3889353 -4749457 -10028776 -9070053 -4672360 -1846987 -2383570 -4185865 -5074439 -4791175
8851d791175J253488J892962N29962k884350m147018j81798M958516N110909J318707
8842C060203m90645K63335r22068l469515j555962M165305N142164p78748m182557
8833A231512N41425M966404O05367o087522m106638L651529N384566l49602l963829
8824A873212j737022K02744p27617N01383M569574M353744j996172n903059k189838
8815a053051K222942M80937k733163l94633M168372L600699l99893p53637K162731
8806G301304J876549j977155l064429K27170K290799M01592j382291o67434j005658
8797D000447m166905n226940l64318N719598N835296N52399k993574j068308K538317
8788D826012K329996k219019o497323n729675J18435N908662O410015J945503
$$ plain form
8851 -4791175 -3537687 -1644725 -1114763 -3999113 -8146131 -8327929 -3369413 1741496 3060203
8842 3060203 2569558 2832893 1910825 -1558690 -3114652 1050653 6192817 5414069 1231512
8833 1231512 1772937 6739341 7344708 1257186 -2849452 802077 6186643 5837041 1873212
8824 1873212 136190 338934 -388683 112700 4682274 9036018 7039846 1136787 -1053051
8815 -1053051 1169891 1650828 -1082335 -1476968 2691404 6292103 5892210 5138573 7301304
8806 7301304 9177853 7200698 4136269 4363439 6654238 7055830 5673539 5006105 4000447
8797 4000447 -166458 -5393398 -5757716 -38118 5797178 6349577 3356003 2287695 4826012
8788 4826012 7156008 4936989 -1560334 -7290009 -7171574 -1262912 5147103 7092606
8780G092606k397253l163141j712040m58548P67415K562701L124065Q15152k246146
8771D384811k596182m87591P18418k48275j244790o82218L74852Q01314J267792
8762B288131K338235L082684K890609K560254K226768M06656l045490n112866
8754G634981l328044J42245J117190o76763j666715m40057J16836j823632l090059
8745b014018j11348M727640N415632O11589m364892m814793k338502j083730j381878
8736e354300o41871J169855J292365n75499j018680J567051L771000K132886j351448
8727I91359k084493L81220K257303J660256Q11296J345735J243178j394719m292074
8718I19061l710044J26164L145837K638982M776j867094j980782j331460j021702
$$ plain form
8780 7092606 4695353 1532212 -179828 -638376 129039 2691740 5815805 6630957 4384811
8771 4384811 1788629 1301038 2019456 1771181 526391 -155827 219025 1020339 2288131
8762 2288131 4626366 7709050 10599659 13159913 15386681 15793337 12747847 7634981
8754 7634981 4306937 4449182 5566372 4889609 3222894 2782837 2899673 1076041 -2014018
8745 -2014018 -2125366 2602274 8017906 8629495 4264603 -550190 -2888692 -3972422 -5354300
8736 -5354300 -5996171 -4826316 -3533951 -4109450 -5128130 -3561079 209921 2342807 991359
8727 991359 -1093134 -711914 1545389 3205645 4016941 5362676 6605854 5211135 919061
8718 919061 -2790983 -2664819 481018 3120000 3124776 1257682 -723100 -2054560 -3076262
8709c076262j223373j371685o93362J170848L540200M673943K853946j764132
8701D110123o081133n925245n70642N037695M913932n34819m297856j593292L683637
8692a257600M255466o60005m718262l233648J509525M548680M154340J743744
8684F342240j049326k900553k564944m26488J221279J151871O85393O42670n61432
8675B540710l278885l958696j00713M231379K969559k658318n065105j259359
8667f579428K973823K222009p57471o15804J595740Q14435k948887m197100n59602
8658h052285L751085M463466K630815J269682L75933j591475l674528l309363
8650d136670m40279J994694J778361j33076j187825l19431Q89613R7139k571260
$$ plain form
8709 -3076262 -4299635 -5671320 -6364682 -5193834 -1653634 3020309 5874255 4110123
8701 4110123 -1971010 -7896255 -8466897 -3429202 1484730 949911 -3347945 -4941237 -1257600
8692 -1257600 2997866 2337861 -2380401 -5614049 -4104524 444156 4598496 6342240
8684 6342240 5292914 2392361 -172583 -599071 622208 1774079 2459472 3102142 2540710
8675 2540710 -738175 -4696871 -4797584 -566205 2403354 -254964 -5320069 -6579428
8667 -6579428 -3605605 -1383596 -2141067 -2756871 -1161131 -346696 -3295583 -7492683 -8052285
8658 -8052285 -4301200 162266 2793081 4062763 4438696 2847221 -827307 -4136670
8650 -4136670 -4576949 -2582255 -803894 -936970 -2124795 -2444226 -1554613 -1457474 -4028734
8641d028734l897202j475248K466444L588064J647164Q01767K804670L990953
8633E897878J604880r71345K38459K228624q08493o984868p632818k26736O354916
8624b99503L549786m787667p521996j028725O853988P530668J490041m072477
8616A714115m149256j04581L363397L088648m96918m371828n272211k029906L168060
8607e090480O020932M010080n54127k855219j565377l62420j944493l361212p43607
8598f445923L567387L783598j09584j891322J006137L305264N61423l554997l220154
8589b998171O44032K806428J942279P02576l00281k556313m642170l067265J539807
8580e929078M157944K116591k009890m738888m972322k750817J045995L351850
$$ plain form
8641 -4028734 -7925936 -9401184 -6934740 -3346676 -1699512 -897745 1906925 5897878
8633 5897878 7502758 6531413 6769872 8998496 8190003 1205135 -6427683 -6654419 -299503
8624 -299503 3250283 -1537384 -9059380 -10088105 -3234117 4296551 5786592 1714115
8616 1714115 -2435141 -2539722 823675 3912323 3415405 -956423 -6228634 -8258540 -5090480
8607 -5090480 930452 4940532 4386405 1531186 -34191 -396611 -2341104 -5702316 -6445923
8598 -6445923 -2878536 905062 795478 -1095844 -89707 3215557 3776980 221983 -2998171
8589 -2998171 -2354139 452289 2394568 3097144 2796863 240550 -4401620 -7468885 -5929078
8580 -5929078 -1771134 345457 -1664433 -6403321 -11375643 -14126460 -13080465 -9728615
8572i728615J571334j910822k244159N81984K038853J142860J939372N123884
8564a485309N172853l05019m844556k425527K700014K420606k545548m178139
8556e490625M9637L833814K490464k19038J171665N144722N477339R6615o010622
8547F543971o797942k096290K369364J635161k755152m853114j881873K466185
8539e369690L159330l1552l217481l317564l82362L339950M842024K647924o91489
8530I79090p88879K128379K469110k126871n712073k428941L871147N102851J357977
8521D851790k45523J959209K036793k058189m232992j063853J781975o39281l821182
8512a431253j815023K211985J631086j906718j471099K855501M026365j3443l301403
$$ plain form
8572 -9728615 -8157281 -10068103 -12312262 -11730278 -9691425 -8548565 -6609193 -1485309
8564 -1485309 3687544 3382525 -1462031 -3887558 -1187544 1233062 -1312486 -5490625
8556 -5490625 -5440988 -1607174 883290 664252 1835917 6980639 12457978 12554593 6543971
8547 6543971 -253971 -2350261 19103 1654264 -1100888 -5954002 -7835875 -5369690
8539 -5369690 -2210360 -2241912 -5459393 -8776957 -9159319 -5819369 -977345 1670579 979090
8530 979090 190211 2318590 4787700 2660829 -3051244 -5480185 -1609038 3493813 4851790
8521 4851790 4606267 6565476 8602269 6544080 2311088 1247235 3029210 2389929 -1431253
8512 -1431253 -3246276 -1034291 596795 -1309923 -2781022 74479 4100844 4087401 785998
8503G85998k070338R2089j84244n54765J355176K914412J491973m22270K87547
8494C695578J676756K30649l000163m249446k623360J80803L260047N535641M159109
8485H865614j232052n075956k360305L198514L755046q60145l143261j89691J892686
8476D850450j428269n451407m077731M10390J576824r19886j913682K97904J982579
8467d672828Q44944o53917J10112K243884L598391L505732K123938k00900j933291
8458D966065j286631P85459R18908k108781n191404m624309n54993L425871M111396
8449D41581J471265j466334j441366J317145K809105L56584l111910k772204Q36418
8440a559716K390046O2607j605077O82382L149828Q46299l927183m371105Q43901
$$ plain form
8503 785998 -1284340 -1192251 -1376495 -1931260 -576084 2338328 3830301 3408031 3695578
8494 3695578 5372334 5602983 2602820 -1646626 -4269986 -4089183 -829136 4706505 8865614
8485 8865614 7633562 2557606 197301 3395815 7150861 6290716 3147455 2957764 4850450
8476 4850450 3422181 -2029226 -6106957 -5696567 -4119743 -5039629 -6953311 -6655407 -4672828
8467 -4672828 -3827884 -4481801 -4371689 -2127805 1470586 4976318 7100256 6899356 4966065
8458 4966065 3679434 4464893 5383801 3275020 -1916384 -6540693 -7095686 -3669815 441581
8449 441581 1912846 446512 -994854 322291 3131396 3487980 376070 -2396134 -1559716
8440 -1559716 830330 892937 -712140 -29758 3120070 3966369 39186 -4331919 -3488018
8431c488018N524687M397438n81622l771070k579655J039173L573520K833857
8423F948310m50416k674407p64529L291052L643784j645906o484983l979465L605613
8414A489053O924342K103071l981616l747504M89925J132995k515151l729859
8406a834744J99501L487550J441520k091595j680140N13113j016169n014533n106729
8397a1102226m55551K701021J026049j338889n27764R43044l56521k175821m16832
8388a1703490L550778M574866J463484j467497o85362K126574K848776J20887
8380H29016l329924l896830j000486K500363L778417K800501Q09843k016022n030045
8371d555167n182454n96531M964697N984102L160836J889628K569462l91830p653548
$$ plain form
8431 -3488018 2036669 6434107 5852485 2081415 -498240 540933 4114453 6948310
8423 6948310 6497894 3823487 3058958 6350010 9993794 8347888 1862905 -2116560 1489053
8414 1489053 8413395 10516466 6534850 2787346 3277271 4410266 1895115 -1834744
8406 -1834744 -1635243 1852307 3293827 1202232 -477908 35205 -980964 -5995497 -11102226
8397 -11102226 -11557777 -8856756 -7830707 -9169596 -9697360 -8754316 -9110837 -11286658 -11703490
8388 -11703490 -8152712 -3577846 -2114362 -3581859 -4267221 -2140647 708129 829016
8380 829016 -2500908 -6397738 -7398224 -4897861 -1119444 1681057 2490900 474878 -4555167
8371 -4555167 -9737621 -10334152 -5369455 614647 3775483 5665111 8234573 7842743 189195
8362A89195j0861227m537046M615650P070086L892453K795858M541748K736492
8354A0443209l664624o955375j940672O396903R637251N542144j757233p350489
8346A0351114q690170n920257j520147J580642K420236J712004N8373j633272
8338a641477j470406P54772J741004q92401l959148k915817P19615J565271q09163
8329f907750j508576R68207K325913M15924r83647P55913K217333P9724k804882
8320e441841k075709J139658K557118J408575M63587J210692K667814L555771
8312E485665K805155l57455m256874m897961j074696K950233K978456O76512J73303
8303D482338J182105K16932k620468l319113p00258J374592J18366j858828r36125
$$ plain form
8362 189195 -10672032 -15209078 -10593428 -3523342 369111 3164969 7706717 10443209
8354 10443209 6778585 -176790 -2117462 4279441 13916692 19458836 17701603 10351114
8346 10351114 1660944 -4259313 -5779460 -4198818 -1778582 -66578 -8205 -1641477
8338 -1641477 -3111883 -2357111 -616107 -1508508 -5467656 -8383473 -7663858 -6098587 -6907750
8329 -6907750 -8416326 -7448119 -5122206 -4706282 -5689929 -4934016 -2716683 -2636959 -5441841
8320 -5441841 -7517550 -6377892 -3820774 -2412199 -1948612 -737920 1929894 5485665
8312 5485665 8290820 7933365 3676491 -1221470 -2296166 654067 3632523 4309035 4482338
8303 4482338 5664443 5881375 3260907 -58206 -758464 616128 734494 -1124334 -2060459
8294b060459J642470J656784j512195l706441j953660J355730K290012J331809
8286i55950K149404M995421N581605J904603k013054k162574n21821p54116j423513
8277F800005O28842K705409m60302o614892p488646j591318K918848J126248j282924
8268c258730J369194M504039J159477n364746n543766K072826Q723596P456151
8260A1118041Q56212m041262l747874j01539K783681K501461N87854j3554l1962
8251I911058k967931p784818p905079j165234M929369L587612q77585l65079L839291
8242A201604M200885J41182k055464j165281k062527m492259k121175M674695
8234a678340O318674p53742o683564k990257M038015L610684k625369m236832
$$ plain form
8294 -2060459 -417989 1238795 -273400 -3979841 -5933501 -4577771 -2287759 -955950
8286 -955950 1193454 6188875 11770480 13675083 11662029 9499455 8977634 8223518 6800005
8277 6800005 7428847 10134256 9673954 3059062 -4429584 -6020902 -3102054 -1975806 -3258730
8268 -3258730 -1889536 2614503 3773980 -1590766 -7134532 -5061706 3661890 11118041
8260 11118041 11974253 7932991 4185117 4083578 6867259 9368720 9956574 9943020 9911058
8251 9911058 6943127 -841691 -8746770 -9912004 -4982635 -1395023 -2272608 -2637687 1201604
8242 1201604 5402489 5543671 3488207 2322926 260399 -4231860 -6353035 -1678340
8234 -1678340 4640334 3886592 -2796972 -5787229 -1749214 1861470 -763899 -5000731
8226e000731J124609N129054K601581j534271j384437J181381R36713k083397
8218I70502k961885N64726M580070L858871j379581n437985m167265l5591J793484
8209b214654P31572M70320K036280J962942j315820l873305j884161K590471M447735
8200B951380J788104l080613o572930n829989n12088N454441O820921L493939
8192D513165O93946J074587J363462o73029j634211Q56805K512642o31923m365576
8183C709868k575402K325902L211352l6870j143862J372569K343958m11505k827919
8174E968091k243229p83486L91414K740453M411288N93908p168512r765605k935559
8165h791237N877148P839343L713037n36280k968318m356039l051855J620319
$$ plain form
8226 -5000731 -3876122 1252932 3854513 2320242 935805 2117186 3053899 970502
8218 970502 -1991383 -1426657 3153413 7012284 5632703 194718 -3972547 -4008138 -2214654
8209 -2214654 -1483082 -1012762 1023518 2986460 1670640 -2202665 -4086826 -1496355 2951380
8200 2951380 4739484 1658871 -4914059 -10744048 -11256136 -5801695 1019226 4513165
8192 4513165 5207111 6281698 7645160 6972131 5337920 6194725 8707367 8075444 3709868
8183 3709868 1134466 3460368 6671720 6634850 5490988 6863557 9207515 8796010 5968091
8174 5968091 3724862 2941376 3332790 6073243 10484531 11078439 3909927 -5855678 -8791237
8165 -8791237 -2914089 4925254 8638291 8102011 5133693 777654 -2274201 -653882
8157f53882M702049J618928l814024m398599n07962J062779j963299m659767l230716
8148a1844493L70271L027633M222091M076722K275711K5005p61478p30960j845102
8139a184600l036595j448939K043107L355442J611781J29185L78929J67708j110731
8130I05287r27386R35929R67485j599458k429858N99376L194197J895251L17204
8121C858027K717143N662254K794785m565005q428205n121361P02672L363607
8113I83917K398892O48027J85162J102511J382355j784757p301973q199837L23379
8104a0262324J1489435J2637505K047107p367864n301026K104405K534351l977646
8096C903943o529460j141941L874362K211945j022708M52262K855031n38714o669189
$$ plain form
8157 -653882 4048167 5667095 1853071 -2545528 -3053490 -1990711 -3954010 -8613777 -11844493
8148 -11844493 -11474222 -8446589 -4224498 -147776 2127935 2152940 1391462 660502 -1184600
8139 -1184600 -4221195 -5670134 -3627027 -271585 1340196 1469381 1848310 2016018 905287
8130 905287 -22099 913830 1881315 281857 -2148001 -1548625 1645572 3540823 3858027
8121 3858027 6575170 12237424 15032209 10467204 2038999 -3082362 -2379690 983917
8113 983917 3382809 4030836 4215998 5318509 6700864 4916107 -2385866 -10585703 -10262324
8104 -10262324 1227111 13864616 15911723 8543859 3242833 5347238 7881589 3903943
8096 3903943 -2625517 -3767458 106904 2318849 1296141 1748403 4603434 4064720 -2604469
8087b604469o814980r21033K283466l91081k181242J089808L649539L13653l708368
8078i284707j092983N228666O468658J362352l235608l370060j590819k13101
8070e727602J348672K272418N38147j835268n43417L295362M144981J490531M79705
8061E463529J819565j4611n538336o785961l48378N072588J485435n501161n295695
8052i643025J824769O712432N292617J404304j682643l816949l684607k64230
8044c857332K499808K33606l745389k707066K173521L424699q3885j438198K148222
8035a352014M668298J643336l110136m675493l808212k610433m0199L882414N194233
8026b08206K000093j420956q94732J537405J873810M12989m13702p83333j867036
$$ plain form
8087 -2604469 -9419449 -10340482 -8057016 -8448097 -10629339 -9539531 -5889992 -5576339 -9284707
8078 -9284707 -10377690 -5149024 1319634 2681986 -553622 -3923682 -5514501 -5727602
8070 -5727602 -4378930 -2106512 -1568365 -3403633 -3947050 -651688 3493293 4983824 5463529
8061 5463529 7283094 7268483 1730147 -5055814 -5404192 -331604 1153831 -4347330 -9643025
8052 -9643025 -7818256 -1105824 4186793 5591097 3908454 91505 -3593102 -3857332
8044 -3857332 -1357524 -1123918 -4869307 -7576373 -5402852 -1978153 -2062038 -3500236 -1352014
8035 -1352014 3316284 4959620 1849484 -2826009 -6634221 -9244654 -9284853 -5402439 -208206
8026 -208206 1791887 370931 -523801 1013604 2887414 3300403 2886701 2103368 236332
8017B36332k520770j362108M28207J281307J373191M52008k542659n398129l176068
8008a1228689L822281Q021366M997523N54950J568226M798250K477028m353767
8000A0657168o883051k128776K836059J741680k562140l507914J34959L790471
7992D078456L198990j247860n234925m812148n89198K960429L149873K060677
7984C564294K173164J881329j186508m743481m433696p69049J418257M19772k47961
7975a923879J880846M291895L822176J397648j86732q16527k375107m510458m089790
7966b509928K51359M861852M549601o47161m561894k514780K289020L252463j80166
7957D790366k397267q48554M75895j306786k795839n67481K523910K269289J66530
$$ plain form
8017 236332 -2284438 -3646546 -3218339 -1937032 -563841 -111833 -2654492 -8052621 -11228689
8008 -11228689 -7406408 614958 5612481 6167431 7735657 12533907 15010935 10657168
8000 10657168 3774117 1645341 4481400 6223080 3660940 153026 287985 4078456
7992 4078456 7277446 6029586 794661 -4017487 -4606685 -1646256 1503617 3564294
7984 3564294 5737458 7618787 6432279 1688798 -2744898 -3513947 -2095690 -1675918 -1923879
7975 -1923879 -43033 4248862 8071038 9468686 9281954 8465427 6090320 1579862 -2509928
7966 -2509928 -2258569 2603283 7152884 6505723 1943829 -570951 1718069 4970532 4790366
7957 4790366 2393099 1544545 2020440 713654 -2082185 -2649666 -125756 2143533 2310063
7948B310063l8061N95616j081321l157510j316371K641361K362505k628486n185016
7939e497220j125016M596807N349286J633335j296889j313083q08409j524110
7931A4701j641500R97514M466830L785759k447074q152364o042278K236892P011483
7922B29963L372456k427040l061516p93752j718648m152273j556288N035890P001253
7913A930045J320617m645712m102293L89545K439778P44866j242424r43429J104181
7904c004826K509440J236013j551102j500325K944565O301232K846397l866747
7896E914647n090225o0061K890706l75253l862556k001927J802859K046282j14669
$$ plain form
7948 2310063 2272002 2867618 1786297 -1371213 -2687584 -46223 2316282 -312204 -5497220
7939 -5497220 -6622236 -2025429 3323857 4957192 3660303 2347220 1538811 14701
7931 14701 -1626799 -629285 3837545 7623304 5176230 -2976134 -9018412 -6781520 229963
7922 229963 3602419 1175379 -1886137 -2679889 -4398537 -8550810 -10107098 -5071208 1930045
7913 1930045 3250662 -1395050 -5497343 -5107798 -2668020 -1923154 -3165578 -4109007 -3004826
7904 -3004826 -495386 740627 -810475 -2310800 633765 6934997 9781394 5914647
7896 5914647 824422 764361 3655067 3279814 -582742 -2584669 -781810 1264472 1149803
$$ [...]
##END NTUPLES=NMR SPECTRUM
##END=
