##TITLE=31Pdec_SR89
 , 124 sc
 20.09.2021
##JCAMPDX= 6.0         $$ Bruker NMR JCAMP-DX V2.0
##DATA TYPE= NMR SPECTRUM
##DATA CLASS= NTUPLES
##ORIGIN= UXNMR, Bruker Analytische Messtechnik GmbH
##OWNER= root
$$ XWIN-NMR		Version 3.5
$$ Mon Sep 20 10:43:25 2021 Russian Standard Time (UT+4h)  she@DPX200
##.OBSERVE FREQUENCY= 81.013821
##.OBSERVE NUCLEUS= ^31P
##.ACQUISITION MODE= SIMULTANEOUS
##.ACQUISITION SCHEME= undefined
##.AVERAGES= 124
##.DIGITISER RES= 16
##SPECTROMETER/DATA SYSTEM= spect
##.PULSE SEQUENCE= zgpg30
##.SOLVENT NAME= CDCl3
##.SHIFT REFERENCE= (INTERNAL, CDCl3, 0, 248.564)
##AUDIT TRAIL= $$ (NUMBER, WHEN, WHO, WHERE, WHAT)
$$ ##TITLE= Audit trail, XWIN-NMR		Version 3.5
$$ ##JCAMPDX= 5.01
$$ ##ORIGIN= Bruker BioSpin GmbH
$$ ##OWNER= she
$$ F:/spectra/data/she/nmr/P31/1/pdata/1/auditp.txt
$$ ##AUDIT TRAIL=  $$ (NUMBER, WHEN, WHO, WHERE, WHAT)
(   1,<2021-09-20 10:40:25.43 +0400>,<she>,<DPX200>,
      <continue with go, POWCHK disabled, PULCHK disabled
       configuration hash MD5:
       00 E9 B6 7A A2 85 ED C7 34 08 36 98 17 FE 4E 26
       data hash MD5: 32K
       17 9E 00 D4 02 02 40 0D D8 58 79 79 07 7B 35 67>)
(   2,<2021-09-20 10:42:20.26 +0400>,<she>,<DPX200>,
      <Start of raw data processing
       efp BC_mod = 2 LB = 1 FT_mod = 6 PKNL = 1 PHC0 = -7746.429 PHC1 = 84.87007 SI = 64K 
       data hash MD5: 64K
       8C DF A3 0A 0A C2 DA 7B 0B D8 63 A1 E7 2E C9 1D>)
(   3,<2021-09-20 10:42:53.85 +0400>,<she>,<DPX200>,
      <pk PHC0 = -403.3445 PHC1 = 291.8002 
       data hash MD5: 64K
       CB B6 3A DE 63 E7 D7 AB 86 24 FD FA D6 A5 0D 54>)
$$ ##END=
$$ 
$$ hash MD5
$$ 09 87 F3 11 5F 7D 48 55 71 FE 56 27 CA FB AD E3
##$RELAX= 
##$RELAX= 
##$RELAX= 
##$RELAX= 
##$RELAX= 
##$RELAX= 
##$RELAX= 
##$RELAX= 
$$ Bruker specific parameters
$$ --------------------------
##$DU= <F:/spectra>
##$EXPNO= 1
##$NAME= <P31>
##$PROCNO= 1
##$TYPE= <nmr>
##$USER= <she>
##$AMP= (0..31)
100 100 100 100 100 100 100 100 100 100 100 100 100 100 100 100 100 100 
100 100 100 100 100 100 100 100 100 100 100 100 100 100 
##$AQSEQ= 0
##$AQ_mod= 1
##$AUNM= <au_zg>
##$AUTOPOS= <>
##$BF1= 81.014009
##$BF2= 200.13
##$BF3= 200.13
##$BF4= 200.13
##$BF5= 200.13
##$BF6= 200.13
##$BF7= 200.13
##$BF8= 200.13
##$BYTORDA= 1
##$CFDGTYP= 0
##$CFRGTYP= 5
##$CHEMSTR= <none>
##$CNST= (0..31)
1 1 145 1 1 1 1 1 1 1 1 1 1 1 1 1 1 1 1 1 1 1 1 1 1 1 1 1 1 1 1 1 
##$CPDPRG= <waltz16>
##$CPDPRG1= <>
##$CPDPRG2= <waltz16>
##$CPDPRG3= <>
##$CPDPRG4= <mlev>
##$CPDPRG5= <mlev>
##$CPDPRG6= <mlev>
##$CPDPRG7= <mlev>
##$CPDPRG8= <mlev>
##$CPDPRGB= <>
##$CPDPRGT= <>
##$D= (0..31)
0 1 0 0 0 0 0 0 0 0 0 0.03 2e-05 3e-06 0 0 0 0 0 0 0 0 0 0 0 0 0 0 0 0 
0 0 
##$DATE= 1632119852
##$DBL= (0..7)
120 120 120 11 120 120 24 19 
##$DBP= (0..7)
150 150 150 150 150 150 150 150 
##$DBP07= 0
##$DBPNAM0= <>
##$DBPNAM1= <>
##$DBPNAM2= <>
##$DBPNAM3= <>
##$DBPNAM4= <>
##$DBPNAM5= <>
##$DBPNAM6= <>
##$DBPNAM7= <>
##$DBPOAL= (0..7)
0.5 0.5 0.5 0.5 0.5 0.5 0.5 0.5 
##$DBPOFFS= (0..7)
$$ [...]
##$SUBNAM2= <"">
##$SUBNAM3= <"">
##$SUBNAM4= <"">
##$SUBNAM5= <"">
##$SUBNAM6= <"">
##$SUBNAM7= <"">
##$SUBNAM8= <"">
##$SUBNAM9= <"">
##$SW= 501.771253377433
##$SWIBOX= (0..15)
0 1 3 0 0 0 0 0 0 0 0 0 0 0 0 0 
##$SW_h= 40650.406504065
##$TD= 32768
##$TD0= 1
##$TE= 0
##$TE2= 300
##$TE3= 300
##$TEG= 300
##$TL= (0..7)
0 120 53 12 22 120 120 120 
##$TP= (0..7)
150 150 150 150 150 150 150 150 
##$TP07= 0
##$TPNAME0= <>
##$TPNAME1= <>
##$TPNAME2= <>
##$TPNAME3= <>
##$TPNAME4= <>
##$TPNAME5= <>
##$TPNAME6= <>
##$TPNAME7= <>
##$TPOAL= (0..7)
0.5 0.5 0.5 0.5 0.5 0.5 0.5 0.5 
##$TPOFFS= (0..7)
0 0 0 0 0 0 0 0 
##$TUNHIN= 0
##$TUNHOUT= 0
##$TUNXOUT= 0
##$USERA1= <user>
##$USERA2= <user>
##$USERA3= <user>
##$USERA4= <user>
##$USERA5= <user>
##$V9= 5
##$VALIST= <valist>
##$VCLIST= <CCCCCCCCCCCCCCC>
##$VD= 0
##$VDLIST= <DDDDDDDDDDDDDDD>
##$VPLIST= <PPPPPPPPPPPPPPP>
##$VTLIST= <TTTTTTTTTTTTTTT>
##$WBST= 1024
##$WBSW= 4
##$XGAIN= (0..3)
0 0 0 0 
##$XL= 0
##$YL= 0
##$YMAX_a= 2932
##$YMIN_a= -7185
##$ZGOPTNS= <>
##$ZL1= 120
##$ZL2= 120
##$ZL3= 120
##$ZL4= 120
##$ABSF1= 0
##$ABSF2= 0
##$ABSG= 0
##$ABSL= 0
##$ALPHA= 0
##$AQORDER= 0
##$ASSFAC= 0
##$ASSFACI= 0
##$ASSFACX= 0
##$ASSWID= 0
##$AUNMP= <proc_1d>
##$AZFE= 0.1
##$AZFW= 0.5
##$BCFW= 0
##$BC_mod= 2
##$BYTORDP= 0
##$COROFFS= 0
##$CY= -3
##$DATMOD= 1
##$DC= 0
##$DFILT= <>
##$DTYPP= 0
##$F1P= 0
##$F2P= 0
##$FCOR= 1
##$FTSIZE= 65536
##$FT_mod= 6
##$GAMMA= 0
##$GB= 0
##$INTBC= 1
##$INTSCL= 5.30512e-09
##$ISEN= 30
##$LB= 1
##$LEV0= 0
##$LPBIN= 0
##$MAXI= 10000
##$MC2= 0
##$MEAN= 0
##$ME_mod= 0
##$MI= 50
##$NCOEF= 0
##$NC_proc= -9
##$NLEV= 6
##$NOISF1= 182.463
##$NOISF2= 159.3651
##$NSP= 0
##$NTH_PI= 0
##$NZP= 0
##$OFFSET= 248.5645
##$PC= 4
##$PHC0= -8149.774
##$PHC1= 376.6703
##$PH_mod= 1
##$PKNL= yes
##$PPARMOD= 0
##$PSCAL= 0
##$PSIGN= 0
##$REVERSE= no
##$SF= 81.014009
##$SI= 65536
##$SIGF1= 159.3651
##$SIGF2= -187.1042
##$SINO= 113.3802
##$SIOLD= 16384
##$SREGLST= <1H.CDCl3>
##$SSB= 0
##$STSI= 65536
##$STSR= 0
##$SW_p= 40650.406504065
##$SYMM= 0
##$S_DEV= 0
##$TDeff= 32768
##$TDoff= 0
##$TI= <>
##$TILT= no
##$TM1= 0
##$TM2= 0
##$TOPLEV= 0
##$USERP1= <user>
##$USERP2= <user>
##$USERP3= <user>
##$USERP4= <user>
##$USERP5= <user>
##$WDW= 1
##$XDIM= 65536
##$YMAX_p= 510091349
##$YMIN_p= -118187850
$$ End of Bruker specific parameters
$$ ---------------------------------
##NTUPLES= NMR SPECTRUM
##VAR_NAME=  FREQUENCY,     SPECTRUM/REAL,   SPECTRUM/IMAG
##SYMBOL=    X,             R,               I
##VAR_TYPE=  INDEPENDENT,   DEPENDENT,       DEPENDENT
##VAR_FORM=  AFFN,          ASDF,            ASDF
##VAR_DIM=   65536,         65536,           65536
##UNITS=     HZ,            ARBITRARY UNITS, ARBITRARY UNITS
##FACTOR=    0.620285442955139, 1,           1
##FIRST=     20137.2065510759, 0,            0
##LAST=      -20513.1999529892, 0,           0
##MIN=       -20513.1999529892, -118187850,  0
##MAX=       20137.2065510759, 510091349,    0
$$ Real data points
##PAGE= N=1
##DATA TABLE= (X++(R..R)), XYDATA
$$ [...]
12181A0944289Q068597O080898q733590k7992780k7309987o922813O509903J223025
12173c8132458o037485k189117M800606P452250J1028653J5933708J2372326J158496
12165F386979l199215J672919j45153j4889697k7143699k4117463j0906535M522383
12157f7819481J9047891K2874921P071059j1723472m584829K2763449K9555235
12150A7184773K96247k8895397k3783384J226278J4149967J2471061J0485137
12143C134682O896665l067216o097077N553836Q927473j6089071m4768830l6692619
12135h2202157L949759L4342056L3214828J9219149J1413121O399647j424889
12128B4911514o950460q429155j1114703j2456462m383128P697646Q992072j95813
$$ y = [10944289, 19012886, 25093784, 16360194, -11632586, -38942573, -45865386, -39355483, -38132458, -44169943, -46359060, -41558454, -34106204, -23077551, -7143843, 5228483, 6386979, 3187764, 4860683, 4715530, -10174167, -37317866, -61435329, -72341864, -67819481, -48771590, -25896669, -18825610, -30549082, -35133911, -12370462, 17184773, 17481020, -11414377, -35197761, -33971483, -19821516, -7350455, 3134682, 10031347, 6964131, 867054, 6420890, 15348363, -740708, -45509538, -82202157, -78252398, -43910342, -10695514, 8523635, 19936756, 26336403, 24911514, 17961054, 9531899, -1582804, -14039266, -18422394, -10724748, -1732676, -1928489]
12120a928489m849645j125673p6578l406317J486169J6337988K2987609Q917486
12112C8342550j3840946k4223557j5721456R14706R973214M405742n206604N33608
12104d822743K1947138L0797489O635094k6804062k7960314K912215K1393436
12097B4098253K020867k6902277k6592739k67786J9215898J6732581N730616L71928
12089A4407341J7807J030076N064598J0165168O728379q593550k1576982j3854554
12081f611717J1456159K7205476J3122121j6268056k7064707q974786J2371872
12074E236362J1913193k055738n133616N066825P390603r010666k6955610k2472907
12066c6021554N418394L1592376L0176914K702928k1525515j8596042J072079
$$ y = [-1928489, -6778134, -7903807, -7980385, -11386702, -9900533, 6437455, 29425064, 38342550, 24501604, 278047, -15443409, -14528703, -4555489, -149747, -5356351, -4822743, 17124395, 47921884, 54556978, 27752916, -207398, 2704817, 24098253, 26119120, -783157, -27375896, -27643682, -8427784, 8304797, 14035413, 14407341, 14425148, 15455224, 20519822, 30684990, 37413369, 28819819, 7242837, -6611717, 4844442, 32049918, 45172039, 28903983, 1839276, -7135510, 5236362, 17149555, 15093817, 9960201, 15027026, 22417629, 13406963, -13548647, -36021554, -30603160, 989216, 31166130, 33869058, 12343543, -6252499, -5180420]
12059e180420R556728K373934K12229R139225R378507n637357j2108048J944199
12051I678997J0290622o482622k1433008n962984J4305337j134208l2438250k3851827
12043e7027943K2834505M4052874J3401496j8114098n410219K3071915J8405657
12036D1214187j1885721k4483078r145241P180051Q685152M092753L80072m142764
12028A1895411n029906L398597J1944377P639303l281516m177747M250380N272960
12020C1911859o441944j6961267j3736909k58555J1321275J2526921L535703p481582
12012A4415501j1532140q783946o649377o472827j667376P997033J2572700P869443
12004G749011K858015M670941Q144906O594185J179204n517498j2534985j3890845
$$ y = [-5180420, 4376308, 6750242, 6962471, 16101696, 25480203, 19842846, 7734798, 9678997, 19969619, 13486997, -7946011, -13908995, 396342, -737866, -33176116, -57027943, -34193438, 9859436, 23260932, 5146834, -263385, 22808530, 41214187, 29328466, 4845388, -4299853, 2880198, 11565350, 15658103, 16038175, 11895411, 6865505, 10264102, 22208479, 29847782, 26566266, 22388519, 26638899, 31911859, 25469915, 8508648, -5228261, -5486816, 5834459, 18361380, 21897083, 14415501, 2883361, -5900585, -12549962, -19022789, -20690165, -12693132, -120432, 7749011, 10607026, 15277967, 23422873, 30017058, 31196262, 25678764, 13143779, -747066]
11996g47066m219765O640224L517188p580513o388354M931621K053407j6007671
11988a7800929j6652762J3182101L8207770K5402881o391690j8119051o280680
11981A1547640N705888R283461Q680747l050763k7883468l8844480j2505360K5949553
11973b1116782L0864482J860377j9054619j1544330L111883N720556K056706k128297
11965a0230024j1114972j7915729q017595R419343Q631954q559319j2065798N034323
11957d4817817J3329577j481845j3153559q16014J5439067J0391656m637194m341640
11949c0087769R106204J5483871J0985968P256583P521491N965762K577050J081355
11941B9890515l87264l742471n395363n935866j2587633k2481782j9118160K661661
$$ y = [-747066, -4966831, 1673393, 5190581, -2389932, -8778286, -3846665, -1793258, -17800929, -34453691, -21271590, 16936180, 42339061, 35947371, 17828320, 11547640, 17253528, 26536989, 35217736, 32166973, 4283505, -34560975, -47066335, -21116782, 9747700, 11608077, -7446542, -18990872, -15878989, -10158433, -8101727, -10230024, -21344996, -39260725, -47278320, -37858977, -29227023, -37786342, -49852140, -44817817, -31488240, -32970085, -46123644, -46939658, -31500591, -21108935, -25746129, -30087769, -20981565, -5497694, 5488274, 12744857, 20266348, 26232110, 28809160, 29890515, 29503251, 25760780, 20365417, 14429551, 1841918, -20639864, -39758024, -37096363]
11933c7096363K3545844K4376157R854688l718902r418178p504115J297371Q853977
11925A0190479L020343j0924998j1523623M278209J0460040q102435k8408804
11918c1010789k2880688J018535J7822450K1357986K0052840J2795712l089315
11911A6066731j4172914q588244R51464k198760q579073j267328R583266L470022
11903d734836j0310901n503576J3861968J6582711m946461k2958439j8606781
11896c6616315n375256J50486J583665N940274Q152644L667289k454632o308458
11888c1260303q202014l382907J0608857J8921761O564217j0945028m374149K0649608
11880a419958K7257844N983702r456196O20022R437167p051517k5983212j6647346
$$ y = [-37096363, -13550519, 10825638, 20680326, 16961424, 7543246, 39131, 1336502, 10190479, 13210822, 2285824, -9237799, -4959590, 5500450, -2601985, -31010789, -53891477, -52872942, -35050492, -13692506, 6360334, 19156046, 16066731, 1893817, -6694427, -5742963, -7941723, -16520796, -17788124, -8204858, -4734836, -15045737, -20549313, -6687345, 9895366, 4948905, -18009534, -36616315, -41991571, -41841085, -40257420, -34317146, -26164502, -22497213, -24951845, -31260303, -39462317, -42845224, -32236367, -13314606, -6750389, -17695417, -22069566, -1419958, 25837886, 31821588, 22365392, 22985414, 32422581, 25371064, -612148, -17259494]
11872a7259494N721014N236784j4986039k0381537k620158J0656531L143006q953875
11864c9443768q614085q76826M867877J0720799J7458247J5544949J193182j2325489
11856a1475114j0340527N022626J9424200K1939632J2071282j575675p039519
11849B8026905m13110P852943N711401l016988m800356J245257J798276p336431
11841B9067897j2397031l950451O268760L004956q465746j1011633k899005J66518
11833b15735r043840j6758929q526026R028854J7285551J0625293P20771k685871
11825D30068l168242o372239q223812k499079O494705Q394920J291198o383347
11817a0035828p194509j216824P162933J2426480J0008053J864143k941725k82562
$$ y = [-17259494, -11538480, -6301696, -21287735, -41669272, -44289430, -33632899, -30489893, -39443768, -48057853, -48934679, -44066802, -33346003, -15887756, -342807, 850375, -11475114, -21815641, -16793015, 2631185, 24570817, 36642099, 35066424, 28026905, 27613795, 35466738, 41178139, 38161151, 33360795, 34606052, 36404328, 29067897, 16670866, 12720415, 18989175, 21994131, 13528385, 2516752, -382253, -215735, -9259575, -26018504, -34544530, -25515676, -8230125, 2395168, 3115939, 430068, -2738174, -9110413, -17334225, -19833304, -13338599, -4943679, -3652481, -10035828, -17230337, -18447161, -11284228, 1142252, 11150305, 13014448, 10072723, 9790161]
11809I790161J206983o303438j4771634j2513852n884065r975296j9796113j3580046
11801g1827300J0976149K7304435J7298478k744213p730113K462188J1279475
11794a2980901J2503374J0664850O071231j981912n430578K020487J1478056J0971716
11786C3316323L277072k386532o296075j0145912n190440J1703461K1650691P251472
11778E3180060j6378549k0505710o314451j79294q205127q230483Q485219J9962533
11770B1814198R471307q720464j4421049r639256n995868l231721L658730J1032636
11762C968513J4124002J4539951J0317274m916134k2832302k1061141K381307
11755c478530J6453968r44649k6809803k3512927P729296L0431823K2853322o75432
$$ y = [9790161, 10997144, 4693706, -10077928, -22591780, -28475845, -38451141, -58247254, -71827300, -60851151, -33546716, -16248238, -18992451, -26722564, -24260376, -12980901, -477527, 10187323, 16258554, 14276642, 8846064, 10866551, 22344607, 33316323, 36593395, 34206863, 27910788, 17764876, 12574436, 24277897, 45928588, 53180060, 36801511, 16295801, 9981350, 9802056, 1596929, -6633554, 1851665, 21814198, 31285505, 22565041, 8143992, -1495264, -7491132, -10722853, -7064123, 3968513, 18092515, 32632466, 42949740, 38033606, 15201304, -5859837, -3478530, 12975438, 12030789, -14779014, -38291941, -30562645, -130822, 22722500, 22047068]
11747B2047068j5815789j3313983K034151J8491332K2075539R053487o644707
11740C7927098j0829311q823668j2868314j7305748p518689J0451190J4043151
11733E075709j34417r277663j37261J0698391L979480j3141541j9830155j0477574
11725c3245031L522569J2242429J4233004J0282540J761111o122654o834289J143084
11717c017237J2003926J5191635L283174j6397975k2618123m559221J7997316
11710A883495J5856670p866118j8469493J192512K5083470K2030474r81097j4786398
11702B3943515j1998773q859051j1305230p582952M861178J1422409O107082L140652
11694I728830J2382223K1379532J4836148k334081j5102746j9654144j9928361
$$ y = [22047068, 6231279, -7082704, -5048553, 13442779, 35518318, 44571805, 37927098, 27097787, 18274119, 5405805, -11899943, -19418632, -8967442, 5075709, 4941292, -4336371, -4473632, 6224759, 10204239, -2937302, -22767457, -33245031, -29722462, -17480033, -3247029, 7035511, 8796622, 2673968, -4160321, -3017237, 8986689, 24178324, 27461498, 11063523, -11554600, -16113821, 1883495, 17740165, 9874047, -8595446, -7402934, 17680536, 39711010, 38729913, 23943515, 11944742, 3085691, -8219539, -15802491, -10941313, 481096, 6588178, 9728830, 22111053, 43490585, 58326733, 55992652, 40889906, 21235762, 1307401]
11687A307401j3130546L494929J7532047J2681312n425214j3483483l773704N315215
11679D517957n60883r399225m747508N296503J791613j0617665q275304J1018146
11671a0976366J7947506n295845l2407698k4617622J5356218M4381129L3119753
11664C7507075j881220k5654842k5890417j5109219n369919K583687R398213J1850127
11656a2566515J0348695J1471535J7548681J9482353O717973j6451140l0606368
11649E945214k1444629K035345J6245214J1291228J903225L683191Q374833k104237
11641B5929384k2184222k5166974l832010J4155179N493325j3261414j0934152
11634b9800884J0585328K0547724O746115q858379n742981Q308171J4849921R381337
$$ y = [1307401, -11823145, -8328216, 9203831, 21885143, 16459929, 2976446, -797258, 4517957, 3957074, -5442151, -10189659, -4893156, -3101543, -13719208, -21994512, -10976366, 6971140, 1675295, -30732403, -55350025, -39993807, 4387322, 37507075, 35625855, 9971013, -15919404, -31028623, -36398542, -33814855, -24416642, -12566515, -2217820, 9253715, 26802396, 46284749, 53002722, 36551582, 5945214, -15499415, -13464070, 2781144, 14072372, 15975597, 19658788, 28033621, 25929384, 3745162, -21421812, -25253822, -11098643, -5605318, -18866732, -29800884, -19215556, 1332168, 8078283, -780096, -6523077, 1785094, 16635015, 26016352]
11626B6016352k088169j3904091j7702962n318197J3643388J4545726p763490
11619G428557k4981058j3894410Q707921J3064258K659570L131833J4903363J2977458
11611B3997492n946810j3305311L925118J9047549P356692j5096432j7926723
11604B051575j601734R444134N738478o87398j355879O23850M155203J0637899
11596B9006128J2307068q7291j7735959k1091088q730759K26391l074649m083986
11588a3264145P781412J7427418P012049j1410511q408731J8889809L6884553
11581E4911854J8998005j6471645k9087171r827866R677746M344540j1266066
11574B1279397j1544951j180316k284913j2358208p748773J2527680K0870041
$$ y = [26016352, 23928183, 10024092, -7678870, -12997067, 646321, 15192047, 7428557, -17552501, -31446911, -22738990, -9674732, -7015162, -3883329, 11020034, 23997492, 18050682, 4745371, 8670489, 27718038, 35074730, 19978298, 2051575, 449841, 9893975, 15632453, 14945055, 13589176, 14213026, 18368229, 29006128, 41313196, 41225905, 23489946, 2398858, -6331901, -6105510, -9180159, -13264145, -5482733, 11944685, 18956734, 7546223, -862508, 18027301, 54911854, 73909859, 57438214, 28351043, 18523177, 28200923, 32545463, 21279397, 9734446, 8554130, 6269217, -6088991, -13837764, -1310084, 19559957]
11567A9559957O296024p845924m731324N34108m520313l601607J2890171J8889655
11559C7470747n106980k9550380j9015579N891504J115676k3267119j7778493
11552e0240624J9507867L5362348R645632j2905656j217473J2107483o108271
11545F151306k9133021j7744788J2801473K2309806J1727518R428768J3549822
11538B9090884j42383k4742386k6637660j445944J7855752J1627985m481299j2475882
11530a1350933j3741750j1783934k493973J0553661J4754059Q584100L422417
11523b056353L132706J492236k68077N109776J1951594O526141p985853j3503644
11515D398526n927263m80569n566258j1607464q859814J703512J5778533K6370503
$$ y = [19559957, 25855981, 18010057, 13278733, 13812841, 9292528, 5690921, 18581092, 37470747, 32363767, 2813387, -16202192, -10310688, -9195012, -32462131, -50240624, -30732757, 4629591, 14275223, 1369567, 152094, 12259577, 6151306, -22981715, -40726503, -27925030, -5615224, 6112294, 15541062, 29090884, 28948501, 4206115, -22431545, -23877489, -6021737, 5606248, 1124949, -11350933, -25092683, -36876617, -39370590, -28816929, -14062870, -5478770, -2056353, 1076353, 2568589, 2300512, 7410288, 19361882, 25888023, 17902170, 4398526, -1528737, -2009306, -7575564, -19183028, -28042842, -26339330, -10560797, 15809706]
11507A5809706K0322619m926964k5709415j8174549M044768P259919r474129j3448346
11499b4296391O247517J9960649O844216j2020512j0009052M172469N997303n309491
11491h413292j0679279j551056J3000154K0229121J1874918j0981031l1288372
11484a7808837k7220222K60514K4238613K4899413J1600080L886287O006056R497363
11476C5359267O871996m999277k1325573k5336545n457258K0690747K2068864
11469B7872221j369172j6437201o542231O058968P38119r735515p149892R07474
11461e657229J209588J507851J1338351J7191152L478939j8108876k4722963j3970439
11453b7733626J041727J2870216J7300346P881598q127755q543046R628775J8171812
$$ y = [15809706, 36132325, 31205361, 5495946, -12678603, -8633835, -1373916, -10848045, -24296391, -18048874, 1911775, 8755991, -3264521, -13273573, -9101104, -3103801, -8413292, -19092571, -20643627, -7643473, 12585648, 24460566, 13479535, -17808837, -45029059, -44768545, -20529932, 4369481, 15969561, 19855848, 25861904, 35359267, 42231263, 37231986, 15906413, -9430132, -14887390, 5803357, 27872221, 26503049, 10065848, 3523617, 9582585, 10320704, 585189, -6564703, -5657229, -4447641, -2939790, 8398561, 25589713, 29068652, 10959776, -13763187, -27733626, -26691899, -13821683, 3478663, 11360261, 3232506, -5310540, 4318235, 22490047]
11445B2490047J140198j6521536r775825N843508N911621M69032Q099513J4329342
11437C1985900k92865j5303265k975343J5193408M00679l0070211k3245021K0600458
11429c706260M3019294J7546439j5596923j8853572n638374j02735M62466K05858
11421A7336193j2223061l0899071k5528279P799297K9383302J5407407n466004
11414d190216l307935N663633l104268j4580576m019580J5156452J4860250P37132
11406G214892k973598J934497k643265j1917738p199257O537401P726483m938856
11398f259441j4429844j5922118j5556928q622466R875013K2783067J2193068
11391a5939649n378474o70366J8229965J6688839p385401j7529713J265384J7536755
$$ y = [22490047, 23630245, 7108709, -2667116, 3176392, 9088013, 9557045, 17656558, 31985900, 31693035, 16389770, 13414427, 28607835, 29008514, -1061697, -24306718, -3706260, 39313034, 56859473, 41262550, 22408978, 16770604, 16667869, 17130335, 17336193, 5113132, -25785939, -51314218, -43514921, -14131619, 1275788, -4190216, -7498151, -1834518, -4938786, -19519362, -23538942, -8382490, 6477760, 7214892, 4241294, 6175791, 3532526, -8385212, -15584469, -9047068, -1320585, -6259441, -20689285, -36611403, -52168331, -60790797, -50915784, -28132717, -15939649, -21318123, -21988489, -3758524, 12930315, 5544914, -11984799, -10719415, 6817340]
11383F817340M659172j7602105j5950505P224504K2573139J6100174k50129j1907074
11375A1664516j5983322j4552643p967536K727847J3130726J7454933J3138232
11368A9612753M499648o17924o30193k136976q120806j1695505q326198m817247
11360a2232448o054863l384686R620708J9922474J1779834o801072j4529830q135664
11352i815547j620706J185216Q503261J6308162R384225r169381j5897005k753649
11344c875424R293216L021368j1200092j6660738j4029446r448419Q17170J6615164
11336b5467201K2607286J0124720m115779j097332J0724293R433527o021535j6913886
11328g25907j4026375n272353K130338P508534P314698p11163n339349N815557
$$ y = [6817340, 11476512, -6125593, -22076098, -14851594, 7721545, 23821719, 23571590, 11664516, -4318806, -18871449, -26838985, -24111138, -10980412, 6474521, 19612753, 24112401, 23494477, 22864284, 20727308, 12606502, 910997, -7415201, -12232448, -18287311, -21671997, -12051289, 7871185, 19651019, 12849947, -1679883, -9815547, -11436253, -10251037, -1747776, 14560386, 23944611, 14775230, -1121775, -3875424, 5417792, 8439160, -2760932, -19421670, -33451116, -42899535, -42082365, -25467201, -2859915, 7264805, 3149026, 2051694, 12775987, 22209514, 16187979, -725907, -14752282, -20024635, -17894297, -10385763, -3071065, -3782228, -9121577, -3306020]
11320c306020K0931000J3229630j8032254l7294003j6961451K3331907L8824616
11313B0723425J3810669k2281250l2314862j2201726J0415075J1148172n334995
11306a6035492j5847345r144385L082657O964738O365535J1750631J8110556J1061909
11298A6308804p313900j7779207j2395912m471582k646120M201756K1767981K9925906
11290B7597726J0618176j7472847k0416192Q75042J2493433J89326j2059331n027188
11282c201855O064152K590998m954157m18499N185778n032637j7080677o260194
11274b3107091J6116568J5609065p620218j5551709N364685J9900333O85762k7392735
11266a5995340k6746763k322894J4394327J4894655J2897770R760178k734896
$$ y = [-3306020, 17624980, 30854610, 12822356, -24471647, -41433098, -18101191, 20723425, 34534094, 12252844, -20062018, -32263744, -21848669, -10700497, -16035492, -31882837, -41027222, -37944565, -30979827, -24614292, -12863661, 5246895, 16308804, 8994904, -8784303, -21180215, -25651797, -28297917, -24096161, -2328180, 27597726, 38215902, 20743055, 326863, 1201905, 13695338, 13884664, 1825333, -3201855, 2862297, 5453295, 499138, 80639, 5266417, 233780, -16846897, -23107091, -6990523, 8618542, 998324, -14553385, -9188700, 10711633, 11397395, -15995340, -42742103, -45064997, -30670670, -15776015, -2878245, 6881933, 4147037]
11259D147037j3760366m761030J3238518J0369143j1765037j7955354L838187
11252a6648902K1335869J0512839o317441j355416R843218l756063l1060834l0412381
11244d7859111N680815L6216804K9451664K759907r879409m695151j676657q048798
11236A950064j2051682o933904J04065L353583N792927P436753J605231j0621638
11228i364601j5404352n464181O172581M248001n306779n958439Q44792j706967
11220c1939945j3626226j2203913J1176757K9766548J6447228j4588645k5138318
11213d0106514n017508J8155067K0497393Q445305j439953o092662q374510n000613
11205a8933995L526531N324403n310407j4271059p579315M606025K260250j1952354
$$ y = [4147037, -9613329, -14374359, -1135841, 9233302, -2531735, -20487089, -16648902, 4686967, 15199806, 8882365, 7526949, 17370167, 13614104, -17446730, -47859111, -42178296, -5961492, 23490172, 26250079, 16370670, 11675519, 9998862, 1950064, -10101618, -17035522, -16931457, -13577874, -7784947, -348194, 1257037, -9364601, -24768953, -30233134, -24060553, -19812552, -25119331, -31077770, -30232978, -31939945, -45566171, -57770084, -46593327, -16826779, -379551, -14968196, -40106514, -45124022, -26968955, -6471562, 1973743, 533790, -5558872, -13933382, -18933995, -15407464, -10083061, -15393468, -29664527, -37243842, -32637817, -30377567, -42329921]
11197d2329921j4614425L336625K2034652J9759260J030618j1667399o393479
11190b8844069P350965J3349397O665255m379886r831009p482081n13017Q784165
11182a4900280J7232154J6729027K807098j2628092j0870196O284491J4009959
11175A8664161n43467j6634591j0515786O432602N305370j2476424j6270202K716086
11167b3322251J4783175n4267j7204283n192334K3351669K9258269M967895j6431104
11159A0156769r812224J2496601K5741058K3093852J0584115p960411k6127441
11152C8172319k9666420j2775769Q392870J3267396K878054m870176j999094K014172
11144A5413352m89289l005152K308199R428552N482142r959479k0918659j3596358
$$ y = [-42329921, -56944346, -53607721, -31573069, -11813809, -10783191, -22450590, -28844069, -21493104, -8143707, -1478452, -5858338, -15689347, -23171428, -23684445, -14900280, 2331874, 19060901, 21867999, 9239907, -1630289, 4654202, 18664161, 18120694, 1486103, -9029683, -2597081, 2708289, -9768135, -26038337, -23322251, -8539076, -8593343, -25797626, -30989960, -7638291, 21619978, 26587873, 10156769, 344545, 12841146, 38582204, 61676056, 72260171, 64299760, 38172319, 8505899, -4269870, 4123000, 17390396, 20268450, 15398274, 13399180, 15413352, 14924063, 11918911, 14227110, 23655662, 29137804, 19178325, -1740334, -15336692]
11136a5336692M733250J1863275j733583j7851622j2243239J1386196K3373143
11129D190728Q468310j1518676q368065J1647514J7580486l13699j7487925j1897120
11121g698447P035124J6665533J1538048J393912q334683j6944997j7586288m613479
11113a8545277J1176898J2410278L91483o643369k685913k427447j3251900j8012942
11105c7588189j111243K2282989K3510895N93829j9800306j9929207r754599l512220
11097d5308051J989413J3865856K4257689K1571895J0573452M083861J346609
11090C2380724p026025j6570254j2445279L291036R212071l859035j8110261j5829644
11082b8956667l336909N380475J1667849K0978522K3636573R552281q111882r259889
$$ y = [-15336692, -10603442, 1259833, -473750, -18325372, -30568611, -19182415, 4190728, 12659038, 1140362, -7227703, 4419811, 22000297, 21686598, 4198673, -7698447, -663323, 16002210, 27540258, 28934170, 20599487, 3654490, -13931798, -18545277, -7368379, 5041899, 5433382, -1209987, -3895900, -6323347, -19575247, -37588189, -38699432, -16416443, 7094452, 7688281, -12112025, -32041232, -41795831, -45308051, -43318638, -29452782, -5195093, 16376802, 26950254, 31034115, 32380724, 25354699, 8784445, -3660834, -369798, 8842273, 4983238, -13127023, -28956667, -32293576, -26913101, -15245252, 5733270, 29369843, 38922124, 30810242, 21550353]
11074B1550353n19949m617251j8361801j3807616J2395319K5123692L723690k1643067
11066C843370j3919553J3374976J7294736p935843k3904368q623996J2309847
11059g560831Q383261j1252218j7375991n508642M246621K959680K707314R958531
11051a3442275J1743946k164963j8634135j6518598M327436K2482451K1824786
11044I618648P744253m979090j0033685r885649o228079J147658R009992J2122483
11036H516531R679399M682778k007953j0677564j6623998j3087325k169373M822808
11028a6864697K032069k281604K417630J2739019J4437062J284283j5545460k0040133
11020b1821831j0035611J222103K244087l139824l348175M044701J0690475J1059088
$$ y = [21550353, 21030404, 16413153, -1948648, -15756264, -3360945, 21762747, 25486437, 3843370, -10076183, 3298793, 20593529, 12657686, -11246682, -19870678, -7560831, 822430, -10429788, -27805779, -33314421, -29067800, -26108120, -23400806, -13442275, -1698329, -3863292, -22497427, -39016025, -34688589, -12206138, 9618648, 17362901, 12383811, 2350126, -7535523, -13763602, -12615944, -3605952, 8516531, 18195930, 22878708, 20870755, 10193191, -6430807, -19518132, -21687505, -16864697, -14832628, -17114232, -14696602, -1957583, 12479479, 13763762, -1781698, -21821831, -31857442, -30635339, -28391252, -31531076, -34879251, -30834550, -20144075, -9084987]
11012i084987P510843J165671r378645j6340157n860817J7410854K5790360N182421
11004A6395543j8773902j3641743J2280043K2828665P544110r151345j1341688
10997F139683r735053j0305396m96652J8807920K1172759l699212k4943755j3508410
10989a6568116J3633127K1068802O924518m212393m950880p673403j2559991o997534
10981a1335870N850737Q537334l81551m923449j092991r37332n535996j290557
10973a1109675J1871968J4945272J073520j0989275n562581P311932R706520P36712
10965A7984393p877873r611694o532257k615676l57496N13772K280254L557017
10957b659560m45256o228984j920203J0573058R812108j0515120k0657208K671708
$$ y = [-9084987, -1574144, -408473, -9787118, -26127275, -31988092, -14577238, 11213122, 16395543, -2378359, -16020102, -3740059, 19088606, 26632716, 17481371, 6139683, -3595370, -13900766, -14397418, 4410502, 25583261, 21884049, -3059706, -16568116, -2934989, 18133813, 25058331, 20845938, 15895058, 8221655, -4338336, -11335870, -5485133, 3052201, 2670650, -2252799, -3345790, -4283122, -9819118, -11109675, 762293, 15707565, 16781085, 5791810, 229229, 7541161, 17247681, 17984393, 10106520, 494826, -6037431, -8653107, -9010603, -8496831, -6216577, -2659560, -3104816, -9333800, -11254003, -680945, 9131163, -1383957, -22041165, -19369457]
10949a9369457L0832576K0453179j5243228k1906066R235772K5399773k405370
10942B6997179l2734390k1927205Q538632J3841544j449782n38591J8230408K0868762
10934C1826557l006515k4075418j9304853o74881Q779740L988363l622428j748297
10926g837732J0929019K0011746Q546079j6716006k5659283m802955J9297070
10919C767938J5784928o845822j6653644n421645O734557O321426k46031m724081
10911a282374n355364j7499Q865298P878225q556881k0403773o623600J8923938
10903f572030K2507326j592221k4645633k4973153j0808955P87200N209773N962532
10895c4125161O463992Q803937Q636167l334957k1629414k1215014O776081L0599627
$$ y = [-19369457, 11463119, 31916298, 16673070, -5232996, 4002776, 29402549, 26997179, -5737211, -27664416, -19125784, -5284240, -6734022, -7272613, 10957795, 31826557, 28820042, 4744624, -14560229, -15235110, -6455370, -2467007, -6089435, -7837732, 3091287, 23103033, 31649112, 14933106, -10726177, -15529132, 3767938, 19552866, 12707044, -3946600, -9368245, -2633688, 3687738, 3441707, -1282374, -6637738, -6655237, 2210061, 10088286, 1531405, -18872368, -25495968, -6572030, 15935296, 14343075, -10302558, -35275711, -46084666, -45297466, -40087693, -34125161, -27661169, -18857232, -10221065, -13556022, -35185436, -56400450, -49624369, -19024742]
10887a9024742J8429555j1049402j4882913Q073798J9950986Q191234J38950R415005
10879A9242471J4666431L082081q455986r676569j2552838j6258295r98792K4979970
10871A4028473K0114377k2451012m8909888k1630388K1668342K7160051M358811
10864e661234k167735J1012899J2134379l943555j2436946n880053J676427Q211108
10856B945290J8852180J8737278n291414k7335411j4191866J5218479J3955175
10849B2889711j5299439k3758659O34306J4525584l920354j8833183j639484K0627562
10841d773956J4545357n460202p998366M077176Q705071M369272K470915J538722
10833A7473989l330878n517450l911381j1051193k3312500j3578535K0280534
$$ y = [-19024742, -595187, -11644589, -26527502, -18453704, 1497282, 9688516, 9827466, 19242471, 33908902, 36990983, 28534997, 18858428, 6305590, -9952705, -10951497, 14028473, 34142850, 11691838, -37218050, -58848438, -37180096, -10020045, -5661234, -7828969, 3183930, 15318309, 11374754, -1062192, -6942245, -5265818, 2945290, 21797470, 40534748, 35243334, 7907923, -6283943, 8934536, 22889711, 7590272, -16168387, -15534081, -1008497, -4928851, -23762034, -25401518, -4773956, 9771401, 4311199, -3687167, 390009, 9095080, 13464352, 15935267, 17473989, 14143111, 8625661, 4714280, -6336913, -29649413, -43227948, -22947414]
10826b2947414L4695645M039825k9156911j4245402K5527861K7566207j0637654
10819A4842157k9497919k972435K6211457K0212128r45968n089244p44960j0822473
10811A1192743k5886500j9965135M946802K1645353J6427666J171068q560125
10804I71872r105928m261881J783951O275915P637071K922446j1060247k6725334
10796c1562135k3413958O901012L7247262L3469859L768094r260519Q197361K0189779
10788D5536755p07354k8260569k3948216L326903J4823394K777360n085439M345949
10780A2808783J2834469P425571K48091J703431J662704q559464j7566014j3268832
10772b711261l734575j607238j278108R314184K3048226K0918737K733637j0181963
$$ y = [-22947414, 11748231, 15788056, -13368855, -27614257, -2086396, 25479811, 14842157, -14655762, -17628197, 8583260, 28795388, 27849420, 22760176, 22015216, 11192743, -14693757, -34658892, -29712090, -8066737, 8360929, 9531997, 971872, -8134056, -12395937, -10611986, -4336071, 3301000, 6223446, -4836801, -31562135, -54976093, -48075081, -10827819, 22642040, 26410134, 17149615, 25346976, 45536755, 44829401, 16568832, -7379384, -4052481, 10770913, 13548273, 8462834, 12808783, 25643252, 33068823, 33316914, 35020345, 36683049, 28123585, 10557571, -2711261, -6445836, -8053074, -9331182, -16998, 23031228, 43949965, 46683602, 36501639]
10764C6501639p228473m333979j6099875k7707177j4354254J7675185L2927675
10757A7380741J4428066j2249020j5779186k006269Q59511j1536536j5197857
10750b4100550J550092J9409300J8005751L193890p032625p446809m052476p81663
10742a255090K72133l803828q687224l048773J3068262K1834881J0825431q721202
10734B0484590j8336021j5299469p122851L759287J4736806J4952029L25811j3164709
10726C35473r321819L885572Q143507M009862N317501J1513387R078311k377980
10718C0583814q562876n397595m192843r894511j3697963j0335053m957588j75963
10710b6630578O592775J0888336M486633o375231n265895P221957J0236576n239440
$$ y = [36501639, 29273166, 24939187, 8839312, -18867865, -33222119, -15546934, 17380741, 31808807, 19559787, 3780601, 1774332, 2633843, -8902693, -24100550, -22550458, -3141158, 14864593, 18058483, 11025858, 3579049, -473427, -1255090, -982957, -4786785, -13474009, -16522782, -3454520, 18380361, 29205792, 20484590, 2148569, -13150900, -20273751, -16514464, -1777658, 13174371, 13500182, 335473, -8986346, -5100774, 3042733, 7052595, 12370096, 23883483, 32961794, 30583814, 22020938, 16623343, 12430500, 2535989, -11161974, -21497027, -26454615, -26630578, -20037803, -9149467, -4662834, -11038065, -16303960, -9082003, 1154573, -4084867]
10702d084867j9465400j1125944J2511145K6048076J8036810O03775q911152o652514
10694F959929k451984n489686j2256582j1806956k137928P255455J1490615J5906881
10686G469744J9110628P731260j8326181l3298476j8410518Q230461J7902761
10679i590321J1935359Q403874M404574j2278452k5835536j0210224J9596011
10672a3574715K0361262j1118934k9402284j0704057J4777906J7978494J2418835
10665G36507J5828218J3151936r864475l1488397k7018649q547286N74826L824421
10657d2802899J1939684J3350497j55394n160337J6043773L4440238J5635129
10650D3290691j8024569j7120367J5604752K9355328N933421j7245422j2637455
$$ y = [-4084867, -23550267, -34676211, -22165066, 3883010, 21919820, 22523595, 13612443, 6959929, 4507945, -981741, -13238323, -25045279, -27183207, -19927752, -8437137, 7469744, 26580372, 34311632, 15985451, -17313025, -35723543, -27493082, -9590321, 2345038, 10748912, 15153486, 2875034, -22960502, -33170726, -13574715, 6786547, -4332387, -33734671, -44438728, -29660822, -11682328, 736507, 16564725, 29716661, 19852186, -11636211, -38654860, -47202146, -46627320, -42802899, -30863215, -17512718, -17668112, -22828449, -6784676, 27655562, 43290691, 25266122, 8145755, 23750507, 53105835, 59039256, 41793834, 29156379]
10643B9156379j464263r209200k3169768j8883015k1566J2234789J0701211L540150
10635B884717k410572m824923k401328J861204K086763j159571j966563q3208
10627f013481L28482J013445M950313M986581n730336j5874550r203310P076854
10619a8466002J1046788K048159K05942P650772K458973j8497945k4094792K999586
10611c4648519L1233268K2052319j2638051k8129899j2219953K770637m537759
10604c6117957j1610070Q389707L8529843L7456072q84566l4682391k7783910
10597b6703272N873143K5709667J6856716j082823q747676o482818l00288P415643
10589A2538292Q895282m188600j9933531j4214507J0740872K2108819N523351
$$ y = [29156379, 27692116, 18482916, -4686852, -23569867, -23591433, -11356644, -655433, 2884717, 474145, -4350778, -6752106, -4890902, -2804139, -3963710, -5930273, -6013481, -5684999, -4671554, 278759, 5265340, -464996, -16339546, -25542856, -18466002, -7419214, -5371055, -5165113, 2485659, 4944632, -13553313, -37648105, -34648519, -3415251, 18637068, 5999017, -22130882, -34350835, -31580198, -36117957, -47728027, -39338320, -808477, 36647595, 35763029, 1080638, -26703272, -20830129, 4879538, 21736254, 20653431, 11905755, 5422937, 5122649, 12538292, 21433574, 17244974, -2688557, -16903064, -6162192, 15946627, 21469978]
10582B1469978j0100029P71866J6869393N411771k1630717k5896279l989283J1107908
10574e985392N080900k358793Q92688J812591n618336p172103N02907p22057j4017236
10565b7584831j2815904J5394637L8523206K2144555j6628256k9619559l775943
10558a4362095K3927640J9847553m342414j4739326k873284Q084951K00626j4537295
10550A206356j4069425J364146J1481311O205126l439102o273483n073255l364523
10542a1962849M156459J6962680K0265490N427585j3652571j8540350r719676
10535g063232L67346N575504M920215l220053j2633642r716136M386005R323114
10527h060879k340550r286179M096573J9920856J6193103J673981m837604p984806
$$ y = [21469978, 11369949, 12141815, 29011208, 34422979, 12792262, -13104017, -17093300, -5985392, -904492, -3263285, -2370597, -558006, -6176342, -13348445, -12845538, -13567595, -27584831, -40400735, -25006098, 13517108, 35661663, 19033407, -10586152, -14362095, 9565545, 29413098, 25070684, 10331358, 7458074, 15543025, 15743651, 1206356, -12863069, -11498923, -17612, 6187514, 2748412, -3525071, -8598326, -11962849, -7806390, 9156290, 29421780, 34849365, 21196794, 2656444, -7063232, -6695886, -1120382, 3799833, 579780, -12053862, -21769998, -17383993, -8060879, -10401429, -19687608, -15591035, 4329821, 20522924, 22196905, 17359301, 9374495]
10519I374495j8595642k3696429p421875J5312696J9721913R940908M534336J297399
10511A0467801r243825j4796643k780278R213258K749259m452400P846482J8540610
10503A7544264K595119j6532050o613732J1311925K814214j0345885O964710K5006899
10495C2745464Q27272k5370870Q334043N6516213L0445615k2846283L1164334
10488A11815788J63775081J64248584m6216046k51570389k23975997l6264871
10482a18187850O8588370K3513051k9438931k529050L1391013O155912k7845674
10475d8353159j1431884K4728028K8463021R717004K722198N319785J34927q444319
10467B855601j0859548j0729947p682457M328087J2748613j791033k4739848k0430428
$$ y = [9374495, -9221147, -32917576, -40339451, -25026755, -5304842, 4636066, 9170402, 10467801, 1223976, -13572667, -16352945, -7139687, -4390428, -8842828, -996346, 17544264, 20139383, 3607333, -3006399, 8305526, 11119740, 773855, 7738565, 32745464, 33572736, 8201866, 16535909, 73052122, 103497737, 80651454, 111815788, 275590869, 439839453, 393623407, 142053018, -81922979, -118187850, -49599480, -26086429, -55525360, -58054410, -26663397, -20507485, -48353159, -59785043, -35057015, -6593994, 3123010, 5845208, 11164993, 11299920, 2855601, -8003947, -18733894, -26416351, -22088264, -9339651, -11130684, -35870532, -56300960]
10459e6300960R713374K5574542J1073845n694562l324481M716575L148875k621823
10451a3714615o651060j0855873q753247N618237J4138844k281868k2207509j0022511
10443e4729602K0749009K2445067q016363k2232564O3373K2451181J7832413O199731
10435D762245N469351o00707j8446409k0073692N469713K2587121O758735j0666051
10427d739694N006141L1634725K7007651k816822j8370755j1121400p238898j5804244
10419C556704j5883277K018525J5616412L451475k2435099k9901548o244373K5168512
10411b4652669L1524876J0447127q457362o130943O11474p895347j6975185k898805
10403b4426834K0571016J9706146k536726r993718O670480J7488070O885665m631087
$$ y = [-56300960, -46587586, -21013044, -9939199, -15633761, -18958242, -14241667, -11092792, -13714615, -20365675, -31221548, -39974795, -34356558, -20217714, -22499582, -44707091, -54729602, -33980593, -11535526, -19551889, -41784453, -41721080, -19269899, -1437486, 4762245, 10231596, 9630889, -8815520, -28889212, -23419499, -832378, 5926357, -4739694, 266447, 31901172, 58908823, 56092001, 37721246, 26599846, 19360948, 3556704, -12326573, -10308048, 5308364, 8759839, -13675260, -43576808, -49821181, -24652669, 6872207, 17319334, 8861972, 2731029, 3342503, -4552844, -21528029, -24426834, -3855818, 15850328, 13313602, 3319884, 9990364, 27478434, 34364099, 29733012]
10395B9733012m355918q877714k4106009k6117473n016779J0668223n8034j5112152
10387d3242844q280471Q080507J0051829L478467N580116R589247J682862o763124
10379a9823411J762082J5050726Q497123j2187013j8079866j435947J6077588
10372a0138718J7816174J0003645M145617J543982j647283p066394j3266914j4913372
10364a3523263o424975P804461J4267279P876711l95340k95201L230376J798j0066831
10355B475015j8736802j8933184q352232Q133868J8230247J4253354M851628L485960
10347E407854Q682123R748507O027095K418618o132992k2420390k8388616q747947
10339c3405748J4466987P693038j7596120j7020522J5405361L5332853J8625173
$$ y = [29733012, 25377094, 16499380, -7606629, -33724102, -38740881, -28072658, -28130692, -43242844, -51523315, -43442808, -33390979, -29912512, -24332396, -14743149, -13060287, -19823411, -18061329, -3010603, 5486520, -6700493, -24780359, -26216306, -10138718, 7677456, 17681101, 21826718, 23370700, 21723417, 14657023, 1390109, -13523263, -19948238, -12143777, 2123502, 10000213, 9604873, 9309672, 12540048, 12541846, 2475015, -16261787, -35194971, -43547203, -35413335, -17183088, -2929734, 1921894, 5407854, 14089977, 23838484, 29865579, 32284197, 26151205, 3730815, -24657801, -33405748, -18938761, -11245723, -28841843, -45862365, -30457004, 4875849, 23501022]
10332B3501022m227382l973918L171231n253123j5568654q033748M388131J988234
10324d008207m409344M117733J7759175J5586378R76549q973526j1610351j1348366
10316a909959l289728J1995250J7346860N452432n067955j871701k091816j8803845
10308A759538l1393462j8789296K922949Q176146M233643J1789981K3617592J8711601
10300B1028692K355627l085158L383726L438974q430586k0693270k3743894j3374843
10292c9120732J0403287L0757232K1763914j1726858k8576374q988588J3140888
10285a2347231M397761j5421207j2219662K960010j007335j6857007j4863435
10278f5358106K193986R423148R590200K2412624L5864298J9500850j8708182
$$ y = [23501022, 19273640, 15299722, 18470953, 13217830, -2350824, -10384572, -5996441, -4008207, -8417551, -4299818, 13459357, 29045735, 30022284, 21048758, 9438407, -1909959, -5199687, 6795563, 24142423, 29594855, 24526900, 22655199, 20563383, 1759538, -29633924, -48423220, -45500271, -37324125, -33090482, -21300501, 2317091, 21028692, 23384319, 20299161, 23682887, 27121861, 18691275, -2001995, -25745889, -39120732, -28717445, 2039787, 23803701, 12076843, -16499531, -25488119, -12347231, -7949470, -23370677, -35590339, -32630329, -33637664, -50494671, -65358106, -63164120, -53740972, -44150772, -21738148, 14126150, 33627000, 14918818]
10271A4918818l7052749k1124078J782637Q628684L422922l512053n251918O547382
10263c1640355K5466730K3468325o856283k5716697l074986K4991936J0157226
10256A6795896k4249740j9629298J6532983K2641051j0161566k4964043j20019
10249b3154736J8159741L581840p807321P457908J5347781p419959k4895958n789075
10241b4519779J9936654J4748073m402865m526917N233821Q08634q151221k482856
10233c356456N997515J300853p03483J4390729K1600398k534504k9956391k0711931
10225a3973270J1061828K0225144R53927j5014386j5472151j4091269j0509581
10218c6819758P124991K5560327J9310462k141922n110565J0339985R092581j7200992
$$ y = [14918818, -22133931, -43258009, -41475372, -32846688, -29423766, -32935819, -38187737, -31640355, -6173625, 17294700, 10438417, -15278280, -18353266, 6638670, 16795896, -7453844, -27083142, -10550159, 12090892, 1929326, -23034717, -23154736, -4994995, -1413155, -9220476, -1762568, 13585213, 6165254, -18730704, -24519779, -4583125, 10164948, 5762083, 1235166, 6468987, 7277621, -873600, -3356456, 2641059, 3941912, 3238429, 17629158, 39229556, 36695052, 6738661, -13973270, -2911442, 17313702, 18267629, 3253243, -12218908, -26310177, -36819758, -29694767, -4134440, 15176022, 13034100, 7923535, 18263520, 27356101, 10155109]
10210A0155109l2866459j6177151O671074N767088q201101q417579M337893Q970194
10202b9760932L52212n704008J918207J6475584K4713102K0732636Q532517l450465
10194C3808853r579867r896962o336880l27794L380081j813932j2110908j1055766
10186a3933175Q931483K9463216K5307625k497850k7556562l1113467j8909246
10179c0307976m307557Q309060J7138315J5350213J659458j0641045q012503L798929
10171g013106O454671m879439j3735019n571453J0471388J2952087k684490j7957579
10163b1962940j5815146o56106J0865228J0249176K070949m317710j875601Q518673
10155a2923477J4877254N982754q973637p175137J2905473K2056546J662350k4641396
$$ y = [10155109, -22711350, -38888501, -32217427, -26450339, -34651440, -43069019, -38731126, -29760932, -29408720, -35112728, -33194521, -16718937, 7994165, 28726801, 37259318, 33808853, 24228986, 14332024, 7995144, 7667350, 11047431, 9233499, -2877409, -13933175, -5001692, 24461524, 49769149, 47271299, 19714737, -11398730, -30307976, -34615533, -26306473, -9168158, 6182055, 7841513, -2799532, -10812035, -7013106, -558435, -5437874, -19172893, -24744346, -14272958, -1320871, -4005361, -21962940, -37778086, -38434192, -27568964, -17319788, -15248839, -19566549, -21442150, -12923477, 1953777, 7936531, -1037106, -8212243, 4693230, 26749776, 28412126, 3770730]
10147C770730k4211469l722859N912436N09483K074859J2872803J0599493o902235
10139I03241j2368843M113057J6565596P781970k713270L224100Q974313m683844
10131B1796320k1074191j2939386J2471783K4554423J3405346m391763j4454937
10124A9367595j4902270o531431N200496O507657o534050j5847601o852032O452512
10116a3139124M460968l625669L302171J7530052J2388203j0429359j8850673
10109h363431j157378J4371134L721851j6837217j8302051k139028P154081J737623
10101a9814416j054875J0367395K1842712J3416821j0555961k3946441j1993444
10094b1738209Q873739J2453169k656168j3354829n937307O783963Q265365K207802
$$ y = [3770730, -20440739, -24163598, -18251162, -17741679, -15666820, -2794017, 7805476, 903241, -11465602, -7352545, 9213051, 16995021, 14281751, 17505851, 26480164, 21796320, 722129, -12217257, 254526, 24808949, 38214295, 33822532, 19367595, 4465325, -2066106, 3134390, 9642047, 3107997, -12739604, -19591636, -13139124, -8678156, -12303825, -9001654, 8528398, 20916601, 10487242, -8363431, -9520809, 4850325, 8572176, -8265041, -26567092, -28706120, -21552039, -19814416, -20869291, -10501896, 11340816, 24757637, 14201676, -9744765, -21738209, -12864470, -411301, -3067469, -16422298, -22359605, -15575642, -7310277, -5102475]
10086e102475J394983M721934J568821p484980j0682661l838467M851199Q609930
10078e961716Q818639P371240K929330l536571p926041q969993q147532m144830
10070a9567474M778244J3195758J2131524J915677o520728o043408k040591k642675
10062d793673o030967l880128M924938J1146067P881131J044617J585923R620175
10054B1498083J4105921R269458K136999r33113n229783j5747228k2761168j3453631
10046a1114462N773245J3586703R11553j8835871k7961385k1223756l447148J6550087
10038d5761034K6402682J6949543n373045k0878768j5981362M290265K2721677
10031a7630042K3629294M787743j6024327j3602585J3332257L2322198J6349208
$$ y = [-5102475, -3707492, 1014442, 2583263, -4901717, -15584378, -19422845, -14571646, -5961716, 2856923, 10228163, 13157493, 9620922, 1694881, -7275112, -15422644, -19567474, -14789230, -1593472, 10538052, 12453729, 5933001, -110407, -2150998, -4793673, -10824640, -14704768, -9779830, 1366237, 9247368, 10291985, 11877908, 21498083, 35604004, 44873462, 47010461, 46077348, 40847565, 25100337, 2339169, -11114462, -5341217, 8245486, 9157039, -9678832, -37640217, -58863973, -62311121, -45761034, -19358352, -2408809, -7781854, -28660622, -44641984, -40351719, -17630042, 5999252, 10786995, -5237332, -18839917, -5507660, 26814538, 43163746]
10024D3163746j6034556k4003091k385168J4030421N582257o564838j133055Q413384
10016B1069100K83568j7845277k1659511o836800Q820807J1759295L892258p071930
10008g588490j4776851j4827841p482821J918357Q001591P455960n31933p847921
10000c5679949O76798K4063941L3925393R623775k4262761k6863411j967255Q772121
9992a1711348n767832j0592941J1138425K6631776J0165757j2738467j0176754
9985c051384M660539L618059o634946m300885M788553M493533M876210J9224422
9977B7674101K5726320j522109l8747116l8935632m171728J7193932M344881j2641735
9969b1079086q794235J513123L8182l738909M304328J6137911J6707597O832679
$$ y = [43163746, 27129190, 3126099, 740931, 14771352, 20353609, 13788771, 12655716, 21069100, 21352668, 3507391, -18152120, -24988920, -16168113, -4408818, -516560, -7588490, -22365341, -37193182, -44676003, -42757646, -34756055, -27300095, -27832028, -35679949, -35003151, -10939210, 22986183, 32609958, 8347197, -18516214, -20483469, -11711348, -17479180, -28072121, -16933696, 9698080, 19863837, 7125370, -3051384, 1609155, 5227214, -1407732, -5708617, -920064, 3573469, 8449679, 27674101, 53400421, 51878312, 13131196, -25804436, -29976164, -12782232, -8437351, -21079086, -29873321, -28360198, -28322016, -32060925, -27756597, -11618686, 5088911, 11921590]
9961A1921590l191369q229408o961296J071150J0197344J1275353L086890q032901
9953A1137353j8237990k5160307k2057636o778004R073326J4587158J5710244
9946b1725856K0685384J9834032K076800j7113072j1890236J2125830K0242514
9939B4235396k779781l0853767l1669462n463723K0531981K4235140P667943r648033
9931c744306j2083787l603742J091848n17324K202865R246704N747136r296400
9923a0957006j3041837O362736K6452716K1879189J40706j4534111j4318493m591611
9915b607711J1613738K4152944J3527026j7352468l2780616j2189990J6530533
9908H93456K0032135P824762M957782O392973k714519j0104821k218654J265464
$$ y = [11921590, 8730221, 500813, -6460483, -5389333, 4808011, 16083364, 19170254, 11137353, -7100637, -32260944, -54318580, -61096584, -52023258, -37436100, -21725856, -1040472, 18793560, 20870360, 3757288, -8132948, 3992882, 24235396, 21455615, -9398152, -41067614, -46531337, -25999356, -1764216, 5903727, -3744306, -15828093, -19431835, -18339987, -18857311, -16654446, -7407742, -1660606, -10957006, -23998843, -17636107, 8816609, 30695798, 30836504, 16302393, 1983900, -2607711, 9006027, 33158971, 46685997, 29333529, -3447087, -15637077, 893456, 20925591, 28750353, 33708135, 40101108, 37386589, 27281768, 25063114, 26328578]
9900B6328578j6393137k7819860n676905K2558440J7885072l820483p552343o470940
9892i61578k5757986l5802813j362450L6564002J8820457k2925118j7260518J6276673
9884c2409331O273344k5026764L657645O2474534L8803815n0763205o0897426
9877e7887388K5923621M7769901m2096808m7740180J41485570K94799470J47837163
9870E10091349j67819367k79462421j01290354P5823644L8096071q1173472p5914081
9863h1648631K1048476N2251506J460971k5226248M916930K8425464J6783343
9856A8011811N313593P708781p02377j9938498k0996774j973243R806866P124686
9848D354845O318437Q927733K306343r722886j3747459j3915515j9286682j8482423
$$ y = [26328578, 9935441, -17884419, -23561324, -1002884, 16882188, 13061705, 5509362, -961578, -26719564, -62522377, -63884827, -27320825, -8500368, -31425486, -48686004, -32409331, -26135987, -51162751, -47505106, 14969428, 53773243, 3010038, -57887388, -31963767, 15806134, -26290674, -74030854, 67454716, 362254186, 510091349, 342271982, 62809561, -38480793, 37342851, 75438922, -5734550, -81648631, -60600155, -8348649, -6887678, -32113926, -27196996, 1228468, 18011811, 23325404, 31034185, 30331808, 10393310, -10603464, -12576707, -2769841, 4354845, 10673282, 19601015, 21907358, 12184472, -1562987, -15478502, -34765184, -53247607]
9840e3247607n28246J5216416O342420j0396041l448261J8482104J8055381q459772
9832a7983606k2961369m342527K1736365K3853690O567452m648405q23806M368406
9824E766200k865549j8738540k5317886j0070728J6690591K8973864J4690186
9817I128138q864953j6620266n633825O092457M847940n090005j0289902l096526
9809b9526942J1049819J8637749J3683193O114290N883605L778236j4115927l4931462
9801a9427439k8341266N614604K6921751J0761723j4340903r019606J7332337
9794a0498799K2104946n855045l0820317k0724835J3211369L4043684K0024383
9787B1485386j5907696l7454223j8700294K3638088M1207121J1613918k8598514
$$ y = [-53247607, -53775853, -38559437, -32217017, -42613058, -46061319, -27579215, -9523834, -17983606, -40944975, -45287502, -23551137, 302553, 6870005, 2221600, 1397794, 5766200, 2900651, -15837889, -41155775, -51226503, -34535912, -5562048, 9128138, 263185, -16357081, -21990906, -15898449, -11050509, -16140514, -26430416, -29526942, -18477123, 160626, 13843819, 19958109, 25841714, 29619950, 15504023, -19427439, -47768705, -42154101, -15232350, -4470627, -18811530, -27831136, -10498799, 11606147, 5751102, -25069215, -45794050, -32582681, 1461003, 21485386, 5577690, -31876533, -50576827, -26938739, 14268382, 25882300, -2716214]
9780b716214l1000277j494577J3622978O41211n209885J6061096L2799423J4256228
9772C6959983j5714889j4237117J2434958J8086102j1800054l7981828k6025215
9765c8278060N830031J6752828l2800j4826083o623294J2770864K1347415J4989263
9757A1930164M458934l472075r569626j2353357q099567j042316j380704q712290
9749b8240837q755261N194989J7926158J2484180k855039n461218O560836J1542819
9741H396627O79532n913847P009384K0582897Q681831j9155825k8831069j1440429
9733a9990899O069780L680606n211828j710116P266418M382662o613023o567015
9725a8693415P822383J7643000P737447j3621197k4203133j1571527J2880403
$$ y = [-2716214, -33716491, -35211068, -21588090, -20946879, -26156764, -10095668, 22703755, 36959983, 21245094, 7007977, 19442935, 37529037, 25728983, -12252845, -38278060, -32448029, -15695201, -15728001, -30554084, -37177378, -24406514, -3059099, 11930164, 16389098, 12917023, 3347397, -9005960, -17105527, -18147843, -19528547, -28240837, -36996098, -31801109, -13874951, -1390771, -4245810, -9707028, -3146192, 8396627, 9076159, 3162312, 10171696, 30754593, 39436424, 20280599, -8550470, -19990899, -13921119, -10240513, -15452341, -17162457, -9896039, -5513377, -12126400, -18693415, -10871032, 6771968, 14509415, 888218, -23314915, -34886442, -22006039]
9718b2006039K2955036O219801j7141523j6556272O286108J6744271k152564k2404529
9710b8055711j3566584J0104787J4173805j230618p449377J086322K063680q074223
9702c0947919n431077J3970142J9733731j558773j8427893l785333K0316457J8766047
9694A2635382j753766r568099j001122J472318n924828k815887J6496123L0371249
9686C9911370K1030193m129398k5804681l0556613j6734121J717955L100838j3867973
9678b5332430k0372535K836800L0158589K5446755p65103p548345Q532777Q724977
9670B1681485j8357152l2044507n790934K6164728K1434560n330230r961146J1055236
9662H852040K1200314N106797j2179958r448343J192350q82190j4368564k2314838
$$ y = [-22006039, 948997, 7168798, -9972725, -26528997, -20242889, -3498618, -5651182, -28055711, -41622295, -31517508, -17343703, -18574321, -26023698, -24937376, -22873696, -30947919, -36378996, -22408854, -2675123, -4233896, -22661789, -26447122, -6130665, 12635382, 10881616, 1313517, 312395, 1784713, -4140115, -6956002, 9540121, 39911370, 60941563, 56812165, 31007484, 450871, -16283250, -14565295, -11464457, -25332430, -45704965, -42868165, -12709576, 12737179, 11972076, 4423731, 12956508, 21681485, 3324333, -28720174, -34511108, -8346380, 13088180, 7757950, -2203196, 8852040, 30052354, 35159151, 22979193, 13530850, 14723200, 13841010, -527554, -22842392]
9654b2842392j4572575M278540K0110348J9037276J013442j5555907j2387512
9647b0918780N667579J6316271P945130q858283j7749673j3262049l21469J1579486
9639a9601788J2153482r96150j5498227j6210199n514625k07499n818234p500392
9631e9193632O841697K6194508K9725441J3938317l392628m317528J0554229K3319390
9623D3669794J6131662r931356l2565012l0281099p482616J0665101J0104042
9616C10516K832760M164073Q775369K564994j1524216j7040108r628460j630382
9608b1175454o57343j89775M917191R140011Q540031P960538Q279077O50086j6063338
9599A401024k5587073j5897641O29998N128813J078261N670791J8292711K0543904
$$ y = [-22842392, -37414967, -33136427, -13026079, 6011197, 7024639, -8531268, -20918780, -15251201, 1065070, 9010200, 151917, -17597756, -30859805, -31181274, -19601788, -7448306, -8444456, -23942683, -40152882, -45667507, -45875006, -51693240, -59193632, -52351935, -26157427, 3568014, 17506331, 14113703, 9796175, 20350404, 43669794, 59801456, 49870100, 17305088, -12976011, -20458627, -9793526, 310516, 3143276, 7307349, 16082718, 18647712, 7123496, -9916612, -19545072, -21175454, -21832797, -22022572, -17105381, -7965370, 574661, 8535199, 16814276, 17464362, 1401024, -24186049, -40083690, -39453692, -34324879, -33246618, -27575827, -9283116, 11260788]
9591A1260788P735927k990754j604927N019p269251j0714290K116989J7857406
9583A6396907J4177334o515571k0595832j7094103q699423p489567p419333J615205
9575c5624383J4410245J5833394K110028j0891307l633120K2584041M0128619
9568D4917517K1733132k4541323n6610522m3353184j007084K6785020J9604109
9561a2472335l438376j4923626q786701M464186J5013927J7085054P806127n909978
9553a161722q334371N257127J6376455M734495k0935267k8793589m575301K6307741
9545a1124432K7302371m468692l3602497k8209708L221648K4407363J6078721
9538f395226l709937p531237M869418J0530992j086103j3522243r459875L370882
$$ y = [11260788, 18996715, 16005961, 14401034, 14406053, 7136802, -3577488, -1460499, 16396907, 30574241, 24058670, 3462838, -13631265, -22330688, -29820255, -37239588, -35624383, -21214138, -5380744, -3270716, -14162023, -17795143, 4788898, 44917517, 66650649, 42109326, -14501196, -57854380, -58861464, -32076444, -12472335, -15910711, -30834337, -39621038, -35156852, -20142925, -3057871, 4748256, -1161722, -9496093, -4238966, 12137489, 16871984, -4063283, -32856872, -37432173, -11124432, 16177939, 11709247, -21893250, -50102958, -46881310, -22473947, -6395226, -10105163, -17636400, -12766982, -2235990, -3322093, -16844336, -26304211, -22933329]
9530b2933329N088270o033958j1974357k128128J2847465J7477048R235738n070226
9522c491477j8834865k4458321j4282221O839290J9726002J3896821L344004M880860
9514a2379907J0641020K663533j2419054j0768820O436654R226384j3115000l0488769
9506e0203959j6497290J1884833K2731007J4906902P831345M518823l097282o282238
9498a4207859P490069K2531374J3207880j0159142j2727096P492114J5453546
9491B9080886j225287j1904391K320857J4978888m33304k6300357l0811379j4579434
9483c8873521J538551J2109284K1542405K2308863P874496p589671q485601k838252
9475G586554m906248q987307m547334L1326n068772p373780O025573J9939348
$$ y = [-22933329, -17845059, -23879017, -35853374, -37981502, -25134037, -7656989, 1578749, -3491477, -22326342, -46784663, -61066884, -54227594, -34501592, -20604771, -17260767, -12379907, -1738887, 924646, -11494408, -22263228, -15826574, -6600190, -19715190, -50203959, -66701249, -54816416, -32085409, -17178507, -9347162, -4828339, -7925621, -14207859, -6717790, 15813584, 29021464, 18862322, 6135226, 13627340, 29080886, 27855599, 15951208, 18272065, 33250953, 32817649, 6517292, -24294087, -38873521, -37334970, -25225686, -3683281, 18625582, 26500078, 18910407, 10424806, 7586554, 2680306, -6307001, -10854335, -10823009, -15891781, -23265561, -17239988, 2699360]
9467B699360J4408888L4339j896816K105324n627918j4742573m122574J4281346
9459G139376J1695782o143293q431386N397479O229132j0412044j8004291r028327
9451b1557572l611297m167016Q429799K6134003J5267039j9500376k8611450L468181
9443b4148689K8359155J1674716j3610198q845344O752298K43402j2783251l232547
9435a5590458J1713812J514350j4800683j3016K8579651K2484982j3746751k7345197
9427g203310m889759R884446m896728j4554319O473825K8426907J6748618j2557195
9419A7432485k1970924p207745Q850461J4983925J5077319Q713825m943134j4021199
9411A6915013o816411Q709815J4766081O741459o147093j5371174j6897850q808706
$$ y = [2699360, 17108248, 17142587, 15245771, 17351095, 11723177, -3019396, -7141970, 7139376, 18835158, 12691865, 4260479, 9657958, 15887090, 5475046, -12529245, -21557572, -25168869, -29335885, -20906086, 5227917, 20494956, 994580, -27616870, -24148689, 4210466, 15885182, 2274984, -6570360, 181938, 425340, -12357911, -15590458, -3876646, -2362296, -17162979, -17175995, 11403656, 33888638, 20141887, -7203310, -12093069, -2208623, -7105351, -21659670, -15185845, 13241062, 29989680, 17432485, -4538439, -11746184, -2895723, 12088202, 27165521, 35879346, 30936212, 16915013, 10098602, 18808417, 33574498, 40315957, 34168864, 18797690, 1899840, -6908866]
9403f908866L874725R305652K966291n434025n878919K41226P807744J5093728
9395B1067556J6557548L638921j6970460k1638517j130242K0089310J3984122
9388C5598238j1904425k5464991j3844703M611616J0452963M989532p34631j640748
9380B062851K311041R370583J2360904K749405j5706739k6662345k0406493n473353
9372c9394146M351478O750514Q113090J0900393J1674763P950435P59959o446343
9364D660143p031762M874272K2553601K5087853k46188l5210670m3808830j3516282
9356d2637863K6670255L7541400J2789529j8167815k6607496j2732274L325922
9349a9818342P490816J292619q202559j6935720k0993699j4427205K880586J9024981
$$ y = [-6908866, -3034141, 6271511, 9237802, 3803777, -2075142, -1833916, 5973828, 21067556, 37625104, 41264025, 24293565, 2655048, 1524806, 21614116, 35598238, 23693813, -1771178, -15615881, -11004265, -551302, 4438230, 3703599, 2062851, 4373892, 13744475, 26105379, 28854784, 13148045, -13514300, -33920793, -39394146, -35042668, -28292154, -20179064, -9278671, 2396092, 10346527, 11106486, 4660143, -2371619, 2502653, 25056254, 50144107, 49897919, 14687249, -29121581, -42637863, -15967608, 21573792, 34363321, 16195506, -10411990, -23144264, -19818342, -12327526, -11034907, -19237466, -36173186, -57166885, -71594090, -68713504, -49688523]
9341d9688523K0464548R325639K204745Q069137J5483133R504129n190791r961721
9333B10296P92704J1416197P155136o561339j3301470o129638P591119J5984105
9325A7157110J1839490k381631j4138393j1513332J620911Q378158O41744j1160731
9317D43326j4684614j0453156l264829P442975J8167412J6452773k85657j4084091
9309b65861j1078380l784003r177850j7891063j0238900P770457J3815384P690771
9301b3159445P875152J3122312M127042j4141456j1878658J3164207K3261397
9294A2370551K42542k0598150m449880K7116740K9108458r31102k6691590k8300864
9286a2133295j8382110j0988530o663340n128157o158700j075364J3915457K2762880
$$ y = [-49688523, -29223975, -19898336, -17693591, -9624454, 5858679, 15362808, 10172017, 210296, 1003000, 12419197, 19574333, 13012994, -288476, -6418114, 1173005, 17157110, 28996600, 26614969, 12476576, 963244, 2584155, 10962313, 11604057, 443326, -14241288, -24694444, -27959273, -20516298, -2348886, 14103887, 13818230, -265861, -11344241, -15128244, -24306094, -42197157, -52436057, -44665600, -30850216, -23159445, -15284293, -2161981, 1965061, -12176395, -24055053, -10890846, 12370551, 12613093, -7985057, -12434937, 14681803, 43790261, 42859159, 16167569, -12133295, -30515405, -41503935, -48167275, -53295432, -59454132, -60529496, -46614039, -23851159]
9278b3851159J1588912l771549J7105J3118472P051895j5222586k0764999n1517
9270c1885426J8299762J4307055K752580k66906l214078j3395639j5671597J53699
9262b8920550J5326432J0357291k717436j779283Q420334Q051714j575902k561626
9254D600974N531600M898025p967330j5462319q866955j865887n736274j0327180
9246c5195346j855051J3830156J9224088R349667l584915o984447p74057O028373
9238C8468N889221o98163o189817l473929N893072J2151295Q466484J52279j595622
9229B0633288M383566N657784o558834k1628745k0501712j644487J5683021J7325045
9221A3348926J0412922N991394l140j3333903k1315440q578192J2540345J3310666
$$ y = [-23851159, -12262247, -16033796, -16016691, -2898219, 4153676, -11068910, -31833909, -31885426, -13585664, 721391, 3473971, 3207065, -7013, -13402652, -29074249, -28920550, -13594118, -3236827, -5954263, -7733546, 686788, 8738502, 7162600, 4600974, 10132574, 15030599, 7063269, -8399050, -17266005, -19131892, -24868166, -35195346, -37050397, -23220241, -3996153, 5353514, 1768599, -5215848, -5989905, 38468, 5927689, 5229526, -960291, -4434220, 1458852, 13610147, 22076631, 22228910, 20633288, 25016854, 30674638, 24115804, 2487059, -18014653, -19659140, -3976119, 13348926, 23761848, 29753242, 29750102, 16416199, -4899241, -13477433, -937088, 12373578]
9213A2373578q072370k1169472q957224Q120273P867043j96079J364821M306396
9205d363034n457720j2528303O220863L3279492K6172325j4716245l6467161q669012
9197a6528795K9534886K5790572j0964979k9539913j3525270K605966o672145
9190a9299678k1506587j3383433J1141898K4267515J7213035N549050K414435
9183F396235M660332M024929j148810o723818p785294k741200L317507K369753
9175B369634m910882o460990N319322J9849287J9596924K487620j5988894k1869374
9167C92647j5031912k966178P871470J2315195O988213m775583j3902543j5057657
9159b4166348j1053772n825719J499136J1760908J9423973J6628715L243828j0400434
$$ y = [12373578, 4301208, -16868264, -25825488, -17705215, -9838172, -10034251, -8669430, -4363034, -9820754, -22349057, -16128194, 17151298, 43323623, 28607378, -7859783, -16528795, 13006091, 38796663, 27831684, -1708229, -15233499, -12627533, -19299678, -40806265, -54189698, -43047800, -18780285, -1567250, 3981800, 6396235, 11056567, 15081496, 13932686, 7208868, -576426, -3317626, -119, 2369634, -2541248, -9002238, -3682916, 16166371, 35763295, 38250915, 22262021, 392647, -14639265, -17605443, -9733973, 2581222, 9569435, 4793852, -9108691, -24166348, -35220120, -41045839, -39546703, -27785795, -8361822, 8266893, 11510721, 1110287]
9151A110287j2579791k440038P786826N582832o726634j4325723q930661J279986
9143b9242916M887557K340944K11717j651836n800869o343205L050969J3857080
9135a8690559J1837419P16081j290765Q960263J3068826J502006r066939k244037
9127D792295J0299448N731965j4786154k7094697j7382342J977060J1552984P510483
9119a7398958J238649L510034J2581545J6258516O564766p619037q705262O139400
9111A2569653J8241610J0567845j0292300k3916595k1192956r809676Q9490M810462
9103a8932467M584115K141096K238534M872703K437978p919106j4138064l195782
9095b7910993J7744680K7514537J8341480L887283k437913l865211q864901j4726519
$$ y = [1110287, -11469504, -13909542, -6122716, -539884, -7266518, -21592241, -30522902, -29242916, -24355359, -22014415, -21802698, -23454534, -29255403, -35598608, -32547639, -18690559, -6853140, -6137059, -7427824, 1532439, 14601265, 16103271, 7036332, 4792295, 15091743, 20823708, 6037554, -21057143, -38439485, -36462425, -24909441, -17398958, -16160309, -12650275, -68730, 16189786, 22754552, 15135515, 6430253, 12569653, 30811263, 41379108, 31086808, 7170213, -14022743, -23832419, -23742929, -18932467, -14348352, -12207256, -9968722, -5096019, -2658041, -10577147, -24715211, -27910993, -10166313, 17348224, 35689704, 39576987, 37139074, 33273863, 24408962, 9682443]
9087I682443j2587725k974248L758423J452457m802990o763471l018149J490532
9079a3762728K707779R85077j222138j619107J644566P743257J0733906N062150
9071A2272762m525993o246671J082778L532580n989183j2464882q73320J5754391
9063B542462J2473344p359400j4371201J449197J5699144R723453k103157k249220
9055A5804622j293556j4802283k9089782j9687067P653944K3701678J7862643
9048A50199O802529L809867N027857N966807P624558M452748j1034800k8751953
9040e952188k8159042r071836O007289N339968J550416M465605L909336p006606
9032b8917058j2093222N085074L1208243L5876986J0042057k2896339l3660977
$$ y = [9682443, -2905282, -5879530, -2121107, -668650, -5471640, -12235111, -15253260, -13762728, -11054949, -10069872, -11292010, -12911117, -11266551, -3523294, 7210612, 12272762, 7746769, 1500098, 2582876, 6115456, 126273, -12338609, -13211929, 2542462, 15015806, 7656406, -6714795, -5265598, 10433546, 20156999, 18053842, 15804622, 14511066, -291217, -29380999, -49068066, -41414122, -17712444, 150199, 6952728, 10762595, 15790452, 21757259, 29381817, 33834565, 22799765, -5952188, -34111230, -43183066, -37175777, -31835809, -30285393, -25819788, -21910452, -28917058, -41010280, -35925206, -4716963, 31160023, 41202080, 18305741, -15355236]
9025a5355236j5838124J0823706K0390254O154869j1390632o877217J7946036
9018E853656L3072351J6214755j8247131l4837870j7693537J2262789K1262883
9011A7887896l73802k7674277k8600565q64670K5377231K4557565N314824o761455
9003H862747n706967o068083j1699421p813792R732381J9683107M883101j8920202
8995g047129k2335143k167824J6596533J5942674M044023l304202m234272n211501
8987g716841n570899l18594O986289P557594K935399L671946R540353O165636
8979B3250883r978662j8856222n379731J2310480O545474j5475705k0322390j287349
8971b9193222J0598510j927658j3648457L06071K2319729K0829193p10835j3857063
$$ y = [-15355236, -31193360, -20369654, 20600, 6175469, -5215163, -12092380, 5853656, 38926007, 55140762, 36893631, 2055761, -15637776, -3374987, 17887896, 17514094, -10160183, -38760748, -39625418, -14248187, 10309378, 15624202, 8862747, 3155780, -2912303, -14611724, -22425516, -12693135, 6989972, 11873073, -7047129, -29382272, -31550096, -14953563, 989111, 5033134, 1728932, -2505340, -7716841, -13287740, -13606334, -6620045, 937549, 3872948, 7544894, 17085247, 23250883, 13272221, -5584001, -10963732, 1346748, 7892222, -7583483, -27905873, -29193222, -18594712, -20522370, -34170827, -33864756, -11545027, 9284166, 8573331, -5283732]
8963e283732r031085L38939N801564P544387J028334j1679878r523540J7033331
8955c771680L6269631J4487264k4642986k5821515J3969917L7091874J1006830
8948E8589335k6262957k8137596m604860N315616n298358j2024158k348299J2135015
8940b636262J7505121J0482206l064879j0021266j127419J2061263P602289j2538572
8932A8262481k0599115n126257J0664670O926474l317854k054760K436104l355664
8924C836079q477007L115985K0493662K0680663L117595j4920379k4853099k6349313
8916b3355814j4775528O821156J7235972L899603j3109418r367434O040668R367325
8908a7243470M203438J0767211K3698071J8067212n783763j9784808j2339961
$$ y = [-5283732, -14314817, -13975878, -8174314, -629927, 398407, -11281471, -20805011, -3771680, 32497951, 46985215, 22342229, -3479286, 10490631, 47582505, 58589335, 32326378, 4188782, -416078, 4899538, -398820, -12422978, -14771277, -2636262, 14868859, 25351065, 22286186, 12264920, 11137501, 23198764, 30801053, 18262481, -2336634, -7462891, 3201779, 10128253, 6810399, 4755639, 7191743, 3836079, -4640928, -1524943, 18968719, 39649382, 42766977, 27846598, 2993499, -23355814, -38131342, -31310186, -14074214, -10174611, -23284029, -32651463, -26610795, -17243470, -13040032, -2272821, 21425250, 39492462, 33708699, 13923891, 1583930]
8901A583930j816313j930484m942419n054438q719321j4273542r529144K338363
8893d2343368K453557r273709q467547J2533983K7234411J6484149L40079N003345
8885C964900J9784961J5100763r975266k6725962j8757573j07445J0044921J0669558
8877C998857J0706776J1335144N586564q994612k3487132k4800246r976930Q148640
8869b7482939J3268437L527174p235049o142083N859771J7604197J8677097P563051
8861B5639656n433406o044153N827658J1072319l451109k0647457j3597270J1444237
8853D810475J8596251l545252k0076372j862630K5701185J7995174j9291163l5382440
8845a3054772r374878K0031074J4496415r287003j2289819M934658R720717n506233
$$ y = [1583930, -232383, -2162867, -7105286, -12159724, -20879045, -35152587, -44681731, -42343368, -39889811, -49163520, -57631067, -45097084, -17862673, -1378524, -1038445, 3964900, 23749861, 38850624, 28875358, 2149396, -16608177, -16715622, -6670701, 3998857, 14705633, 26040777, 31627341, 22632729, -854403, -25654649, -35631579, -27482939, -14214502, -10687328, -17922377, -24064460, -18204689, -600492, 18076605, 25639656, 20206250, 14162097, 19989755, 31062074, 27610965, 6963508, -6633762, 4810475, 23406726, 19861474, -214898, -2077528, 23623657, 41618831, 22327668, -13054772, -22429650, -2398576, 12097839, 2810836, -9478983, -4544325, 5176392, -329841]
8837c29841j4053286m518581L14704j1833373j5479642R000440L3223194J8698362
8829A5021977j9845054l0557175l14042K7200927J7780448p290374j1034296M483434
8821d554155J1013471J475300o084896k518262K591241L488384O888912J4655550
8813B6955545J6417086N743936r156156j6881061j5873655j1182615n645248J65420
8805i456748L649545J545387m678657q289650m567447K368453M147552M38837
8797a4842728J4318N823090Q356467K206338j736877N263762J0150272k343481
8789A2891161j9151248j5178514L929746P901450p193596j0976599P836568J8944065
8781i96967J788696j7348066q897722J0929150J0481810l050250k65327J6748327
$$ y = [-329841, -14383127, -18901708, -18587004, -30420377, -45900019, -36899579, -3676385, 15021977, -4823077, -35380252, -35694294, -8493367, 9287081, 1996707, -9037589, -4554155, 6459316, 7934616, 1849720, -668542, 1922699, 5411083, 12299995, 26955545, 43372631, 49116567, 39960411, 23079350, 7205695, -3976920, -9622168, -9456748, -5807203, -4261816, -8940473, -17230123, -21797570, -19429117, -15281565, -14842728, -14828410, -9005320, -648853, 1557485, -179392, 5084370, 15234642, 12891161, -6260087, -21438601, -17508855, -9607405, -16801001, -27777600, -19941032, -996967, 791729, -16556337, -25454059, -14524909, -4043099, -7093349, -7358676, 9389651]
8773I389651J9684872L815540q164458q148566r674638j3241790k783729J8254320
8765I131202K2992538L029077j6489681j5347510n053725m236170j0023995q368880
8757b4367144L298288J5428454J7627080N724624j1981207j6835231j819805J3414219
8749D89278P375552j0237115j3449882j094029O164529N711148J5010917L1702252
8741D1672650K9321172K794623j7854153j4582016q347608j9303629l1327761
8734a7626722k1587104J22058R606372O679958P530715J2787264J0317818J154508
8726H984867j971157K257086K339823o127494j4664027j5062510p701785J301173
8718c0644024M712829J18468n602784m879276k380393o880757j1438783r54248
$$ y = [9389651, 29074523, 32890063, 24725605, 16577039, 6902401, -6339389, -9123118, 9131202, 32123740, 35152817, 18663136, 3315626, -1738099, -5974269, -15998264, -24367144, -21068856, -5640402, 11986678, 17711302, 5730095, -11105136, -12924941, 489278, 7864830, -2372285, -15822167, -16916196, -10751667, -5040519, 9970398, 41672650, 70993822, 73788445, 55934292, 41352276, 33004668, 13701039, -17626722, -39213826, -39091768, -29485396, -22805438, -15274723, -2487459, 7830359, 8984867, 7013710, 9270796, 11610619, 5483125, -9180902, -24243412, -31945197, -30644024, -25931195, -25812727, -31415511, -36294787, -38675180, -45555937, -56994720, -57948968]
8710e7948968J8840672K4071052J0606791K332472J0508169J4005484k272771
8703B0142901j8179734j2190103R91209l451721j7224450j4901903J895888J0649907
8695c2268006Q117895R775240J5264701R638444k433148Q03954J7395916J7803307
8687D4098303p851232k9572534k0509911M799611J4331082K228264j1499582j2527565
8679a6503564l968418O513671J3753388J1812982j146419j3924260j1166070M962772
8671i665918J3049342P2044j7734936j4458100Q228863K0647473P295649r360178
8663a925761l036142J4343009J0859105j2872553k2146437k863837J5823693P988113
8655F169190j0090745j0002524L906767P666819r51609l979894K971622O408481
$$ y = [-57948968, -39108296, -15037244, -4430453, -2097981, 8410188, 22415672, 20142901, 1963167, -10226936, -9235727, -12687448, -29911898, -44813801, -42917913, -32268006, -24150111, -14374871, 889830, 10528274, 8095126, 8899080, 26294996, 44098303, 36247071, 6674537, -13835374, -9035763, 5295319, 7523583, -3975999, -16503564, -20471982, -13958311, -204923, 11608059, 10461640, -3462620, -14628690, -9665918, 3383424, 3455468, -14279468, -28737568, -20508705, 138768, 7434417, -1925761, -4961903, 9381106, 20240211, 7367658, -14778779, -17642616, -1818923, 6169190, -3921555, -13924079, -10017312, -2350493, -3302102, -7281996, -4310374, 2098107]
8647B098107O62119n838924p975679p694822l577443M944997Q045383r64230r160922
8638a9461414j754155J1154857R367505k743291m149869M328595J030580j5361718
8630a7588910j8422499L144323K4486691K0394447j235632j6141718j4659966
8623b0023264k377161J3351051K4125178K1020345N585667r610615j6645862j6838836
8615a413497r599127N611416J6317222Q895621n214427k435131J0899187L535692
8607B6596956k4824713l2676013j318702L0055853K3908920J635985K156206J6007521
8599D1542013R578944r254379o215484J1635050L945520k7140273l0722547Q996182
8591B365026L9479026J7607578k6396366l7428178j1686928J3159280J7314788
$$ y = [2098107, 2760226, -3078698, -11054377, -18749199, -22326642, -17381645, -9336262, -10300492, -19461414, -21215569, -10060712, -693207, -3436498, -7586367, -3257772, -2227192, -17588910, -36011409, -32867086, -8380395, 12014052, 10778420, -5363298, -20023264, -22400425, -9049374, 15075804, 36096149, 41681816, 32071201, 15425339, -1413497, -11012624, -5401208, 10916014, 19811635, 14597208, 12162077, 23061264, 26596956, 1772243, -30903770, -32222472, -2166619, 21742301, 23378286, 25534492, 41542013, 51120957, 41866578, 35651094, 47286144, 51231664, 24091391, -6631156, 2365026, 41844052, 59451630, 33055264, -4372914, -16059842, -2900562, 14414226]
8584A4414226J0116314j66602j1330197j2524032L352521J9035524J2236747j0148669
8576B4985832k2203842j6930856q608035l058561O963087J8455570J6974933J375701
8568A7953829j2212830j3288782n148316Q013928K1362385K0361989l011483k6234048
8560G796672j7429833J6202929L1768641J0608972j6268302j6835655k363289
8553A3480135j788740j5729637k2006538j2280059J214914P750317P833396N822116
8545a5704096O027633J0532341J2732368K870707j3496907j7219287l839272P339927
8537a0756586K634818p154745r426595r208126j0400581j697543J8456154K6976328
8529e76876J0839010o589766j858399R376332K202174j1431886n628604J0119442
$$ y = [14414226, 24530540, 24363938, 13033741, 509709, 3862230, 22897754, 35134501, 24985832, 2781990, -14148866, -22756901, -25815462, -18852375, -396805, 16578128, 17953829, 5740999, -7547783, -12696099, -4682171, 16680214, 37042203, 34030720, 7796672, -9633161, 6569768, 38338409, 48947381, 32679079, 15843424, 13480135, 11691395, -4038242, -26044780, -38324839, -37109925, -29359608, -21526212, -15704096, -9676463, 855878, 13588246, 16458953, 2962046, -14257241, -18096513, -10756586, -8121768, -15276513, -24703108, -33911234, -44311815, -46009358, -27553204, -576876, 10262134, 3672368, 1813969, 11190301, 13392475, 1960589, -3668015, 6451427]
8521F451427R118366m95260Q388256K4287221J0574754k5642156l6092579r775662
8513a3185633R289764k132973j0879908P587828K3436310O805438j8776228j7870891
8505a5726293k49671M989254N43480M088809P758094k608896j0823807L501449
8497h527581K1508572J2090461j3314163j8171581j357278O208615j783035j607537
8489d953527R990423P555356j3577821k3281019n621209J5459254J5490312K631374
8481C693143n465477r836604j6332150j6381421j454728J8634087K7477022K0690299
8473B1024171L559879j6501988k7854943k0328564j002200J0264086P487618M804154
8465a8547787J0150173J1845354J091158j0936515j1579562o143147m431627k024820
$$ y = [6451427, 15569793, 15074533, 23462789, 47750010, 58324764, 32682608, -3409971, -13185633, -3895869, -6028842, -16908750, -9320922, 14115388, 20920826, 2144598, -15726293, -15975964, -10986710, -10443230, -6354421, 1403673, -1205223, -12029030, -8527581, 12980991, 25071452, 11757289, -6414292, -7771570, -1562955, -3345990, -4953527, 5036896, 12592252, -985569, -24266588, -29887797, -14428543, 1061769, 3693143, -1772334, -11608938, -27941088, -44322509, -45777237, -27143150, 333872, 21024171, 24584050, 8082062, -19772881, -40101445, -41103645, -30839559, -23351941, -18547787, -8397614, 3447740, 4538898, -6397617, -17977179, -24120326, -28551953, -30576773]
8457c0576773Q624120J9168830J5061438j181907j1771625o910108N418269J2412654
8449A0244898J0211961L817267j052645m112488r016684j5408898j6033644o945330
8441b8295563L466040M672856N6690Q22870N826736K786987q820224j2894982
8433c2378590o64796J5897353K2773737K1542467J8010299P423091j3797632l1163986
8425G641943k4947311J794156K2480042J7130200n768897k0870187j4052426M775750
8417a1816730J5393146J0385978Q76598j124802J342515j185742o790115n815625
8409A265223J81771j311627j2064378j6963509o091545J0181650J6420752J1216999
8401B835336K446972n734738j1192087r078146l36811L411611m336227j1765303
$$ y = [-30576773, -21952653, -2783823, 12277615, 11095708, -675917, -7586025, -2167756, 10244898, 20456859, 24274126, 23221481, 19108993, 10092309, -5316589, -21350233, -28295563, -24829523, -20156667, -20099977, -19277107, -13450371, -10663384, -19483608, -32378590, -33043386, -17146033, 5627704, 27170171, 45180470, 52603561, 38805929, 7641943, -17305368, -15511212, 6968830, 24099030, 18330133, -2540054, -16592480, -11816730, 3576416, 13962394, 14838992, 13714190, 15056705, 13870963, 7080848, 1265223, 1446994, 135367, -11929011, -28892520, -34984065, -24802415, -8381663, 2835336, 5282308, -452430, -11644517, -20722663, -21059474, -17647863, -21984090, -33749393]
8393c3749393m912001R236567J1754736P50281o148949L14458P915888M231522
8385a0606891l879140l214694L824092M498164j773809j720469Q903777J4818442
8377A0849472K377223j7911030k2709056o678090J1511855J5801196J1434442
8370D676012R819299P901611l257157j7436323j8765519o754099K304920K035358
8362a9475898N464363J9038461K5199710P663705j8196032k2111529k050625J2314554
8354G846709K911401j2097787q763440O003058P658363o830331j6250241r349207
8346b8871475J362700M450052N893370J0150937O005092j1260572k1025459m189613
8338c7484968K2600793K6424964O144953p802680j426131N749369j617291j0232668
$$ y = [-33749393, -38661394, -29424827, -17670091, -16919810, -23068759, -22754301, -14838413, -10606891, -14486031, -17700725, -13876633, -9378469, -11152278, -12872747, -3968970, 10849472, 13226695, -4684335, -27393391, -34071481, -22559626, -6758430, 4676012, 14495311, 22396922, 19139765, 1703442, -17062077, -23816176, -21511256, -19475898, -14011535, 5026926, 30226636, 37890341, 19694309, -2417220, -4467845, 7846709, 10758110, -1339677, -10103117, -4100059, 3558304, -3272027, -19522268, -28871475, -27508775, -23058723, -17165353, -7014416, -1009324, -12269896, -33295355, -37484968, -14884175, 11540789, 17685742, 9883062, 8456931, 14206300, 12589009, 2356341]
8330B356341n328601M300565O239951O313519J0707992P853481q878072j9885953
8322C679223p176859J2592115J1538920n712672j2029040k019406N422225K881718
8314I176224L13004k053484j3612883k5733550j7779428N234942J4480793L693816
8306b6280566o01566J3614032K1453548M306447j6357914j2693423P041994J5725741
8298F208293P907479k218797p875798j0076762l685625J2405272K0832849N408820
8290B8905731k1050890l0295868j5604599M459744J4940712J7084035J3999569
8283A2438434L730247j0199702j6243332p962366P798156J6980897R056617j2921751
8275B677200k8580537j6958804J4798266L2180139J5360001j2650196j7320937
$$ y = [2356341, -2972260, 1328305, 7568256, 13881775, 24589767, 32443248, 23565176, 3679223, -3497636, 9094479, 20633399, 14920727, 2891687, 872281, 6294506, 9176224, 9489228, 7435744, -6177139, -31910689, -49690117, -44455175, -29974382, -26280566, -26882132, -13268100, 8185448, 12491895, -3866019, -16559442, -9517448, 6208293, 14115772, 11896975, 4021177, -6055585, -9741210, 2664062, 23496911, 28905731, 7854841, -22441027, -38045626, -33585882, -18645170, -1561135, 12438434, 16168681, 5968979, -10274353, -18236719, -10438563, 6542334, 15598951, 2677200, -25903337, -42862141, -28063875, 4116264, 19476265, 6826069, -10494868]
8268a0494868k33747P798526n116297j7203408r016169R428504J7042789J0737321
8260B942651M285401O709986J1716702P143398q545798k0445940j2571942R228493
8252D62951J9641702O244795j2353840j3276541k334745j290663j0726994j0080465
8244b3713800O138569J7089294P551143r054077j0817075K838207J2563765L546068
8236F142094j7742228k7808787q886466K5796558L7016964M988604l7259802l9040559
8228e6793622J451884L4065918K5308539j381660q789750J261850M107827k155828
8220b924842n30452P758894M295760j0906508j6027741l578290P362282K991068
8212a1559829n049742k640453M409049N467362N524011J2665984J7067409K915722
$$ y = [-10494868, -10728615, -2930089, -8046386, -25249794, -34265963, -24837459, -7794670, 2942651, 7228052, 13938038, 25654740, 32798138, 24252340, 3806400, -8765542, 462951, 20104653, 26349448, 13995608, 719067, -1615678, -2906341, -13633335, -23713800, -17575231, -485937, 7065206, -1988871, -12805946, -9967739, 2596026, 6142094, -11600134, -39408921, -48295387, -22498829, 14518135, 19506739, -17753063, -56793622, -55341738, -21275820, 4032719, 2651059, -6138691, -4876841, -769014, -2924842, -3455294, 4303600, 8599360, -2307148, -18334889, -21913179, -14550897, -11559829, -16609571, -19250024, -14840975, -9373613, -3849602, 8816382, 25883791, 28799513]
8204B8799513k3011140l3717784j5566018J4051577K7607810J7225876j345121
8197A4044713q463876Q20114J4791887J7542998M384368j3093212j8272679p197259
8189D557054O279410N207743j0896237k4155959j8090604L011453J9126416J8633582
8181C672858J0252988O955617O194541l052011j7539541j9479066l092328J2678605
8173c408337Q522673p938570j3393100k784872M598209m263969j4906671n649513
8165c9224150J9499690L2840383J8400412p303097j7144869p496173J753689j521058
8157a95173o223705L30449J0176614P894017l568619p868979j584121L341594
8149B302077K260022K582127M266166k140403j3227381j3040799l610841o836594
$$ y = [28799513, 5788373, -27929411, -43495429, -29443852, -1836042, 15389834, 14044713, 5580837, 6400951, 21192838, 38735836, 43120204, 30026992, 11754313, 4557054, 10836464, 16044207, 5147970, -19007989, -37098593, -34087140, -14960724, 3672858, 13925846, 20881463, 27076004, 24023993, 6484452, -12994614, -16086942, -3408337, 5114336, -2824234, -16217334, -19002206, -14403997, -18667966, -33574637, -39224150, -19724460, 13115923, 31516335, 24213238, 7068369, -427804, 1325885, -195173, -6418878, -6088429, 4088185, 11982202, 8413583, 544604, -1039517, 2302077, 4562099, 7144226, 11410392, 9269989, -3957392, -16998191, -20609032, -27445626]
8141b7445626k2468482j7226629K0068644M5996990K2084939k0777057k4497963
8134b4265184Q554156K4622579O687781o910533L372194P676915j0589448j9818528
8126a0670068Q80268J8836984L201095k0111761j3843779O199338K204559j7674406
8118c0977770j5870883P602299J7897201O199190k337496J706277J697644m719079
8110a8802617J90124J5174582J7014181L158653k585327N486718N260080q015709
8102A6880685q153842J3938684K7601517R959065j7212794k2704455r893618o49016
8094I766226M36895L78983k968611j0845132r971562O948198K2142815J7267382
8086C3155194K937996J04629M651010k991200k0661717k4213854m300926J9253238
$$ y = [-27445626, -49914108, -67140737, -47072093, -1075103, 21009836, 232779, -24265184, -15711028, 8911551, 15599332, 8688799, 12060993, 19737908, 9148460, -10670068, -9789800, 9047184, 12248279, -7863482, -21707261, -15507923, -13303364, -30977770, -46848653, -39246354, -21349153, -15149963, -17487459, -15781182, -14083538, -18802617, -18612493, -3437911, 13576270, 16734923, 14149596, 19636314, 24896394, 16880685, 8726843, 22665527, 50267044, 60226109, 43013315, 20308860, 10415242, 9766226, 10203121, 10582104, 7613493, -3231639, -13203201, -6255003, 15887812, 33155194, 36093190, 36197819, 40848829, 37857629, 17195912, -7017942, -11318868, 7934370]
8078G934370K4176812J0416596o869804j6526135j7324933j2314830m418462K944522
8070a1981864N003675j3106m978450O09332J4471052K0316838J1816876N479399
8062D0723752J3427627J6631408q282189m3389662m4798094o071955K8453397
8055c305716K4449327q32863j3971192j1929138j0590193j1432457n830524L712474
8047b9730282R447330J2461484J2927318K066052j7932071k4150543m867696J6303083
8039b3475325J3053795k909697k300242J3584956J7591883L091645p751916k982371
8031G902728K732064k372041p607746j513340O998360L375834r193330j4524877
8023a4202348n793640O764642R366166P33585o428932J96780J7187572K7101399
$$ y = [7934370, 32111182, 42527778, 35657974, 19131839, 1806906, -10507924, -14926386, -11981864, -6978189, -6991295, -11969745, -11360413, 3110639, 23427477, 35244353, 40723752, 54151379, 70782787, 62500598, 19110936, -25687158, -31759113, -3305716, 21143611, 20310748, 6339556, -5589582, -16179775, -27612232, -33442756, -29730282, -20282952, -7821468, 5105850, 7171902, -10760169, -34910712, -39778408, -23475325, -10421530, -13331227, -15631469, -2046513, 15545370, 18637015, 10885099, 7902728, 10634792, 8262751, 655005, -858335, 6140025, 9515859, 322529, -14202348, -19995988, -13231346, -3865180, -3131595, -9560527, -9363747, 7823825, 34925224]
8015C4925224J6644488r437177l2628256l5890172j7350258N821708J1537346
8008b6377097j679452j0540712K13277J2142689Q14548k0999837j8420854J0235163
8000e4612275K9219256K1433433J0235187J2544191J0506941p783850j8085173
7993C457710k312367J2411214l921418k9072244k0266746J5827816L1758301J1846331
7985A9728597q992192l090546J2615596R697759j0225618k3177794j5711871K236593
7977a6919476J0557838Q65165j2546538q822418J0157938K0295577J0698784j455997
7969A2830873k233516k393875j0095604r467518P960774J6935460l477788k8788269
7961a8729463k4344371j913825K628554p204139K590920L0500209L5572081N267530
$$ y = [34925224, 51569712, 42132535, 9504279, -26385893, -43736151, -37914443, -26377097, -28056549, -38597261, -38383984, -26241295, -25426747, -46426584, -64847438, -54612275, -25393019, -3959586, 6275601, 18819792, 29326733, 21542883, 3457710, 1145343, 13556557, 9635139, -19437105, -39703851, -23876035, 7882266, 19728597, 10736405, 7645859, 20261455, 29959214, 19733596, -3444198, -19156069, -16919476, -6361638, -5496473, -18043011, -26865429, -16707491, 3588086, 14286870, 12830873, 10597357, 8203482, -1892122, -11359640, -3398866, 13536594, 10058806, -18729463, -43073834, -44987659, -42359105, -49563244, -46972324, -16472115, 19099966, 24367496]
7953B4367496k1927515j6303813K813076O192649r80022K378895J5351419J9025847
7945C0918032M855220j6518332k6969371j6260293N476913J3192723k521019j8301006
7937b6127133r776953J0421955J2105133m449976j1217142J797751J6267685J9252567
7929H273887J4979696M393609j3822266k3234872o481580J7962235J3990161j5346616
7921G14254k9875596j5443146j407505o068376r857840J687344J1586412P889490
7913d0774963O486367J5767333J6384031n18708j1284812n75440J1017597N962802
7905B464207J059555J1039564J5826815k325398k0484007j0958248J0803398J2716136
7897B0142022j181098l531404P362442R855567p64267r450980j1181289j2657474
$$ y = [24367496, 2439981, -13863832, -11050756, -4858107, -5838129, -3459234, 11892185, 30918032, 35773252, 19254920, -7714451, -23974744, -18497831, -5305108, -7826127, -26127133, -35904086, -25482131, -13376998, -17826974, -29044116, -27246365, -10978680, 8273887, 23253583, 27647192, 13824926, -9409946, -15891526, 2070709, 16060870, 714254, -29161342, -44604488, -46011993, -52080369, -61938209, -60250865, -48664453, -40774963, -34288596, -18521263, -2137232, -2655940, -13940752, -14516192, -3498595, 2464207, 3523762, 14563326, 30390141, 28064743, 7580736, -3377512, 7425886, 20142022, 18960924, 15429520, 22791962, 32647529, 31883262, 22432282, 11250993, -1406481]
7889a406481j1308079q82065Q878840M666838n205423l306528O358041N469944
7881C265087p015662j5022788j2581123p825074l268994O186941J7224598J8914737
7873a22278R168716l259374j0416084q751064J691303J2100629R282901n186648
7865D508101j3181764o601404J257757J191701L159365J1464746R721221q924944
7857B594779k1070010q072030J0618535Q075004o451081o584280N925595R782122
7849e181366M366005N402953J0269088L749337q203827o286571M675575J759361
7841A0550555j3889253j6531407K15291J3076580Q473267O43934K277644N374640
7833A0191251J350196l791819l853872j983736M67240N536541N966356p845779
$$ y = [-1406481, -12714560, -13596625, -4717785, -50947, -5256370, -8562898, -2204857, 3265087, -3750575, -18773363, -31354486, -39179560, -42448554, -36261613, -19037015, -122278, 9046438, 5787064, -4629020, -13380084, -11688781, 411848, 9694749, 4508101, -8673663, -15275067, -14017310, -12825609, -9666244, 1798502, 11519723, 2594779, -18475231, -26547261, -15928726, -7853722, -14304803, -20889083, -14963488, -5181366, -815361, 4587592, 14856680, 18606017, 10402190, 4115619, 8791194, 10550555, -3338698, -19870105, -19654814, -6578234, 1895033, 2538967, 4816611, 10191251, 11541447, 7749628, 3895756, 1912020, 2379260, 7915801, 13882157, 6036378]
7825F036378k5328532k3506777k006158J3666329J0453549M667782J0451881J5517950
7817I952402M264453j3635550j6617943k605138R686730O638030n070835r260790
7809a6648641k68620J0558135J0125794L031656N289794J5924428J2305604j3638391
7801B6679759l3283311j8240144J4524827K3943950M120514j0632983q77072J1652362
7793A7887902L322997j4786525j7216635j520826J3026789J3057940K842170n762741
7785A0851071n665069J27230K380818j894474l958660K429070P773721N97312
7777A2641019j1675539j2304442j469788N930562N861084P271020R252361j88398
7769A5317879j8470353k4783801j0468522O939515R828907L236725R41109L985853
$$ y = [6036378, -19292154, -42798931, -44805089, -31138760, -20685211, -16017429, -5565548, 9952402, 14216855, 581305, -16036638, -18641776, -8955046, -2317016, -7387851, -16648641, -16917261, -6359126, 3766668, 6798324, 12088118, 28012546, 40318150, 26679759, -6603552, -24843696, -10318869, 13625081, 17745595, 7112612, 6235540, 17887902, 21210899, 6424374, -10792261, -12313087, 713702, 13771642, 16613812, 10851071, 5186002, 5313232, 7694050, 5799576, 1840916, 4269986, 12043707, 12641019, 965480, -11338962, -12808750, -6878188, -1017104, 6253916, 15506277, 15317879, -3152474, -27936275, -38404797, -31465282, -21636375, -18399650, -17458541, -13472688]
7761a3472688M479433k70940o680009r648340l923845R493996J6859401N368695
7753B205703j4562802j7539319J398598J7484110J0705120p522073j3923091n218062
7745b6971816L905743M847944K317702J679421J179646k498008p078544n423054
7737b8040966N589620J6706755J3349495l544168j2854796r14592J5358725J0490941
7729A6141014j0833646j9622248o012533Q000419M591029n128159l701465N192172
7721a1373417O829912q37202q177922r407890n032113M190276J5620810K2321426
7713A4133880J9807411J1079794J059251p991393j2909726r535421J07727P587674
7705B3339197P892128L151171l943051j2203326j6961693j2383326p24438Q176685
$$ y = [-13472688, -8993255, -9264195, -15944204, -25592544, -29516389, -20022393, -3162992, 2205703, -12357099, -29896418, -28497820, -11013710, -308590, -7830663, -21753754, -26971816, -23066073, -18218129, -15900427, -14221006, -13041360, -15539368, -22617912, -28040966, -22451346, -5744591, 7604904, 4060736, -8794060, -9708652, 5650073, 16141014, 5307368, -14314880, -20327413, -12326994, -7735965, -12864124, -16565589, -11373417, -4543505, -5380707, -13558629, -22966519, -27998632, -23808356, -8187546, 14133880, 33941291, 45021085, 46080336, 38088943, 25179217, 15643796, 15751523, 23339197, 31231325, 34382496, 30439445, 18236119, 1274426, -11108900, -11833338, -3656653]
7697c656653P618332j095423j1666013j4869169m291256J2004012J5453234L465218
7689B962282k043623J1002231J9302969o92823k7579460k1508491J1704665K5811477
7681A8959227N851766j0680853K404474J9593131J1796877m089376J241150J4894000
7673E9970396J898804l4326403n1642171k8412984Q764363K3090776J1036860
7666i620359k204317J634393J3475605J1731551o947064k0255676j0721354O338521
7658a6568700L712252j4595956j7739246K657246J8335102J0109559l303807o34994
7650a8028544O606656j83533r651045l46324J8782266K0743228M355127n829423
7642A6448408J13156O539683K446733m067169o199850j0048362j7734932j7626367
$$ y = [-3656653, 3961679, 2866256, -8799757, -23668926, -27960182, -15956170, -502936, 2962282, 918659, 11920890, 31223859, 30531036, 2951576, -18556915, -6852250, 18959227, 24810993, 14130140, 16534614, 36127745, 47924622, 43835246, 45076396, 59970396, 61869200, 27542797, -24099374, -52512358, -43747995, -20657219, -9620359, -11824676, -10190283, 3285322, 15016873, 8069809, -12185867, -22907221, -16568700, -12856448, -27452404, -45191650, -42534404, -24199302, -14089743, -17393550, -18028544, -11421888, -11605421, -21256466, -21602790, -2820524, 17922704, 22277831, 16448408, 16561564, 23101247, 25547980, 21480811, 15280961, 5232599, -12502333, -30128700]
7634c0128700k196185J6526395J9967171N778763r863166j1452613j913840J369825
7626a1912350r957621k0565452j0039388J5857175K8178686J3195961r065479
7619d308468j3844541l134596M949044M354960K515734L370864M792859O365593
7611E061449O770622N16470j0865203j2982511K775445K2464505K4982910Q085742
7603D6809429j2690540k4299771k4508691j7519112j1485523j2337186j2377925
7596f8409319K507911K6083135L0490302N848363j8660118j3732778Q054203J4521363
7588a3296938K954419l198082L090595N825363o33061k686694N164445J1074907
7580H294954Q609665N027396K438261o111636j6262314j1298000R750493K3531426
$$ y = [-30128700, -32324885, -15798490, 4168681, 9947444, 84278, -11368335, -13282175, -11912350, -21869971, -42435423, -52474811, -36617636, -8438950, 4757011, -4308468, -18153009, -21287605, -16338561, -11983601, -9467867, -6097003, -1304144, 5061449, 11832071, 12348541, 1483338, -11499173, -8723728, 13740777, 38723687, 46809429, 34118889, 9819118, -14689573, -32208685, -43694208, -56031394, -68409319, -65901408, -39818273, -9327971, -3479608, -22139726, -35872504, -27818301, -13296938, -10342519, -13540601, -10450006, -4624643, -5257704, -7944398, -2779953, 8294954, 16904619, 21932015, 24370276, 18258640, 1996326, -9301674, 448819, 23980245]
7572B3980245J2862881j0404161k3032806j7131858n63106J6214119K4306831
7565B6232145J8115917K175360j0599052j3079133r984495p402835m716042J47668
7557H89533N314300P520437M294033n741745j8063727k0999105q635400Q186209
7549b7235465J3948947P650728r17897p929237j4158405j3139313N28015J4209018
7541b7043609R484150q113415j2784747M372276K2512735K2230672J0492130M390506
7533B5540698N843296M708598l181232j1840646j3584633o183609L933375N291707
7525A0527554n239020j5512614j3638875m733265O54828O502463K0209985K9005085
7517B7776141J4212725j2843260j9681018j655677R570069l673405j8734152j3057978
$$ y = [23980245, 36843126, 26438965, 3406159, -13725699, -14288805, 1925314, 26232145, 44348062, 46523422, 35924370, 22845237, 12860742, 5457907, 741865, 889533, 6203833, 13724270, 18018303, 12276558, -5787169, -26786274, -35421674, -27235465, -13286518, -5635790, -6553687, -14482924, -28641329, -41780642, -41252627, -27043609, -17559459, -25672874, -38457621, -34085345, -11572610, 10658062, 21150192, 25540698, 31383994, 36092592, 32911360, 21070714, 7486081, 1302472, 5235847, 10527554, 5288534, -10224080, -23862955, -28596220, -27941392, -21438929, -1228944, 27776141, 41988866, 29145606, 9464588, 7808911, 17378980, 13705575, -5028577, -18086555]
7509a8086555J29802j19756n503574K184932J5645938J6474766R284682J0199446
$$ y = [-18086555, -17956753, -18076509, -23580083, -21395151, -5749213, 10725553, 20010235, 30209681]
$$ [...]
##END NTUPLES=NMR SPECTRUM
##END=
