##TITLE=31Pdec_SR88_rm6
 , 24 sc
 21.09.2021
##JCAMPDX= 6.0         $$ Bruker NMR JCAMP-DX V2.0
##DATA TYPE= NMR SPECTRUM
##DATA CLASS= NTUPLES
##ORIGIN= UXNMR, Bruker Analytische Messtechnik GmbH
##OWNER= root
$$ XWIN-NMR		Version 3.5
$$ Tue Sep 21 10:15:40 2021 Russian Standard Time (UT+4h)  she@DPX200
##.OBSERVE FREQUENCY= 81.013821
##.OBSERVE NUCLEUS= ^31P
##.ACQUISITION MODE= SIMULTANEOUS
##.ACQUISITION SCHEME= undefined
##.AVERAGES= 24
##.DIGITISER RES= 16
##SPECTROMETER/DATA SYSTEM= spect
##.PULSE SEQUENCE= zgpg30
##.SOLVENT NAME= CDCl3
##.SHIFT REFERENCE= (INTERNAL, CDCl3, 0, 248.564)
##AUDIT TRAIL= $$ (NUMBER, WHEN, WHO, WHERE, WHAT)
$$ ##TITLE= Audit trail, XWIN-NMR		Version 3.5
$$ ##JCAMPDX= 5.01
$$ ##ORIGIN= Bruker BioSpin GmbH
$$ ##OWNER= she
$$ F:/spectra/data/she/nmr/P31/1/pdata/1/auditp.txt
$$ ##AUDIT TRAIL=  $$ (NUMBER, WHEN, WHO, WHERE, WHAT)
(   1,<2021-09-21 10:14:33.96 +0400>,<she>,<DPX200>,
      <created by zg, POWCHK disabled, PULCHK disabled
       configuration hash MD5:
       00 E9 B6 7A A2 85 ED C7 34 08 36 98 17 FE 4E 26
       data hash MD5: 32K
       84 A3 AD E2 5B 37 EA 8D 44 4F 15 9D CC 3C 8B 40>)
(   2,<2021-09-21 10:14:36.45 +0400>,<she>,<DPX200>,
      <Start of raw data processing
       efp BC_mod = 2 LB = 1 FT_mod = 6 PKNL = 1 PHC0 = -8022.438 PHC1 = -151.3302 SI = 64K 
       data hash MD5: 64K
       40 53 22 20 4D DE 5F 4B 65 B8 01 8E 13 3C BE 60>)
(   3,<2021-09-21 10:14:59.87 +0400>,<she>,<DPX200>,
      <pk PHC0 = -183.3244 PHC1 = 479.5999 
       data hash MD5: 64K
       6B D2 7B 7D 38 64 AA C7 B2 D5 09 36 5D D8 AC 76>)
(   4,<2021-09-21 10:15:16.84 +0400>,<she>,<DPX200>,
      <abs ABSG = 5 
       data hash MD5: 64K
       36 6E 7B 74 CD BE 9F 5A A8 CA FE 07 93 D1 D5 17>)
$$ ##END=
$$ 
$$ hash MD5
$$ 25 EC BD 85 86 ED FE 79 B9 97 D0 F0 AC 67 10 4F
##$RELAX= 
##$RELAX= 
##$RELAX= 
##$RELAX= 
##$RELAX= 
##$RELAX= 
##$RELAX= 
##$RELAX= 
$$ Bruker specific parameters
$$ --------------------------
##$DU= <F:/spectra>
##$EXPNO= 1
##$NAME= <P31>
##$PROCNO= 1
##$TYPE= <nmr>
##$USER= <she>
##$AMP= (0..31)
100 100 100 100 100 100 100 100 100 100 100 100 100 100 100 100 100 100 
100 100 100 100 100 100 100 100 100 100 100 100 100 100 
##$AQSEQ= 0
##$AQ_mod= 1
##$AUNM= <au_zg>
##$AUTOPOS= <>
##$BF1= 81.014009
##$BF2= 200.13
##$BF3= 200.13
##$BF4= 200.13
##$BF5= 200.13
##$BF6= 200.13
##$BF7= 200.13
##$BF8= 200.13
##$BYTORDA= 1
##$CFDGTYP= 0
##$CFRGTYP= 5
##$CHEMSTR= <none>
##$CNST= (0..31)
1 1 145 1 1 1 1 1 1 1 1 1 1 1 1 1 1 1 1 1 1 1 1 1 1 1 1 1 1 1 1 1 
##$CPDPRG= <waltz16>
##$CPDPRG1= <>
##$CPDPRG2= <waltz16>
##$CPDPRG3= <>
##$CPDPRG4= <mlev>
##$CPDPRG5= <mlev>
##$CPDPRG6= <mlev>
##$CPDPRG7= <mlev>
##$CPDPRG8= <mlev>
##$CPDPRGB= <>
##$CPDPRGT= <>
##$D= (0..31)
0 1 0 0 0 0 0 0 0 0 0 0.03 2e-05 3e-06 0 0 0 0 0 0 0 0 0 0 0 0 0 0 0 0 
0 0 
##$DATE= 1632204873
##$DBL= (0..7)
120 120 120 11 120 120 24 19 
##$DBP= (0..7)
150 150 150 150 150 150 150 150 
##$DBP07= 0
##$DBPNAM0= <>
##$DBPNAM1= <>
##$DBPNAM2= <>
$$ [...]
##$SUBNAM3= <"">
##$SUBNAM4= <"">
##$SUBNAM5= <"">
##$SUBNAM6= <"">
##$SUBNAM7= <"">
##$SUBNAM8= <"">
##$SUBNAM9= <"">
##$SW= 501.771253377433
##$SWIBOX= (0..15)
0 1 3 0 0 0 0 0 0 0 0 0 0 0 0 0 
##$SW_h= 40650.406504065
##$TD= 32768
##$TD0= 1
##$TE= 0
##$TE2= 300
##$TE3= 300
##$TEG= 300
##$TL= (0..7)
0 120 53 12 22 120 120 120 
##$TP= (0..7)
150 150 150 150 150 150 150 150 
##$TP07= 0
##$TPNAME0= <>
##$TPNAME1= <>
##$TPNAME2= <>
##$TPNAME3= <>
##$TPNAME4= <>
##$TPNAME5= <>
##$TPNAME6= <>
##$TPNAME7= <>
##$TPOAL= (0..7)
0.5 0.5 0.5 0.5 0.5 0.5 0.5 0.5 
##$TPOFFS= (0..7)
0 0 0 0 0 0 0 0 
##$TUNHIN= 0
##$TUNHOUT= 0
##$TUNXOUT= 0
##$USERA1= <user>
##$USERA2= <user>
##$USERA3= <user>
##$USERA4= <user>
##$USERA5= <user>
##$V9= 5
##$VALIST= <valist>
##$VCLIST= <CCCCCCCCCCCCCCC>
##$VD= 0
##$VDLIST= <DDDDDDDDDDDDDDD>
##$VPLIST= <PPPPPPPPPPPPPPP>
##$VTLIST= <TTTTTTTTTTTTTTT>
##$WBST= 1024
##$WBSW= 4
##$XGAIN= (0..3)
0 0 0 0 
##$XL= 0
##$YL= 0
##$YMAX_a= 6515
##$YMIN_a= -11577
##$ZGOPTNS= <>
##$ZL1= 120
##$ZL2= 120
##$ZL3= 120
##$ZL4= 120
##$ABSF1= 248.5645
##$ABSF2= -253.2056
##$ABSG= 5
##$ABSL= 3
##$ALPHA= 0
##$AQORDER= 0
##$ASSFAC= 0
##$ASSFACI= 0
##$ASSFACX= 0
##$ASSWID= 0
##$AUNMP= <proc_1d>
##$AZFE= 0.1
##$AZFW= 0.5
##$BCFW= 0
##$BC_mod= 2
##$BYTORDP= 0
##$COROFFS= 0
##$CY= -3
##$DATMOD= 1
##$DC= 0
##$DFILT= <>
##$DTYPP= 0
##$F1P= 0
##$F2P= 0
##$FCOR= 1
##$FTSIZE= 65536
##$FT_mod= 6
##$GAMMA= 0
##$GB= 0
##$INTBC= 1
##$INTSCL= 5.30512e-09
##$ISEN= 30
##$LB= 1
##$LEV0= 0
##$LPBIN= 0
##$MAXI= 10000
##$MC2= 0
##$MEAN= 0
##$ME_mod= 0
##$MI= 50
##$NCOEF= 0
##$NC_proc= -8
##$NLEV= 6
##$NOISF1= 182.463
##$NOISF2= 159.3651
##$NSP= 0
##$NTH_PI= 0
##$NZP= 0
##$OFFSET= 248.5645
##$PC= 4
##$PHC0= -8205.763
##$PHC1= 328.2697
##$PH_mod= 1
##$PKNL= yes
##$PPARMOD= 0
##$PSCAL= 0
##$PSIGN= 0
##$REVERSE= no
##$SF= 81.014009
##$SI= 65536
##$SIGF1= 159.3651
##$SIGF2= -187.1042
##$SINO= 113.3802
##$SIOLD= 16384
##$SREGLST= <1H.CDCl3>
##$SSB= 0
##$STSI= 65536
##$STSR= 0
##$SW_p= 40650.406504065
##$SYMM= 0
##$S_DEV= 0
##$TDeff= 32768
##$TDoff= 0
##$TI= <>
##$TILT= no
##$TM1= 0
##$TM2= 0
##$TOPLEV= 0
##$USERP1= <user>
##$USERP2= <user>
##$USERP3= <user>
##$USERP4= <user>
##$USERP5= <user>
##$WDW= 1
##$XDIM= 65536
##$YMAX_p= 299067865
##$YMIN_p= -302595022
$$ End of Bruker specific parameters
$$ ---------------------------------
##NTUPLES= NMR SPECTRUM
##VAR_NAME=  FREQUENCY,     SPECTRUM/REAL,   SPECTRUM/IMAG
##SYMBOL=    X,             R,               I
##VAR_TYPE=  INDEPENDENT,   DEPENDENT,       DEPENDENT
##VAR_FORM=  AFFN,          ASDF,            ASDF
##VAR_DIM=   65536,         65536,           65536
##UNITS=     HZ,            ARBITRARY UNITS, ARBITRARY UNITS
##FACTOR=    0.620285442955139, 1,           1
##FIRST=     20137.2065510759, 0,            0
##LAST=      -20513.1999529892, 0,           0
##MIN=       -20513.1999529892, -302595022,  0
##MAX=       20137.2065510759, 299067865,    0
$$ Real data points
##PAGE= N=1
##DATA TABLE= (X++(R..R)), XYDATA
$$ [...]
43447h87464j158112j981266O25830M563629N162950K251184k01065o26342j253139
$$ -887464 -2045576 -4026842 -3401012 1162617 6325567 8576751 8375686 7749344 6496205
43438F496205k982231l635156k242664q01136l17165R59757L461376M146080J045976
$$ 6496205 3513974 -121182 -2363846 -3164982 -3482147 -2522390 938986 5085066 6131042
43429F131042k915703l576721j044119J141309R71917l10026o73005L47393J390496
$$ 6131042 3215339 -361382 -1405501 -264192 707725 397699 -275306 72087 1462583
43420A462583O64998j657959k761523p97691J528714M58160k096305n44480M555441
$$ 1462583 2127581 469622 -2291901 -3089592 -1560878 -1102718 -3199023 -3743503 811938
43411H11938N211827j786773p832697m031227N128960P770439J600706m026518
$$ 811938 6023765 4236992 -3595705 -7626932 -2497972 5272467 6873173 2846655
43403B846655k678350J404074K121208K39558n40053k69623r65694k155421k276955
$$ 2846655 168305 1572379 3693587 3933145 3393092 3123469 2157775 2354 -2274601
43394b274601j634813q00974J054786L358743K836751j533948n113224l183019
$$ -2274601 -3909414 -4710388 -3655602 -296859 2539892 1005944 -4107280 -7290299
43386g290299J978848L799905L09564l598763k990118J219291M263309L489474
$$ -7290299 -5311451 -1511546 -1201982 -4800745 -7790863 -6571572 -2308263 1181211
43378A181211Q81070n1492J102470J334270j079596l439830k326950J039254K393220
$$ 1181211 2062281 2010789 3113259 4447529 3367933 -71897 -2398847 -1359593 1033627
43369A033627N81370j653215k591888k803600j601398K330675N991451L966033
$$ 1033627 1614997 -38218 -2630106 -5433706 -7035104 -4704429 1287022 5253055
43361E253055k627797n558093j176098L802028K777404r23910q77161J607384
$$ 5253055 2625258 -2932835 -4108933 -306905 2470499 1546589 669428 2276812
43353B276812J160991j500052j542762P35281J091939j32400Q37846K780905J008339
$$ 2276812 3437803 1937751 394989 1130270 2222209 2089809 2927655 5708560 6716899
43344F716899l002364k590325K616293N158603J628848k425750k255475n11893
$$ 6716899 3714535 1124210 3740503 8899106 10527954 8102204 5846729 5334836
43336E334836o31233j101745k91797j50108j121011p4311K733371J809695l855335
$$ 5334836 4703603 3601858 3310061 3159953 2038942 1964631 4698002 6507697 2652362
43327B652362o799167k594021K238528R73721j971003O27693N380119L901735
$$ 2652362 -4146805 -6740826 -4502298 -3528577 -5499580 -4871887 508232 4409967
43319D409967k305781m121929j80816J478268k416763n224066j815654L869989
$$ 4409967 2104186 -2017743 -2198559 -720291 -3137054 -8361120 -10176774 -6306785
43311f306785O008553M324895J197545k273762m346634k613815J350574K717099
$$ -6306785 -298232 4026663 5224208 2950446 -1396188 -4010003 -2659429 57670
43303E7670Q83747L51287K161855J518888k885086m703635n0125N113301L968409
$$ 57670 941417 1292704 3454559 4973447 2088361 -2615274 -2665399 2447902 6416311
43294F416311o89196k197498j272092l087984o467748n235944O15960L986985
$$ 6416311 5727115 3529617 2257525 -830459 -7298207 -12534151 -11918191 -7931206
43286g931206J853230m12123J805458N483365N505830J999357j453251l206712
$$ -7931206 -6077976 -6490099 -4684641 798724 6304554 8303911 6850660 3643948
43278C643948l721240l005033j041510Q43612J355445Q41057K49378r3673N5257
$$ 3643948 -77292 -3082325 -4123835 -3280223 -1924778 -1083721 -834343 -928016 -872759
43269h72759O94116L83789k174586m731447l078995K427351N639690K598560k536750
$$ -872759 -178643 205146 -1969440 -6700887 -9779882 -7352531 -1712841 885719 -1651031
43260a651031l132394Q59548L724738K430420k23912p35031Q07902K310615K532028
$$ -1651031 -4783425 -3923877 -199139 2231281 2007369 1272338 2080240 4390855 6922883
43251F922883J389493m56261j715804j776393j710578k217604j565252J566865
$$ 6922883 8312376 7856115 6140311 4363918 2653340 435736 -1129516 437349
43243D37349M192776K125327l006503m678464p81157K883691J120622l184752
$$ 437349 4630125 6755452 3748949 -929515 -1710672 1173019 2293641 -891111
43235h91111m104704j457894N23223Q11209K039777M214841L888767M77522j737623
$$ -891111 -4995815 -6453709 -5930486 -5119277 -3079500 1135341 5024108 5501630 3764007
43226C764007O6026K932766K619623n84292l131218l175116j768298m72626J17826
$$ 3764007 3830033 6762799 9382422 8798130 5666912 2491796 723498 250872 368698
43217C68698K52524P50945K012551K647135O59859l191094n270937l642089o75085
$$ 368698 621222 1372167 3384718 6031853 6691712 3500618 -1770319 -5412408 -6087493
43208f087493O54034Q73249J895135K679692N74135l525858m981805j424875L559260
$$ -6087493 -5433459 -4560210 -2665075 14617 588752 -2937106 -7918911 -9343786 -5784526
43199e784526M470994M35956l883998l793475J32101L032785J849849r94429j233026
$$ -5784526 -1313532 -877576 -4761574 -8555049 -8422948 -5390163 -3540314 -4534743 -5767769
43190e767769J181359K346629N96933j058961j5068J785945J291906q42233j970316
$$ -5767769 -4586410 -2239781 -1642848 -2701809 -2716877 -930932 360974 -481259 -2451575
43181b451575j682765q83754J118914M385330N178252L96986n803945o028051
$$ -2451575 -4134340 -5018094 -3899180 486150 5664402 6061388 257443 -5770608
43173e770608n95179K262155r54569l338651J217345P667889P334550J265348
$$ -5770608 -6365787 -4103632 -5058201 -8396852 -7179507 488382 7822932 9088280
43165I088280k060490l44215J9378m132505o695685k034002N560830P667379L279172
$$ 9088280 7027790 6683575 6702953 2570448 -4125237 -6159239 -598409 7068970 10348142
43156A0348142j214930j862806j224354k244931l031939k67180M831356O965026
$$ 10348142 9133212 7270406 6046052 3801121 769182 502002 5333358 12298384
43148A2298384K988120l910291o997278l005243M018588O798655K985387k364225
$$ 12298384 15286504 11376213 4378935 1373692 5392280 12190935 15176322 12812097
43140A2812097l605362j725293j794346m439226m492586O05820N525134L768349
$$ 12812097 9206735 7481442 5687096 1247870 -3244716 -2638896 2886238 6654587
43132F654587k961961o607554l214211K789660N390179M111637K422740K032731
$$ 6654587 3692626 -2914928 -6129139 -3339479 2050700 6162337 8585077 10617808
43124A0617808J643903j5848k507677m639056n359018m067169j459558M23961
$$ 10617808 12261711 12245863 9738186 5099130 -259888 -4327057 -5786615 -5362654
43116e362654M49076J53298J597107L887943L970162J063491j912625k294927
$$ -5362654 -4913578 -4760280 -3163173 724770 4694932 5758423 3845798 1550871
43108A550871j131907j086303k246850k187597J44863K684305K920878Q44957
$$ 1550871 418964 -667339 -2914189 -5101786 -4956923 -2272618 648260 1493217
43100A493217j581360k757270k264045l26669K129309L341192K207775L1904o50492
$$ 1493217 -88143 -2845413 -5109458 -5436127 -3306818 34374 2242149 2274053 1623561
43091A623561O57880J706229O84614j299406j993110j018044K84462J094332J556377
$$ 1623561 2281441 3987670 4672284 3372878 1379768 361724 646186 1740518 3296895
43082C296895J523232N78916p41162j192978m22346O93364J194063O60806q08402
$$ 3296895 4820127 5399043 4657881 3464903 3042557 3735921 4929984 5590790 4782388
43073D782388k179629j801030M09110J896762M46411k433873l223273j019117
$$ 4782388 2602759 801729 1210839 3107601 3554012 1120139 -2103134 -3122251
43065c122251J792624L069764K643033R52574j138009j440028J233585L733590
$$ -3122251 -1329627 1740137 4383170 5335744 4197735 2757707 3991292 7724882
43057G724882J499220m345955o998210k859726L447763N378147K359102j398499
$$ 7724882 9224102 4878147 -2120063 -4979789 -1532026 3846121 6205223 4806724
43049D806724k977037k430827o52649J236556J714121L87003j484574l088813
$$ 4806724 1829687 -601140 -1253789 -17233 1696888 2083891 599317 -2489496
43041b489496m462165m113224k5236N464269O437152J733893k305055r72266K018895
$$ -2489496 -6951661 -11064885 -11090121 -5625852 811300 2545193 240138 -732128 1286767
43032A286767J456025r31565r81975j92900j896948l326510l8723M501410L072965
$$ 1286767 2742792 1811227 829252 636352 -1260596 -4587106 -4625829 -124419 2948546
43023B948546k960290n129093j558403P65734j234890j752414K806077O825396
$$ 2948546 -11744 -5140837 -6699240 -5933506 -7168396 -8920810 -6114733 710663
43015G10663M432509j735202n584273n527805l172791M24748L262552K465376
$$ 710663 5143172 3407970 -2176303 -7704108 -10876899 -10452151 -7189599 -4724223
43007d724223n85839o26819K853132L642635r53356m942667l352093N4575M14153
$$ -4724223 -5310062 -5936881 -3083749 558886 -394470 -5337137 -8689230 -8634655 -8220502
42998h220502M0184K343528M222095K287006N15953L039699M963744K13728o237881
$$ -8220502 -8180318 -5836790 -1614695 672311 1188264 4227963 9191707 9405435 3167554
42989C167554n046312J849443M036672m21062l012372j32317J766233j100738
$$ 3167554 -1878758 -29315 4007357 3586295 573923 441606 2207839 1107101
42981A107101l376627j211043P04344j519215l183129O53468N829912N364673
$$ 1107101 -2269526 -3480569 -2776225 -4295440 -7478569 -6825101 -995189 4369484
42973D369484K29176l163271k806756j813914j517832j54552K328518L411926
$$ 4369484 4598660 1435389 -1371367 -3185281 -4703113 -4857665 -2529147 882779
42965H82779K188011N52409j74601q71555k334374l498018k649439N24151M258448
$$ 882779 3070790 3623199 3448598 2577043 242669 -3255349 -5904788 -5380637 -1122189
42956a122189N791511L697766m74060l481335l463973j294508O73704N53165j379972
$$ -1122189 4669322 8367088 7893028 4411693 947720 -346788 326916 880081 -499891
42947d99891k127168J072688N960576O323547L67328n395411m681304m12787N08253
$$ -499891 -2627059 -1554371 4406205 10729752 11097080 5701669 1020365 607578 1115831
42938A115831j688563j330683J674890J578566k113098k794577J597082M353331
$$ 1115831 -572732 -1903415 -228525 1350041 -763057 -3557634 -1960552 2392779
42930B392779J458339j475540O74806L474698J052864l398936l375281k34420
$$ 2392779 3851118 2375578 3050384 6525082 7577946 4179010 803729 569309
42922E69309p9174k977246l762698j398591M67857R02340K035445K933362O00405
$$ 569309 490135 -2487111 -6249809 -7648400 -7180543 -6278203 -4242758 -1309396 -708991
42913g08991l185617l348648q5195J217546o19140o40864K945113M820884J255969
$$ -708991 -3894608 -7243256 -7328451 -6110905 -6730045 -7370909 -4425796 395088 1651057
42904A651057l380204l134795R95054L442792J876032j345011l391350l307730
$$ 1651057 -1729147 -4863942 -3868888 -426096 1449936 104925 -3286425 -6594155
42896f594155j526723N01969J315836J476886K877773M970648M381388J48211
$$ -6594155 -8120878 -7618909 -6303073 -4826187 -1948414 3022234 7403622 7551833
42888G551833l422341k016004K439587M011872M95266m082383m941553k201300
$$ 7551833 4129492 2113488 4553075 8564947 9060213 4977830 36277 -2165023
42880b165023Q0964o55358k550873k256475K54477J599217O6760j462403L74350
$$ -2165023 -2084059 -2739417 -5290290 -7546765 -7292288 -5693071 -5626311 -7088714 -6714364
42871f714364M052868M849782J330533k876041l966859j895919R95644K640082
$$ -6714364 -2661496 2188286 3518819 642778 -3324081 -5220000 -4224356 -1584274
42863a584274J922711p05745k494554q00231K894514M060422J372666j062011
$$ -1584274 338437 -367308 -2861862 -3662093 -767579 3292843 4665509 3603498
42855C603498L78877L450144L352588m33467l770860l604972j256601J97954k77193
$$ 3603498 3982375 7432519 10785107 10351640 6580780 2975808 1719207 1917161 1639968
42846A639968j212302q35879Q95461K185944J288068j394940l488166l151369
$$ 1639968 427666 -408213 487248 2673192 3961260 2566320 -921846 -4073215
42838d073215r56134R59596J179556K85955J18479J632707L382153K940065K75479
$$ -4073215 -5029349 -4069753 -2890197 -2604242 -2485763 -853056 2529097 5469162 5744641
42829E744641j721138j253028l64767j486936k976091j532687J837013K513367
$$ 5744641 4023503 2770475 2405708 918772 -2057319 -3590006 -1752993 760374
42821G60374o66918l224847j429698K737440N023367M218962J839125p23707k334275
$$ 760374 93456 -3131391 -4561089 -1823649 3199718 7418680 9257805 8534098 6199823
42812F199823j871188k33588k09727k027102j879684K095543N370808K799041
$$ 6199823 4328635 4095047 3885320 1858218 -21466 2074077 7444885 10243926
42804A0243926l325005n921876k817506J279056K279154R63827r67517l608955
$$ 10243926 6918921 997045 -1820461 -541405 1737749 2701576 1734059 -1874896
42796a874896n504284k853572M165602Q487377M611278k737311m221726R59427
$$ -1874896 -7379180 -10232752 -6067150 2420227 7031505 4294194 72468 1031895
42788A031895M081130J15571m749740k808856L219717M352321j106532n527324
$$ 1031895 5113025 5228596 478856 -2330000 889717 5242038 4135506 -1391818
42780a391818l775271P0990N72281p26454L84523K783669K548599P16131J676985
$$ -1391818 -5167089 -5096099 -4523818 -5250272 -4865749 -2082080 466519 1182650 2859635
42771B859635M741996M268759r32100m817439l047484R13841J847467J42303q18016
$$ 2859635 7601631 11870390 10938290 6120851 3073367 3987208 5834675 5976978 5158962
42762E158962p20282j207038j403087O99228L765140M249328J499088j611198
$$ 5158962 4438680 3231642 1828555 2527783 6292923 10542251 12041339 10430141
42754A0430141k810192k406787j437032k85448Q60959J804654K303021J516436
$$ 10430141 7619949 5213162 3776130 3490682 4351641 6156295 8459316 9975752
42746I975752j096320l616054k924321M47184J848916q03783l242255j013140
$$ 9975752 8879432 5263378 2339057 2786241 4635157 3831374 589119 -424021
42738d24021L730350N644970L655397N59182k204820m357138l803577K34656K998060
$$ -424021 3306329 8951299 12606696 13165878 10961058 6603920 2800343 3034999 6033059
42729F033059l00257n944717n971786n16472K246451o31455k582538N69268L262415
$$ 6033059 5732802 -211915 -6183701 -6700173 -4453722 -5085177 -7667715 -7098447 -3836032
42720c836032M4938m813521m488554n40446J097549P53536L012246O495563M866537
$$ -3836032 -3791094 -8604615 -13093169 -13633615 -12536066 -11782530 -8770284 -2274721 2591816
42711B591816j725881m780138L33373P070543O664571l76907o234691o247099
$$ 2591816 865935 -3914203 -3580830 3489713 10154284 9777377 3542686 -2704413
42703b704413k801670p5613P21074M04892m41525j088538p4061K803170M770736
$$ -2704413 -5506083 -5581696 -4860622 -4455730 -4897255 -5985793 -6059854 -3256684 1514052
42694A514052K731220k171108m886969k450261K313236M692218L835854K210210
$$ 1514052 4245272 2074164 -2812805 -5263066 -2949830 1742388 5578242 7788452
42686G788452R59622p82491k628417k750815j299764n56617r78071m33686J656580
$$ 7788452 8748074 7965583 5337166 2586351 1286587 729970 -248101 -681787 974793
42677I74793K811524J446089q41467k284596k998013k735605l98743K482701J991767
$$ 974793 3786317 5232406 4390939 2106343 -891670 -3627275 -4026018 -1543317 448450
42668D48450j989070m185234j700852J167894J56855j412824J783347P192854
$$ 448450 -1540620 -5725854 -7426706 -6258812 -6101957 -7514781 -5731434 1461420
42660A461420P111421J67757o500457o905775k597089J382749K261169L36913
$$ 1461420 8572841 8740598 2240141 -4665634 -7262723 -5879974 -3618805 -3281892
42652c281892j991712j224345L684534Q425408P592779J982757k228828j758413
$$ -3281892 -5273604 -6497949 -2813415 5611993 13204772 15187529 12958701 11200288
42644A1200288N53535J225948L05656j057039k782124l934158k605416M08487
$$ 11200288 11753823 12979771 13285427 12228388 9446264 5512106 2906690 3315177
42636C315177J468718m90715j985119m45087J919406K130423R26257L91961R1737
$$ 3315177 4783895 4293180 2308061 1862974 3782380 5912803 6839060 7231021 7322758
42627G322758j216811k357743j596865j29691m98753k425857l039076r61783J936382
$$ 7322758 6105947 3748204 2151339 2021648 1522895 -902962 -3942038 -4903821 -2967439
42618b967439K837067P41317k777436m782588l524382l77641J470446N53669j541035
$$ -2967439 -130372 610945 -2166491 -6949079 -10473461 -10851102 -9380656 -8826987 -10368022
42609a0368022k353763r01257J930595L996817L422251J047164K30330K148323
$$ -10368022 -12721785 -13623042 -11692447 -7695630 -4273379 -3226215 -2995885 -847562
42601h47562L135650O7992l576916k029581L509220N964179K803812j156284k313038
$$ -847562 2288088 2356080 -1220836 -3250417 258803 6222982 9026794 7870510 5557472
42592E557472k514203k691932m5366M625964M575943k228780p207477l151586
$$ 5557472 3043269 351337 305971 4931935 9507878 7279098 71621 -3079965
42584c079965M035744M278554q75173j678454L260859N116267j8836m801850k748325
$$ -3079965 955779 5234333 4359160 2680706 5941565 11057832 11038996 6237146 3488821
42575C488821K051415K344382j450705l506979j855454O4909l83102j544629n17203
$$ 3488821 5540236 7884618 6433913 2926934 1071480 1136389 753287 -791342 -1308545
42566a308545K469079L735031N12093m617315n640205q05014M195131L498700
$$ -1308545 1160534 4895565 5407658 790343 -4849862 -5654876 -1459745 2038955
42558B038955j032415l119046r78738J982667L608342M347399L273998p42330
$$ 2038955 1006540 -2112506 -3091244 -1108577 2499765 6847164 10121162 9378832
42550I378832m065778j511658M557155N572443p94568o734126n914389j882177
$$ 9378832 5313054 3801396 8358551 13930994 13136426 6402300 487911 -1394266
42542a394266m94666o59684J416969M037262K964467o90589k030134O487J954630
$$ -1394266 -1888932 -2548616 -1131647 2905615 5870082 5179493 3149359 3155846 5110476
42533E110476J336826j506094n256996p308784m227471K959900O907530K777391
$$ 5110476 6447302 4941208 -315788 -7624572 -11852043 -8892143 -1984613 792778
42525G92778l886497m322579R80054M306849L276460K604456L623816J804868
$$ 792778 -3093719 -7416298 -6436244 -2129395 1147065 3751521 7375337 9180205
42517I180205l137810m295175Q30960M444554M69317n004671l279585K758839
$$ 9180205 6042395 1747220 2578180 7022734 7492051 2487380 -792205 1966634
42509A966634L550298j516360l841589l18123K119180j115160m611237k401091
$$ 1966634 5516932 4000572 158983 -159140 1960040 844880 -3766357 -6167448
42501f167448K194823K304280j742443l852868j603721J763947L366773L314373
$$ -6167448 -3972625 -1668345 -3410788 -7263656 -8867377 -7103430 -3736657 -422284
42493d22284J907270r00750l152546k343231L47436J183043l47825r17795O77552
$$ -422284 1484986 584236 -2568310 -4911541 -4564105 -3381062 -3728887 -4646682 -3969130
42484c969130J220569j520918m895126n255188k698609M92187L376996N639141
$$ -3969130 -2748561 -4269479 -9164605 -14419793 -17118402 -16626215 -13249219 -7610078
42476g610078N738562K884844o24056j795522o92384M01941M86582L76226O38056
$$ -7610078 -1871516 1013328 389272 -1406250 -2098634 -1696693 -1210111 -833885 -195829
42467a95829R83763J144029R54811K74459l36672j6611P69975O85382q4914k39985
$$ -195829 787934 1931963 2886774 3161233 2824561 2807950 3577925 4263307 4178393 3938408
42457C938408l04993j813076l239958j322311K523266K740178j237841k900819
$$ 3938408 3633415 1820339 -1419619 -2741930 -218664 2521514 1283673 -1617146
42449a617146O53182L137086j85713l516891l06033M575880K774521k485043j539887
$$ -1617146 -963964 2173122 1987409 -1529482 -1835515 2740365 5514886 3029843 1489956
42440A489956M300822M069342m060002r057181m973516M29091J1112j730925J090789
$$ 1489956 5790778 9860120 5800118 -3257063 -8230579 -7801488 -7790376 -9521301 -8430512
42431h430512M873001M165795J756157K372086L214058k78385m734913l893735
$$ -8430512 -3557511 608284 2364441 4736527 7950585 7672200 2937287 -956448
42423i56448Q02407L065100J919602J157053J496942Q34228j06014N27801O37073
$$ -956448 -154041 2911059 4830661 5987714 7484656 8318884 8212870 8740671 9377744
42414I377744k400232n636948m733539j666163j041687j369665J797698O024258
$$ 9377744 6977512 1340564 -3392975 -5059138 -6100825 -7470490 -5672792 351466
42406C51466M459452k247068n589199j864636L055307L493374R94057q77754j957862
$$ 351466 4810918 2563850 -3025349 -4889985 -1834678 1658696 2652753 1774999 -182863
42397a82863k636771j376972J635154L021648J354186k03172J061423L299841
$$ -182863 -2819634 -4196606 -2561452 460196 1814382 1611210 2672633 5972474
42389E972474L384941J233274j162913k491994k466811j535957r10880r98316
$$ 5972474 9357415 10590689 9427776 6935782 4468971 2933014 2022134 1023818
42381A023818l25450J643372K235516l50847k675441o50443L133052K667496j731419
$$ 1023818 698368 2341740 4577256 4226409 1550968 900525 4033577 6701073 4969654
42372D969654l688722j017072J315030o6587j923958p32650J638745J618723r09868
$$ 4969654 1280932 263860 1578890 1512303 -411655 -1144305 494440 2113163 1203295
42363A203295l397300l184606J310896P890515R689993K840332n601811m981456
$$ 1203295 -2194005 -5378611 -4067715 3822800 13512793 16353125 10751314 5769858
42355E769858L400997P089385O95888o642226o101518j517106n19568k179572
$$ 5769858 9170855 16260240 16956128 10313902 4212384 2695278 2175710 -3862
42347c862j576515L62293K87985J66995K900115M776906J099148m346098m271986
$$ -3862 -1580377 -1218084 -930099 -763104 2137011 6913917 8013065 3666967 -605019
42338f05019N11852L181907K175306J482691J507445r79960m442500l551636R27962
$$ -605019 -93167 3088740 5264046 6746737 8254182 7274222 2831722 -719914 208048
42329B08048K212487j233780l160211l13003K658727K048556Q35941J657137J460045
$$ 208048 2420535 1186755 -1973456 -2286459 372268 2420824 3256765 4913902 6373947
42320F373947j848884l881657p34490L625067L108807j145123l296926j939900
$$ 6373947 4525063 643406 -91084 3533983 6642790 5497667 2200741 260841
42312B60841o77011j225930j693493j154201q97892j006253M6544K001362K674448
$$ 260841 -416170 -1642100 -3335593 -4489794 -5387686 -6393939 -6347395 -4346033 -1671585
42303a671585J616347O35466L37356o00078k224115k707169j763710j372734j935059
$$ -1671585 -55238 580228 917584 317506 -1906609 -4613778 -6377488 -7750222 -9685281
42294i685281j086782J929358M068507L128658J507799K153878L511845K493496
$$ -9685281 -10772063 -8842705 -4774198 -1645540 -137741 2016137 5527982 8021478
42286H021478K79367K84297J632684K48537l669575n245660l047413j355794k040729
$$ 8021478 8300845 8585142 10217826 10466363 6796788 1551128 -1496285 -2852079 -4892808
42277d892808q18998M236219O926761K083437m609178l986885K545586N208796
$$ -4892808 -5711806 -1475587 5451174 7534611 2925433 -1061452 1484134 6692930
42269F692930R30297k976120j238393K026959J482930j267023j995050p88158
$$ 6692930 7623227 4647107 3408714 5435673 6918603 5651580 3656530 2868372
42261B868372k20092o09957r42257j326720j594166n41963J166417Q11999j754640
$$ 2868372 2648280 2038323 1096066 -230654 -1824820 -2366783 -1200366 -388367 -2143007
42252b143007l219294k240915j175496o71772J765150N416059N170867L98133
$$ -2143007 -5362301 -7603216 -8778712 -9450484 -7685334 -2269275 2901592 3299725
42244C299725j995814J520636M194446j95489o154142m777277J757320L825061
$$ 3299725 1303911 2824547 7018993 6823504 669362 -4107915 -2350595 1474466
42236A474466m93007l859428k121041J111175K444176K747931K462513N37065
$$ 1474466 981459 -2877969 -4999010 -3887835 -1443659 1304272 3766785 4303850
42228D303850j108462O94209L546169J855941l229760m349169R7976K977221J86477
$$ 4303850 3195388 3889597 7435766 9291707 6061947 1712778 1810754 4787975 4974452
42219D974452k984315j407374J668751J308357p11574k09315J868005K344061
$$ 4974452 1990137 582763 2251514 3559871 2848297 2638982 4506987 6851048
42211F851048K116864L480608M382981J371570l932979o741399n785604l341499
$$ 6851048 8967912 12448520 16831501 18203071 14270092 7528693 1743089 -1598410
42203a598410m61945K835742M304831J850942j615916j070540K956886M736482
$$ -1598410 -2060355 775387 5080218 6931160 5315244 4244704 7201590 11938072
42195A1938072J839781j850944k934991l188367m824752n496460k130098K991036
$$ 11938072 13777853 11926909 8991918 5803551 978799 -4517661 -6647759 -3656723
42187c656723M623972K098472N9067J280040K805064J065544k435093l556217
$$ -3656723 967249 3065721 3124788 4404828 7209892 8275436 5840343 2284126
42179B284126j637800L29326Q15432J307281K459621K330352j26355k756064l245227
$$ 2284126 646326 975652 1791084 3098365 5557986 7888338 7761983 5005919 1760692
42170A760692k117228r07817L28407J703063J982497O75538m68004l47370o42737
$$ 1760692 -356536 -1264353 -935946 767117 2749614 3425152 2957148 2609778 1967041
42161A967041k517101l698291k006842O31251J368391J288120K750935M012082
$$ 1967041 -550060 -4248351 -6255193 -5623942 -4255551 -2967431 -216496 3795586
42153C795586J744735k316638l046198j11959J342484q56723k431341J94320M061215
$$ 3795586 5540321 3223683 177485 65526 1408010 551287 -1880054 -1685734 2375481
42144B375481M195618P00503j982000j202411J120322J349173j570309m659420
$$ 2375481 6571099 7271602 5289602 4087191 5207513 6556686 4986377 326957
42136C26957l964082N73562M610603M782750K470766M14294j504617l925119m456635
$$ 326957 -3637125 -3063563 1547040 6329790 8800556 9214850 7710233 3785114 -671521
42127f71521j064548L149134L645448J349123N72730J517973P68041j694303k348333
$$ -671521 -1736069 1413065 5058513 6407636 6980366 8498339 9266380 7572077 5223744
42118E223744q01406k75504j325797j385677p06024k014085l896036j879630K857135
$$ 5223744 4422338 4146834 2821037 1435360 729336 -1284749 -5180785 -7060415 -4203280
42109d203280L601757j161661m808222k935327P92067K130433K162228K276432
$$ -4203280 -601523 -1763184 -6571406 -9506733 -8714666 -6584233 -4422005 -2145573
42101b145573O12707k531105k838724L59905J660633r78080j965693J901414N118916
$$ -2145573 -1532866 -4063971 -6902695 -6542790 -4882157 -5860237 -7825930 -5924516 -805600
42092h05600L074251N4541P35738J399415k201324n358627k207452K952027K303427
$$ -805600 2268651 2323192 3058930 4458345 2257021 -3101606 -5309058 -2357031 -53604
42083e3604k118200k241824K071832L456122k46503l606260l353534j668312J0640
$$ -53604 -2171804 -4413628 -2341796 1114326 867823 -2738437 -6091971 -7760283 -7749643
42074g749643K445289M122990K722831N42503J411337L251451J128201l469987
$$ -7749643 -5304354 -1181364 1541467 2083970 3495307 6746758 7874959 4404972
42066D404972m396959j142112Q31665k49760o77117P81104J254058N00798J322064
$$ 4404972 8013 -1134099 -302434 -552194 -1229311 -448207 805851 1306649 2628713
42057B628713K842705J364029j798671j720433O42108m33002m140897l179808
$$ 2628713 5471418 6835447 5036776 3316343 3958451 3525449 -615448 -3795256
42049c795256L053307O037506K253811j029389J117573K999319l90751l755619
$$ -3795256 -741949 5295557 7549368 6519979 7637552 10636871 10246120 6490501
42041F490501j445707J595599j486383o540989m716736K710639O313723L075215
$$ 6490501 5044794 6640393 5154010 -1386979 -6103715 -3393076 2920647 5995862
42033E995862p88268r71513j90029j154256j853714j34945K152895J898478j290242
$$ 5995862 5207594 4236081 4046052 2891796 1038082 903137 3056032 4954510 3664268
42024C664268m794215m852372L78320P401296R020405K670853m989444n795520
$$ 3664268 -1129947 -5982319 -5603999 1797297 10817702 13488555 8499111 2703591
42016B703591l81863L850503L221335N56448j547355l672061n005863k349219
$$ 2703591 2321728 6172231 9393566 9950014 8402659 4730598 -275265 -2624484
42008b624484L593919O324746J928587m436995m833346J053364O236534N905509
$$ -2624484 969435 7294181 9222768 4785773 -47573 1005791 7242325 13147834
42000A3147834K037981j491039l876786n633799n419650j861189L081479N773538
$$ 13147834 15185815 13694776 9817990 4184191 -1235459 -3096648 -15169 5758369
41992E758369N414026M069531K473561q53934n511598p670706m788264M82529
$$ 5758369 11172395 15241926 17715487 16861553 11349955 3679249 -1109015 -626486
41984f26486L435541K684971L64351j267151j227678M06150J791400K33469l725500
$$ -626486 2809055 5494026 5858377 4591226 3363548 3769698 5561098 5794567 2069067
41975B069067n321156j741674K946121K851918j619276m913228m047521p12103
$$ 2069067 -3252089 -4993763 -2047642 804276 -815000 -5728228 -9775749 -10487852
41967a0487852K933722N624952N278611J259119k425762j713157O95241m97363
$$ -10487852 -7554130 -1929178 3349433 4608552 2182790 469633 1164874 667511
41959F67511l152155q2797P868356J0512196L308234n186353o011275k063632
$$ 667511 -2484644 -2567441 5300915 15813111 19121345 13934992 7923717 5860085
41951E860085j055286k955382k569562Q2484O51854q46893m03826K022805K347661
$$ 5860085 4804799 1849417 -720145 -637661 14193 -832700 -1236526 786279 3133940
41942C133940M2378p86904J293276K682705J052287j159492j296483j87914N66179
$$ 3133940 3176318 2389414 3682690 6365395 7417682 6258190 4961707 4773793 5339972
41933E339972J281211K147542J669075o41796k434410j569759P45311J816240
$$ 5339972 6621183 8768725 10437800 9796004 7361594 5791835 6537146 8353386
41925H353386J078996m7260r22770k144283l376504k836736K6466K725020K431689
$$ 8353386 9432382 9385122 8462352 6318069 2941565 104829 131295 2856315 5288004
41916E288004P5524n38414J721286L228714Q68888l045945m089587k082795l72387
$$ 5288004 5363528 4825114 6546400 9775114 10644002 7598057 3508470 1425675 1053288
41907A053288l3894O72469J552545L87950j789776q15851L369079M940910P33011
$$ 1053288 1019394 1691863 3244408 3632358 1842582 1026731 4395810 9336720 10069731
41898A0069731m165237l444637J431943L889252J521239j872167k418065l53382
$$ 10069731 5904494 2459857 3891800 7781052 9302291 7430124 5012059 4658677
41890D658677J827837K532412J934147J074545L44297r56133k638773k424127
$$ 4658677 6486514 9018926 10953073 12027618 12371915 11415782 8777009 6352882
41882F352882N79118K473780p88829n849147n073046J758842N810181K027138
$$ 6352882 6932000 9405780 8616951 2767804 -2305242 -546400 5263781 7290919
41874G290919l464170l436765m21262r91216m386430m523479k80022L700764M877177
$$ 7290919 3826749 389984 -31278 -1022494 -5408924 -9932403 -10212425 -6511661 -1634484
41865a634484M785320M058994J610355j458010k415530j377318q47072j155593
$$ -1634484 3150836 7209830 8820185 7362175 4946645 3569327 2722255 1566662
41857A566662l63587J823759L637072L942914K443303j047599m638917m567096
$$ 1566662 1203075 3026834 6663906 10606820 13050123 12002524 7363607 2796511
41849B796511q72867Q46199k207042m363055j58603N819958N547628M09477j650071
$$ 2796511 1923644 2769843 562801 -3800254 -3958857 1861101 7408729 7818206 6168135
41840F168135N43621R87586j373181q00845L664556N077935J25736n262088n725978
$$ 6168135 6711756 7699342 6326161 5525316 9189872 14267807 14393543 9131455 3405477
41831C405477l836277l314868k367263J094751L906914K811237K04899k32035
$$ 3405477 -430800 -3745668 -6112931 -5018180 -1111266 1699971 1904870 1672835
41823A672835O55611N46990L92802J703866K770856J744646J38319m54880j611614
$$ 1672835 2328446 2875436 3268238 4972104 7742960 9487606 9625925 9171045 7559431
41814G559431m296487n416951k315630K292199L907553K289605L89866k85246
$$ 7559431 3262944 -2154007 -4469637 -2177438 1730115 4019720 4409586 4124340
41806D124340o695R97742J716782K99374k476034k692775Q94081L817758J908119
$$ 4124340 4117645 5115387 6832169 7131543 4655509 1962734 2856815 6674573 8582692
41797H582692k776278n341316m374527j651179J293360K953075J487967j970853
$$ 8582692 5806414 465098 -3909429 -5560608 -4267248 -1314173 173794 -1797059
41789a797059l007825k97693J629265k42640j945843N96310L962457K896295m73212
$$ -1797059 -4804884 -5102577 -3473312 -3715952 -5661795 -5065485 -1103028 1793267 1320055
41780A320055n42488J724296R93422k067868j635929K289842K963236j442616
$$ 1320055 777567 2501863 3495285 1427417 -208512 2081330 5044566 3601950
41772C601950m021614m08827L808844J901373l668549n413203j500618L196899
$$ 3601950 -419664 -828491 2980353 4881726 1213177 -4200026 -5700644 -2503745
41764b503745M550918K929172N28778j178621j436765k13595J567885K902692
$$ -2503745 2047173 4976345 5505123 4326502 2889737 2676142 4244027 7146719
41756G146719L312107K228892o16571l498378l448756m2414L317068L328827N91492
$$ 7146719 10458826 12687718 12071147 8572769 5124013 5081599 8398667 11727494 12318986
41747A2318986j742875j716070J62975K105847K542048J484101P02743J210188
$$ 12318986 10576111 8860041 9023016 11128863 13670911 15155012 15857755 17067943
41739A7067943J113177j428761l703377j183967M622524O388148J472900l295302
$$ 17067943 18181120 16752359 13048982 11865015 16487539 22875687 24348587 21053285
41731B1053285j719160K063117N62558m190268l463936L512253P137560J868211
$$ 21053285 19334125 21397242 21959800 17769532 14305596 17817849 24955409 26823620
41723B6823620n478124o431157k850566j773906l381048k028245K866931M911033
$$ 26823620 21345496 14914339 12063773 10289867 6908819 4880574 7747505 12658538
41715A2658538M66842n831696p361365l205126K316180M787997K905187j037100
$$ 12658538 13125380 7293684 -67681 -3272807 -956627 3831370 6736557 5699457
41707E699457k834759o06075K473097K116686p81405j434599J174814K511892
$$ 5699457 2864698 2258623 4731720 6848406 6067001 4632402 5807216 8319108
41699H319108k23768l592045l303965k95860J715185J654446Q63798Q6652j98808
$$ 8319108 8095340 4503295 1199330 903470 2618655 4273101 5136899 5223551 5024743
41690E024743J111939L261430K865026j049880m048429k342465Q44448o0276l889643
$$ 5024743 6136682 9398112 12263138 11213258 7164829 4822364 5666812 5606536 1716893
41681A716893m119140J087962N926592N113024L35676l200801l132435r24280
$$ 1716893 -2402247 -1314285 4612307 9725331 10061007 6860206 3727771 2803491
41673B803491J012820J453792R30408R73544K043927K714911J971210R64788Q43834
$$ 2803491 3816311 5270103 6200511 7174055 9217982 11932893 13904103 14868891 15712725
41664A5712725O88278j85682j46029J607936K358137P9382k245454j139630J030735
$$ 15712725 16401003 16215321 16069292 17677228 20035365 20114747 17869293 16729663 17760398
41655A7760398j23500k926472k095667J821485K945334J82498q65874K327457
$$ 17760398 17636898 14710426 12614759 14436244 17381578 17564076 16698202 19025659
41647A9025659M908657K797502j381291l672529m221782l999148j606093K874479
$$ 19025659 23934316 26731818 25350527 21677998 17456216 13457068 11850975 14725454
41639A4725454N501676L545456r09943m853824p413059p194310k360455L998574
$$ 14725454 20227130 23772586 22862643 18008819 10595760 3401450 1040995 5039569
41631E039569M940300l07722l865391r43208K849283J374151j862720n90020L213463
$$ 5039569 9979869 9672147 5806756 4863548 7712831 9086982 7224262 6634242 9847705
41622I847705L551402R82062M8642l02719m209641q892676p079638O28237N067874
$$ 9847705 13399107 14381169 14429811 14127092 9917451 1024775 -6054863 -5426626 -358752
41613c58752J782088l013061k332354K323465M952358L451188O26645l75428P13582
$$ -358752 1423336 -1589725 -3922079 -1598614 3353744 6804932 7431577 7056149 7769731
41604G769731J364396p92499m107526l879613P04980L825150J116913l014392
$$ 7769731 9134127 8341628 4234102 354489 1059469 4884619 6001532 2987140
41596B987140j854225K890567M025153O00477j520512l31722j29137k168133j759761
$$ 2987140 1132915 4023482 8048635 8649112 7128600 6796878 6667741 4499608 2739847
41587B739847K367857M051252m74930n682213n027659m64502K076943K058772
$$ 2739847 5107704 9158956 8684026 3001813 -2025846 -2490348 -413405 1645367
41579A645367K808211L825557J413248l974337o837539l810470K136521N620004
$$ 1645367 4453578 8279135 9692383 5718046 -1119493 -4929963 -2793442 2826562
41571B826562M545853J231482o77348J7587R65365o24151l932193n232150k843857
$$ 2826562 7372415 8603897 7926549 7944136 8909501 8285350 4353157 -878993 -3722850
41562c722850Q40929K960210L310805K755013J154132j320510l066774l239499
$$ -3722850 -2881921 78289 3389094 6144107 7298239 5977729 2910955 -328544
41554c28544l176127l733826l150680J33764M106393N239318L114584O91292L18858
$$ -328544 -3504671 -7238497 -10389177 -10255413 -6149020 -909702 2204882 2896174 3215032
41545C215032J420446K099428J485362J45980r78183j619177k073194j978991
$$ 3215032 4635478 6734906 8220268 8366248 7388065 5768888 3695694 1716703
41537A716703r9209L412153N377353K719441k661803n048201k116612J776771
$$ 1716703 1617494 5029647 10407000 13126441 10464638 5416437 3299825 5076596
41529E076596J592328j508224k318075P54490L796358L279025N30748j054900
$$ 5076596 6668924 5160700 2842625 3597115 7393473 10672498 11203246 10148346
41521A0148346p76864l14766q2175J211933L270852L249452l66486m703291n496781
$$ 10148346 9371482 9056716 8974541 10186474 13457326 16706778 16340292 11637001 6140220
41512F140220k385250R17681J493080J64786n96324K29029J717524K175981O36808
$$ 6140220 3754970 4672651 6165731 6330517 5734193 5963222 7680746 9856727 10493535
41503A0493535j578270j461920J613707L697447J303276k535154j912590K580553
$$ 10493535 8915265 7453345 9067052 12764499 14067775 11532621 9620031 12200584
41495A2200584M026491j07497l887557k477895N24765j11020k645904k343842
$$ 12200584 16227075 16119578 12232021 9754126 10278891 10167871 7521967 5178125
41487E178125K36280J155662J41509l23074k82561q27591m6961L346393N042238
$$ 5178125 5414405 6570067 6711576 6388502 6105941 5278350 5231389 8577782 13620020
41478A3620020P56951n314228n295043L34172L386313M15251l371472l424021
$$ 13620020 14376971 9062743 3767700 4101872 7488185 7903436 4531964 1107943
41470A107943j554673o07474o2911Q42963J070246O47231R43660J289023L4949
$$ 1107943 -446730 -1054204 -1117115 -274152 796094 1443325 2386985 3676008 3710957
41461C710957j127963O08698L119199J926305j536007j537241J987285L099876
$$ 3710957 2582994 3191692 6310891 8237196 6701189 5163948 7151233 10251109
41453A0251109K49081j520451k91743l74865l272905m426669k139696r90052k718411
$$ 10251109 10500190 8979739 8687996 8313131 5040226 613557 -1526139 -2516191 -5234602
41444e234602k581185J114492L011761R75151P56005M669390N675519Q8289l852639
$$ -5234602 -7815787 -6701295 -3689534 -2714383 -1958378 2711012 8386531 8474820 4622181
41435D622181O41921O245588L295172l657597l711423J833609K460187l298351
$$ 4622181 5264102 11509690 14804862 11147265 7435842 9269451 11729638 8431287
41427H431287o239339k439637J760655J820869R37416J764558J836205k1229q89741
$$ 8431287 2191948 -247689 1512966 3333835 4271251 6035809 7872014 7850785 6961044
41418F961044n769n25955k628199j830526K933213N881225K533997l560583n638072
$$ 6961044 6955275 6429320 3801121 1970595 4903808 10785033 13319030 9758447 4120375
41409D120375j957722L196319M548418Q74984l306803j973174M343001P418796
$$ 4120375 2162653 5358972 9907390 10782374 7475571 5502397 9845398 17264194
41401A7264194K104846n253903n190022J005290L617044n86406m463582k270219
$$ 17264194 19369040 14115137 8925115 9930405 13547449 12961043 8497461 6227242
41393F227242K826344N159851L605584j79286m479578o240862k775698L101061
$$ 6227242 9053586 14213437 17819021 17639735 13160157 6919295 4143597 7244658
41385G244658N062273K143082j24575R04819J153681j878731l811235p20328L820751
$$ 7244658 12306931 14450013 14325438 15230257 16383938 14505207 10693972 9973644 13794395
41376A3794395M002631J677l514388l810155j287929K519215M793595K574721
$$ 13794395 17797026 17798703 14284315 10474160 9186231 11705446 16499041 19073762
41368A9073762k615992m608212m64873M748658M764840O00458j876912m36929
$$ 19073762 16457770 11849558 11384685 16133343 20898183 21498641 19621729 19184800
41360A9184800J800317J816860P6060j163631m83474J340620J597103j229879
$$ 19184800 20985117 22801977 22878037 21714406 21230932 22571552 24168655 22938776
41352B2938776m120108k366436L100184N264345L82103o203190p192637k841787
$$ 22938776 18818668 16452232 19552416 24816761 25198864 18995674 11803037 8961250
41344H961250J026958J768520J494364J362644k01831l165462m323409j743605
$$ 8961250 9988208 11756728 13251092 14613736 14411905 11246443 6923034 5179429
41336E179429K099687L338906J243962j539603k434317j672204j544856l017648
$$ 5179429 7279116 10618022 11861984 10322381 7888064 6215860 4671004 1653356
41328A653356l751297q67229M372601O879124L869404j318605l411203j693032
$$ 1653356 -2097941 -2965170 1407431 8286555 12155959 10837354 7426151 5733119
41320E733119L1099p94376k374803j746458R02937K565259J495356n36419p76035
$$ 5733119 5764218 4969842 2595039 848581 1751518 4316777 5812133 5275714 4499679
41311D499679O86916J274223K1729r14220J02395J346180O57194o78090Q5363
$$ 4499679 5186595 6460818 6482547 5568327 5670722 7016902 7674096 6996006 7081369
41302G081369K368379K714957j49884l548149m372703k186441J204620L362375
$$ 7081369 9449748 12164705 12014821 8466672 4093969 1907528 3112148 6474523
41294F474523K725380K50987j222117p91952q61148k603109k925277M31295L702289
$$ 6474523 9199903 9450890 8228773 7436821 6575673 3972564 1047287 1478582 5180871
41285E180871K166043j805675j932243J981936M028438J954031j76885Q5261J16034
$$ 5180871 7346914 5541239 3608996 5590932 9619370 11573401 11396516 11481777 11597811
41276A1597811j487183j983852l99019M4619j742706k197008n8965N45408k143651
$$ 11597811 10110628 8126776 7727757 7772376 6029670 3832662 3773697 4319105 2175454
41267B175454l068911J334897N998377M243957k246432o200578m403807L42863
$$ 2175454 -893457 441440 6439817 10683774 8437342 2236764 -2167043 -1824180
41259a824180M180194M880443K264360n82237M29885M166608M572115M4786l189773
$$ -1824180 2356014 7236457 9500817 8918580 9348465 13515073 18087188 18131974 14942201
41250A4942201j145860R68792k229067o528984m981747M43832K488887K72140
$$ 14942201 13796341 14765133 12536066 6007082 1025335 1469167 3958054 4230194
41242D230194j158516j93678P98737J989536M668022N389796N52519m792774k538489
$$ 4230194 3071678 2878000 3676737 5666273 10334295 15724091 16276610 11483836 8945347
41233H945347M668754N789075j439887o606634l009824K507705J511166l103938
$$ 8945347 13614101 19403176 17963289 11356655 8346831 10854536 12365702 9261764
41225I261764l374570P90172K799423K63441k312085r35832K712138M021105R03595
$$ 9261764 5887194 6677366 9476789 9740230 7428145 6492313 9204451 13225556 14129151
41216A4129151l818697n058866j229491L325059L561297J31460k458047k432724
$$ 14129151 10310454 5251588 4022097 7347156 10908453 11039913 8581866 6149142
41208F149142j185247J235805N251389P229215K815230m740214o916585k132036
$$ 6149142 4963895 6199700 11451089 18680304 21495534 16755320 9838735 7706699
41200G706699J846338J18821k550929r82244K032109J948545M37083R12460J708103
$$ 7706699 9553037 9671858 7120929 6138685 8170794 10119339 10556422 11468882 13176985
41191A3176985K89329o11084J934448M060387P23164m934228n606774r99389K679352
$$ 13176985 13466314 12855230 14789678 18850065 19573229 14639001 9032227 8032838 10712190
41182A0712190K820933K294502K159494M75135j583670l90350K440536J010755
$$ 10712190 13533123 15827625 17987119 18462254 16878584 16488234 18928770 19939525
41174A9939525m322997n510671O52869O332669M195599j602536k778154l5646
$$ 19939525 15616528 10105857 10758726 17091395 21286994 19684458 16906304 16870658
41166A6870658m50034m535101n199602p8907L818894J334160j978695J677646
$$ 16870658 16420624 11885523 6685921 6607014 10425908 11760068 9781373 11459019
41158A1459019R170440R475847l62617r637155p629122K305575P654168L169872
$$ 11459019 20629459 30105306 29742689 20105534 12476412 14781987 22436155 25606027
41150B5606027l922358n275175j702259P89598L71650p2890P16617P98857n14182
$$ 25606027 21683669 16408494 14706235 15495833 15867483 15794593 16511210 17310067 16795885
41141A6795885j088138K42580J673929J461859L92446K0533N15599J268552J747626
$$ 16795885 15707747 15950327 17624256 19086115 19478561 19499094 20014693 21283245 23030871
41132B3030871R94594j595585m170868l608213j12578K045459L93221j775435
$$ 23030871 24025465 22429880 18259012 14650799 14538221 16583680 16976901 15201466
41124A5201466k34404L501557M259600J043526j559119m34803J532132J5308m354254
$$ 15201466 14967062 18468619 22728219 23771745 22212626 21777823 23309955 23325263 18971009
41115A8971009o692730l808568K397624O880379N846740J72844m859344m595303
$$ 18971009 12278279 8469711 10867335 17747714 23594454 23767298 18907954 14312651
41107A4312651m43539J668251q01225l517183j895164J890259K549220K02992
$$ 14312651 13869112 15537363 14736138 11218955 9323791 11214050 13763270 13966262
41099A3966262j16351K866763M359076J481069j825330j177166J227868M26286
$$ 13966262 13849911 16716674 21075750 22556819 20731489 19554323 20782191 21208477
41091B1208477l223854m737054k216622Q39220J314714N92564J358972K969659
$$ 21208477 17984623 13247569 11030947 11870167 13184881 13777445 15136417 18106076
41083A8106076K253197j730353n342436l797655K738024P761502N396011j681779
$$ 18106076 20359273 18628920 13286484 9488829 12226853 19988355 25384366 23702587
41075B3702587m842440r24714L427861J677382k947976k873471J975979M506102
$$ 23702587 18860147 17935433 21363294 23040676 20092700 17219229 19195208 23701310
41067B3701310J652806j686249r89153J737993K541901J381810M42076J40918
$$ 23701310 25354116 23667867 22678714 24416707 26958608 28340418 28782494 28923412
41059B8923412m10368j506902l245214n297371n301099r29730N257933P244075
$$ 28923412 28513044 27006142 23760928 18463557 13162458 12232728 17490661 24734736
41051B4734736L726798L82438J358873L309286J674215j720298k455433j235980
$$ 24734736 28461534 28843972 30202845 33512131 35186346 33466048 31010615 29774635
41043B9774635j859439l850056l316774n1544K093522J614200P78883O71663J0715
$$ 29774635 27915196 24065140 20748366 20696822 22790344 24404544 25183427 25855090 25865805
41034B5865805q44388P7798J770928R95129j563763j592495J000711R17526l151263
$$ 25865805 25021417 25099215 26870143 27865272 26301509 24709014 25709725 26627251 23475988
41025B3475988m688036M34342N950312M002207k546828m454778j77246K952194
$$ 23475988 18787952 19222294 25172606 29174813 26627985 22173207 21995961 24948155
41017B4948155J072449j509997j612104k479779n746445n862336R53837P987600
$$ 24948155 26020604 24510607 22898503 20418724 14672279 8809943 9763780 17751380
41009A7751380O335109j422131m559057k6212M168430K506190k72442J137472
$$ 17751380 24086489 22664358 18105301 18079089 22247519 24753709 24481267 25618739
41001B5618739L236657N27204m160388l988718O11676L035374J349130P0334J109680
$$ 25618739 28855396 29382600 25222212 21233494 21845170 24880544 26229674 26300008 27409688
40992B7409688Q28036k257107m157466k586300p39861m14346J926571P325864
$$ 27409688 28237724 25980617 21823151 19236851 18496990 18082644 20009215 27335079
40984B7335079R103552K394635o199464o854714r92447J855620j54475O83638
$$ 27335079 36438631 38833266 32633802 25779088 24786641 26642261 26487786 27171424
40976B7171424O593662Q784808J962200n427107l513855L517179M122431k541310
$$ 27171424 33765086 42549894 44512094 39084987 35571132 39088311 43210742 40669432
40968D0669432o048800j369684M469055M550642J504672L45573k37868l181646
$$ 40669432 34620632 33250948 37720003 42270645 43775317 44120890 43883022 40701376
40960D0701376n606878l472297K91227R4294k312289m33696N260404P009625K282395
$$ 40701376 35094498 31622201 31913428 32007722 29695433 29261737 34522141 41531766 43814161
40951D3814161k030223r66536J150028m51004k246086O77567M844673L660834
$$ 43814161 41783938 40817402 41967430 41516426 39270340 39947907 44792580 48453414
40943D8453414j417321l468646j429938j11265k16094K291739O483358N775309
$$ 48453414 47036093 43567447 42137509 42026244 41810150 44101889 50585247 56360556
40935E6360556n64748m192632j40466N347495M699081J4146j903318J3643K194374
$$ 56360556 55795808 51603176 51462710 56810205 61509286 61523432 59620114 59633757 61828131
40926F1828131L607293N081829M817516J357666j411416J125523O438197P909691
$$ 61828131 65435424 70517253 75334769 76692435 75281019 76406542 82844739 90754430
40918I0754430M362059L54168j639751k674799j913155K812434Q616503R089078
$$ 90754430 95116489 95470657 93830906 91156107 89242952 92055386 100671889 109760967
40910A09760967L898935L09402K866455P631962R362796Q620849Q273290Q040082
$$ 109760967 113659902 113969304 116835759 124467721 133830517 142451366 150724656 158764738
40902A58764738O606580N162851M931043M488170K981105K638220M624999N862647
$$ 158764738 165371318 170534169 175465212 179953382 182934487 185572707 190197706 196060353
40894A96060353L790511R13447L52561K23374k414604m912305k656784K140609
$$ 196060353 199850864 200764311 201116872 201340246 198925642 194013337 191356553 193497162
40886A93497162K158491m105565r555997q632652m675656l921528o482867p629070
$$ 193497162 195655653 191550088 181994091 173361439 168685783 164764255 158281388 150652318
40878A50652318n542023l193765l047872l850034l637604l114393m130811o222290
$$ 150652318 145110295 141916530 138868658 135018624 131381020 128266627 124135816 117913526
40870A17913526o871100n187886l413118l754308n153352n022568l447777l136911
$$ 117913526 111042426 105854540 102441422 98687114 93533762 88511194 85063417 81926506
40862H1926506m868746n744450l488017j57833P66191o84014j708049j255180
$$ 81926506 77057760 71313310 67825293 67667460 68433651 67749637 66041588 64786408
40854F4786408o11103k7351J577097L195537J942380j784102l141829L37921L994035
$$ 64786408 64175305 64147954 65725051 68920588 70862968 69078866 65937037 66274958 70268993
40845G0268993K173369l028066m355514k61318K636308k71020m433726l229818
$$ 70268993 72442362 69414296 65058782 64797464 67433772 67162752 62729026 59499208
40837E9499208J838638L704704N50054k255931j201747O51871J68698l13715K031780
$$ 59499208 61337846 65042550 65592604 63336673 62134926 62786797 62955495 62641780 64673560
40828F4673560M294706J911332l480196n916155l918837j856179k184889j921434
$$ 64673560 68968266 70879598 67399402 61483247 57564410 55708231 53523342 51601908
40820E1601908J156406L600924J141342m462938p147794l946034K119042N899742
$$ 51601908 52758314 56359238 57500580 53037642 45889848 41943814 44062856 49962598
40812D9962598M817961L20504l497537l129872R10087M146730K838937j705604
$$ 49962598 54780559 55101063 51603526 48473654 49383741 53530471 56369408 54663804
40804E4663804m565164k613273K448184O172290N670132J970606j434113k362665
$$ 54663804 50098640 47485367 49933551 56105841 61775973 63746579 62312466 59949801
40796E9949801j854866j693798j126883J704280N456315O044834K540187o89924
$$ 59949801 58094935 56401137 55274254 56978534 62434849 68479683 71019870 70329946
40788G0329946m2251J975076P37124l284133n361718l534510m28440J928658M547020
$$ 70329946 70287695 72262771 72999895 69715762 64354044 60819534 60391094 62319752 66866772
40779F6866772P458637P692370M160666J227609L390865Q167944Q682939L163700
$$ 66866772 74325409 82017779 86178445 87406054 90796919 98964863 107647802 110811502
40771A10811502k452177k777529r3409k63586l947391n906642k695496K792391
$$ 110811502 108359325 105581796 105488387 105224801 101277410 95370768 92675272 95467663
40763I5467663N664161M964218L268130K467366K467478K892403L544984L651250
$$ 95467663 101131824 106096042 109364172 111831538 114299016 117191419 120736403 124387653
40755A24387653K863924K695361M743365P661172Q271325N920915L401473L004360
$$ 124387653 127251577 129946938 134690303 142351475 150622800 156543715 159945188 162949548
40747A62949548L893286M190684L558684K619165J604816P33897M76214N77949
$$ 162949548 166842834 171033518 174592202 177211367 178816183 179550080 180026294 180604243
40739A80604243K40265k37142J55893O58655q31266l808830m497177j148386K444997
$$ 180604243 180844508 180607366 180763259 181421914 180590648 176781818 172284641 171136255 173581252
40730A73581252J452036l574466p553901p317938m737528l716867n918948r373159
$$ 173581252 175033288 171458822 163904921 156586983 151849455 148132588 142213640 132840481
40722A32840481j0281028o783755j601085L63674k190023n463870n981904m995077
$$ 132840481 122559453 115775698 114174613 114538287 112348264 106884394 100902490 95907413
40714I5907413n326124o252773m856723j222976J135846r162k987074m538705
$$ 95907413 90581289 84328516 79471793 78248817 79384663 79375501 76388427 71849722
40706G1849722l148719k22612J031271j313115n113860o008730l012861j088j75536
$$ 71849722 68701003 68478391 69509662 68196547 63082687 57073957 54061096 54060008 53884472
40697E3884472j907711k247800j403325p49655L57194K012233J311841k778707
$$ 53884472 51976761 49728961 48325636 47575981 47933175 49945408 51257249 48478542
40689D8478542n196785j314160M698609M935454j29588k230813J829354N796440
$$ 48478542 43281757 41967597 46666206 51601660 51472072 49241259 51070613 56867053
40681E6867053M293588J92200j564341j237338j418249j943321j835704k325098
$$ 56867053 61160641 61352841 59788500 58551162 57132913 55189592 53353888 51028790
40673E1028790m069098m724563k710460k54939L72870L97558J207785Q81378k353967
$$ 51028790 46959692 42235129 39524669 39269730 39642600 40040158 41247943 42129321 39775354
40664C9775354n933717n809428j615690L494923O051610L764056k784730q169887
$$ 39775354 33841637 28032209 26416519 29911442 35963052 39727108 36942378 28772491
40656B8772491o201036J486818N735163K037938k935990j535890L609672M765579
$$ 28772491 22571455 24058273 29793436 31831374 28895384 27359494 30969166 35734745
40648C5734745J060340k062243k388964k367017k683051j676230l18089j049867
$$ 35734745 36795085 34732842 32343878 29976861 27293810 25617580 25299491 24249624
40640B4249624k259368m41454K737308K376345r25957j534519J580147L133125
$$ 24249624 21990256 21548802 24286110 26662455 25736498 24201979 25782126 28915251
40632B8915251P92911j260207k70716P36290m56674j112877K34928j85268m387734
$$ 28915251 29708162 28447955 28177239 28913529 28456855 27343978 27578906 27393638 23005904
40623B3005904p249264l730704K753119M983625K020911q96515o21516Q66544
$$ 23005904 15756640 12025936 14779055 19762680 21783591 20887076 20265560 21132104
40615B1132104Q63326p82569k574341k786040n96298K309676K746307L58436j298664
$$ 21132104 21995430 21212861 18638520 15852480 15256182 17565858 20312165 20670601 19371937
40606A9371937j4381J581616M92703j631717j475000M82555J424623J101098J140514
$$ 19371937 19357556 20939172 21431875 19800158 18325158 18807713 20232336 21333434 22473948
40597B2473948J080503n83240k480878j896516L56321R30053k74391L02008L752627
$$ 22473948 23554451 22971211 20490333 18593817 18950138 19880191 19605800 19907808 23660435
40588B3660435O132222L671237k123147o186347n163885j84588M371749M695629
$$ 23660435 29792657 33463894 31340747 25154400 19990515 19805927 24177676 28873305
40580B8873305J243805j785509j623896j02235j7395o01065L13087J599331N53993
$$ 28873305 30117110 28331601 26707705 26605470 26588075 25987010 26300097 27899428 28453421
40571B8453421j798704j856849L62187J202276P7760Q23475M556956O398536K519715
$$ 28453421 26654717 24797868 25160055 26362331 26440091 27263566 31820522 38219058 40738773
40562D0738773l652972o088298l988314j123946L30894J221155K002834J769570
$$ 40738773 37085801 30997503 27009189 25885243 26216137 27437292 29440126 31209696
40554C1209696L85126j160616k126391j789541P96198M422786N029238Q71578
$$ 31209696 31594822 30434206 28307815 26518274 27314472 31737258 36766496 37638074
40546C7638074l262062j565043L894346N289393N83643l187323q03238K923564
$$ 37638074 34376012 32810969 36705315 41994708 42578351 39391028 38587790 41511354
40538D1511354R01182m643008n296898M29585M524984J177295n375746p818544
$$ 41511354 42412536 37769528 32472630 32902215 37427199 38604494 33228748 25410204
40530B5410204n571333l190716k286626l64334L270525N293483K919884k372392
$$ 25410204 19838871 16648155 14361529 13997195 17267720 22561203 25481087 23108695
40522B3108695o598154o809105k770491K771748N461867L290180o16794j436657
$$ 23108695 16510541 9701436 6930945 9702693 15164560 18454740 17837946 16401289
40514A6401289J073109K502804L55349k596518k832258r10792L08496n1437o48986
$$ 16401289 17474398 19977202 20332551 17736033 14903775 13992983 14301479 14250042 13601056
40505A3601056l71747Q59543K397936K699400N90092k249372k539952m30594O9835
$$ 13601056 13229309 14088852 16486788 19186188 19776280 17526908 14986956 14556362 14626197
40496A4626197k151121k209136L126978Q411683O107360j808821n716956j951022
$$ 14626197 12475076 10265940 13392918 21804601 27911961 26103140 20386184 18435162
40488A8435162K331535P6041n802478p438396k874692K687326M469002K725496
$$ 18435162 20766697 20842738 15040260 7601864 4727172 7414498 11883500 14608996
40480A4608996K78070j205686j818686k213460k677369k899283k454421j490990
$$ 14608996 14887066 13681380 11862694 9649234 6971865 4072582 1618161 127171
40472A27171n38762K37347R43884J415517J617598K063386K721853K345270M59614
$$ 127171 -411591 -174244 769640 2185157 3802755 5866141 8587994 10933264 11392878
40463A1392878j017526l65078P60618l44975k684435k744853k01599J693074J814127
$$ 11392878 10375352 10010274 10770892 10425917 7741482 4996629 4795030 6488104 8302231
40454H302231K617808M599128M298019N05485k167746K14331M476809M715383
$$ 8302231 10920039 15519167 19817186 20322671 18154925 18369256 22846065 27561448
40446B7561448L76613m366238o905823p191439m490028J347385O227744N076744
$$ 27561448 27938061 23571823 16666000 9474561 4984533 6331918 12559662 17636406
40438A7636406p14635m088533j751236J701698Q91402l127851n325119l410001
$$ 17636406 16921771 12833238 11082002 12783700 13675102 10547251 5222132 1812131
40430A812131O28885L744268M169283J857267j350758k770519j530781M45264
$$ 1812131 2441016 6185284 10354567 12211834 10861076 8090557 6559776 7005040
40422G005040R72120K06713m2894J291829L411984M099650J371539l845676o992691
$$ 7005040 7977160 8183873 8140979 9432808 12844792 16944442 18315981 14470305 7477614
40413G477614m374437J248250K803391j835516o178990l730405K626786M475914
$$ 7477614 3103177 4351427 7154818 5319302 -859688 -4590093 -1963307 2512607
40405B512607j29790m035274j583787L247801L042586j862218l606801J908824
$$ 2512607 2382817 -1652457 -3236244 11557 3054143 1191925 -2414876 -506052
40397e06052Q822123Q806798J751377m610927m645973o44830J855764J162299
$$ -506052 8316071 17122869 18874246 14263319 9617346 8972516 10828280 11990579
40389A1990579l02134n77796j08879J51940j1162p55283k021952k506778p53854
$$ 11990579 11688445 11110649 11001770 11153710 11142548 10387265 8365313 5858535 5104681
40380E104681K247363L400119J247764k103207l655376k790240r51588O91375
$$ 5104681 7352044 10752163 11999927 9896720 6241344 3451104 2499516 3190891
40372C190891K031921L168997L832299L527798J998728q6531j244381j023483
$$ 3190891 5222812 8391809 12224108 15751906 17750634 17664103 16419722 15396239
40364A5396239j218545l342669n216327l005298K687782O194455M167244L04504
$$ 15396239 14177694 10835025 5618698 2613400 5301182 11495637 15662881 15967385
40356A5967385l51082J125069J52844l210647m194538j245348J441452P56099
$$ 15967385 15616303 16741372 16894216 13683569 9489031 8243683 9685135 10441234
40348A0441234q86624n21954K13664j420823l757383l037290M53051K745059J969938
$$ 10441234 9554610 9032656 9246320 7825497 4068114 1030824 1483875 4228934 6198872
40339F198872O37j422124k453544k650340m42961L465265N213085K460016j989600
$$ 6198872 6199509 4777385 2323841 -326499 -769460 2695805 7908890 10368906 8379306
40330H379306l442524j084751J571870J602436R1874l295J679374K075896j019739
$$ 8379306 4936782 3852031 5423901 7026337 7118211 7114916 8794290 10870186 9850447
40321I850447m916087m455001J065296N940497M944918k230k988643k276199j358536
$$ 9850447 4934360 479359 1544655 7485152 12430070 12427840 9439197 7162998 5804462
40312E804462k415811l195020j339815K071608M845240O219066N590457K045415
$$ 5804462 3388651 193631 -1146184 925424 5770664 11989730 17580187 19625602
40304A9625602k993438n796533m939514k854561j194458J421312M814000N092110
$$ 19625602 16632164 10835631 5896117 3041556 1847098 3268410 8082410 13174520
40296A3174520Q37954k820546j085842L105395L794836J017821o98469k85991
$$ 13174520 14012474 11191928 10106086 13211481 17006317 18024138 17325669 17039678
40288A7039678k53520p16834J17221Q06822j306239m008144l112406l36893m25677
$$ 17039678 16786158 16069324 16186545 16993367 15687128 11678984 8566578 8229685 7804008
40279G804008j386343K785664R275690P628273l088861r747346l825534N700458
$$ 7804008 6417665 9203329 18479019 26107292 23018431 13271085 9445551 15146009
40271A5146009O281496k16785l362561j139228J51546j226024r94726J389730
$$ 15146009 21427505 21210720 17848159 16708931 16860477 15634453 14639727 16029457
40263A6029457J850967L24401J166257M510406N474381K737341J99878p39221
$$ 16029457 17880424 18204825 19371082 23881488 29355869 32093210 32293088 31553867
40255C1553867k820539n539783m021378K232500O595646M515212n74569l540576
$$ 31553867 28733328 23193545 19172167 21404667 28000313 32515525 31940956 28400380
40247B8400380m018690l488600j520997J355155J995520l36551j727476n8002
$$ 28400380 24381690 20893090 19372093 20727248 22722768 22386217 20658741 20600739
40239B0600739Q48102k223508n431494l259612K556072M989181J367433l681366
$$ 20600739 21448841 19225333 13793839 10534227 13090299 18079480 19446913 15765547
40231A5765547m798584j828399J313880J485292o37098j753902k33440J516122
$$ 15765547 10966963 9138564 10452444 11937736 11300638 9546736 9313296 10829418
40223A0829418N32002j904559k062659K13862J426344N97368P73595L170241M624894
$$ 10829418 11361420 9456861 7394202 7608064 9034408 9631776 10405371 13575612 18200506
40214A8200506K819401l89702k737407m087661l592001J58675M052588K141064
$$ 18200506 21019907 20630205 17892798 13805137 10213136 10371811 14424399 16565463
40206A6565463m297402n778357J211129O762158J820017o939843o549972K443037
$$ 16565463 12268061 6489704 7700833 14462991 16283008 9343165 2793193 5236230
40198E236230P032152J233000o578641p118519j481698L803200N371835L432330
$$ 5236230 12268382 13501382 6922741 -195778 -1677476 2125724 7497559 10929889
40190A0929889m95790l343949k560821p5227J49764j220165k62056K134161P88359
$$ 10929889 10434099 7090150 4529329 4454102 4603866 3383701 3121645 5255806 6044165
40181F044165l930823m814108O56347N311345L301796j039368j011449J934139
$$ 6044165 2113342 -2700766 -2044419 3266926 6568722 5529354 4517905 6452044
40173F452044K149456m48630j603399n23630J52801k899M61031Q12652j16079
$$ 6452044 8601500 8152870 6549471 6025841 6178642 6175743 6636774 7449426 7333347
40164G333347j78872K420935L854602m42202p002173p602715j279163L995944
$$ 7333347 7154475 9575410 13430012 12987810 5985637 -1617078 -2896241 1099703
40156A099703K853929q72544j481478M69304Q87073j119036k828588j861082J786611
$$ 1099703 3953632 3081088 1599610 2068914 2955987 1836951 -991637 -2852719 -1066108
40147a066108N702272O085430J569573l422671k920804K151237M499535J107693
$$ -1066108 4636164 10721594 12291167 8868496 5947692 8098929 12598464 13706157
40139A3706157k216569k70249L247676K262992j469023j733040J323743J602362
$$ 13706157 11489588 11219339 14467015 16730007 15260984 13527944 14851687 16454049
40131A6454049k328165m825992k692781O0339k61792j078066Q42374L027298J671962
$$ 16454049 14125884 9299892 6607111 6667450 6405658 5327592 6169966 9197264 10869226
40122A0869226j440976j948666l33911o09725k905394l163712j97959K369007
$$ 10869226 9428250 7479584 7145673 6535948 3630554 466842 268883 2637890
40114B637890K145873J090873J083975R12672j62690K0922K544553M468730L048188
$$ 2637890 4783763 5874636 6958611 7871283 7708593 7729515 10274068 14742798 17790986
40105A7790986m7807j937949k997609m370961l975145N9929M073188K850551j896102
$$ 17790986 17743179 15805230 12807621 8436660 4461515 4521444 8594632 11445183 9549081
40096I549081l232607M85138L376392K029938Q06274L297569M898166J83681o755111
$$ 9549081 6316474 6801612 10178004 12207942 13014216 16311785 21209951 21393632 14638521
40087A4638521p131943p59194L496979J044517k333184n03943L483082K858091
$$ 14638521 7506578 6747384 10244363 11288880 8955696 8451753 11934835 14792926
40079A4792926k199909n230727l057181O81621J519280o31047l079965l817063
$$ 14792926 12593017 7362290 4305109 4986730 6506010 5874963 2794998 -1022065
40071a022065k177467J307232M359538M288860J216593j587836j622295J87470
$$ -1022065 -3199532 -1892300 2467238 6756098 7972691 6384855 4762560 4950030
40063D950030J633826K025346J487644l22606k644431k712970N95698L530424
$$ 4950030 6583856 8609202 10096846 9774240 7129809 4416839 5012537 8542961
40055H542961J473783m148561o788586l282476K273153M648793L815976K537184
$$ 8542961 10016744 5868183 -920403 -4202879 -1929726 2719067 6535043 9072227
40047I072227R39235k351089n390108m037188J735754O530806N911479J367071
$$ 9072227 10011462 7660373 2270265 -1766923 -31169 6499637 12411116 13778187
40039A3778187k560086l734464l114390j790749J54736K238189L021855J617599
$$ 13778187 11218101 7483637 4369247 2578498 2733234 4971423 7993278 9610877
40031I610877r08292k131688o09946K120406K587931m84508l762129l000895R34981
$$ 9610877 8702585 6570897 5960951 8081357 10669288 10184780 6422651 3421756 4356737
40022D356737K486486j090870n382550m368895J552552O157645N275803J027978
$$ 4356737 6843223 5752353 369803 -3999092 -2446540 3711105 8986908 10014886
40014A0014886k002365k068896p01435J29803j68565q60042p27649O52295K191706
$$ 10014886 8012521 5943625 5242190 5371993 5203428 4343386 3615737 4268032 6459738
40005F459738K508071J757159J145268P92064k69588j842796k377056j689592
$$ 6459738 8967809 10724968 11870236 12662300 12392712 10549916 8172860 6483268
39997F483268j638644k790232k707493K54182L319582K463696j676481m250777
$$ 6483268 4844624 2054392 -653101 -398919 2920663 5384359 3707878 -542899
39989e42899k566694J016053L175541L631503L605917K856652N52022k415291
$$ -542899 -3109593 -2093540 1082001 4713504 8319421 11176073 11728095 9312804
39981I312804m291365m762268m298534k002783L198923R049084J0457029N203945
$$ 9312804 5021439 259171 -4039363 -6042146 -2843223 6205861 16662890 21866835
39973B1866835k398734n661471k985600O94690L40734l123299m710769k281950
$$ 21866835 19468101 13806630 10821030 11515720 11856454 8733155 4022386 1740436
39965A740436R63636J393188j69093m46380J042481J628565p197j950752k262006
$$ 1740436 2704072 4097260 3928167 3481787 4524268 6152833 6145636 4194884 1932878
39956A932878j458053p47334j74668J05592r53781k965475l140335O9272M120300
$$ 1932878 474825 -272509 -447177 -341585 -1295366 -4260841 -7401176 -7331904 -3211604
39947c211604N603835M679644L601043K499605J16238k361891k212339K04726
$$ -3211604 2392231 7071875 10672918 13172523 13288761 10926870 8714531 8919257
39939H919257J625257J082971J071980K592148L001504O49162j901011j832963
$$ 8919257 10544514 11627485 12699465 15291613 18293117 18942279 17041268 15208305
39931A5208305m30404n60419j947041k090345n84697N38438K66425k10940K11278
$$ 15208305 14777901 14217482 12270441 10180096 9595399 10133837 10400262 10189322 10400600
39922A0400600J103848J588999J412090O43069o52514k056168k569100j145369
$$ 10400600 11504448 13093447 14505537 15148606 14496092 12439924 9870824 8725455
39914H725455K062530M722463L725004r73429m894975l792436O82652L046169
$$ 8725455 10787985 15510448 19235452 18262023 13367048 9574612 10257264 13303433
39906A3303433J576201N2309J131090K305210O66490k226164l378382l020706
$$ 13303433 14879634 14931943 16063033 18368243 19034733 16808569 13430187 10409481
39898A0409481k694683j519846J537055L909545K517723p27299j064004K061212
$$ 10409481 7714798 6194952 7732007 11641552 14159275 13431976 12367972 14429184
39890A4429184M364225L017678m28236l465883m969904l810695N99163N221876
$$ 14429184 18793409 21811087 21382851 17916968 12947064 9136369 9735532 14957408
39882A4957408M939881o44160n134087k798231L911360P106856K970950l889343
$$ 14957408 19897289 19253129 14119042 11320811 15232171 22339027 25309977 21420634
39874B1420634o079571k038059K421021J560535k823916l862613P30864N230358
$$ 21420634 15341063 13303004 15724025 17284560 14460644 10598031 11328895 16559253
39866A6559253L975016p84826k735939n54034J489018O69339j178526j675216
$$ 16559253 20534269 19749443 17013504 16459470 17948488 18617827 17439301 15764085
39858A5764085p36712R78048K873969L298652Q95773k625303m079660l079966
$$ 15764085 15027373 16005421 18879390 22178042 23073815 20448512 16368852 13288886
39850A3288886j675467l90466J573859K843323J246281j351996o93440K703544
$$ 13288886 11613419 11222953 12796812 15640135 16886416 15534420 14840980 17544524
39842A7544524L312287r26773n009488m059255L64029L673156L952760J756173
$$ 17544524 20856811 19930038 14920550 10861295 11225324 14898480 18851240 20607413
39834B0607413j884366m526357l028516J920047N146433L521599J12881o20342
$$ 20607413 18723047 14196690 11168174 13088221 18234654 21756253 21869134 21248792
39826B1248792J356956L119129K990428R02516k431035m605580l133399J31625
$$ 21248792 22605748 25724877 28715305 29617821 27186786 22581206 19447807 19579432
39818A9579432J73556l453648m847092p03489M027309L524054o28911l381488
$$ 19579432 19752988 16299340 11452248 10748759 14776068 18300122 17671211 14289723
39810A4289723m038327m547157l776607J20573M224015M102382R89848j22968
$$ 14289723 10251396 5704239 1927632 2048205 6272220 10374602 11364450 11241482
39802A1241482J603176K400459N73255j549412j978701r55869R58020K759609
$$ 11241482 12844658 15245117 15818372 14268960 12290259 11334390 12292410 15052019
39794A5052019K082792j687806m891465m135963j291651L48065J993637N812674
$$ 15052019 17134811 15447005 10555540 6419577 5127926 5475991 7469628 13282302
39786A3282302Q308162M520511k596119m804743n96970K982840J478547j340923
$$ 13282302 21590464 26110975 23514856 18710113 18113143 21095983 22574530 21233607
39778B1233607j028824R78635J310071r6959j623876k671245k455671Q7950L377128
$$ 21233607 20204783 21183418 22493489 22396530 20772654 18101409 15645738 15733688 19110816
39769A9110816L768530N85955k708544l179433r56298K791862O328562O212299
$$ 19110816 22879346 23465301 20756757 17577324 16621026 19412888 25741450 31953749
39761C1953749P32344n590459o379676k296710L39795l23982p0306K289905K419017
$$ 31953749 32686093 27095634 20715958 18419248 18759043 18435061 18364755 20654660 23073677
39752B3073677p68662k051008R27452L217871J514931n8047J794552K863147p18821
$$ 23073677 22305015 20254007 21181459 24399330 25914261 25856214 27650766 30513913 29795092
39743B9795092m528235k983105R71299R93084k053095k479629K64423J749477
$$ 29795092 25266857 22283752 23255051 24248135 22195040 19715411 19979834 21729311
39735B1729311Q24991M96258J431197J034018j138938k357755j221744Q23261
$$ 21729311 22554302 23050560 24481757 25515775 24376837 22019082 20797338 21620599
39727B1620599K070594J588682r36232l630495l114932L51216J796755r65859
$$ 21620599 23691193 25279875 24343643 20713148 17598216 17949432 19746187 18780328
39719A8780328l079597m30487L033225J795195j758718j584678J763954K988238
$$ 18780328 15700731 15270244 18303469 20098664 18339946 16755268 18519222 21507460
39711B1507460J565295J221144J717622l87221l829573l957389j437190j133329
$$ 21507460 23072755 24293899 26011521 25624300 21794727 17837338 16400148 15266819
39703A5266819k509631j98874N261823O726617K252875j642474j164610n32094
$$ 15266819 12757188 12558314 17820137 24546754 26799629 25157155 23992545 23460451
39695B3460451k595008l284605j99823J814673n28247k378670M46435L260462
$$ 23460451 20865443 17580838 17381015 19195688 18667441 16288771 16735206 19995668
39687A9995668O87732l245514j881152K118242J198897l662337l996707K205366
$$ 19995668 20683400 17437886 15556734 17674976 18873873 15211536 11214829 13420195
39679A3420195O961372M421889j277363l393513j791138p90996j759300k078030
$$ 13420195 20381567 24803456 23526093 20132580 18341442 17550446 15791146 13713116
39671A3713116R0286L225394M566401L189426O45609j020846j485134j845240
$$ 13713116 13803402 17028796 21595197 24784623 25430232 24409386 22924252 21079012
39663B1079012k351057j884272j96607J027761M58977r62693j593147j241362
$$ 21079012 18727955 16843683 16647076 17674837 18133814 17171121 15577974 14336612
39655A4336612o27879o7461J77761l62898j213846j021963K78987J053600N51140
$$ 14336612 13708733 13641272 13819033 13456135 12242289 11220326 11499313 12552913 13104053
39646A3104053j21937m66710j481681k849177k145929J191884L906911L384877
$$ 13104053 12982116 12515406 11033725 8184548 6038619 7230503 11137414 14522291
39638A4522291J582277J648373K739653J484628k556019n873557n125046m58155
$$ 14522291 16104568 17752941 20492594 21977222 19421203 13547646 8422600 7964445
39630G964445M707877O257442L050204j284515k169661o1245M73747j762853k569298
$$ 7964445 12672322 18929764 21979968 20695453 18525792 18464547 18938294 17175441 14606143
39621A4606143K44651K512084M76471k699867k143549O65165O89374k306003l930671
$$ 14606143 14850794 17362878 17839349 15139482 12995933 13661098 14350472 12044469 8113798
39612H113798k200758Q40890L327877M496359K723547k233715o046059m047446
$$ 8113798 5913040 6753930 10081807 14578166 17301713 15067998 9021939 4974493
39604D974493J884459N436491M113170P38378k055532l552062k345420J988994
$$ 4974493 6858952 12295443 16408613 17146991 15091459 11539397 9193977 11182971
39596A1182971N198339K522743l579274o088330l685789j609653k065227j410206
$$ 11182971 16381310 18904053 15324779 9236449 5550660 3941007 1875780 465574
39588D65574J692252L116625R99740n47242J128347K594843Q72651j471278j692818
$$ 465574 2157826 5274451 6274191 5726949 6855296 9450139 10322790 8851512 7158694
39579G158694j579592k704798k548874L00009K402553J377224L22045J801564
$$ 7158694 5579102 2874304 325430 625439 3027992 4405216 4727261 6528825
39571F528825K830609P89870j184066j92859O25040j605923l067214j79153K531496
$$ 6528825 9359434 10149304 8965238 8772379 9397419 7791496 4724282 4545129 7076625
39562G076625k51209m311670k259270L658567N313709K498649J911221L743980
$$ 7076625 6825416 2513746 254476 3913043 9226752 11725401 13636622 17380602
39554A7380602J269718n355222o947383l11532N486788K971275k932114m074273
$$ 17380602 18650320 13295098 6347715 6036183 11522971 14494246 11562132 7487859
39546G487859j249896k14257j573195j870654o25757K45757J002627K436958K415557
$$ 7487859 6237963 6023706 4450511 2579857 1954100 2199857 3202484 5639442 8054999
39537H054999o31299l249080j292945L195782M595253J845201q83846q16889O87747
$$ 8054999 7423700 4174620 2881675 6077457 10672710 12517911 11634065 10817176 11504923
39528A1504923J656435J618319K45681k385789l997003k066067J835618K845016
$$ 11504923 13161358 14779677 15025358 12639569 8642566 6576499 8412117 11257133
39520A1257133q96538n214398m777912L46869M606876L303488j936965m910878
$$ 11257133 10360595 5146197 368285 715154 5322030 8625518 6688553 1777675
39512A777675k177293K802653M378191K082963K05173O42276N64120j731305l175774
$$ 1777675 -399618 2403035 6781226 8864189 9069362 9711638 10275758 8544453 5368679
39503E368679q95266K784338L740606J809948l02774j563993k439317k231157
$$ 5368679 4473413 7257751 10998357 12808305 12505531 10941538 8502221 6271064
39495F271064n96779j46018l134325o440434m496677K607067Q314461P897681
$$ 6271064 5674285 5528267 2393942 -4046492 -8543169 -5936102 2378359 10276040
39487A0276040L721601N97471o98970k543330n138621n396373j446052L779243
$$ 10276040 13997641 14595112 13896142 11352812 6214191 817818 -628234 3151009
39479C151009N089684J143236l474815l626050o9714J944256K95806j356064J60396
$$ 3151009 8240693 9383929 5909114 2283064 2213350 4157606 4453412 3097348 3257744
39470C257744K413960J542383j404556k350576p52005M8111j416311k604718j164371
$$ 3257744 5671704 7214087 5809531 3458955 2706950 2755061 1338750 -1265968 -2430339
39461b430339J816486L636278K991470O36647j450996j537447P1944J319762J428585
$$ -2430339 -613853 3022425 6013895 6650542 5199546 3662099 3734043 5053805 6482390
39452F482390J914639L059021K101841k060800n142787k911621J567324J605795
$$ 6482390 8397029 11456050 13557891 11497091 6354304 3442683 5010007 6615802
39444F615802k907731m961757q32737M739261N867647K997455J27100j353081
$$ 6615802 3708071 -1253686 -2086423 2652838 8520485 11517940 11645040 10291959
39436A0291959k462086l037052j918917N75659K818016L589983K358023o23569
$$ 10291959 7829873 4792821 2873904 3449563 6267579 9857562 12215585 11592016
39428A1592016l340910l052703L24232L489942L512663P43418k544234m322978
$$ 11592016 8251106 5198403 5522635 9012577 12525240 13268658 10724424 6401446
39420F401446l214309N40719L768457L009549n72104k198488m57152P11774j181900
$$ 6401446 3187137 3727856 7496313 10505862 9933758 7735270 7278118 7989892 6807992
39411F807992k887678j114870J585823R73778j963520l035946j565805j38396
$$ 6807992 3920314 2805444 4391267 5365045 3401525 365579 -1200226 -1338622
39403a338622P54558K588026M133221K383914j578881k928358n04093J085573
$$ -1338622 -584064 2003962 6137183 8521097 6942216 4013858 3509765 4595338
39395D595338j100396l412420j528941K269948K267590j946269m574746j729177
$$ 4595338 3494942 82522 -1446419 823529 3091119 1144850 -3429896 -5159073
39387e159073L395047N127968K584389j21835P8058J509886P40217k424183m517105
$$ -5159073 -1764026 3363942 5948331 5826496 5904554 7414440 8154657 5730474 1213369
39378A213369k763261J493705M398411L999262K015867R86814P30542r42006m100176
$$ 1213369 -1549892 -56187 4342224 8341486 10357353 11344167 12074709 11132703 7032527
39369G032527n363834k237015K702855M454666J848811j662235l262715l305364
$$ 7032527 1668693 -568322 2134533 6589199 8438010 6775775 3513060 207696
39361B07696k140509J149381M961306M773137r1770l580356j217416K722347J945429
$$ 207696 -1932813 -783432 4177874 8951011 8859241 5278885 4061469 6783816 8729245
39352H729245j652810j690891J417800J438632k319276l767685j009135O98438
$$ 8729245 7076435 5385544 6803344 8241976 5922700 2155015 1145880 1844318
39344A844318p81338n44406L173869M158080p62790m461188p86031M295595J915450
$$ 1844318 1062980 518574 3692443 7850523 7087733 2626545 1840514 6136109 8051559
39335H051559m923456n955327K51737N146109M096264J633490J798729J916676
$$ 8051559 3128103 -2827224 -2575487 2570622 6666886 8300376 10099105 12015781
39327A2015781j105767m678426m332257L7375M270403M372062J40863m222181
$$ 12015781 10910014 6231588 1899331 1936706 6207109 10579171 10720034 6497853
39319F497853m067243k70911J402292j040650k335138R52638L462820k22172n140112
$$ 6497853 2430610 2159699 3561991 2521341 186203 1138841 4601661 4379489 -760623
39310g60623l346684K162539J990816l158561l118587L843631P003291J011546
$$ -760623 -4107307 -1944768 46048 -3112513 -6231100 -2387469 4615822 5627368
39302E627368m801478j805220M089117L010557k887504m374526l79679K306285
$$ 5627368 825890 -979330 3109787 6120344 3232840 -1141686 -1521365 784920
39294G84920J361287Q16467J681997J8926m622120o549792k201771M275641O305608
$$ 784920 2146207 2962674 4644671 4663597 41477 -6508315 -8710086 -4434445 1871163
39285A871163K400496l333219n847302l272812J887894N184399M730591K660964
$$ 1871163 4271659 938440 -4908862 -8181674 -6293780 -1109381 3621210 6282174
39277F282174J420401O72282n34988j159455l69091K9148j415343k408212j32819
$$ 6282174 7702575 8374857 7839869 6680414 6311323 6340471 4925128 2516916 2384097
39268B384097L696140M748712J974158j918307m725455n814475m108244O22663
$$ 2384097 6080237 10828949 12803107 10884800 6159345 344870 -3763374 -3140711
39260c140711M881140M385391K92701j768511K62962K104450J07003l073963k819792
$$ -3140711 1740429 6125820 6418521 4650010 4912972 7017422 7124425 4050462 1230670
39251A230670L41274J841025J42709j226308N23569K761267J087666l700349n742808
$$ 1230670 1571944 3412969 3555678 2329370 2852939 5614206 6701872 3001523 -2741285
39242b741285k091182K662179K565956j139761k054186J503528M003675J462822
$$ -2741285 -4832467 -2170288 395668 -744093 -2798279 -1294751 2708924 4171746
39234D171746k558557k909737m60668N86890k19864j81632R35698J067663N66358
$$ 4171746 1613189 -1296548 -1757216 -1170326 -1390190 -1571822 -636124 431539 997897
39225I97897J597800L114206J595131k552876m295622j285025K464796K505645
$$ 997897 2595697 5709903 7305034 4752158 456536 -828489 1636307 4141952
39217D141952q9782j509325j001383n18092m12905Q45015L065640L658049J374175
$$ 4141952 4052170 2542845 1541462 1023370 610465 1455480 4521120 8179169 9553344
39208I553344j445410j789101j0407O94917j288055l697018l378477m42608K060301
$$ 9553344 8107934 6318833 6308426 7003343 5715288 2018270 -1360207 -1802815 257486
39199B57486K091717N06077r04725j293869m35123J369282K458350J094416j580760
$$ 257486 2349203 2855280 1950555 656686 221563 1590845 4049195 5143611 3562851
39190C562851k221970L6534K197495K020365R31290M12925q98524l451309l756014
$$ 3562851 1340881 1377415 3574910 5595275 6526565 6939490 6040966 2589657 -1166357
39181a166357M30285M835572M049749J66929k23308L207679L885435o72939m520967
$$ -1166357 -736072 4099500 8149249 8316178 8092870 11300549 15185984 14513045 9992078
39172I992078k915734K83021l52772k622696q70285L797878M540220o03844n673474
$$ 9992078 7076344 7359365 7006593 4383897 3513612 7311490 11851710 11247866 5574392
39163E574392n628543k680311j212650r97543N88656K755010K593033Q16569J056444
$$ 5574392 -54151 -2734462 -3947112 -4944655 -4355999 -1600989 992044 1808613 2865057
39154B865057L140934K277012k940889o422550k556314M892619P022877J592726
$$ 2865057 6005991 8283003 5342114 -1080436 -3636750 1255869 8278746 9871472
39146I871472m690518n686996k493998N80302J906884K036322J103492m71599
$$ 9871472 5180954 -506042 -3000040 -2419738 -512854 1523468 2626960 2155361
39138B155361j306572j156286j156608o93252K279966O065525N152083j388708
$$ 2155361 848789 -307497 -1464105 -2157357 122609 6188134 11340217 9951509
39130I951509o221185l276355L090359M370509K00686k485841q47060Q31196l48925
$$ 9951509 3730324 453969 3544328 7914837 8115523 5629682 4782622 5613818 5264893
39121E264893j486754P8089K120000J700846k54796j251328r93714o92945r48853
$$ 5264893 3778139 3856228 5976228 7677074 7422278 6170950 5177236 4484291 3535438
39112C535438j694188k199197q54407K378439L687033l98933o445719o851659
$$ 3535438 1841250 -357947 -1212354 1166085 4853118 4454185 -1991534 -8843193
39104h843193n36190M530320K393487k390124j883870L488583O219035L005710
$$ -8843193 -9379383 -4849063 -2455576 -4845700 -6729570 -3240987 2978048 5983758
39096E983758j339405j867712j28846k87921k149204j836860J750096M904397
$$ 5983758 4644353 2776641 2647795 2359874 210670 -1626190 123906 5028303
39088E028303M309022J348231p15727j599598k949567l859001j687629K520068
$$ 5028303 9337325 10685556 9969829 8370231 5420664 1561663 -125966 2394102
39080B394102M016015J240399j649773j426887m50619j382491j844986Q85237
$$ 2394102 6410117 7650516 6000743 4573856 4123237 2740746 895760 1780997
39072A780997L764937K381627j405187k446089q11231p78036k784974l252274
$$ 1780997 5545934 7927561 6522374 4076285 3265054 2487018 -297956 -3550230
39064c550230j666253q68140n86903K038565N304687M099279p61640k451320O28595
$$ -3550230 -5216483 -6084623 -6671526 -4632961 671726 4771005 4009365 1558045 2186640
39055B186640J873575k068005n269508k728449J203702P97313j369603n1629K665111
$$ 2186640 4060215 1992210 -3277298 -6005747 -4802045 -4004732 -5374335 -5425964 -2760853
39046b760853J290750k542600k068638L274817O409674L240171j817693k865953
$$ -2760853 -1470103 -4012703 -6081341 -2806524 3603150 6843321 5025628 2159675
39038B159675j59451J909412J207063o59291j771063k120369k133646r28417K081164
$$ 2159675 2000224 3909636 5116699 4457408 2686345 565976 -1567670 -2496087 -414923
39029d14923M493112K887202j491280k676921J619432N403195K734069k948269
$$ -414923 4078189 6965391 5474111 2797190 4416622 9819817 12553886 9605617
39021I605617m164477j113523o3891j868514j487580J354439J413669r60428Q64807
$$ 9605617 5441140 4327617 4263726 2395212 907632 2262071 3675740 2715312 3580119
39012C580119O424968N972028l016276q940656l473761M938266M650520j562019
$$ 3580119 10005087 15977115 12960839 4020183 546422 5484688 10135208 8573189
39004H573189l668733j262255p92715j847817O64361M395551K598699k740330
$$ 8573189 4904456 3642201 2849486 1001669 1666030 6061581 8660280 5919950
38996E919950l140201J937850M626652K377777O59181J453778M70240k668213
$$ 5919950 2779749 4717599 9344251 11722028 12381209 13834987 14305227 11637014
38988A1637014k521698J419282K584200r07198k414105J258343L693668j10147
$$ 11637014 9115316 10534598 13118798 12211600 9797495 11055838 14749506 14639359
38980A4639359n077298m546137m68893J248690J52492k37152O76483P76172k63515
$$ 14639359 9562061 5015924 4547031 5795721 5948213 5711061 6387544 7163716 6900201
38971F900201j010393q80378P8330J807586K896661J444043j475352k578327j551493
$$ 6900201 5889808 5009430 5087760 6895346 9792007 11236050 9760698 7182371 5630878
38962E630878j409737k700040k083653J678452N023794M883194K443008n2420
$$ 5630878 4221141 1521101 -562552 1115900 6139694 11022888 13465896 13413476
38954A3413476j923593k095303O47777L822177K732222k310805n408987l730684
$$ 13413476 11489883 9394580 10042357 13864534 16596756 14285951 8876964 5146280
38946E146280j278185j591729k436127j023736Q96305J073836J125630K741600
$$ 5146280 3868095 2276366 -159761 -1183497 -287192 786644 1912274 4653874
38938D653874L613177J314965k052275k890532j140414O72713R83070k63555j950665
$$ 4653874 8267051 9582016 7529741 4639209 3498795 4171508 5154578 4891023 2940358
38929B940358j632165J560288L647535L61786m848927m050793K706685O010358
$$ 2940358 1308193 2868481 6516016 6877802 2028875 -2021918 684767 6695125
38921F695125J072506n060605m831248q72575N66177j40712O03353J747049N93937
$$ 6695125 7767631 2707026 -2124222 -2996797 -2430620 -2571332 -1967979 -220930 373007
38912C73007q47027L15299J595821m14307l036233j859026J315525J861970N20348
$$ 373007 -474020 -158721 1437100 1022793 -2013440 -3872466 -2556941 -694971 -174623
38903a74623J118695K941632K541101O76669K85549j32935l692709p663617o460471
$$ -174623 944072 3885704 6426805 7103474 7389023 7256088 3563379 -4100238 -10560709
38894a0560709p45152L722038M942836N089360L783484p02949m595204k099891
$$ -10560709 -11305861 -7583823 -2640987 2448373 6231857 5528908 933704 -1166187
38886a166187M037720M720168j389092n213615j437960L681232L034994q35119
$$ -1166187 2871533 7591701 6202609 988994 -448966 3232266 6267260 5432141
38878E432141j772851j95128n28569k654615k609734K51217K508483K345597J422281
$$ 5432141 3659290 3464162 2935593 280978 -2328756 -2077539 430944 2776541 4198822
38869D198822J098187M18284j362518k698090j530587J702732L916659K625764
$$ 4198822 5297009 5715293 4352775 1654685 124098 1826830 5743489 8369253
38861H369253j019821l439652k944263j269851k78721N41742J819742K104823
$$ 8369253 7349432 3909780 965517 -304334 -583055 -41313 1778429 3883252
38853C883252L97381j287793p49628Q34802J074482K24163j87979n72547j679088
$$ 3883252 4280633 2992840 2243212 3078014 4152496 4376659 4188680 3616133 1937045
38844A937045j832650L45856K337597J067912j752154j978257O76338L033269
$$ 1937045 104395 450251 2787848 3855760 2103606 125349 801687 3834956
38836C834956L684634L404637J909710j057308k937289j531103O53880K07445
$$ 3834956 7519590 10924227 12833937 11776629 8839340 7308237 7962117 8169562
38828H169562j166578j04177J378015q95805n001663n419910k267944n9035J196867
$$ 8169562 7002984 6898807 8276822 7381017 2379354 -3040556 -5308500 -5367535 -4170668
38819d170668M562268P080308K802103m945442n966129M34070L730606l7207j977929
$$ -4170668 391600 7471908 10274011 5328569 -637560 -203490 3527116 3489909 1511980
38810A511980K710927N197744r60395o971092l464861K811409O50215n720931
$$ 1511980 4222907 9420651 8460256 1489164 -1975697 835712 1485927 -4235004
38802d235004l930219M702780P127405N88309l516538O49118M739645J660091
$$ -4235004 -8165223 -3462443 3664962 4253271 736733 1385851 6125496 7785587
38794G785587l336509l334252r62076j400685k419235M19441M399676L682904
$$ 7785587 4449078 1114826 152750 -1247935 -3667170 -3247729 1151947 4834851
38786D834851p38323k484042M67816L668285L365190Q22799r01233q95232k97875
$$ 4834851 4096528 1612486 2080302 5748587 9113777 9936576 9035343 8140111 7842236
38777G842236l53379j140762j462850l26029J273474J343918j27861j212454j377254
$$ 7842236 7488857 6348095 4885245 4559216 5832690 7176608 7048747 5836293 4459039
38768D459039k003666k754067j017571K989371M339785J79716m626914l420250
$$ 4459039 2455373 -298694 -1316265 1673106 6012891 6192607 1565693 -1854557
38760a854557K374006M786933P35457l778253k909053O76560Q12824k136127j915884
$$ -1854557 519449 5306382 6041839 2263586 -645467 31093 843917 -1292210 -3208094
38751c208094L428468P614056M770103j921392m377294o98508K747315J015955
$$ -3208094 220374 7834430 12604533 10683141 6305847 5607339 8354654 9370609
38743I370609k356313j293943L002660L476265j955376o603545m384588J567250
$$ 9370609 7014296 5720353 8723013 12199278 10243902 3640357 -744231 823019
38735H23019L882182J507493k18647J194004K352137J090325L73120K142521K807184
$$ 823019 4705201 6212694 5994047 7188051 9540188 10630513 11003633 13146154 15953338
38726A5953338n60268m067752k848978M48861j8265k827387j392474L944841M995738
$$ 15953338 15393070 11325318 8476340 8925201 8906936 6079549 4687075 8631916 13627654
38717A3627654j169972o994872o180233k449072j113646K88116N254629Q698882
$$ 13627654 12457682 5462810 -717423 -3166495 -4280141 -3992025 1262604 9961486
38709I961486L864170m907229o735489l89017M046857N25209n109162n235237
$$ 9961486 13825656 8918427 2182938 1793921 5840778 6365987 1256825 -3978412
38701c978412p05018K736238K460596k52134l041484l194691O80336N610018O558338
$$ -3978412 -4683430 -1947192 513404 261270 -2780214 -5974905 -5294569 315449 6873787
38692F873787L129125j59359j147535k338380m612936m803466k113498p44107
$$ 6873787 10002912 9843553 8696018 6357638 1744702 -3058764 -5172262 -5916369
38684e916369k430323k327794K825445P764828N884846n40130l670441j225991
$$ -5916369 -8346692 -10674486 -7849041 -84213 5800633 5260503 1590062 364071
38676C64071J802943J445335p42349j582415n35115P16056O31311n09938n57946
$$ 364071 2167014 3612349 2870000 1287585 752470 1468526 2099837 1589899 1031953
38667A031953J713215L682400J716481k612541l582055q8099K035945o50666l428677
$$ 1031953 2745168 6427568 8144049 5531508 1949453 1861354 3897299 3246633 -182044
38658a82044j550619J528576L34574k839094j829732K724716M438418J396721
$$ -182044 -1732663 -204087 130487 -2708607 -4538339 -1813623 2624795 4021516
38650D021516k079616l235341l450228l125725p62064K362798K859891J262092
$$ 4021516 1941900 -1293441 -4743669 -7869394 -8631458 -6268660 -3408769 -2146677
38642b146677J424690L316386K751025o44501j928290O66907K400813K90445j534501
$$ -2146677 -721987 2594399 5345424 4700923 2772633 3439540 5840353 6130798 4596297
38633D596297R67811M464756L418655j179730l746668k586325j204690j960379
$$ 4596297 5564108 10028864 13447519 12267789 8521121 5934796 4730106 2769727
38625B769727l027304k198465k97415N25958L7741N9116J734054L474115K432999
$$ 2769727 -257577 -2456042 -2753457 -2227499 -2189758 -2130642 -396588 3077527 5510526
38616E510526j578630m762144l444952J160009M348384L797831J718738R59898
$$ 5510526 3931896 -830248 -4275200 -3115191 1233193 5031024 6749762 7709660
38608G709660J410455J146309p00349l187521m533476l493601p97810J068156
$$ 7709660 9120115 10266424 9566075 6378554 1845078 -1648523 -2446333 -1378177
38600a378177P96110J84571J353035L160581L001980J164542N4591l14810k058249
$$ -1378177 -582067 -397496 955539 4116120 7118100 8282642 8337233 8022423 5964174
38591E964174m495927l927553L50993L890196L106834O3729j257481n02927J67491
$$ 5964174 1468247 -2459306 -2108313 1781883 4888717 4952446 3694965 3192038 3359529
38582C359529L80798J279679K155371P86451k722911n065801l695486j80917J728919
$$ 3359529 3740327 5020006 7175377 7961828 5238917 173116 -3522370 -3703287 -1974368
38573a974368R15586J16308J467802K520627m36597n565475o382585j127957L542361
$$ -1974368 -1058782 -942474 525328 3045955 2609358 -2956117 -9338702 -10466659 -6924298
38564f924298K005359j632461j03119N202333O665799L099933J132226L215439
$$ -6924298 -4918939 -6551400 -6654519 -1452186 5213613 8313546 9445772 12661211
38556A2661211L388514j781565o367341m377236Q53279K621774Q26914m25510
$$ 12661211 16049725 14268160 7900819 3523583 4376862 6998636 7825550 7400040
38548G400040o53105j492748r86715L052196O335444K748877n094400p784479
$$ 7400040 6746935 5254187 4267472 7319668 13655112 16403989 11309589 3525110
38540C525110k278700M040551M204536N9336k845813l072515k353734j218018
$$ 3525110 1246410 5286961 9491497 9550833 6705020 3632505 1278771 60753
38532F0753L76805Q72156p75022k583269j983203O31645K863628L300987J907271
$$ 60753 437558 1309714 534692 -2048577 -4031780 -3400135 -536507 2764480 4671751
38523D671751o80688k609563j751135J038030K064162J71132j084047O29316J853499
$$ 4671751 3991063 1381500 -369635 668395 2732557 2903689 1819642 2448958 4302457
38514D302457r71642m430483k719525K531419M104122O70279j328405J042418
$$ 4302457 3330815 -1099668 -3819193 -1287774 2816348 3486627 2158222 3200640
38506C200640K229079j430703m167486l38941M786407K617066m448657o318690
$$ 3200640 5429719 3999016 -168470 -507411 4278996 6896062 2447405 -3871285
38498c871285j170646K454806K90954j614097J128573L300080P7615l445295o61903
$$ -3871285 -5041931 -2587125 -2296171 -3910268 -2781695 518385 596000 -2849295 -3511198
38489c511198M754965M310312j776782n263200k426600K034352L271911J587099
$$ -3511198 1243767 5554079 3777297 -1485903 -3912503 -1878151 1393760 2980859
38481B980859p62346k183196r78026K835227N185262K559687j853462k364721
$$ 2980859 2218513 35317 -942709 1892518 7077780 9637467 7784005 5419284
38473E419284j2592n65125l796847l207993K207039M777929K89699m771588l316973
$$ 5419284 5406692 4841567 1044720 -2163273 43766 4821695 5111394 339806 -2977167
38464b977167J685463K889075j41580j968835l10149K201939L284541K719743
$$ -2977167 -1291704 1597371 1455791 -513044 -823193 1378746 4663287 7383030
38456G383030K96674l377846n317218l437194r7547J178268P83735J144307J736338
$$ 7383030 7679704 4301858 -1015360 -4452554 -4550101 -3371833 -2588098 -1443791 292547
38447B92547L25941k209392k760602r94351N49805Q64481J218246J920221J945296
$$ 292547 618488 -1590904 -4351506 -5345857 -4796052 -3931571 -2713325 -793104 1152192
38438A152192J491739J581726J556586K53217j014760k32697J310371Q39216o98633
$$ 1152192 2643931 4225657 5782243 6035460 5020700 4788003 6098374 6937590 6238957
38429F238957K6961K229290J322007l061689n080892j546788K429438J032447
$$ 6238957 6265918 8495208 9817215 6755526 1674634 127846 2557284 3589731
38421C589731l081681k933082J744855M194458J436537j174889J122064M479919
$$ 3589731 508050 -2425032 -680177 3514281 4950818 3775929 4897993 9377912
38413I377912K431363l259369m294251J604152O277444K288417o319294r324016
$$ 9377912 11809275 8549906 4255655 5859807 12137251 14425668 8106374 -1217642
38405a217642l825917L069103M534532J602766q19229r47586m35125n67939r95359
$$ -1217642 -5043559 -1974456 2560076 4162842 3343613 2396027 1960902 1392963 397604
38396C97604r34800R1938J635371J721350j200209m958016m897023J24032N416906
$$ 397604 -537196 -445258 1190113 2911463 1711254 -3246762 -8143785 -8019753 -2602847
38387b602847N949801J997885k381824m141094k545439J696560N895941O121858
$$ -2602847 3346954 5344839 2963015 -1178079 -3723518 -2026958 3868983 9990841
38379I990841J552287l366179l905676q79584J200131L33751j628749k687925
$$ 9990841 11543128 8176949 4271273 3391689 4591820 4925571 3296822 608897
38371F08897k462121r19136J504071K860718J720258q6738K26895J651096N06241
$$ 608897 -1853224 -2772360 -1268289 1592429 3312687 3225949 3452844 5103940 5610181
38362E610181l231957m631135o96157M611164N248463J214349j676306O1606L116852
$$ 5610181 2378224 -2252911 -2949068 1662096 6910559 8124908 6448602 6510208 9627060
$$ [...]
##END NTUPLES=NMR SPECTRUM
##END=
