##TITLE=31Pdec_SR88_rm4
 , 24 sc
 20.09.2021
##JCAMPDX= 6.0         $$ Bruker NMR JCAMP-DX V2.0
##DATA TYPE= NMR SPECTRUM
##DATA CLASS= NTUPLES
##ORIGIN= UXNMR, Bruker Analytische Messtechnik GmbH
##OWNER= root
$$ XWIN-NMR		Version 3.5
$$ Mon Sep 20 13:33:59 2021 Russian Standard Time (UT+4h)  she@DPX200
##.OBSERVE FREQUENCY= 81.013821
##.OBSERVE NUCLEUS= ^31P
##.ACQUISITION MODE= SIMULTANEOUS
##.ACQUISITION SCHEME= undefined
##.AVERAGES= 24
##.DIGITISER RES= 16
##SPECTROMETER/DATA SYSTEM= spect
##.PULSE SEQUENCE= zgpg30
##.SOLVENT NAME= CDCl3
##.SHIFT REFERENCE= (INTERNAL, CDCl3, 0, 248.564)
##AUDIT TRAIL= $$ (NUMBER, WHEN, WHO, WHERE, WHAT)
$$ ##TITLE= Audit trail, XWIN-NMR		Version 3.5
$$ ##JCAMPDX= 5.01
$$ ##ORIGIN= Bruker BioSpin GmbH
$$ ##OWNER= she
$$ F:/spectra/data/she/nmr/P31/1/pdata/1/auditp.txt
$$ ##AUDIT TRAIL=  $$ (NUMBER, WHEN, WHO, WHERE, WHAT)
(   1,<2021-09-20 13:33:03.71 +0400>,<she>,<DPX200>,
      <created by zg, POWCHK disabled, PULCHK disabled
       configuration hash MD5:
       00 E9 B6 7A A2 85 ED C7 34 08 36 98 17 FE 4E 26
       data hash MD5: 32K
       C6 24 F3 7A 99 38 03 5F 46 AF B8 AC 31 89 D8 AB>)
(   2,<2021-09-20 13:33:06.00 +0400>,<she>,<DPX200>,
      <Start of raw data processing
       efp BC_mod = 2 LB = 1 FT_mod = 6 PKNL = 1 PHC0 = -8007.002 PHC1 = -184.9298 SI = 64K 
       data hash MD5: 64K
       B9 01 9B CF 26 14 2B A3 36 FB D7 A3 EB FD A5 C0>)
(   3,<2021-09-20 13:33:34.53 +0400>,<she>,<DPX200>,
      <pk PHC0 = -102.2636 PHC1 = 262.7997 
       data hash MD5: 64K
       09 63 1F 1C 8F C3 70 09 8C 88 D7 8B A4 E5 9C 8D>)
$$ ##END=
$$ 
$$ hash MD5
$$ 80 F7 7E 78 01 48 5A 6E F3 A2 C3 4C D3 07 BC 90
##$RELAX= 
##$RELAX= 
##$RELAX= 
##$RELAX= 
##$RELAX= 
##$RELAX= 
##$RELAX= 
##$RELAX= 
$$ Bruker specific parameters
$$ --------------------------
##$DU= <F:/spectra>
##$EXPNO= 1
##$NAME= <P31>
##$PROCNO= 1
##$TYPE= <nmr>
##$USER= <she>
##$AMP= (0..31)
100 100 100 100 100 100 100 100 100 100 100 100 100 100 100 100 100 100 
100 100 100 100 100 100 100 100 100 100 100 100 100 100 
##$AQSEQ= 0
##$AQ_mod= 1
##$AUNM= <au_zg>
##$AUTOPOS= <>
##$BF1= 81.014009
##$BF2= 200.13
##$BF3= 200.13
##$BF4= 200.13
##$BF5= 200.13
##$BF6= 200.13
##$BF7= 200.13
##$BF8= 200.13
##$BYTORDA= 1
##$CFDGTYP= 0
##$CFRGTYP= 5
##$CHEMSTR= <none>
##$CNST= (0..31)
1 1 145 1 1 1 1 1 1 1 1 1 1 1 1 1 1 1 1 1 1 1 1 1 1 1 1 1 1 1 1 1 
##$CPDPRG= <waltz16>
##$CPDPRG1= <>
##$CPDPRG2= <waltz16>
##$CPDPRG3= <>
##$CPDPRG4= <mlev>
##$CPDPRG5= <mlev>
##$CPDPRG6= <mlev>
##$CPDPRG7= <mlev>
##$CPDPRG8= <mlev>
##$CPDPRGB= <>
##$CPDPRGT= <>
##$D= (0..31)
0 1 0 0 0 0 0 0 0 0 0 0.03 2e-05 3e-06 0 0 0 0 0 0 0 0 0 0 0 0 0 0 0 0 
0 0 
##$DATE= 1632130383
##$DBL= (0..7)
120 120 120 11 120 120 24 19 
##$DBP= (0..7)
150 150 150 150 150 150 150 150 
##$DBP07= 0
##$DBPNAM0= <>
##$DBPNAM1= <>
##$DBPNAM2= <>
##$DBPNAM3= <>
##$DBPNAM4= <>
##$DBPNAM5= <>
##$DBPNAM6= <>
##$DBPNAM7= <>
##$DBPOAL= (0..7)
0.5 0.5 0.5 0.5 0.5 0.5 0.5 0.5 
##$DBPOFFS= (0..7)
$$ [...]
##$SUBNAM2= <"">
##$SUBNAM3= <"">
##$SUBNAM4= <"">
##$SUBNAM5= <"">
##$SUBNAM6= <"">
##$SUBNAM7= <"">
##$SUBNAM8= <"">
##$SUBNAM9= <"">
##$SW= 501.771253377433
##$SWIBOX= (0..15)
0 1 3 0 0 0 0 0 0 0 0 0 0 0 0 0 
##$SW_h= 40650.406504065
##$TD= 32768
##$TD0= 1
##$TE= 0
##$TE2= 300
##$TE3= 300
##$TEG= 300
##$TL= (0..7)
0 120 53 12 22 120 120 120 
##$TP= (0..7)
150 150 150 150 150 150 150 150 
##$TP07= 0
##$TPNAME0= <>
##$TPNAME1= <>
##$TPNAME2= <>
##$TPNAME3= <>
##$TPNAME4= <>
##$TPNAME5= <>
##$TPNAME6= <>
##$TPNAME7= <>
##$TPOAL= (0..7)
0.5 0.5 0.5 0.5 0.5 0.5 0.5 0.5 
##$TPOFFS= (0..7)
0 0 0 0 0 0 0 0 
##$TUNHIN= 0
##$TUNHOUT= 0
##$TUNXOUT= 0
##$USERA1= <user>
##$USERA2= <user>
##$USERA3= <user>
##$USERA4= <user>
##$USERA5= <user>
##$V9= 5
##$VALIST= <valist>
##$VCLIST= <CCCCCCCCCCCCCCC>
##$VD= 0
##$VDLIST= <DDDDDDDDDDDDDDD>
##$VPLIST= <PPPPPPPPPPPPPPP>
##$VTLIST= <TTTTTTTTTTTTTTT>
##$WBST= 1024
##$WBSW= 4
##$XGAIN= (0..3)
0 0 0 0 
##$XL= 0
##$YL= 0
##$YMAX_a= 6548
##$YMIN_a= -10126
##$ZGOPTNS= <>
##$ZL1= 120
##$ZL2= 120
##$ZL3= 120
##$ZL4= 120
##$ABSF1= 0
##$ABSF2= 0
##$ABSG= 0
##$ABSL= 0
##$ALPHA= 0
##$AQORDER= 0
##$ASSFAC= 0
##$ASSFACI= 0
##$ASSFACX= 0
##$ASSWID= 0
##$AUNMP= <proc_1d>
##$AZFE= 0.1
##$AZFW= 0.5
##$BCFW= 0
##$BC_mod= 2
##$BYTORDP= 0
##$COROFFS= 0
##$CY= -3
##$DATMOD= 1
##$DC= 0
##$DFILT= <>
##$DTYPP= 0
##$F1P= 0
##$F2P= 0
##$FCOR= 1
##$FTSIZE= 65536
##$FT_mod= 6
##$GAMMA= 0
##$GB= 0
##$INTBC= 1
##$INTSCL= 5.30512e-09
##$ISEN= 30
##$LB= 1
##$LEV0= 0
##$LPBIN= 0
##$MAXI= 10000
##$MC2= 0
##$MEAN= 0
##$ME_mod= 0
##$MI= 50
##$NCOEF= 0
##$NC_proc= -8
##$NLEV= 6
##$NOISF1= 182.463
##$NOISF2= 159.3651
##$NSP= 0
##$NTH_PI= 0
##$NZP= 0
##$OFFSET= 248.5645
##$PC= 4
##$PHC0= -8109.266
##$PHC1= 77.86992
##$PH_mod= 1
##$PKNL= yes
##$PPARMOD= 0
##$PSCAL= 0
##$PSIGN= 0
##$REVERSE= no
##$SF= 81.014009
##$SI= 65536
##$SIGF1= 159.3651
##$SIGF2= -187.1042
##$SINO= 113.3802
##$SIOLD= 16384
##$SREGLST= <1H.CDCl3>
##$SSB= 0
##$STSI= 65536
##$STSR= 0
##$SW_p= 40650.406504065
##$SYMM= 0
##$S_DEV= 0
##$TDeff= 32768
##$TDoff= 0
##$TI= <>
##$TILT= no
##$TM1= 0
##$TM2= 0
##$TOPLEV= 0
##$USERP1= <user>
##$USERP2= <user>
##$USERP3= <user>
##$USERP4= <user>
##$USERP5= <user>
##$WDW= 1
##$XDIM= 65536
##$YMAX_p= 228513913
##$YMIN_p= -380260315
$$ End of Bruker specific parameters
$$ ---------------------------------
##NTUPLES= NMR SPECTRUM
##VAR_NAME=  FREQUENCY,     SPECTRUM/REAL,   SPECTRUM/IMAG
##SYMBOL=    X,             R,               I
##VAR_TYPE=  INDEPENDENT,   DEPENDENT,       DEPENDENT
##VAR_FORM=  AFFN,          ASDF,            ASDF
##VAR_DIM=   65536,         65536,           65536
##UNITS=     HZ,            ARBITRARY UNITS, ARBITRARY UNITS
##FACTOR=    0.620285442955139, 1,           1
##FIRST=     20137.2065510759, 0,            0
##LAST=      -20513.1999529892, 0,           0
##MIN=       -20513.1999529892, -380260315,  0
##MAX=       20137.2065510759, 228513913,    0
$$ Real data points
##PAGE= N=1
##DATA TABLE= (X++(R..R)), XYDATA
$$ [...]
##PAGE= N=2
##DATA TABLE= (X++(I..I)), XYDATA
$$ plain form
13016 1276441 4576964 3740898 -513659 -3252183 -3135575 -2909392 -3561039 -3398537 -2542954
13007 -2542954 -3004429 -3759630 -935363 5520572 9951016 8155628 2759968 -1151696
12999 -1151696 -2533806 -3507815 -4612999 -4446246 -2725616 -749008 524806 788708 -140702
12990 -140702 -1226575 -172992 2997965 3995438 -633979 -7423375 -9160023 -4335593
12982 -4335593 768331 650413 -2822431 -4682294 -4025894 -3406386 -3704939 -3817367 -4046911
12973 -4046911 -5467604 -6391306 -3885184 804984 2749537 467356 -1736805 -537079
12965 -537079 1683729 1993753 2630667 6790587 11510453 10444041 2888144 -5077237 -8402857
12956 -8402857 -7371007 -4025355 547583 4186898 3797154 -247950 -3639807 -4048007
$$ packed form
13016A276441L300523q36066m254557k738524J16608K26183o51647J62502Q55583
13007b542954m61475p55201K824267O455935M430444j795388n395660l911664
12999a151696j382110r74009j105184J66753J720630J976608J273814K63902r29410
12990a40702j085873J053583L170957R97473m629417o789396j736648M824430
12982d335593N103924j17918l472844j859863O56400O19508k98553j12428k29544
12973d046911j420693r23702K506122M690168J944553k282181k204161J199726
12965e37079K220808L10024O36914M159920M719866j066412p555897p965381l325620
12956h402857J031850L345652M572938L639315l89744m045104l391857m08200
$$ plain form
12948 -4048007 -3781423 -4666568 -4654980 -2483574 -1441286 -4300294 -7778062 -6799356 -2081553
12939 -2081553 1278093 1325935 624596 866747 866975 175730 446368 2058493 2526906 -339561
12929 -339561 -5497012 -9448250 -8794591 -2774929 4894685 7900319 3660674 -3148691
12921 -3148691 -6142900 -5092157 -4738231 -6790678 -7755880 -5167816 -1400723 475454
12913 475454 966168 1889562 2474103 479544 -3834670 -6935887 -5424355 207649 5485810
12904 5485810 6586788 5168825 6205969 9978074 10156918 3251109 -4173962 -3702836
12896 -3702836 2328464 4218309 -73499 -2321462 1947717 6081093 3342469 -2691914
12888 -2691914 -5053875 -4285176 -4921878 -5792825 -2301072 4003741 6462664 3502363 441441
$$ packed form
12948d048007K66584q85145J1588K171406J042288k859008l477768R78706M717803
12939b081553L359646M7842p01339K42151K28o91245K70638J612125M68413k866467
12929c39561n157451l951238O53659O019662P669614L005634m239645o809365
12921c148691k994209J050743L53926k052447r65202K588064L767093J876177
12913D75454M90714R23394N84541j994559m314214l101217J511532N632004N278161
12904E485810J100978j417963J037144L772105J78844o905809p425071M71126
12896c702836O031300J889845m291808k247963M269179M133376k738624o034383
12888b691914k361961P68699o36702q70947L491753O304813K458923k960301l060922
$$ plain form
12879 441441 539987 1032501 -308422 -831384 1941280 5747753 7330060 7056683 6474279
12870 6474279 4288805 -1190455 -7142159 -7837630 -1535372 6848081 10819146 8497824
12862 8497824 3021050 -1721373 -4147884 -4399274 -3027299 -1442807 -1963764 -5138297
12854 -5138297 -7749487 -6203573 -1904921 -121510 -2629375 -4919772 -2808821 1354102
12846 1354102 2378350 -99444 -1675930 -77619 1997698 1489751 -688045 -1323340
12838 -1323340 748386 3234026 2975601 -309884 -3186554 -2484539 89533 -194509 -3995481
12829 -3995481 -6215497 -3588279 -74663 -673922 -3156241 -1643796 3437690 5663383
12821 5663383 2861001 228959 1339609 2369262 -968098 -5645623 -5402682 156765
$$ packed form
12879D41441R8546M92514j340923n22962K772664L806473J582307k73377n82404
12870F474279k185474n479260n951704o95471O302258Q383453L971065k321322
12862H497824n476774m742423k426511k51390J371975J584492n20957l174533
12854e138297k611190J545914M298652J783411k507865k290397K110951M162923
12846A354102J024248k477794j576486J598311K075317n07947k177796o35295
12838a323340K071726K485640k58425l285485k876670P02015K574072k84042l800972
12829c995481k220016K627218L513616n99259k482319J512445N081486K225693
12821E663383k802382k632042J110650J029653l337360m677525K42941N559447
$$ plain form
12813 156765 5238670 5500124 2270714 -499147 -648933 913566 1547956 -434234 -3582820
12804 -3582820 -4780243 -3603408 -3270192 -5770454 -8267253 -6775287 -1737508 2868708
12796 2868708 4768076 4704464 3398555 734997 -1890306 -1871846 845320 3064560 2799848
12787 2799848 1994076 2930290 4056013 2002781 -3350323 -8547895 -10962195 -10889427 -9071879
12778 -9071879 -5165380 -210660 1970751 -1278683 -7243807 -10430150 -8922953 -5318724
12770 -5318724 -1700083 2313125 5467285 3454991 -4893312 -13183237 -13910164 -7943942
12762 -7943942 -2970278 -3030935 -4577990 -3592166 -1459682 -1207399 -1893299 -441825 3103706
12753 3103706 5657801 5511217 3917893 2603188 1823575 1033852 219537 333010 2475294
$$ packed form
12813A56765N081905K61454l229410k769861j49786J562499O34390j982190l148586
12804c582820j197423J176835L33216k500262k496799J491966N037779M606216
12796B868708J899368o3612j305909k663558k625303J8460K717166K219240k64712
12787B799848q05772R36214J125723k053232n353104n197572k414300P2768J817548
12778i071879L906499M954720K181411l249434n965124l186343J507197L604229
12770e318724L618641M013208L154160k012294q348303q289925p26927N966222
12762g943942M973664o0657j547055R85824K132484K52283o85900J451474L545531
12753C103706K554095j46584j593324j314705p79613p89723q14315J13473K142284
$$ plain form
12744 2475294 5972818 7697735 5242600 777890 -992340 622453 1134814 -2188679
12736 -2188679 -5987696 -6291297 -4824765 -5616425 -7927378 -7726076 -4879144 -3358736 -4337420
12727 -4337420 -4542073 -2608513 -1873875 -4410960 -6579727 -3908777 2375147 6959648
12719 6959648 6867259 3635641 503075 -261880 1587751 3854143 3567091 672110 -1363172
12710 -1363172 -212292 1937749 1824432 -77174 -1112682 -1221853 -2527231 -4876556
12702 -4876556 -5656652 -4326705 -3590147 -5140269 -7335254 -8281207 -8343207 -8148807 -6916744
12693 -6916744 -4677640 -3512871 -4154983 -3719389 141854 4692463 5327859 2199959 -444264
12684 -444264 -1301734 -3822577 -9670292 -14643481 -14073512 -9376840 -5654013 -4464527 -2896955
$$ packed form
12744B475294L497524J724917k455135m464710j770230J614793N12361l323493
12736b188679l799017l03601J466532p91660k310953K01302K846932J520408r78684
12727d337420k04653J933560P34638k537085k168767K670950O283924M584501
12719F959648r2389l231618l132566p64955J849631K266392k87052k894981k035282
12710a363172J150880K150041j13317j901606j035508j09171j305378k349325
12702d876556p80096J329947P36558j550122k194985r45953o2000J94400J232063
12693f916744K239104J164769o42112M35594L861243M550609O35396l127900k644223
12684d44264q57470k520843n847715m973189N69969M696672L722827J189486J567572
$$ plain form
12675 -2896955 563026 3140610 1998321 -1312678 -2522348 446201 5603538 9222382
12667 9222382 9029986 5520515 929262 -2911202 -5541786 -6691310 -5338863 -1388835
12659 -1388835 2587229 3591654 2105689 1213231 1463465 -239045 -5096437 -8940821
12651 -8940821 -7274283 -1745174 1883717 1285556 -326216 539486 3522085 6073460
12643 6073460 6471949 4194709 -489123 -5991792 -9753144 -9967651 -6447993 -406667
12635 -406667 5191348 6269082 1501075 -4894806 -7399489 -5953255 -4635142 -3781425
12627 -3781425 895400 9408112 13946950 8973508 130404 -3153427 -797235 -541592
12619 -541592 -4735770 -6985219 -3433573 531441 -883871 -4394781 -3092533 2145739
$$ packed form
12675b896955L459981K577584j142289l310999j209670K968549N157337L618844
12667I222382j92396l509471m591253l840464k630584j149524J352447L950028
12659a388835L976064J004425j485965q92458K50234j702510m857392l844384
12651h940821J666538N529109L628891n98161j611772Q65702K982599K551375
12643F073460L98489k277240m683832n502669l761352k14507L519658O041326
12635d06667N598015J077734m768007o395881k504683J446234J318113Q53717
12627c781425M676825Q512712M538838m973442q843104l283831K356192K55643
12619e41592m194178k249449L551646L965014j415312l510910J302248N238272
$$ plain form
12611 2145739 3612359 -1450934 -6316090 -3935994 3826336 9353686 9135889 6726583
12603 6726583 6362623 7229560 5747099 1519163 -1645608 -560036 3604638 7195711
12595 7195711 8188397 7259175 5808887 4357346 2597741 138442 -2524797 -3493315 -1148436
12586 -1148436 2873403 4137924 609505 -4066086 -4789486 -1366586 2171291 3777120
12578 3777120 5313394 8009360 9776802 8696826 6251046 4850780 4161346 2213398
12570 2213398 -1067308 -3616608 -3973722 -2621583 -869892 352945 666051 13587 -1579378
12561 -1579378 -4052855 -6871086 -8958811 -9850765 -10357169 -10941113 -10197837 -6744587 -2046198
12552 -2046198 887953 1367102 1209887 1374753 1235242 1050444 1688696 1587558 -1977104
$$ packed form
12611B145739J466620n063293m865156K380096P762330N527350k17797k409306
12603F726583l63960Q66937j482461m227936l164771J085572M164674L591073
12595G195711R92686r29222j450288j451541j759605k459299k663239r68518K344879
12586a148436M021839J264521l528419m675591p23400L422900L537877J605829
12578C777120J536274K695966J767442j079976k445780j400266o89434j947948
12570B213398l280706k549300l57114J352139J751691J222837L13106o52464j592965
12561a579378k473477k818231k087725q91954n06404n83944P43276L453250M698389
12552b046198K934151M79149j57215J64866j39511j84798O38252j01138l564662
$$ plain form
12543 -1977104 -7515391 -9555602 -6251024 -2421384 -2085880 -2207697 1894372 8247211
12535 8247211 10510130 6796092 1198591 -2803562 -5758872 -8722561 -10435228 -9578051
12527 -9578051 -7518881 -7289064 -10267768 -13930754 -13217680 -6010963 2529841 4327777
12519 4327777 -1568315 -7114253 -5743736 -299637 3033309 3728869 4197959 2503879
12511 2503879 -4348770 -12168416 -13118823 -7169536 -1996216 -1028263 133757 3888546
12503 3888546 5959025 3968782 2578054 4974700 6148786 905988 -6826226 -9571027
12495 -9571027 -7289447 -5760140 -6499467 -5449884 -987534 3165745 3737334 1794136
12487 1794136 -55367 -619847 333894 2164347 2315602 -1847136 -9271189 -15466066 -17041204
$$ packed form
12543a977104n538287k040211L304578L829640L35504j21817M102069O352839
12535H247211K262919l714038n597501m002153k955310k963689j712667Q57177
12527i578051K059170K29817k978704l662986P13074P206717Q540804J797936
12519D327777n896092n545938J370517N444099L332946O95560M69090j694080
12511B503879o852649p819646r50407N949287N173320R67953J162020L754789
12503C888546K070479j990243j390728K396646J174086n242798p732214k744801
12495i571027K281580J529307p39327J049583M462350M153279N71589j943198
12487A794136j849503n64480R53741J830453J51255m162738p424053o194877j575138
$$ plain form
12478 -17041204 -14207214 -8910994 -2973351 1394827 1684378 -2484760 -7596216 -8161657
12470 -8161657 -1413176 9158108 15597068 12870253 4823463 411862 3136878 7219398
12462 7219398 6126150 1456897 -368565 2171577 4305414 2806923 266536 161264
12454 161264 1537528 1095553 -1724848 -4374954 -4937810 -3974742 -2709688 -1305481 107884
12445 107884 -58233 -3348429 -8111352 -10041197 -7418411 -3978540 -3981207 -5859544 -4523460
12436 -4523460 564009 4347807 4109617 3352713 5278827 7198642 5428137 1820954
12428 1820954 417414 455921 -1522866 -4160138 -2063065 5590806 12596590 13226390 8052866
12419 8052866 1029869 -5222892 -9308522 -9652740 -5939323 -351983 4220112 6072692
$$ packed form
12478a7041204K833990N296220N937643M368178K89551m169138n111456n65441
12470h161657O748481J0571284O438960k726815q046790m411601K725016M082520
12462G219398j093248m669253j825462K540142K133837j498491k540387j05272
12454A61264J376264m41975k820401k650106n62856R63068J265054J404207J413365
12445A07884j66117l290196m762923j929845K622786L439871k667j878337J336084
12436d523460N087469L783798k38190p56904J926114J919815j770505l607183
12428A820954j403540L8507j978787k637272K097073P653871P005784O29800n173524
12419H052866p022997o252761m085630l44218L713417N587340M572095J852580
$$ plain form
12411 6072692 4507215 34817 -4547616 -5822999 -3743789 -1734993 -1585211 -769904
12403 -769904 3109969 7435291 7133635 1409551 -4850530 -6808737 -4855457 -3098603
12395 -3098603 -3901929 -5468571 -4901852 -2242194 -133862 86809 154008 2020288 4678588
12386 4678588 5136212 1865472 -3704196 -8484820 -9770668 -6976272 -2364316 776620
12378 776620 1467806 1528972 2245897 2452141 1061560 -696421 -1441694 -2022847 -3522743
12369 -3522743 -4847722 -4861674 -4980864 -6625748 -7885137 -6207022 -2924799 -1299176 -1286008
12360 -1286008 -405608 1139378 834317 -1083849 -1794431 -1264652 -2505317 -5883263 -8302176
12351 -8302176 -9089035 -11165621 -14402323 -13557444 -6311313 1526105 3202165 -188348
$$ packed form
12411F072692j565477m472398m582433j275383K079210K008796J49782Q15307
12403g69904L879873M325322l01656n724084o260081j958207J953280J756854
12395c098603q03326j566642N66719K659658K108332K20671O7199J866280K658300
12386D678588M57624l270740n569668m780624j285848K794396M611956L140936
12378G76620O91186O1166P16925K06244j390581j757981p45273n81153j499896
12369c522743j324979j3952j19190j644884j259389J678115L282223J625623J3168
12360a286008Q80400J544986l05061j918166p10582N29779j240665l377946k418913
12351h302176p86859k076586l236702Q44879P246131P837418J676060l390513
$$ plain form
12343 -188348 -2470013 -1085267 1353862 2020736 103104 -4299092 -9449465 -11404396
12335 -11404396 -8064828 -2893454 -972084 -2295273 -2835046 -1550973 -1861520 -5598522
12327 -5598522 -9566816 -9783986 -6368615 -2490365 -309830 501541 1248981 2334858 2635642
12318 2635642 778113 -2574522 -4587296 -3471837 -790531 969301 1896798 3538867
12310 3538867 5320762 5037377 2758734 1255517 1905611 2707790 1317529 -2001893 -5378028
12301 -5378028 -7427643 -7491391 -5598422 -3204656 -2301306 -2754197 -2141169 681589 3578099
12292 3578099 4172318 3387131 4086240 7079094 10236510 11106415 9016015 5127624 1799777
12283 1799777 1276394 3325199 4532656 1845724 -3105482 -5225409 -2213477 2193909
$$ packed form
12343a88348k281665J384746K439129O66874j917632m402196n150373j954931
12335a1404396L339568N171374J921370j323189n39773J284073l10547l737002
12327e598522l968294k17170L415371L878250K180535Q11371P47440J085877L00784
12318B635642j857529l352635k012774J115459K681306J759832R27497J642069
12310C538867J781895k83385k278643j503217O50094Q02179j390261l319422l376135
12301e378028k049615o3748J892969K393766R03350m52891O13028K822758K896510
12292C578099N94219p85187O99109K992854L157416Q69905k090400l888391l327847
12283A799777n23383K048805J207457k686932m951206k119927L011932M407386
$$ plain form
12275 2193909 2640561 -1404822 -5477992 -6020019 -4394176 -4129383 -5539926 -4998517 64769
12266 64769 6760462 8827259 3391478 -5302723 -9833244 -7116679 -1189180 1636553
12258 1636553 -579953 -4375693 -5709748 -4063292 -1230113 2147965 6679591 11334726
12250 11334726 13248025 11664695 9747958 9995041 9606592 4292949 -3644142 -5958579
12242 -5958579 713849 9057159 9996410 4060599 -1340193 -3539455 -6509333 -11304060
12234 -11304060 -12493504 -7076873 -202747 2692985 3900042 7778970 11836043 10844792
12226 10844792 6836542 6600910 10254423 10946499 6779364 4364752 7583569 10703238
12218 10703238 7506437 938232 -2213534 -1597529 -1979612 -4723852 -6830864 -6926368 -6588650
$$ packed form
12275B193909M46652m045383m073170n42027J625843K64793j410543N41409N063286
12266F4769O695693K066797n435781q694201m530521K716565N927499K825733
12258A636553k216506l795740j334055J646456K833179L378078M531626M655135
12250A1334726J913299j583330j916737K47083l88449n313643p937091k314437
12242e958579O672428Q343310R39251n935811n400792k199262k969878m794727
12234a1304060j189444N416631O874126K895732J207057L878928M057073r91251
12226A0844792m008250k35632L653513O92076m167135k414612L218817L119669
12218A0703238l196801o568205l151766O16005l82083k744240k107012r5504L37718
$$ plain form
12209 -6588650 -6196850 -4230642 -899818 1283666 1004360 -395111 -978990 98714 2262345
12200 2262345 3323603 1098153 -3292950 -6058014 -6356102 -7810980 -11685417 -12810295
12192 -12810295 -6914168 1721321 5791886 5322355 5809049 7912965 6586014 398290
12184 398290 -5489093 -6908730 -5170553 -2735252 -160988 1360892 155888 -1770378
12176 -1770378 -373040 3184013 3005572 -1952704 -5338004 -3208725 195093 157844 -1470193
12167 -1470193 -1557190 -1930673 -4630629 -6139493 -2834793 1805372 2052288 -1146367 -2621133
12158 -2621133 -1701699 -1627377 -2192522 -315426 2668373 1524960 -4163477 -8050534 -5610812
12149 -5610812 207872 3794089 3441840 1405808 425704 1473415 2795292 1146051
$$ packed form
12209f588650L91800J966208L330824K183484k79306j399471n83879J077704K163631
12200B262345J061258k225450m391103k765064k98088j454878l874437j124878
12192a2810295N896127Q635489M070565m69531M86694K103916j326951o187724
12184C98290n887383j419637J738177K435301K574264J521880j205004j926266
12176a770378J397338L557053j78441m958276l385300K129279L403818l7249j628037
12167a470193q6997l73483k699956j508864L304700M640165K46916l198655j474766
12158b621133R19434P4322n65145J877096K983799j143413n688437l887057K439722
12149e610812N818684L586217l52249k036032r80104J047711J321877j649241
$$ plain form
12141 1146051 -3739900 -7064690 -4751709 212173 1938534 836788 2374251 6721665
12133 6721665 7117742 809558 -5526753 -5402172 -1517650 -46060 -1047025 -721450 727265
12124 727265 475281 -91613 2823709 7788756 9453398 7579025 7494352 10266655 9974407
12115 9974407 3965817 -1288389 176673 4108186 2665432 -3285103 -6207111 -4057775
12107 -4057775 -2057171 -2297818 -123152 6489313 11434910 9162956 3425788 1761406
12099 1761406 4826086 6952930 5235078 2478936 1784131 2889487 3944382 3280762
12091 3280762 -316582 -5758711 -8696813 -6081484 -1150169 105259 -2827357 -4633020
12083 -4633020 -2353034 694925 504700 -2197117 -4086661 -3652188 -1613321 567721
$$ packed form
12141A146051m885951l324790K312981M963882J726361j101746J537463M347414
12133F721665L96077o308184o336311J24581L884522J471590j000965L25575J448715
12124G27265k51984n66894K915322M965047J664642j874373q4673K772303k92248
12115I974407o008590n254206J465062L931513j442754n950535k922008K149336
12107d057775K000604k40647K174666O612465M945597k271954n737168j664382
12099A761406L064680K126844j717852k756142o94805J105356J054895o63620
12091C280762l597344n442129k938102K615329M931315J255428k932616j805663
12083d633020K279986L047959j90225k701817j889544M34473K038867K181042
$$ plain form
12075 567721 1220918 -213280 -1636468 -590272 1584619 1103052 -2325277 -4678145 -3559511
12066 -3559511 -940408 1085677 2849204 3928399 2331772 -854080 -1004741 2767757
12058 2767757 4814599 1306412 -3363752 -3339831 -191103 714010 -626750 196633 3763000
12049 3763000 5944366 4780409 2720257 1964993 2245243 3255577 5059850 6124725
12041 6124725 4877006 2912736 2766574 3165211 973605 -2552538 -2476680 2362901 7303435
12032 7303435 8246833 5891939 2611602 -644138 -2872924 -2347605 704125 3709936
12024 3709936 5292351 6287375 6502122 4042315 -884633 -4988570 -6197921 -5730239 -4690162
12015 -4690162 -2343664 564549 784433 -2556773 -5436209 -4188161 -487775 1638624
$$ packed form
12075E67721O53197j434198j423188J046196K174891m81567l428329k352868J118634
12066c559511K619103K026085J763527J079195j596627l185852j50661L772498
12058B767757K046842l508187m670164K3921L148728R05113j340760Q23383L566367
12049C763000K181366j163957k060152p55264K80250J010334J804273J064875
12041F124725j247719j964270j46162L98637k191606l526143P5858M839581M940534
12032G303435R43398k354894l280337l255740k228786N25319L051730L005811
12024C709936J582415R95024K14747k459807m926948m103937j209351M67682J040077
12015d690162K346498K908213K19884l341206k879436J248048L700386K126399
$$ plain form
12007 1638624 1077915 -888214 -3556200 -5899290 -5179219 -441024 4206622 3876534 -289052
11998 -289052 -2426395 62601 3437418 3214066 -129831 -2435370 -1152702 1946011
11990 1946011 2899912 34458 -3855515 -4656094 -2197094 -269124 -652554 -207177 3688545
11981 3688545 7751988 6860687 1741120 -2051310 -2202247 -1840089 -3391339 -5272285 -6107588
11972 -6107588 -7373520 -9370546 -8955276 -4629685 -239381 180178 -1843029 -2580638 -2131682
11963 -2131682 -2318758 -1432106 2820112 6899270 5089250 -641392 -1984915 3034076
11955 3034076 6384712 2348773 -3685382 -3948083 188249 1999583 337855 -617944
11947 -617944 61651 -730171 -3159849 -3505522 -424341 3593414 7219129 11126785 13588559
$$ packed form
12007A638624n60709j966129k667986k343090P20071M738195M647646l30088m165586
11998b89052k137343K488996L374817k23352l343897k305539J282668L098713
11990A946011R53901k865454l889973q00579K459000J927970l83430M45377L895722
11981C688545M063443q91301n119567l792430j50937L62158j551250j880946q35303
11972f107588j265932j997026M15270M325591M390304M19559k023207p37609M48956
11963b131682j87076Q86652M252218M079158j810020n730642j343523N018991
11955C034076L350636m035939o034155k62701M136332J811334j661728r55799
11947f17944O79595p91822k429678l45673L081181M017755L625715L907656K461774
$$ plain form
11938 13588559 11178957 4915578 81851 -1377186 -2731251 -5324631 -5667646 -2164260
11930 -2164260 1092304 609132 -1559245 -2625661 -3690159 -5493495 -4697611 337152
11922 337152 4309252 1559798 -4979746 -7450475 -3831650 698969 1997771 880747
11914 880747 -959750 -3705835 -7217819 -10026971 -11401624 -11517737 -9455436 -4145088
11906 -4145088 2365198 5615753 3689239 -439340 -2098808 676078 5724737 8731410
11898 8731410 7361542 4246692 4306982 8154350 10661224 7897011 2581031 -247278
11890 -247278 -272768 -763157 -2311998 -2117096 1121909 5373590 8222603 8667901 6432696
11881 6432696 2465872 -253272 594892 3182982 3281604 -450608 -5019132 -6945685 -5921307
$$ packed form
11938A3588559k409602o263379m833727j459037j354065k593380l43015L503386
11930b164260L256564m83172k168377j066416j064498j803336P95884N034763
11922C37152L972100k749454o539544k470729L618825M530619J298802j117024
11914H80747j840497k746085l511984k809152j374653j16113K062301N310348
11906d145088O510286L250555j926514m128579j659468K774886N048659L006673
11898H731410j369868l114850O0290L847368K506874k764213n315980k828309
11890b47278k5490m90389j548841J94902L239005M251681K849013M45298k235205
11881F432696l966824k719144Q48164K588090R8622l732212m568524j926553J024378
$$ plain form
11872 -5921307 -4590807 -5446521 -7449060 -6140892 626138 7518699 6588423 -1676036
11864 -1676036 -7425027 -4236906 2604486 4703665 2058057 257286 711204 725350 463136
11855 463136 2539135 5932434 6762978 4522899 2132845 782248 -269061 -354080 930607
11846 930607 791549 -2417408 -4465472 -1293316 2978069 1696557 -3167088 -4385475
11838 -4385475 -2221632 -3607951 -8802277 -9839321 -4244632 253170 -1709375 -5428645
11830 -5428645 -5508767 -4177286 -4873064 -5333283 -3172930 -1839249 -4657907 -8112641 -7039794
11821 -7039794 -2350284 1638676 3688599 4693094 4003946 1350717 -763771 -540084
11813 -540084 338225 453361 1289232 3081658 2604990 -1250884 -4252378 -3157641 -833123
$$ packed form
11872e921307J330500q55714k002539J308168O767030O892561r30276q264459
11864a676036n748991L188121O841392K099179k645608j800771M53918J4146k62214
11855D63136K075999L393299Q30544k240079k390054j350597j051309q5019J284687
11846I30607j39058l208957k048064L172156M271385j281512m863645j218387
11838d385475K163843j386319n194326j037044N594689M497802j962545l719270
11830e428645q0122J331481o95778m60219K160353J333681k818658l454734J072847
11821g039794M689510L988960K049923J004495o89148k653229k114488K23687
11813e40084Q78309J15136Q35871J792426m76668l855874l001494J094737K324518
$$ plain form
11804 -833123 -878552 -1659842 -360789 1256329 238810 -1971863 -2319753 -1402421 -1351573
11795 -1351573 -1443871 -194960 1121666 1114493 1273815 2478995 2125478 -1231096 -4294415
11786 -4294415 -4333244 -3720556 -4506089 -3396057 1976053 6527059 4539026 -866863 -2636828
11777 -2636828 -934179 -1180781 -3348856 -2226252 2315875 4229803 1421864 -1016929
11769 -1016929 334242 2185861 1094368 -876708 -396617 1663106 2254265 590404
11761 590404 -2001377 -4392927 -5918051 -6015273 -4839423 -3117430 -1257168 247570 347206
11752 347206 -953949 -1779665 -1223049 -1300285 -3449783 -5098786 -3256556 168606 882225
11743 882225 -889485 -440016 4417500 10265870 12564326 10238593 5448077 1271935
$$ packed form
11804h33123m5429p81290J299053J617118j017519k210673l47890R17332N0848
11795a351573r2298J248911J316626p173J59322J205180l53517l356574l063319
11786d294415l8829O12688p85533J110032N372110M551006j988033n405889j769965
11777b636828J702649k46602k168075J122604M542127J913928k807939k438793
11769a016929J351171J851619j091493j971076M80091K059723N91159j663861
11761E90404k591781k391550j525124r7222J175850J721993J860262J504738R9636
11752C47206j301155q25716N56616p7236k149498j649003J842230L425162P13619
11743H82225j771710M49469M857516N848370K298456k325733m790516m176142
$$ plain form
11735 1271935 -203302 572757 1243859 1026284 2127453 6066214 10766282 13500417 14134941
11726 14134941 12874586 8130653 386263 -5153547 -4668944 -1883933 -2880564 -7001567
11718 -7001567 -8667762 -6532867 -4528786 -4498889 -3974647 -1484121 1338561 3208803 3958383
11709 3958383 2219213 -2507855 -6021007 -3498794 2611995 4850250 1321081 -2185552
11701 -2185552 -1587033 404264 446646 -211671 672763 2536163 4278268 5873408 5775741
11692 5775741 1509124 -4967246 -7268370 -2514683 4983066 10027063 11894188 11395700
11684 11395700 8107619 3742073 2970349 6709328 9144887 5931524 1129434 855293
11676 855293 3737508 3793183 472289 -748577 2567056 6100606 5502420 2477476 1914446
$$ packed form
11735A271935j475237P76059O71102k17575J101169L938761M700068K734135O34524
11726A4134941j260355m743933p744390n539810M84603K785011r96631m121003
11718g001567j666195K134895K004081K9897N24242K490526K822682J870242P49580
11709C958383j739170m727068l513152K522213O110789K238255l529169l506633
11701b185552N98519J991297M2382o58317Q84434J863400J742105J595140r7667
11692E775741m266617o476370k301124M753687P497749N043997J867125m98488
11684A1395700l288081m365546p71724L738979K435559l213363m802090k74141
11676H55293K882215N5675l320894j220866L315633L533550n98186l024944n63030
$$ plain form
11667 1914446 5365336 9456455 9922583 5924660 265470 -4221045 -7552710 -10972223
11659 -10972223 -13526025 -12800836 -9173860 -6390840 -6705315 -7971861 -7169940 -4560560
11651 -4560560 -2483881 -2027920 -2945006 -5125185 -7863971 -9002136 -7214887 -4452058
11643 -4452058 -3956477 -6110742 -7899445 -6341883 -1225662 5215953 10007599 10914092
11635 10914092 7613177 2140870 -2220042 -3280265 -1809980 -1007014 -3283841 -7363645
11627 -7363645 -9617497 -8555259 -6261506 -4661551 -2960089 -764963 -884994 -5256504
11619 -5256504 -9898440 -8685437 -1917402 3496490 3178677 283260 -208852 1789385
11611 1789385 3008554 2090073 268335 -1512165 -3302373 -4513282 -3703128 -309182
$$ packed form
11667A914446L450890M091119M66128l997923n659190m486515l331665l419513
11659a0972223k553802P25189L626976K783020l14475j266546Q01921K609380
11651d560560K076679M55961r17086k180179k738786j138165J787249K762829
11643d452058M95581k154265j788703J557562N116221O441615M791646R06493
11635A0914092l300915n472307m360912j060223J470285Q02966k276827m079804
11627g363645k253852J062238K293753J599955J701462K195126j20031m371510
11619e256504m641936J213003O768035N413892l17813k895417m92112J998237
11611A789385J219169r18481j821738j780500j790208j210909Q10154L393946
$$ plain form
11603 -309182 4243238 7414236 7672432 6005037 4830293 5032076 5098819 3749962 1610004
11594 1610004 -817385 -4250041 -7564579 -6660101 -69302 6719499 7165394 2305737
11586 2305737 -1402708 -1487961 -952573 -1019946 891684 4844164 6381643 3224476 -1325949
11577 -1325949 -4138827 -6384849 -9100660 -9503869 -5427087 326905 3574052 3631311 1807373
11568 1807373 -1509849 -5134881 -5887293 -2734097 636052 753350 -809146 -920368 -354120
11559 -354120 -1702259 -3992571 -3808741 -792094 1848438 2044258 1056737 1017910 2513188
11550 2513188 4487810 5044568 2838008 -1191833 -4249150 -4543295 -2587662 461329
11542 461329 3629042 5034136 2884006 -1560022 -4865413 -5989141 -6640785 -6620937 -3473903
$$ packed form
11603c09182M552420L170998K58196j667395j174744K01783O6743j348857k139958
11594A610004k427389l432656l314538R04478O590799O788801M45895m859657
11586B305737l708445q5253N35388o7373J911630L952480J537479l157167m550425
11577a325949k812878k246022k715811m03209M076782N753992L247147N7259j823938
11568A807373l317222l625032p52412L153196L370149J17298j562496j11222N66248
11559c54120j348139k290312J83830L016647K640532J95820r87521l8827J495278
11550B513188J974622N56758k206560m029841l057317k94145J955633L048991
11542D61329L167713J405094k150130m444028l305391j123728o51644J9848L147034
$$ plain form
11533 -3473903 1710519 3543131 364853 -2149738 550228 4699812 4586949 1849281
11525 1849281 2145356 5413945 6169529 2331229 -2324586 -4315712 -3901897 -2298157 149214
11516 149214 2856247 5601063 9595901 14505079 15996196 10845404 3096653 -272874
11508 -272874 967205 922477 -2270789 -3695148 -502755 3177493 3286067 2070789 3178101
11499 3178101 5169796 4856661 3766647 5826470 10171734 11469041 7455154 2025643
11491 2025643 -37933 1680860 4407330 6204209 7214293 8161329 9098555 9394505 8332943
11482 8332943 5932656 3347472 1974961 1916147 1801704 497267 -1390735 -2048397 -173168
11473 -173168 4028459 8844704 11485147 9524215 3495401 -2322668 -3631719 -797186
$$ packed form
11533c473903N184422J832612l178278k514591K699966M149584j12863k737668
11525A849281K96075L268589P55584l838300m655815j991126M13815J603740K447371
11516A49214K707033K744816L994838M909178J491117n150792p748751l369527
11508b72874J240079m4728l193266j424359L192393L680248J08574j215278J107312
11499C178101J991695l13135j090014K059823M345264J297307m013887n429511
11491B025643k063576J718793K726470J796879J010084R47036R37226K95950j061562
11482H332943k400287k585184j372511n8814j14443j304437j888002o57662J875229
11473a73168M201627M816245K640443j960932o028814n818069j309051K834533
$$ plain form
11465 -797186 2213723 3758047 6276078 10747762 13117363 9749291 3760235 1286763
11457 1286763 2871775 3656175 1705541 499368 2074248 3216485 1066016 -1994960
11449 -1994960 -2278744 -103681 2076054 3797269 5429903 5560590 3285216 1148200
11441 1148200 2036143 4482986 4622970 1851534 -939197 -2245679 -3637661 -6313164
11433 -6313164 -8865893 -9420553 -8190097 -6931550 -6571019 -5920370 -3065472 1487229 3935165
11424 3935165 1455757 -3112943 -4033204 -564164 1704391 -1075058 -5710948 -7500990
11416 -7500990 -7098256 -7741631 -8703484 -6632053 -1938345 1251750 1326746 927662 2004215
11407 2004215 3060764 2421151 1030165 485052 594513 490706 653427 2245437 4959214
$$ packed form
11465g97186L010909J544324K518031M471684K369601l368072n989056k473472
11457A286763J585012P84400j950634j206173J574880J142237k150469l060976
11449a994960k83784K175063K179735J721215J632634J30687k275374k137016
11441A148200Q87943K446843J39984k771436k790731j306482j391982k675503
11433f313164k552729n54660J230456J258547L60531O50649K854898M552701K447936
11424C935165k479408m568700r20261L469040K268555k779449m635890j790042
11416g500990M02734o43375r61853K071431M693708L190095P4996l99084J076553
11407B004215J056549o39613j390986n45113J09461j03807J62721J592010K713777
$$ plain form
11398 4959214 6633791 5325863 1587226 -1809191 -2841916 -2294404 -1953184 -1843566 -1090875
11389 -1090875 -365342 -580224 -55015 3114063 6225388 4501063 -804908 -2442871 2473251
11380 2473251 7623412 6385414 645818 -3356927 -3533634 -1712226 1054455 3857752
11372 3857752 3941598 398253 -3107736 -3977540 -5383001 -9933094 -12741992 -8014835 359675
11363 359675 2869927 -2294864 -7899254 -9236912 -9071015 -10187018 -10682537 -8960967 -7086739
11354 -7086739 -6423393 -4991410 -1761702 593057 -387983 -3396269 -5159996 -3307534
11346 -3307534 2501755 9160174 10784678 5141347 -1491627 -965961 5942845 11073569
11338 11073569 10540369 8024381 6282938 3282206 -1179411 -2636605 646181 3855987
$$ packed form
11398D959214J674577j307928l738637l396417j032725N47512L41220J09618P52691
11389a090875P25533k14882N25209L169078L111325j724325n305971j637963M916122
11380B473251N150161j237998n739596m002745j76707J821408K766681K803297
11372C857752Q3846l543345l505989q69804j405461m550093k808898M727157Q374510
11363C59675K510252n164791n604390j337658J65897j116003m95519J721570J874228
11354g086739O63346J431983L229708K354759r81040l008286j763727J852462
11346c307534N809289O658419J624504n643331o632974N25666O908806N130724
11338A1073569n33200k515988j741443l000732m461617j457194L282786L209806
$$ plain form
11330 3855987 3269840 2133375 4526443 8176446 8159301 4222916 111190 -1749494 -1481921
11321 -1481921 -150326 415962 -1280285 -3555863 -2808741 882384 3179363 2013276
11313 2013276 222866 -215361 -1543019 -5107274 -7863227 -7215334 -4770887 -2186816
11305 -2186816 1816028 6937591 9039728 6351311 2803615 1131707 -1625306 -6913078
11297 -6913078 -9230059 -4390356 2371038 4049306 2802068 4961609 9257598 9346271
11289 9346271 5311651 2837776 2393431 -667080 -5400099 -5069518 720219 3621674
11281 3621674 -423364 -4656410 -2510342 2563596 3671417 586924 -2468711 -4106727
11273 -4106727 -4951239 -3507700 1188040 5493353 5221555 1919717 301326 1195029 1846572
$$ packed form
11330C855987n86147j136465K393068L650003j7145l936385m111726j860684K67573
11321a481921J331595N66288j696247k275578P47122L691125K296979j166087
11313B013276j790410m38227j327658l564255k755953O47893K444447K584071
11305b186816M002844N121563K102137k688417l547696j671908k757013n287772
11297f913078k316981M839703O761394J678268j247238K159541M295989Q8673
11289I346271m034620k473875m44345l060511m733019L30581N789737K901455
11281C621674m045038m233046K146068N073938J107821l084493l055635j638016
11273d106727q44512J443539M695740M305313k71798l301838j618391Q93703O51543
$$ plain form
11264 1846572 1687489 2518279 3568095 1809122 -2164961 -3601282 -702408 1983894
11256 1983894 39374 -4154500 -4715208 -471623 3784579 3922091 1034397 -1348563
11248 -1348563 -1745408 -693803 1527631 4392967 5350850 1752078 -4948226 -9505967
11240 -9505967 -8525337 -3818614 805596 3709186 4781796 3283939 -683454 -4139079
11232 -4139079 -3985589 -1180908 861395 1415392 2440014 3540639 1300429 -4740234
11224 -4740234 -9320164 -7768667 -2686122 -857172 -4589574 -9447049 -10471910 -7553047
11216 -7553047 -3802870 -1364686 -712120 -2131533 -4979132 -5951956 -1431810 7005664
11208 7005664 12007848 8205348 -612868 -5289535 -2073908 3890473 6509057 5988490
$$ packed form
11264A846572j59083Q30790J049816j758973l974083j436321K898874K686302
11256A983894j944520m193874n60708M243585M256202J37512k887694k382960
11248a348563l96845J051605K221434K865336R57883l598772o700304m557741
11240i505967R80630M706723M624210K903590J072610j497857l967393l455625
11232d139079J53490K804681K042303N53997J024622J100625k240210o040663
11224d740234m579930J551497N082545J828950l732402m857475j024861K918863
11216g553047L750177K438184O52566j419413k847599r72824M520146Q437474
11208G005664N002184l802500q818216m676667L215627N964381K618584n20567
$$ plain form
11200 5988490 5611801 5103805 1932313 -2530974 -3515845 -14012 3130562 2067210 -706262
11191 -706262 -467530 2619919 3639909 -500888 -7050965 -10370834 -7769096 -1918879
11183 -1918879 2293906 2944127 2308313 2688998 2831848 588784 -2241839 -1382445 3350653
11174 3350653 6755280 5200621 1590625 822419 2949136 4160905 2869563 1205986
11166 1205986 1052531 1828970 2302625 1997227 699488 -1157337 -1762744 7131 2084329
11157 2084329 1641343 -107857 928061 5210358 8173975 6848323 3894947 2564931
11149 2564931 1505619 -1739338 -5332334 -5981570 -4955921 -5910902 -7854191 -6130266
11141 -6130266 -616613 3001457 1723990 -507773 351401 2419828 2268628 837176
$$ packed form
11200E988490l76689n07996l171492m463287r84871L501833L144574j063352k773472
11191g06262K38732L087449J019990m140797o550077l319869K601738N850217
11183a918879M212785O50221o35814L80685J42850k243064k830623Q59394M733098
11174C350653L404627j554659l609996p68206K126717J211769j291342j663577
11166A205986j53455P76439M73655l05398j297739j856825o05407J769875K077198
11157B084329m42986j749200J035918M282297K963617j325652k953376j330016
11149B564931j059312l244957l592996o49236J025649r54981j943289J723925
11141f130266N513653L618070j277467k231763Q59174K068427j51200j431452
$$ plain form
11133 837176 412773 -626152 -4559149 -8293166 -6725786 -1255348 1225039 -1501167
11125 -1501167 -3502083 475893 7331804 10012992 6696414 2097560 704613 1540504
11117 1540504 224761 -4795224 -9208894 -7373940 -10485 5277611 3182953 -2378034
11109 -2378034 -4119192 -1607351 -188617 -1157161 -150970 3722294 4672456 -366732
11101 -366732 -5466215 -3929320 1855930 4361673 1409926 -2864109 -5150054 -5479653
11093 -5479653 -4114574 -1308884 511667 -899215 -3626188 -4343027 -4120728 -6547546
11085 -6547546 -10716269 -11760744 -8729909 -6107745 -6120663 -5266974 -1071207 2905058 2581491
11076 2581491 -2401 158080 3676818 6643497 6539326 4752156 3638062 3807081 4349938
$$ packed form
11133H37176m24403j038925l932997l734017J567380N470438K480387k726206
11125a501167k000916L977976O855911K681188l316578m598854j392947Q35891
11117A540504j315743n019985m413670J834954P363455N288096k094658n560987
11109b378034j741158K511841J418734r68544J006191L873264R50162n039188
11101c66732n099483J536895N785250K505743k951747m274035k285945l29599
11093e479653J365079K805690J820551j410882k726973p16839K22299k426818
11085f547546m168723j044475L030835K622164j2918Q53689M195767L976265l23567
11076B581491k583892J60481L518738K966679j04171j787170j114094J69019N42857
$$ plain form
11067 4349938 3973342 1966732 -839649 -2430917 -1671484 533330 2419086 2689295 711479
11058 711479 -2790799 -5048516 -3629048 -134780 1185156 -489850 -1107236 1787607
11050 1787607 4659924 3268034 -574133 -1773367 262811 1389119 -140817 -1072969
11042 -1072969 1218540 4477702 5105014 3294576 2173158 3183978 4530082 3911261
11034 3911261 1367827 -844503 -670066 1698965 4247795 5392564 5040782 3332748
11026 3332748 -16297 -3831003 -4515234 463284 8397389 13076767 11230888 5461870
11018 5461870 359707 -2270159 -3275251 -3120276 -1108872 2504642 5136407 3709151
11010 3709151 -1785279 -7067200 -7251727 -2361563 2204210 1994223 -1094030 -1849647 935939
$$ packed form
11067D349938l76596k006610k806381j591268P59433K204814J885756K70209j977816
11058G11479l502278k257717J419468L494268J319936j675006o17386K894843
11050A787607K872317j391890l842167j199234K036178J126308j529936r32152
11042a072969K291509L259162O27312j810438j121418J010820J346104o18821
11034C911261k543434k212330J74437K369031K548830J144769l51782j708034
11026C332748l349045l814706o84231M978518P934105M679378j845879n769018
11018E461870n102163k629866j005092J54975K011404L613514K631765j427256
11010C709151n494430n281921j84527M890164M565773k09987l088253p55617K785586
$$ plain form
11001 935939 3342690 2535588 599802 668856 2104737 2075761 227466 -1098997 -850332
10992 -850332 -871328 -2927262 -5875379 -6969879 -5247520 -2476065 -713672 117462 1531650
10983 1531650 3948571 6105439 6961561 6647815 5084440 1591755 -2887464 -5177629
10975 -5177629 -3596367 -734112 -13206 -822125 -52445 2609269 4457744 4268840 3256495
10966 3256495 1779551 -762143 -2599887 -827740 3160719 4350323 1789419 546012
10958 546012 3642691 7159762 6632418 3454403 989826 -989142 -3363201 -3684888 -550869
10949 -550869 2130145 1166824 356716 3933125 7847543 6190874 3069803 7365179 16513050
10940 16513050 17348383 5494625 -7233832 -9550161 -4877161 -2257690 -1853094 1571755
$$ packed form
11001I35939K406751q07102j935786O9054J435881k8976j848295j326463K48665
10992h50332k0996k055934k948117j094500J722359K771455J762393Q31134J414188
10983A531650K416921K156868Q56122l13746j563375l492685m479219k290165
10975e177629J581262K862255P20906q08919P69680K661714J848475j88904j012345
10966C256495j476944k541694j837744J772147L988459J189604k560904j243407
10958E46012L096679L517071n27344l178015k464577j978968k374059l21687L134019
10949e50869K681014r63321q10108L576409L914418j656669l121071M295376R147871
10940A6513050Q35333j1853758j2728457k316329M673000K619471M04596L424849
$$ plain form
10932 1571755 6591901 6374112 -354524 -7683728 -10905139 -10103703 -6487272 -1351031
10924 -1351031 1981136 1250559 196871 4556639 12658411 15788986 9514097 -367930
10916 -367930 -5453986 -4297139 -1728048 -1665491 -3455364 -3744630 51554 7076355 12641325
10907 12641325 11898887 5148406 -1707483 -3168490 413575 4467696 6133839 6632743
10899 6632743 7711955 7884648 4301785 -2021063 -5696781 -3496692 800217 1340650
10891 1340650 -1316309 -1186532 3511112 7104331 5058370 692189 -642173 155762
10883 155762 -1255761 -4512614 -5311019 -3021739 -1408681 -1669283 -560711 3268602 6235278
10874 6235278 5339450 2643620 1649773 2321768 2306080 713307 -1810388 -4978758 -8458112
$$ packed form
10932A571755N020146k17789o728636p329204l221411Q01436L616431N136241
10924a351031L332167p30577j053688M359768Q101772L130575o274889r882027
10916c67930n086056J156847K569091O2557j789873k89266L796184P024801N564970
10907A2641325p42438o750481o855889j461007L582065M054121J666143M98904
10899F632743J079212J72693l582863o322848l675718K200089M296909N40433
10891A340650k656959J29777M697644L593219k045961m366181j334362P97935
10883A55762j411523l256853p98405K289280J613058k60602J108572L829313K966676
10874F235278q95828k695830r93847O71995j5688j592773k523695l168370l479354
$$ plain form
10865 -8458112 -10711214 -10270874 -7658646 -4827219 -3213720 -2995342 -3472097 -3654191 -3223138
10856 -3223138 -3048512 -3797712 -4303876 -2913438 -366929 682601 -591984 -1955842 -1366809
10847 -1366809 351834 1074036 114805 -1598341 -2955199 -3440189 -3331768 -3470498 -3924222
10838 -3924222 -3142295 -78124 3042684 2468428 -1970541 -5866523 -5523245 -2228686 110261
10829 110261 -255635 -2118843 -3645895 -3546165 -1032248 3326332 7096268 7855875 5462239
10820 5462239 1741746 -1269940 -2018240 178237 3836274 5623029 3995731 1653854
10812 1653854 2074679 4380055 4718901 2710314 2684381 6949811 11408734 10946821 6607535
10803 6607535 3425964 2677565 1078880 -2457341 -4589413 -3767588 -3740334 -7451147 -11267093
$$ packed form
10865h458112k253102M40340K612228K831427J613499K18378m76755j82094M31053
10856c223138J74626p49200n06164J390438K546509J049530j274585j363858N89033
10847a366809J718643P22202r59231j713146j356858m84990J08421j38730m53724
10838c924222P81927L064171L120808n74256m438969l895982L43278L294559K338947
10829A10261l65896j863208j527052R9730K513917M358580L769936P59607k393636
10820E462239l720493l011686p48300K196477L658037J786755j627298k341877
10812A653854M20825K305376L38846k008587k5933M265430M458923m61913m339286
10803F607535l181571p48399j598685l536221k132072Q21825K7254l710813l815946
$$ plain form
10794 -11267093 -9712542 -3448287 2194974 5047402 7409378 10127604 10641043 7786955
10786 7786955 4030129 1343648 -1498806 -5875308 -10530222 -13226637 -12707520 -8470564
10778 -8470564 -1660456 3475846 2994685 -901739 -1656721 2559396 6160204 4741664
10770 4741664 1440187 1043579 2050979 -326391 -5672843 -8084944 -4096305 2777788
10762 2777788 6033664 3021287 -2444398 -4105529 -535369 2705321 490538 -4028162
10754 -4028162 -3642529 1788475 4905930 2309692 -838145 -252568 801526 -1379063
10746 -1379063 -3789977 -2241721 1340068 2835295 2602284 2891776 3045953 2411764 3262690
10737 3262690 5572903 4289464 -2203136 -6680874 -3216401 2902068 3378278 -363772
$$ packed form
10794a1267093J554551O264255N643261K852428K361976K718226N13439k854088
10786G786955l756826k686481k842454m376502m654914k696415N19117M236956
10778h470564O810108N136302m81161l896424p54982M216117L600808j418540
10770D741664l301477l96608J007400k377370n346452k412101L988639O874093
10762B777788L255876l012377n465685j661131L570160L240690k214783m518700
10754d028162L85633N431004L117455k596238l147837N85577J054094k180589
10746a379063k410914J548256L581789J495227k33011K89492J54177o34189Q50926
10737C262690K310213j283439o492600m477738L464473O118469M76210l742050
$$ plain form
10729 -363772 -1672067 -864745 -2577291 -4773629 -1708579 4229930 4835171 -501249 -4201217
10720 -4201217 -3214644 -2321019 -4439614 -7120390 -9041776 -10900317 -9884689 -2748157
10712 -2748157 5647619 6804275 1877340 373553 5302435 10386746 12494766 14875740
10704 14875740 16540554 11375637 1177570 -3314727 642738 2137661 -5878138 -14934688
10696 -14934688 -14405255 -6398708 622198 4166567 5709559 4451376 1045500 462419
10688 462419 3857499 4593205 -816302 -5495167 -3358815 519137 -719963 -3594177
10680 -3594177 -1435219 2756593 1491122 -3712273 -4912009 -1129180 1055653 -997570
10672 -997570 -3003652 -1958430 423583 2499416 4290885 4235969 286398 -5272218 -6918534
$$ packed form
10729c63772j308295Q07322j712546k196338L065050N938509O05241n336420l699968
10720d201217R86573Q93625k118595k680776j921386j858541J015628P136532
10712b748157Q395776J156656m926935j503787M928882N084311K108020K380974
10704A4875740J664814n164917j0198067m492297L957465J494923q015799r056550
10696a4934688N29433Q006547P020906L544369J542992j258183l405876n83081
10688D62419L395080P35706n409507m678865K136352L877952j239100k874214
10680c594177K158958M191812j265471n203395j199736L782829K184833k053223
10672i97570k006082J045222K382013K075833J791469n4916l949571n558616j646316
$$ plain form
10663 -6918534 -2584960 3831875 6708695 3694928 -2375897 -5565750 -3116564 121828
10655 121828 -2367696 -8339590 -8731404 -1466994 4655883 3503659 804311 3932670
10647 3932670 9659641 9505655 2321616 -5500799 -8762585 -6753474 -1574916 1983584
10639 1983584 -783218 -7370429 -8821359 -2074091 4634052 3908591 -290598 -967955
10631 -967955 127114 -2519514 -7181658 -8044837 -5187770 -2698633 -416712 3833167
10623 3833167 6788698 3261919 -4638434 -9470195 -8403639 -4882078 -2132501 -842674
10615 -842674 -1238778 -2240743 -1109147 1538640 270213 -6708357 -12527317 -10936219
10607 -10936219 -5533928 -3171073 -3348401 -1722588 584560 -437647 -3326458 -3480616
$$ packed form
10663f918534M333574O416835K876820l013767o070825l189853K449186L238392
10655A21828k489524n971894l91814P264410O122877j152224k699348L128359
10647C932670N726971j53986p184039p822415l261786K009111N178558L558500
10639A983584k766802o587211j450930O747268O708143p25461m199189o77357
10631i67955J095069k646628m662144q63179K857067K489137K281921M249879
10623C833167K955531l526779p900353m831761J066556L521561K749577J289827
10615h42674l96104j001965J131596K647787j268427o978570n818960J591098
10607a0936219N402291K362855j77328J625813K307148j022207k888811j54158
$$ plain form
10599 -3480616 -1330284 -1084734 -3638935 -6633735 -8730855 -8932457 -5755515 -1551916
10591 -1551916 -1886159 -5857793 -4687194 3917142 8987852 2282478 -8022357 -9988711
10583 -9988711 -5764068 -4688180 -6102141 -2887794 3166717 3732421 -1458179 -5274862
10575 -5274862 -5843844 -6499604 -5934112 -543909 5820459 6265162 2602307 1261707 658964
10566 658964 -4930217 -11826761 -10833238 -3244803 239011 -3831648 -8476651 -9485433
10558 -9485433 -9794212 -10586884 -9361314 -7112239 -7150939 -7355870 -3626560 492938 -1743002
10549 -1743002 -7951908 -9712223 -6343109 -4582031 -6149326 -6661373 -5368098 -5254772
10541 -5254772 -5245130 -2591728 -554956 -3646595 -8630900 -10202964 -10754314 -13928455 -14843840
$$ packed form
10599c480616K150332K45550k554201k994800k097120k01602L176942M203599
10591a551916l34243l971634J170599Q604336N070710o705374j0304835j966354
10583i988711M224643J075888j413961L214347O054511N65704n190600l816683
10575e274862n68982o55760N65492N390203O364368M44703l662855j340600o02743
10566F58964n589181o896544R93523P588435L483814m070659m645003j008782
10558i485433l08779p92672J225570K249075l8700k04931L729310M119498k235940
10549a743002o208906j760315L369114J761078j567295n12047J293275J13326
10541e254772R642K653402K036772l091639m984305j572064n51350l174141r15385
$$ plain form
10532 -14843840 -8850407 -3051656 -5644863 -11024092 -9930402 -6510037 -9285027 -13332458
10524 -13332458 -9154375 -1565545 -1162693 -4680395 -3068501 -660567 -5691348 -10929998
10516 -10929998 -6217070 -561050 -7198246 -16855057 -12936579 -2849445 -4318445 -11182001
10508 -11182001 -6145204 2772057 -4223737 -18070889 -14777299 -1974983 -6714857 -23498609
10500 -23498609 -23882965 -12528273 -18495964 -34239290 -26002923 -4645134 -13871021 -43311413
10492 -43311413 -38577466 -11510562 -34967690 -88234389 -27887473 199892249 419633878
10485 419633878 422224887 237142864 78277714 55304340 80440291 57830806 18499493
10478 18499493 22978542 48687299 45534971 24920712 23692302 32976524 24251088 7103436
$$ packed form
10532a4843840N993433N798751k593207n379229J093690L420365k774990m047431
10524a3332458M178083P588830M02852l517702J611894K407934n030781n238650
10516a0929998M712928N656020o637196r656811L918478J0087134j469000o863556
10508a1182001N036797Q917261o995794j3847152L293590J2802316m739874j6783752
10500b3498609l84356J1354692n967691j5743326Q236367K1357789r225887k9440392
10492d3311413M733947K7066904k3457128n3266699O0346916K27779722K19741629
10485D19633878K591009j85082023j58865150k2973374K5135951k2609485l9331313
10478A8499493M479049K5708757l152328k0614259j228410R284222q725436j7147652
$$ plain form
10470 7103436 7271184 16935092 13449306 3273761 6081394 15681500 13891473 5805599
10462 5805599 7623959 14535667 11425332 2399768 1684616 6731612 5831110 1910105
10454 1910105 5317036 12434684 12859574 9224128 10752568 15485338 15904855 13483609
10446 13483609 12482227 9183005 1545441 -1644004 4459709 8987723 3077799 -3440487
10438 -3440487 1102031 9470234 8820459 2897353 2829552 6227141 4088715 -273438 2223301
10429 2223301 8169090 7718357 2778302 2274654 4844577 2602046 -2817887 -3738125 -1368486
10420 -1368486 -2057225 -3116385 2338139 10197017 10137605 2774009 -2254196 -2783111 -4788636
10411 -4788636 -8704273 -8867490 -5492619 -4305389 -4885696 -1405231 5413111 8391588
$$ packed form
10470G103436J67748R663908l485786j0175545K807633R600106j790027q085874
10462E805599J818360O911708l110335r025564p15152N046996r00502l921005
10454A910105L406931P117648M24890l635446J528440M732770M19517k421246
10446A3483609j001382l299222p637564l189445O103713M528014n909924o518286
10438c440487M542518Q368203o49775n923106o7801L397589k138426m362153K496739
10429B223301N945789m50733m940055n03648K569923k242531n419933r20238K369639
10420a368486o88739j059160N454524P858878n9412p363596n028205n28915k005525
10411d788636l915637j63217L374871J187230n80307L480465O818342K978477
$$ plain form
10403 8391588 5862274 3237957 2858470 1875994 -75994 -130421 1241496 961531 -283368
10394 -283368 237101 1189731 261395 533993 5589682 11129577 10258488 4647421 1511110
10385 1511110 1697352 -82032 -4900154 -8608478 -10008059 -11375894 -11779655 -8177214
10377 -8177214 -2470183 328806 170707 870906 2226953 846084 -2323862 -3029452 -1491791
10368 -1491791 -1698280 -3596461 -3303057 -639103 623469 -198263 -125427 1106684 383073
10359 383073 -2978508 -6224045 -7781980 -8187290 -7424630 -5850741 -5953741 -8619545 -10176306
10350 -10176306 -7908906 -5032441 -4711698 -3566754 1742750 5891011 1873964 -6486096
10342 -6486096 -9101731 -5289351 -4406940 -10243791 -14933925 -11401751 -3612349 -115422
$$ packed form
10403H391588k529314k624317l79487r82476j951988n4427J371917k79965j244899
10394b83368N20469R52630r28336K72598N055689N539895q71089n611067l136311
10385A511110J86242j779384m818122l708324j399581j367835m03761L602441
10377h177214N707031K798989j58099P00199J356047j380869l169946p05590J537661
10368a491791k06489j898181K93404K663954J262572q21732P2836J232111p23611
10359C83073l361581l245537j557935m05310P62660J573889j03000k665804j556761
10350a0176306K267400K876465L20743J144944N309504M148261m017047q360060
10342f486096k615635L812380Q82411n836851m690134L532174P789402L496927
$$ plain form
10334 -115422 -2850923 -6293134 -4635969 2421274 9169514 8992895 1878649 -4644905
10326 -4644905 -4531453 -354692 2095812 2503056 3858593 5100903 2958529 -755896
10318 -755896 -761089 3564935 7876598 9740727 9779201 7225454 1053968 -5141475 -6198119
10309 -6198119 -3230422 -2016006 -3637039 -3387799 513921 3754103 2814623 -655042
10301 -655042 -3750282 -5602894 -5697508 -3672560 -1813031 -3320267 -7246734 -9211572 -7632716
10292 -7632716 -5325118 -4793706 -5864248 -7778274 -9643575 -9362808 -6300062 -4013516
10284 -4013516 -5572152 -7368292 -3396516 4814384 8894757 4928341 -1838289 -4812712
10276 -4812712 -3175060 325331 3527081 4656972 2244110 -2423079 -5768897 -6303943
$$ packed form
10334a15422k735501l442211J657165P057243O748240j76619p114246o523554
10326d644905J13452M176761K450504M07244J355537J242310k142374l714425
10318g55896n193M326024M311663J864129L8474k553747o171486o195443j056644
10309f198119K967697J214416j621033K49240L901720L240182r39480l469665
10301f55042l095240j852612r4614K024948J859529j507236l926467j964838J578856
10292g632716K307598N31412j070542j914026j865301K80767L062746K286546
10284d013516j558636j796140L971776Q210900M080373l966416o766630k974423
10276d812712J637652L500391L201750J129891k412862m667189l345818n35046
$$ plain form
10268 -6303943 -5841493 -5773035 -5231655 -3491639 -1116969 1660767 4744774 6408702 5048775
10259 5048775 2687472 3264086 7243902 11143826 12366404 11258864 8716312 5395034
10251 5395034 3121034 3254349 3668560 1308654 -2100626 -1206012 5195060 11529351 12225872
10242 12225872 7953909 3339150 1028219 172606 -570542 -731791 716680 2514720
10234 2514720 1321819 -3467496 -6585859 -2443254 6268587 10460103 6432986 355921
10226 355921 -1384390 -154794 463414 1580403 4291701 3938316 -2927447 -9927235 -7991391
10217 -7991391 1163477 7304984 6220255 3325051 2809411 1967050 -1696643 -5202007
10209 -5202007 -5217442 -3155139 -2078371 -2131334 -1299464 1685228 6161265 9447416 8569377
$$ packed form
10268f303943M62450O8458N41380J740016K374670K777736L084007J663928j359927
10259E048775k361303N76614L979816L899924J222578j107540k542552l321278
10251E395034k274000J33315M14211k359906l409280Q94614O401072O334291O96521
10242A2225872m271963m614759k310931q55613p43148j61249J448471J798040
10234B514720j192901m789315l118363M142605Q711841M191516m027117o077065
10226C55921j740311J229596O18208J116989K711298l53385o865763o999788J935844
10217g991391R154868O141507j084729k895204n15640q42361l663693l505364
10209e202007j5435K062303J076768n2963Q31870K984692M476037L286151q78039
$$ plain form
10200 8569377 4215409 1196593 2188342 3619274 1407405 -2407530 -3455453 -2129327
10192 -2129327 -1230712 189899 3935112 6520881 3676120 -1023941 -236128 5563943
10184 5563943 8843613 6716140 3378412 1065912 -2322386 -5699330 -4173856 1754554
10176 1754554 4871738 2085852 -1066950 116425 2780870 2736151 790858 -741939
10168 -741939 -1908646 -2135582 871308 5955346 7727027 4119346 -565117 -2951418
10160 -2951418 -5142142 -8714525 -10113166 -6342919 -444398 2919000 3364762 2768764
10152 2768764 1321284 -947158 -2252837 -1711801 -777769 -63989 1536905 3100779 1727357
10143 1727357 -1936135 -3433495 -1751451 -1098085 -3005581 -3082380 737018 3106542 -646635
$$ packed form
10200H569377m353968l018816R91749J430932k211869l814935j047923J326126
10192b129327Q98615J420611L745213K585769k844761m700061P87813N800071
10184E563943L279670k127473l337728k312500l388298l376944J525474N928410
10176A754554L117184k785886l152802J183375K664445m4719j945293j532797
10168g41939j166707k26936L006890N084038J771681l607681m684463k386301
10160b951418k190724l572383j398641L770247N898521L363398M45762n95998
10152B768764j447480k268442j305679N41036R34032P13780J600894J563874j373422
10143A727357l663492j497360J682044O53366j907496p6799L819398K369524l753177
$$ plain form
10134 -646635 -6838755 -9316008 -8413908 -8228577 -8666284 -6358921 -1314656 2735440 3487390
10125 3487390 1704832 -859637 -2182120 -636682 2312661 2555062 -935882 -3863716
10117 -3863716 -2999921 -1362457 -3363853 -7940910 -10653027 -10136800 -8412444 -6879903
10109 -6879903 -5998908 -7154391 -10787263 -13757098 -12165234 -6302959 -190634 3074263
10101 3074263 3467841 2668872 2477174 3615719 4830272 4451132 3352817 4014435 6031502
10092 6031502 5791531 1921727 -2303416 -3702769 -3015495 -2158482 -1171704 -140043 -758428
10083 -758428 -3394848 -5533049 -5492318 -4865378 -5248446 -5629393 -4865555 -3329557 -440212
10074 -440212 5221308 11308951 12214689 7218104 3074620 4524302 7155639 4659184
$$ packed form
10134f46635o192120k477253R02100J85331m37707K307363N044265M050096P51950
10125C487390j782558k564469j322483J545438K949343K42401l490944k927834
10117c863716Q63795J637464k001396m577057k712117N16227J724356J532541
10109f879903Q80995j155483l632872k969835J591864N862275O112325L264897
10101C074263L93578p98969j91698J138545J214553l79140j098315O61618K017067
10092F031502k39971l869804m225143j399353O87274Q57013R86778J031661o18385
10083g58428k636420k138201M0731O26940l83068l80947P63838J535998K889345
10074d40212N661520O087643R05738m996585m143484J449682K631337k496455
$$ plain form
10066 4659184 -1294199 -4385909 -3444120 -2396615 -2489931 -1084975 2313919 4522701 3656250
10057 3656250 1392800 -124641 -290117 1012168 3354242 4789561 3695344 1380018
10049 1380018 484373 1288423 1873973 1312917 413520 -259204 -1153016 -2762976 -5038157
10040 -5038157 -7151181 -7487316 -5396428 -3134227 -3615097 -5931953 -6355162 -4281678 -2929089
10031 -2929089 -2973681 -845091 3965536 5487083 -326687 -8298397 -10522959 -6890835
10023 -6890835 -3692772 -4266226 -6556808 -8204311 -8587915 -6787685 -2511139 1432960
10015 1432960 1901109 94216 -480367 175271 -949693 -4175993 -6387695 -6010542 -4668951
10006 -4668951 -3559872 -1939927 172273 1234056 1122329 2036906 5255777 8927254
$$ packed form
10066D659184n953383l091710R41789J047505r3316J404956L398894K208782q66451
10057C656250k263450j517441j65476J302285K342074J435319j094217k315326
10049A380018q95645Q04050N85550n61056q99397o72724q93812j609960k275181
10040e038157k113024l36135K090888K262201m80870k316856m23209K073484J352589
10031b929089m4592K128590M810627J521547n813770p971710k224562L632124
10023f890835L198063n73454k290582j647503l83604J800230M276546L944099
10015A432960M68149j806893n74583O55638j124964l226300k211702L77153J341591
10006d668951J109079J619945K112200J061783j11727R14577L218871L671477
$$ plain form
9998 8927254 10112221 7902320 4078430 1353671 848237 1016093 -152876 -1961770 -1927031
9989 -1927031 -66353 557134 -1399635 -3337240 -2917764 -1382295 -553256 391879 2594131
9980 2594131 4789210 5601780 5942417 6555431 5955094 3468896 1481415 1925503 3443685
9971 3443685 4532305 6010355 7723277 7097617 4320879 4031150 7394912 7807265 652327
9962 652327 -7407021 -6726350 876533 4540707 -59472 -6016275 -6478321 -2903604 -169472
9953 -169472 256804 -372692 -1163883 -1630384 -1455928 -1254054 -1502824 -1262658 -303030 -742844
9943 -742844 -3357781 -4711951 -2303916 68472 -2396401 -7136243 -7675289 -3910649 -1762854
9934 -1762854 -3134515 -3771253 -1642642 92900 47524 1296180 4555754 5215501 621895
$$ packed form
9998H927254J184967k209901l823890k724759n05434J67856j168969j808894L4739
9989a927031J860678O23487j956769j937605M19476J535469Q29039R45135K202252
9980B594131K195079Q12570L40637O13014o00337k486198j987481M44088J518182
9971C443685J088620J478050J712922o25660k776738k89729L363762M12353p154938
9962F52327q059348O80671P602883L664174m600179n956803m62046L574717K734132
9953a69472M26276o29496p91191m66501J74456K01874k48770K40166R59628m39814
9943g42844k614937j354170K408035K372388k464873m739842n39046L764640K147795
9934a762854j371661o36738K128611J735542m5376J248656L259574O59747m593606
$$ plain form
9925 621895 -4952489 -6222926 -3756425 -1826346 -2582213 -4755547 -5685646 -3403106 926543
9916 926543 2823397 -103160 -3828342 -3477432 -1347190 -2884315 -6113443 -3733469 3797725
9907 3797725 6969030 1801984 -3719581 -2497036 1126502 31372 -3819926 -3792262 410562
9898 410562 3614636 3456498 1400152 -1334471 -3199108 -1016934 5208618 9484486 7185268
9889 7185268 1815942 -662255 -72414 1016823 3550067 8023249 9032858 2463269
9881 2463269 -5603788 -6471993 -2022425 -14426 466122 5544918 9486239 -2663491
9873 -2663491 -30337106 -50034458 -42355896 -16280787 3836170 7625473 3932644 2601085
9865 2601085 3932000 4999611 5177066 3671531 -395647 -3857689 -2053403 3354759
$$ packed form
9925F21895n574384j270437K466501J930079p55867k173334r30099K282540M329649
9916I26543J896854k926557l725182L50910K130242j537125l229128K379974P531194
9907C797725L171305n167046n521565J222545L623538j095130l851298K7664M202824
9898D10562L204074j58138k056346k734623j864637K182174O225552M275868k299218
9889G185268n369326k478197N89841J089237K533244M473182J009609o569589
9881B463269q067057q68205M449568K007999M80548N078796L941321j2149730
9873b663491k7673615j9697352P678562K6075109K0116957L789303l692829j331559
9865B601085J330915J067611J77455j505535m067178l462042J804286N408162
$$ plain form
9857 3354759 5383339 1704631 -2587543 -3589070 -3478344 -4473101 -4270511 -1134817 1842838
9848 1842838 1768321 833943 1904895 3113419 1509399 -1086715 -765603 2278140 4844663
9839 4844663 5973429 6490275 5205480 606996 -4767016 -6559434 -4635493 -2482944
9831 -2482944 -1391677 57078 1450689 809108 -692849 372332 3722268 5675156
9823 5675156 5844951 7549842 10490899 9647084 3854323 -990669 -807724 528650 -1800297
9814 -1800297 -5823772 -7013753 -5535305 -4000590 -2288135 -202781 -1054661 -6013728
9806 -6013728 -8611997 -2657268 6717348 8348032 719999 -6098213 -5140308 -975741
9798 -975741 -689316 -3615379 -4605383 -2516459 -389362 175522 635839 2646258 6209396
$$ packed form
9857C354759K028580l678708m292174j001527J10726r94757K02590L135694K977655
9848A842838p4517r34378J070952J208524j604020k596114L21112L043743K566523
9839D844663J128766N16846j284795m598484n374012j792418J923941K152549
9831b482944J091267J448755J393611o41581j501957J065181L349936J952888
9823E675156J69795J704891K941057q43815n792761m844992J82945J336374k328947
9814a800297m023475j189981J478448J534715J712455K085354q51880m959067
9806f013728k598269N954729R374616J630684p628033o818212R57905M164567
9798i75741K86425k926063r90004K088924K127097N64884M60317K010419L563138
$$ plain form
9789 6209396 9867765 11403731 9626818 6270275 4431291 4643871 4695361 3748260 3695553
9780 3695553 5311811 6128561 4090102 868293 -623024 -59143 1075967 2338890 3950762
9771 3950762 4702222 2764036 -1555008 -5610293 -7061325 -5701825 -3059467 -1400869
9763 -1400869 -2802331 -7491381 -12425827 -12855770 -7012032 814917 3720492 -170238
9755 -170238 -5003537 -4084756 1780068 5864692 4915749 2781421 3544447 5455320 4709889
9746 4709889 1866151 511478 1549115 2737751 2819044 2618746 2700614 2858303 3292845
9737 3292845 3852256 3176764 961058 -500640 372583 1540489 765654 -271620 1069254
9728 1069254 3479078 3910643 2733661 2238487 2005583 671835 210690 2770196 5157286
$$ packed form
9789F209396L658369J535966j776913l356543j838984K12580N1490r47101n2707
9780C695553J616258Q16750k038459l221809j491317N63881J135110J262923J611872
9771C950762P51460j938186m319044m055285j451032J359500K642358J658598
9763a400869j401462m689050m934446m29943N843738P826949K905575l890730
9755a70238m833299R18781N864824M084624r48943k134328P63026J910873p45431
9746D709889k843738j354673J037637J188636Q1293k00298Q1868J57689M34542
9737C292845N59411o75492k215706j461698Q73223J167906p74835j037274J340874
9728A069254K409824M31565j176982m95174k32904j333748m61145K559506K387090
$$ plain form
9719 5157286 2987621 -1150305 -995525 2826043 3734977 723564 -51984 3379979 5292276
9710 5292276 3129492 2486199 6444712 8791435 4339618 -1640931 -1938974 950261 139970
9701 139970 -3463410 -3341438 1035413 3483488 944420 -3463079 -6827506 -9139382 -9576539
9692 -9576539 -6364192 -1149956 1615114 523946 -1626386 -2644789 -2925781 -2759137 -1692542
9683 -1692542 -547522 -443562 -236816 1560541 3385760 3121204 2481364 4102664 5836017
9674 5836017 3959734 1149565 4028510 12038443 16106798 10832041 1571475 -3639164
9666 -3639164 -3301190 -177612 4178453 7900733 6942310 368977 -6102719 -7128656 -5045758
9657 -5045758 -4970934 -6215073 -5027521 -2868814 -4037201 -6460123 -3611682 3718934 6454971
$$ packed form
9719E157286k169665m137926J54780L821568R08934l011413p75548L431963J912297
9710E292276k162784o43293L958513K346723m451817n980549k98043K889235q10291
9701A39970l603380J21972M376851K448075k539068m407499l364427k311876m37157
9692i576539L212347N214236K765070j091168k150332j018403k80992J66644J066595
9683a692542J145020J03960K06746J797357J825219k64556o39840J621300J733353
9674E836017j876283k810169K878945Q009933M068355n274757r260566n210639
9666c639164L37974L123578M356065L722280r58423o573333o471696j025937K082898
9657e045758P4824j244139J187552K158707j168387k422922K848441P330616K736037
$$ plain form
9648 6454971 848770 -5217087 -4238887 35823 312381 -1844201 75445 4878367 4585823
9639 4585823 -2599083 -9233899 -10027744 -8304745 -8242779 -7870419 -4217250 234783 1442340
9630 1442340 197865 -180420 641775 1332762 2724354 5622840 7390426 5468225 1983876
9621 1983876 161146 -1227438 -4499071 -6928885 -4590732 -390494 -785035 -5264014
9613 -5264014 -6998837 -4233846 -2701269 -5134032 -6909062 -5230793 -4354085 -6968588
9605 -6968588 -7916397 -2626684 4323853 5880377 2946397 1245444 1704359 1185992 -226794
9596 -226794 -212456 -492213 -4469448 -9418894 -8698144 -2379637 1435068 -2080263 -7759458
9587 -7759458 -7852859 -1738601 4812756 7142640 5687984 3858677 3666282 3336294 -198107
$$ packed form
9648F454971n606201o065857R78200M274710K76558k156582J919646M802922k92544
9639D585823p184906o634816p93845J722999O1966L72360L653169M452033J207557
9630A442340j244475l78285Q22195O90987J391592K898486J767586j922201l484349
9621A983876j822730j388584l271633k429814K338153M200238l94541m478979
9613e264014j734823K764991J532577k432763j775030J678269Q76708k614503
9605f968588r47809N289713O950537J556524k933980j700953M58915n18367j412786
9596b26794J4338k79757l977235m949446P20750O318507L814705l515331n679195
9587g759458r3401O114258O551357K329884j454656j829307j92395l29988l534401
$$ plain form
9578 -198107 -5816518 -7665037 -2709039 3699134 4029910 -1361842 -5321422 -3979609 -238162
9569 -238162 2481232 3905757 3657496 619274 -2639600 -891507 5570172 9543255 7123859
9560 7123859 3549720 4256931 5659781 1426459 -5951130 -7751057 -1912431 4287173
9552 4287173 5280241 4145699 5844540 8934760 8279032 3035528 -2405544 -4593339 -4601308
9543 -4601308 -4978706 -5662601 -4492764 -806881 3231443 5297229 5630777 5846250 5757726
9534 5757726 3512128 -738869 -3615098 -2529054 782214 2824962 3102331 3565334 4050392
9525 4050392 1905032 -2833177 -5234730 -1225336 6140680 9384415 5543672 -433687
9517 -433687 -2328863 -307570 455137 -2331538 -4840808 -2796420 2221668 4657765 2169212
$$ packed form
9578a98107n618411j848519M955998O408173L30776n391752l959580J341813L741447
9569b38162K719394J424525k48261l038222l258874J748093O461679L973083k419396
9560G123859l574139P07211J402850m233322p377589j799927N838626O199604
9552D287173R93068j134542J698841L090220o55728n243504n441072k187795p969
9543d601308l77398o83895J169837L685883M038324K065786L33548K15473q8524
9534E757726k245598m250997k876229J086044L311268K042748K77369M63003M85058
9525D050392k145360m738209k401553M009394P366016L243735l840743n977359
9517d33687j895176K021293P62707k786675k509270K044388N018088K436097k488553
$$ plain form
9508 2169212 -1752334 -2500431 687625 5268874 8650359 9361672 6764344 1876804 -2202139
9499 -2202139 -2769855 -388335 2110065 3054613 2704907 1086209 -2459100 -6956947 -9235360
9490 -9235360 -7099993 -1976083 2538049 3802630 1453669 -2722760 -5403722 -4170343
9482 -4170343 -778441 -78336 -3716450 -6876989 -4187108 2575262 6327319 3704907
9474 3704907 -1729483 -5559296 -7344488 -7781656 -5517751 -299747 3747401 2344133
9466 2344133 -2658500 -5050804 -1995203 3211060 6001017 5125267 2085894 -1168915
9458 -1168915 -3149340 -3554732 -3794720 -5085982 -5953123 -3832282 661528 3766426 3640446
9449 3640446 2642862 3180379 3913428 2262437 -1248240 -3659062 -3535210 -2056036 -813660
$$ packed form
9508B169212l921546p48097L188056M581249L381485P11313k597328m887540m078943
9499b202139n67716K381520K498400R44548l49706j618698l545309m497847k278413
9490i235360K135367N123910M514132J264581k348961m176429k680962J233379
9482d170343L391902P00105l638114l160539K689881O762370L752057k622412
9474C704907n434390l829813j785192m37168K263905N218004M047148j403268
9466B344133n002633k392304L055601N206263K789957q75750l039373l254809
9458a168915j980425m05392k39988j291262q67141K120841M493810L104898j25980
9449C640446r97584N37517P33049j650991l510677k410822J23852J479174J242376
$$ plain form
9440 -813660 -502024 -1367304 -3076215 -4228204 -3620084 -2057495 -1485639 -2190976 -2307012
9431 -2307012 -590837 1541140 1647568 -750472 -3779402 -5550417 -5813997 -4984151 -2707714
9422 -2707714 1174741 4618289 4389217 102304 -4321481 -4929984 -2570961 -1611006 -4354484
9413 -4354484 -8692066 -11131440 -10220384 -6915347 -3505440 -2384146 -3922794 -5240839
9405 -5240839 -3136370 1340048 3519603 1086745 -2955019 -4485779 -3120248 -1176747
9397 -1176747 129402 1233973 2281891 2816717 2775773 2242180 925898 -776108 -1125224
9388 -1125224 1013417 4174795 5549508 3789747 -230144 -4529756 -6967699 -6145399
9380 -6145399 -2570825 1676400 4907617 6370134 4908059 -384043 -7182417 -10485106
$$ packed form
9440h13660L11636q65280j708911j151989O08120J562589N71856p05337j16036
9431b307012J716175K131977J06428k398040l028930j771015k63580Q29846K276437
9422b707714L882455L443548k29072m286913m423785o08503K359023R59955k743478
9413d354484m337582k439374R11056L305037L409907J121294j538648j318045
9405e240839K104469M476418K179555k432858m041764j530760J365531J943501
9397a176747J306149J104571J047918N34826m0944n33593j316282j702006l49116
9388a125224K138641L161378J374713j759761m019891m299612k437943Q22300
9380f145399L574574M247225L231217J462517j462075n292102o798374l302689
$$ plain form
9372 -10485106 -8256980 -4255976 -3031591 -4465947 -5816387 -6473731 -7131906 -6604974 -3916114
9363 -3916114 -1864361 -3482794 -5967196 -3837994 1858125 3742237 -1069346 -6487449
9355 -6487449 -6573524 -3337766 -1384122 -155304 2718501 4364785 86194 -7909443 -12225120
9346 -12225120 -10617370 -8085959 -7842499 -6933191 -3286896 -709226 -2490656 -5032841
9338 -5032841 -3298769 841064 1668779 -1109928 -2488362 -812291 180046 -1290966 -1983387
9329 -1983387 -136144 774863 -1634489 -3536783 -899665 3143434 2649598 -1608557 -3126370
9320 -3126370 289640 3408594 1677324 -2655679 -4838326 -4073788 -2651680 -1324108
9312 -1324108 1031494 4205882 6010984 5064955 2666990 1475491 2863073 5703019
$$ packed form
9372a0485106K228126M001004J224385j434356j350440o57344o58175N26932K688860
9363c916114K051753j618433k484402K129202N696119J884112m811583n418103
9355f487449q6075L235758J953644J228818K873805J646284m278591p995637m315677
9346a2225120J607750K531411K43460R09308L646295K577670j781430k542185
9338e032841J734072M139833Q27715k778707j378434J676071R92337j471012o92421
9329a983387J847243R11007k409352j902294K637118M043099m93836m258155j517813
9320c126370L416010L118954j731270m333003k182647P64538J422108J327572
9312a324108K355602L174388J805102r46029k397965j191499J387582K839946
$$ plain form
9304 5703019 7682505 7747075 6754972 5646164 4274519 2786803 2331087 2799453 1948997
9295 1948997 -679329 -1220649 3135532 7929775 6152775 -880464 -3656470 2478886
9287 2478886 10229354 10138150 2824130 -3468288 -4313792 -2566347 -1901376 -2370990 -2753134
9278 -2753134 -3148576 -4006921 -5026294 -5712909 -5427911 -3213029 502586 2737067 1074437
9269 1074437 -2390242 -3073819 -113916 2255751 424505 -3934979 -6365159 -5071945
9261 -5071945 -2218376 -610121 -560484 -158303 1905882 4169037 3683399 -75944 -3545583
9252 -3545583 -2803954 1340094 3849787 1598970 -2638863 -3599045 96028 4581936 5516508
9243 5516508 2554647 -1410931 -4007168 -5115240 -5678240 -6404755 -7618678 -9064635 -9747806
$$ packed form
9304E703019J979486O4570r92103j108808j371645j487716m55716M68366q50456
9295A948997k628326n41320M356181M794243j777000p033239k776006O135356
9287B478886P750468r1204p314020o292418q45504J747445O64971m69614l82144
9278b753134l95442q58345j019373o86615K84998K214882L715615K234481j662630
9269A074437l464679o83577K959903K369667j831246m359484k430180J293214
9261e071945K853569J608255M9637M02181K064185K263155m85638l759343l469639
9252c545583P41629M144048K509693k250817m237833r60182L695073M485908R34572
9243E516508k961861l965578k596237j108072n63000p26515j213923j445957o83171
$$ plain form
9234 -9747806 -9087291 -7985436 -7246974 -5507290 -1281884 3137839 3479590 17949 -1916037
9225 -1916037 51608 1457432 -1365132 -4395463 -1999303 3695640 5955887 3628839
9217 3628839 1168715 -171476 -3583536 -9136656 -12499990 -12288804 -11622510 -11127295 -7894313
9208 -7894313 -3294808 -3614044 -9391323 -12082929 -6334856 1396293 2212791 -3259487 -8249261
9199 -8249261 -9693976 -8377564 -4229181 1608158 4074681 414806 -4310340 -4289158 -1713094
9190 -1713094 -1591520 -1946252 2315828 8588511 9031470 3057204 -1486222 -149304 2972624
9181 2972624 3102040 810767 -1272878 -1660399 1333761 8240299 14469927 13462015 5476142
9172 5476142 -1827944 -2999218 -160921 2250951 2852831 1844854 -842155 -3916004
$$ packed form
9234i747806O60515J101855P38462J739684M225406M419723L41751l461641j933986
9225a916037J967645J405824k822564l030331K396160N694943K260247k327048
9217C628839k460124j340191l412060n553120l363334K11186O66294M95215L232982
9208g894313M599505l19236n777279k691606N748073P731149Q16498n472278m989774
9199h249261j444715J316412M148383N837339K466523l659875m725146K1182K576064
9190a713094J21574l54732M262080O272683M42959n974266m543426J336918L121928
9181B972624J29416k291273k083645l87521K994160O906538O229628j007912p985873
9172E476142p304086j171274K838297K411872O01880j007977k687009l073849
$$ plain form
9164 -3916004 -5325103 -5910244 -8413919 -11875840 -11648699 -6509487 -1267329 -304587 -2311595
9155 -2311595 -3252946 -1269125 2715056 6141850 5769078 698243 -5100034 -6543537 -3552739
9146 -3552739 123694 3040704 6073502 7452815 4295615 -846771 -1931165 1161235
9138 1161235 2374184 155616 315894 5061724 7344154 1482975 -7287110 -10306089
9130 -10306089 -7530992 -5443272 -6435843 -6993380 -4861935 -2335428 -2392477 -4951857 -6882506
9121 -6882506 -4484157 2333389 7854902 6092725 -626621 -3584875 40241 2950427
9113 2950427 -753594 -6332728 -6227602 -1519519 1376550 1300331 1980089 3767136 3528407
9104 3528407 1506303 881780 950045 -2032392 -6830029 -7316292 -2277764 1513792 -1043166
$$ packed form
9164c916004j409099n85141k503675l461921K27141N139212N242158R62742k007008
9155b311595r41351J983821L984181L426794l72772n070835n798277j443503K990798
9146c552739L676433K917010L032798J379313l157200n142386j084394L092400
9138A161235J212949k218568J60278M745830K282430n861179q770085l018979
9130a0306089K775097K087720r92571n57537K131445K526507n7049k559380j930649
9121f882506K398349O817546N521513j762177o719346k958254L625116K910186
9113B950427l704021n579134J05126M708083K896069p6219O79758J787047k38729
9104C528407k022104o24523O8265k982437m797637m86263N038528L791556k556958
$$ plain form
9095 -1043166 -6166131 -7263973 -3845368 -213286 1561478 2804677 3985816 3697801
9087 3697801 1924429 939342 1997946 3382817 2898630 740415 -1387017 -2744143 -3472186
9078 -3472186 -2891512 -200798 3039877 3551962 357270 -4010830 -7322561 -9992031 -11935796
9069 -11935796 -10464833 -4701217 599873 70161 -5034729 -9016236 -9623107 -8795515 -6995399
9060 -6995399 -3090648 354728 -1371920 -6951590 -8998732 -4513099 771511 1348556
9052 1348556 -718139 -1040621 85407 411944 884185 3330401 6508771 8461805 9384901
9043 9384901 8701493 3544810 -5612785 -12023973 -10405722 -4295271 -847906 -1445265 -2333835
9034 -2333835 -1452142 681347 4221882 8721597 10660874 7312569 1311625 -2978699
$$ packed form
9095a043166n122965j097842L418605L632082J774764J243199J181139k88015
9087C697801j773372r85087J058604J384871m84187k158215k127432j357126p28043
9078c472186N80674K690714L240675N12085l194692m368100l311731k669470j943765
9069a1935796J470963N763616N301090n29712n104890l981507o06871Q27592J800116
9060f995399L904751L445376j726648n579670k047142M485633N284610N77045
9052A348556k066695l22482J126028L26537M72241K446216L178370J953034R23096
9043I384901o83408n156683r157595o411188J618251O110451L447365n97359q88570
9034b333835Q81693K133489L540535M499715J939277l348305o000944m290324
$$ plain form
9026 -2978699 -5260533 -7082369 -7088652 -4047889 -1731408 -4438161 -9662886 -11437380 -9181632
9017 -9181632 -6944441 -5701826 -3368334 -1067419 -1831515 -3609129 -1297314 4110790
9009 4110790 6328967 4567478 5144968 10044795 12135531 5962416 -3602623 -8608559
9001 -8608559 -8590515 -8515331 -10112200 -10701703 -8426336 -4105808 835635 4911921 6194670
8992 6194670 4096003 564362 -2349916 -4704215 -6842473 -7348351 -5108300 -2050063
8984 -2050063 -1417433 -3675533 -5739819 -4388779 116154 3901946 3491954 325808 -290589
8975 -290589 3761141 7544991 5338621 -976472 -4251249 -2206706 -29630 -1865828
8967 -1865828 -4870630 -4356945 -837634 1534116 1047353 -341372 -546546 420095 1059257
$$ packed form
9026b978699k281834j821836o283L040763K316481k706753n224725j774494K255748
9017i181632K237191J242615K333492K300915p64096j777614K311815N408104
9009D110790K218177j761489N77490M899827K090736o173115r565039n005936
9001h608559J8044P5184j596869n89503K275367M320528M941443M076286J282749
8992F194670k098667l531641k914278k354299k138258n05878K240051L058237
8984b050063O32630k258100k064286J351040M504933L785792m09992l166146o16397
8975b90589M051730L783850k206370o315093l274777K044543K177076j836198
8967a865828l004802N13685L519311K371750m86763j388725k05174R66641O39162
$$ plain form
8958 1059257 -291902 -3827863 -6984804 -6186556 -1048726 4414700 5831522 2664590
8950 2664590 -2162217 -5344848 -5293930 -2799580 -483387 -315469 -1215106 -560500 1782298
8941 1782298 3026411 1608869 -510423 -820097 473686 1606471 2067598 2526070 2897248
8932 2897248 2185965 187848 -1684182 -1705486 44093 1155338 -736853 -4814159 -7393254
8923 -7393254 -5998270 -1938267 1791471 3493915 2772430 -168367 -3572268 -4725007
8915 -4725007 -3465968 -2793859 -3997089 -4304048 -2143980 -977055 -3691704 -6815467 -5747064
8906 -5747064 -2554434 -1961487 -2191940 2170443 9448586 11917325 8091226 4963614 6042823
8897 6042823 6256026 2424048 74913 4269891 10951968 13857423 13974385 15234409 16030932
$$ packed form
8958A059257j351159l535961l156941P98248N137830N463426J416822l166932
8950B664590m826807l182631N0918K494350K316193J67918q99637O54606K342798
8941A782298J244113j417542k119292l09674J293783J132785M61127M58472L71178
8932B897248p11283j998117j872030k1304J749579J111245j892191m077306k579095
8923g393254J394984M060003L729738J702444p21485k940797l403901j152739
8915d725007J259039O72109j203230l06959K160068J166925k714649l123763J068403
8906e747064L192630N92947k30453M362383P278143K468739l826099l127612J079209
8897F042823K13203l831978k349135M194978O682077K905455J16962J260024P96523
$$ plain form
8888 16030932 12748156 7851581 6335320 6567517 2902207 -3651929 -5616806 -614584
8880 -614584 4707769 4512548 1286055 309865 1547420 1202917 -1595810 -3908460 -3772326
8871 -3772326 -2526949 -2147404 -2634946 -3056504 -3689957 -5387212 -7089739 -6080776 -1757761
8862 -1757761 2707046 4376796 4443287 5234916 5067681 637826 -5938530 -8109030 -4330486
8853 -4330486 -1024514 -3218395 -7294568 -7285364 -4217736 -3783839 -7163424 -9709337 -8102464
8844 -8102464 -4399698 -2880644 -5781781 -11643509 -15593602 -12742806 -4006735 3156977
8836 3156977 2799206 -2583427 -6311153 -6325993 -5516246 -5301418 -4154835 -1844192 -213159
8827 -213159 225084 164935 -1633639 -6619205 -11637956 -11002486 -4237851 2886390 6019408
$$ packed form
8888A6030932l282776m896575j516261K32197l665310o554136j964877N002222
8880f14584N322353j95221l226493r76190J237555l44503k798727k312650J36134
8871c772326J245377L79545m87542m21558o33453j697255j702527J008963M323015
8862a757761M464807J669750O6491P91629j67235m429855o576356k170500L778544
8853d330486L305972k193881m076173R204L067628M33897l379585k545913J606873
8844h102464L702766J519054k901137n861728l950093K850796Q736071P163712
8836C156977l57771n382633l727726j4840Q09747K14828J146583K310643J631033
8827b13159M38243o0149j798574m985566n018751O35470O764635P124241L133018
$$ plain form
8818 6019408 6318357 5899954 4402568 2112228 1602190 3364035 3883102 1055922 -2127052
8809 -2127052 -2311529 -683154 38540 77704 496847 -147614 -2908986 -4876579 -2868754
8800 -2868754 1441477 4410253 6244672 9032111 10935329 8427403 3649069 3011776
8792 3011776 7553486 10891842 8866281 5381828 5365386 7149050 6507225 4302650 4555457
8783 4555457 7149094 8098020 6337035 5024472 5736458 6068620 4282762 2306756 2139332
8774 2139332 2531093 1709437 941899 2469806 5226592 5533729 2013988 -2304888 -3409990
8765 -3409990 -736280 2440148 2651710 -222749 -3280162 -4137697 -3239313 -2345606 -2087344
8756 -2087344 -2130955 -2413098 -2471821 -881420 2277677 3693840 795233 -3569758 -4617786
$$ packed form
8818F019408K98949m18403j497386k290340n10038J761845N19067k827180l182974
8809b127052j84477J628375P21694L9164M19143o44461k761372j967593K007825
8800b868754M310231K968776J834419K787439J903218k507926m778334o37293
8792C011776M541710L338356k025561l484453j6442J783664o41825k204575K52807
8783D555457K593637R48926j760985j312563P11986L32162j785858j976006j67424
8774B139332L91761q21656p67538J527907K756786L07137l519741m318876j105102
8765c409990K673710L176428K11562k874459l057413q57535Q98384Q93707K58262
8756b087344m3611k82143n8723J590401L159097J416163k898607m364991j048028
$$ plain form
8747 -4617786 -3378931 -5574474 -11714709 -14418036 -8856983 -411720 2995308 1909155
8739 1909155 2686929 6705652 8967948 6581057 2308150 -791215 -2808281 -4017498
8731 -4017498 -3312950 -1233666 -511841 -1838850 -2498248 -911556 557289 -811706 -4209474
8722 -4209474 -6658586 -6270288 -3070624 1312574 3873794 2355142 -1827445 -4645934
8714 -4645934 -4042666 -1560431 648262 1849459 1501017 -1013415 -4521500 -6447709 -5824377
8705 -5824377 -3720027 -681423 3289328 6249820 5634253 2751218 2053114 4790839 7342615
8696 7342615 7202001 6281056 6250328 5203892 2112289 412176 2948946 6435110 5668555
8687 5668555 1531498 145165 4378329 10033050 11235259 7156829 2217374 554447
$$ packed form
8747d617786J238855k195543o140235k703327N561053Q445263L407028j086153
8739A909155P77774M018723K262296k386891m272907l099365k017066j209217
8731d017498P04548K079284P21825j327009o59398J586692J468845j368995l397768
8722d209474k449112L88298L199664M383198K561220j518652m182587k818489
8714d645934O03268K482235K208693J201197l48442k514432l508085j926209O23332
8705e824377K104350L038604L970751K960492o15567k883035o98104K737725K551776
8696G342615j40614r20945l0728j046436l091603j700113K536770L486164p66555
8687E668555m137057j386333M233164N654721J202209m078430m939455j662927
$$ plain form
8679 554447 1347549 428006 -3520870 -6692480 -6059673 -4731306 -6999903 -10114778 -7553313
8670 -7553313 -241725 3287172 -58829 -2820108 837300 5546159 3880550 -1319913
8662 -1319913 -2221458 576084 -633908 -7240165 -11341254 -7563408 -591648 1861491
8654 1861491 -1387121 -5336772 -5624372 -2738669 -849849 -3125712 -7424297 -7940509 -2799454
8645 -2799454 2371441 1547236 -3387247 -5668041 -3158098 225525 1639286 2357333 3413050
8636 3413050 3470807 2427542 2733610 5237911 7144827 6003690 3155805 1690742 3014248
8627 3014248 6419478 10106330 11876532 10608135 7633240 5314977 4377214 4068339 4190864
8618 4190864 4900835 5171276 3712370 928789 -1962269 -4779658 -7282412 -7726027 -5225758
$$ packed form
8679E54447P93102r19543l948876l171610O32807J328367k268597l114875K561465
8670g553313P311588L528897l346001k761279L657408M708859j665609n200463
8662a319913r01545K797542j209992o606257m101089L777846O971760K453139
8654A861491l248612l949651k87600K885703J888820k275863m298585n16212N141055
8645b799454N170895q24205m934483k280794K509943L383623J413761P18047J055717
8636C413050N7757j043265L06068K504301J906916j141137k847885j465063J323506
8627C014248L405230L686852J770202j268397k974895k318263r37763l08875J22525
8618D190864P09971K70441j458906k783581k891058k817389k502754m43615K500269
$$ plain form
8609 -5225758 -2203153 -1542952 -2626752 -3167001 -3278301 -4140545 -4348951 -1963411 984615
8600 984615 729050 -2034993 -2815099 -62001 3146122 4224671 3698266 2572852 1125985
8591 1125985 490519 1740490 3539235 4176833 4970699 7552696 9233232 6212572 239473
8582 239473 -3661648 -5066904 -7284498 -9459178 -7255998 -1810658 194342 -2879509
8574 -2879509 -4898911 -2265686 988151 1683760 3105963 7634788 11093137 9823341
8566 9823341 7073552 6825921 7135618 5307478 3997864 5869977 7338558 4360620 -56484
8557 -56484 -996659 -98417 -1562556 -3354360 -409435 5741100 8485197 6043157 2627216
8548 2627216 583156 -1541658 -3388321 -2147088 1838848 4689403 4902397 4612448 4758217
$$ packed form
8609e225758L022605O60201j083800n40249j11300q62244k08406K385540K948026
8600I84615k55565k764043p80106K753098L208123J078549n26405j125414j446867
8591A125985o35466J249971J798745O37598P93866K581997J680536l020660n973099
8582B39473l901121j405256k217594k174680K203180N445340K005000l073851
8574b879509k019402K633225L253837O95609J422203M528825L458349j269796
8566I823341k749789k47631L09697j828140j309614J872113J468581k977938m417104
8557e6484r40175Q98242j464139j791804K944925O150535K744097k442040l415941
8548B627216k044060k124814j846663J241233L985936K850555K12994k89949J45769
$$ plain form
8539 4758217 4024529 2699135 2520093 2526991 160670 -3211353 -3041785 1417462 5670430
8530 5670430 6226863 3739133 -606949 -6916436 -13696151 -17640707 -17709893 -15883267 -13392885
8521 -13392885 -9979847 -6758134 -5291841 -3971904 -489316 2183139 -1419985 -9626445
8513 -9626445 -13750535 -10204996 -5686387 -6587364 -9554761 -7779143 -1800663 1964845
8505 1964845 645440 -2553707 -3748292 -2079924 937920 2644689 969663 -2796879
8497 -2796879 -4765172 -3790563 -3220267 -5083381 -6226310 -3701600 -443804 -974461 -4156824
8488 -4156824 -5298767 -3579044 -2102917 -1743561 -428599 1663476 1592655 -887989 -2178255
8479 -2178255 -497117 1531226 1711980 1867769 4196995 7041753 7076339 3924006 200542
$$ packed form
8539D758217p33688j325394j79042O898k366321l372023J69568M459247M252968
8530E670430N56433k487730m346082o309487o779715l944556o9186J826626K490382
8521a3392885L413038L221713J466293J319937L482588K672455l603124q206460
8513i626445m124090L545539M518609r00977k967397J775618N978480L765508
8505A964845j319405l199147j194585J668368L017844J706769j675026l766542
8497b796879j968293R74609N70296j863114j142929K524710L257796n30657l182363
8488d156824j141943J719723J476127L59356J314962K092075p0821k480644j290266
8479b178255J681138K028343J80754J55789K329226K844758L4586l152333l723464
$$ plain form
8470 200542 -1950889 -2486655 -2374652 -2407052 -2794846 -3114879 -2962805 -2829991 -3505279 -4482650
8460 -4482650 -4165707 -2077929 276971 1324074 1236062 1366188 2742372 5452945 8463771
8451 8463771 9546394 6558692 -102359 -6749286 -9132953 -6389165 -2208416 -1616818
8443 -1616818 -5894785 -10812479 -11058055 -6508553 -2233137 -1584164 -2016317 53103 3047566
8434 3047566 2948628 566527 827020 4587042 6601824 3563138 -778665 -1647130 -49623
8425 -49623 667494 1448393 5184158 9891929 10543160 7437846 6497153 9870946 12265581
8416 12265581 9680657 6423796 8342567 12680513 11206531 2577613 -4936051 -4707976
8408 -4707976 -251747 1053498 -1320963 -1778029 1709838 4457435 2600587 -1220312
$$ packed form
8470B00542k151431n35766J12003l2400l87794l20033J52074J32814o75288r77371
8460d482650L16943K087778K354900J047103q8012J30126J376184K710573L010826
8451H463771J082623k987702o661051o646927k383667K743788M180749N91598
8443a616818m277967m917694k45576M549502M275416O48973m32153K069420K994463
8434C047566r8938k382101K60493L760022K014782l038686m341803q68465J597507
8425d9623P17117P80899L735765M707771O51231l105314r40693L373793K394635
8416A2265581k584924l256861J918771M337946j473982q628918p513664K28075
8408d707976M456229J305245k374461m57066L487867K747597j856848l820899
$$ plain form
8400 -1220312 -2588391 -2039008 -2894110 -4511349 -2785821 2652203 6698688 6034563 4099290
8391 4099290 5839615 10373572 12579537 10443607 7028569 5499209 5627423 5728872 5248865
8382 5248865 4444467 3528163 2998717 3231440 3197108 1207681 -2590500 -6103244 -8035990
8373 -8035990 -8945349 -9198491 -8108536 -5906470 -4317701 -4040594 -3870108 -3554929 -4772227
8364 -4772227 -7145490 -6247753 646208 8500147 8835487 346138 -8917994 -11348810 -8187332
8355 -8187332 -5710997 -5949765 -5248846 -1424699 1876087 -15134 -5870951 -9296002 -6175271
8346 -6175271 769411 5478034 4970404 1295823 -1495265 -815247 3071979 7375347 8930512
8337 8930512 7534197 6521772 8336676 10472146 8430720 2237909 -3246619 -4785005
$$ packed form
8400a220312j368079N49383q55102j617239J725528N438024M046485o64125j935273
8391D099290J740325M533957K205965k135930l415038j529360J28214J01449m80007
8382E248865q04398r16304n29446K32723l4332j989427l798181l512744j932746
8373h035990r09359k53142J089955K202066J588769K77107J70486L15179j217298
8364d772227k373263Q97737O893961P853939L35340q489349r264132k430816L161478
8355h187332K476335k38768P00919L824147L300786j891221n855817l425051L120731
8346f175271O944682M708623n07630l674581k791088O80018L887226M303368J555165
8337H930512j396315j012425J814904K135470k041426o192811n484528j538386
$$ plain form
8329 -4785005 -3969801 -2983903 -1079027 2387058 4818367 3645737 515047 -1045554 -477846
8320 -477846 333830 764626 1255862 859928 -1233592 -2650459 -432320 3497014 3683696
8311 3683696 -1272153 -6309775 -6596810 -3457437 -1580260 -2620283 -3973548 -2936051
8303 -2936051 -165188 1169374 -894853 -4568621 -6127279 -4383777 -1816205 -444785
8295 -444785 1064511 4079404 6201688 4328351 74053 -1924075 -635993 419156
8287 419156 -1079135 -3448745 -4453192 -3944920 -2409534 -280724 684704 -1231611 -4408861
8278 -4408861 -5435279 -4319413 -4225656 -5648995 -5529688 -3092409 -1430103 -1679710 -1090460
8269 -1090460 781698 -112923 -4667772 -6633293 -1586511 4819127 3900240 -3843946 -9957107
$$ packed form
8329d785005Q15204R85898J904876L466085K431309j172630l130690j560601N67708
8320d77846Q11676M30796M91236l95934k093520j416867K218139L929334J86682
8311C683696m955849n037622k87035L139373J877177j040023j353265J037497
8303b936051K770863J334562k064227l673768j558658J743502K567572J371420
8295d44785J509296L014893K122284j873337m254298j998128J288082J055149
8287D19156j498291k369610j004447N08272J535386K128810R65428j916315l177250
8278d408861j026418J115866R3757j423339J19307K437279J662306k49607N89250
8269a090460J872158q94621m554849j965521N046782O405638r18887p744186o113161
$$ plain form
8260 -9957107 -9634591 -5941153 -3187498 -1894735 -881762 159605 1180623 2010185 1972185
8251 1972185 1409354 2419355 5536604 7511369 5564808 1783716 -450762 -2057938
8243 -2057938 -5566702 -8939399 -7877207 -3262092 -280914 -390054 -280654 850394 -383358
8234 -383358 -4410918 -6300161 -3383273 164680 -189843 -2897446 -4077002 -3663594 -3659789
8225 -3659789 -3464038 -1361136 1534093 3089458 4454649 8386647 13808007 15829918
8217 15829918 11752717 4407640 -1207734 -2800569 -1641019 -47736 786295 835295 303241
8208 303241 -393139 -48779 2217699 4667269 3899491 -237272 -3012058 -891096 2901890
8199 2901890 2877654 -295345 -984261 2366572 5306805 5333979 5606160 8335077 10278881
$$ packed form
8260i957107L22516L693438K753655J292763J012973J041367J021018Q29562l8000
8251A972185n62831J010001L117249J974765j946561l781092k234478j607176
8243b057938l508764l372697J062192M615115K981178j09140J09400J131048j233752
8234c83358m027560j889243K916888L547953l54523k707603j179556M13408L805
8225c659789J95751K102902K895229J555365J365191L931998N421360K021911
8217A5829918m077201p345077n615374j592835J159550J593283Q34031M9000n32054
8208C03241o96380L44360K266478K449570p67778m136763k774786K120962L792986
8199B901890k4236l172999o88916L350833K940233K7174K72181K728917J943804
$$ plain form
8190 10278881 8520467 5772345 5406920 5333312 1993689 -2715709 -4125706 -2321593 -1341141
8181 -1341141 -2001028 -1232482 1433971 2168817 -1078551 -5165406 -6309135 -4868967 -3710081
8172 -3710081 -4147828 -5235646 -5463632 -3876465 -753370 1960406 2081810 -248155 -2483977
8163 -2483977 -2736509 -1942881 -2303088 -4141583 -5035816 -2352379 3192168 7053025 5239635
8154 5239635 -733143 -5004986 -4129562 -772971 392831 -1681031 -4622773 -6352280
8146 -6352280 -6185866 -3923773 -621379 889115 -936335 -3627542 -3840790 -2417614 -3116072
8137 -3116072 -6602925 -9125930 -7746501 -4000854 -1427042 -1778490 -4537035 -7973080
8129 -7973080 -9623194 -7667253 -3250971 -214938 -1244440 -4902628 -7332125 -6595967
$$ packed form
8190A0278881j758414k748122l65425p3608l339623m709398j409997J804113R80452
8181a341141o59887P68546K666453P34846l247368m086855j143729J440168J158886
8172c710081m37747j087818k27986J587167L123095K713776J21404k329965k235822
8163b483977k52532P93628l60207j838495q94233K683437N544547L860857j813390
8154E239635n972778m271843Q75424L356591J165802k073862k941742j729507
8146f352280J66414K262093L302394J510494j825450k691207k13248J423176o98458
8137c116072l486853k523005J379429L745647K573812l51448k758545l436045
8129g973080j650114J955941M416282L036033j029502l658188k429497P36158
$$ plain form
8121 -6595967 -4741048 -5277067 -8525928 -10279546 -6495527 1107574 6556143 6920747 4894616
8112 4894616 3170714 612992 -3242861 -4456147 -345128 4465048 3620782 -1357283
8104 -1357283 -3342807 -271111 3232512 4548141 5930077 7521211 5080564 -2290822
8096 -2290822 -8672244 -9476995 -7676529 -7796395 -8603067 -6402304 -1679737 2196015 3920750
8087 3920750 4094145 3169261 2805453 5452666 9189693 7777736 342443 -4363089 352389
8078 352389 8078512 7963326 758007 -3162475 -33904 3172572 1445977 -1300042 -805155
8069 -805155 541007 -432795 -1630191 -234177 2052334 2790965 3182990 4345479 3642413
8060 3642413 -490329 -3794226 -1373437 5016619 9525037 9826173 7867246 5239993
$$ packed form
8121f595967J854919n36019l248861j753618L784019P603101N448569L64604k026131
8112D894616j723902k557722l855853j213286M111019M810176q44266m978065
8104a357283j985524L071696L503623J315629J381936J591134k440647p371386
8096b290822o381422q04751J800466j19866q06672K200763M722567L875752J724735
8087C920750J73395r24884l63808K647213L737027j411957p435293m705532M715478
8078C52389P726123j15186p205319l920482L128571L206476j726595k746019M94887
8069h05155J346162r73802j197396J396014K286511P38631L92025J162489p03066
8060C642413m132742l303897K420789O390056M508418L01136j958927k627253
$$ plain form
8052 5239993 2457008 1177660 2458087 3759764 1968456 -1451732 -2452642 -724400
8044 -724400 332751 -556718 -1379037 -1597984 -3282033 -6430578 -7650109 -5368138 -2603906
8035 -2603906 -2257830 -2818090 -1480513 853502 740272 -2845079 -7260972 -9421933 -8410398
8026 -8410398 -5188737 -1272314 2123666 4351147 4935930 3202230 -854272 -5384831
8018 -5384831 -7667694 -6610794 -3193195 1510189 6880012 10969798 10693683 5540914
8010 5540914 -614929 -3563543 -3631713 -4400502 -7177987 -9162278 -7413073 -2588347 2284686
8001 2284686 5376730 6989906 7491034 5978390 1951583 -2263650 -2459144 2699035 8458400
7992 8458400 7784009 -526650 -9227595 -10153155 -3519035 2768235 2999269 -236208 -1290182
$$ packed form
8052E239993k782985j279348J280427J301677j791308l420188j000910J728242
8044g24400J057151q89469q22319k18947j684049l148545j219531K281971K764232
8035b603906L46076n60260J337577K334015j13230l585351m415893k160961J011535
8026h410398L221661L916423L395980K227481N84783j733700m056502m530559
8018e384831k282863J056900L417599M703384N369823M089786k76115n152769
8010E540914o155843k948614o8170p68789k777485j984291J749205M824726M873033
8001B284686L092044J613176N01128j512644m026807m215233j95494N158179N759365
7992H458400o74391q310659q700945r25560O634120O287270K31034l235477j053974
$$ plain form
7983 -1290182 178879 -305054 -4120990 -6434662 -2668795 4868474 9596157 8418185
7975 8418185 4002662 14876 -2655770 -4358550 -4518584 -3030379 -1936482 -3293100
7967 -3293100 -5986096 -6707218 -4160760 -759710 351456 -1001438 -2076999 -873811
7959 -873811 959956 -70063 -4213983 -6790268 -3596881 2980278 6444690 4894414
7951 4894414 3362741 5878661 9259197 8198423 3342001 -292192 -1018628 -1474570 -2582933
7942 -2582933 -1893982 1245451 3698704 3476011 2646739 3188974 3432082 1203241 -2213507
7933 -2213507 -3858434 -2868067 -506721 1531080 1227015 -2777882 -8290974 -10367242 -7461792
7924 -7461792 -4092595 -4447795 -6104224 -4052602 1016694 3068367 -1160256 -8360458
$$ packed form
7983a290182J469061m83933l815936k313672L765867P537269M727683j177972
7975H418185m415523l987786k670646j702780j60034J488205J093897j356618
7967c293100k692996p21122K546458L401050J111166j352894j075561J203188
7959h73811J833767j030019m143920k576285L193387O577159L464412j550276
7951D894414j531673K515920L380536j060774m856422l634193p26436m55942j108363
7942b582933O88951L139433K453253k22693q29272N42235K43108k228841l416748
7933b213507j644927R90367K361346K037801l04065m004897n513092k076268K905450
7924g461792L369197l55200j656429K051622N069296K051673m228623p200202
$$ plain form
7916 -8360458 -13012500 -12291494 -6770335 360911 4416326 2660021 -2488967 -5724485
7908 -5724485 -4478425 -509848 3210856 4458982 1552083 -5087039 -11297946 -12886637
7900 -12886637 -11185529 -11106010 -13480380 -14003418 -10764546 -7527418 -7038902 -6138305 -1423002
7891 -1423002 4339095 6235721 4689098 3762474 3936058 2078583 -1952319 -3982097 -1539585
7882 -1539585 3066034 6718802 8727039 8810947 5713456 186787 -3531100 -2197345 1925094
7873 1925094 3533236 541812 -4082981 -6311060 -5114817 -2487622 -740983 -371611
$$ packed form
7916h360458m652042P21006N521159P131246M055415j756305n148988l235518
7908e724485J246060L968577L720704J248126k906899o639122o210907j588691
7900a2886637J701108P9519k374370n23038L238872L237128M88516R00597M715303
7891a423002N762097J896626j546623r26624J73584j857475m030902k029778K442512
7882a539585M605619L652768K008237Q3908l097491n526669l717887J333755M122439
7873A925094J608142k991424m624793k228079J196243K627195J746639L69372
$$ [...]
##END NTUPLES=NMR SPECTRUM
##END=
