##TITLE=31Pdec_SR88_rm3
 , 24 sc
 20.09.2021
##JCAMPDX= 6.0         $$ Bruker NMR JCAMP-DX V2.0
##DATA TYPE= NMR SPECTRUM
##DATA CLASS= NTUPLES
##ORIGIN= UXNMR, Bruker Analytische Messtechnik GmbH
##OWNER= root
$$ XWIN-NMR		Version 3.5
$$ Mon Sep 20 12:41:41 2021 Russian Standard Time (UT+4h)  she@DPX200
##.OBSERVE FREQUENCY= 81.013821
##.OBSERVE NUCLEUS= ^31P
##.ACQUISITION MODE= SIMULTANEOUS
##.ACQUISITION SCHEME= undefined
##.AVERAGES= 24
##.DIGITISER RES= 16
##SPECTROMETER/DATA SYSTEM= spect
##.PULSE SEQUENCE= zgpg30
##.SOLVENT NAME= CDCl3
##.SHIFT REFERENCE= (INTERNAL, CDCl3, 0, 248.564)
##AUDIT TRAIL= $$ (NUMBER, WHEN, WHO, WHERE, WHAT)
$$ ##TITLE= Audit trail, XWIN-NMR		Version 3.5
$$ ##JCAMPDX= 5.01
$$ ##ORIGIN= Bruker BioSpin GmbH
$$ ##OWNER= she
$$ F:/spectra/data/she/nmr/P31/1/pdata/1/auditp.txt
$$ ##AUDIT TRAIL=  $$ (NUMBER, WHEN, WHO, WHERE, WHAT)
(   1,<2021-09-20 12:39:48.18 +0400>,<she>,<DPX200>,
      <created by zg, POWCHK disabled, PULCHK disabled
       configuration hash MD5:
       00 E9 B6 7A A2 85 ED C7 34 08 36 98 17 FE 4E 26
       data hash MD5: 32K
       A3 D8 CA 31 6C F5 AF 2C 84 98 32 A4 FC 1E B1 0C>)
(   2,<2021-09-20 12:40:50.34 +0400>,<she>,<DPX200>,
      <Start of raw data processing
       efp BC_mod = 2 LB = 1 FT_mod = 6 PKNL = 1 PHC0 = -8104.434 PHC1 = 61.67024 SI = 64K 
       data hash MD5: 64K
       AD D3 55 6A 52 4B 74 90 4B 16 AA 73 56 F7 0B 09>)
(   3,<2021-09-20 12:41:12.50 +0400>,<she>,<DPX200>,
      <pk PHC0 = -5.258162 PHC1 = 19.4 
       data hash MD5: 64K
       9C 24 79 7C 03 32 BC EE EE BD 34 C7 BA 6E 18 16>)
(   4,<2021-09-20 12:41:16.82 +0400>,<she>,<DPX200>,
      <abs ABSG = 5 
       data hash MD5: 64K
       C8 D8 78 D1 6F 6F 22 E6 D3 D0 2F EC 02 B1 A4 19>)
$$ ##END=
$$ 
$$ hash MD5
$$ 89 72 7C B0 D9 78 A3 91 FC 16 B5 6A 30 69 2F 38
##$RELAX= 
##$RELAX= 
##$RELAX= 
##$RELAX= 
##$RELAX= 
##$RELAX= 
##$RELAX= 
##$RELAX= 
$$ Bruker specific parameters
$$ --------------------------
##$DU= <F:/spectra>
##$EXPNO= 1
##$NAME= <P31>
##$PROCNO= 1
##$TYPE= <nmr>
##$USER= <she>
##$AMP= (0..31)
100 100 100 100 100 100 100 100 100 100 100 100 100 100 100 100 100 100 
100 100 100 100 100 100 100 100 100 100 100 100 100 100 
##$AQSEQ= 0
##$AQ_mod= 1
##$AUNM= <au_zg>
##$AUTOPOS= <>
##$BF1= 81.014009
##$BF2= 200.13
##$BF3= 200.13
##$BF4= 200.13
##$BF5= 200.13
##$BF6= 200.13
##$BF7= 200.13
##$BF8= 200.13
##$BYTORDA= 1
##$CFDGTYP= 0
##$CFRGTYP= 5
##$CHEMSTR= <none>
##$CNST= (0..31)
1 1 145 1 1 1 1 1 1 1 1 1 1 1 1 1 1 1 1 1 1 1 1 1 1 1 1 1 1 1 1 1 
##$CPDPRG= <waltz16>
##$CPDPRG1= <>
##$CPDPRG2= <waltz16>
##$CPDPRG3= <>
##$CPDPRG4= <mlev>
##$CPDPRG5= <mlev>
##$CPDPRG6= <mlev>
##$CPDPRG7= <mlev>
##$CPDPRG8= <mlev>
##$CPDPRGB= <>
##$CPDPRGT= <>
##$D= (0..31)
0 1 0 0 0 0 0 0 0 0 0 0.03 2e-05 3e-06 0 0 0 0 0 0 0 0 0 0 0 0 0 0 0 0 
0 0 
##$DATE= 1632127187
##$DBL= (0..7)
120 120 120 11 120 120 24 19 
##$DBP= (0..7)
150 150 150 150 150 150 150 150 
##$DBP07= 0
##$DBPNAM0= <>
##$DBPNAM1= <>
##$DBPNAM2= <>
$$ [...]
##$SUBNAM3= <"">
##$SUBNAM4= <"">
##$SUBNAM5= <"">
##$SUBNAM6= <"">
##$SUBNAM7= <"">
##$SUBNAM8= <"">
##$SUBNAM9= <"">
##$SW= 501.771253377433
##$SWIBOX= (0..15)
0 1 3 0 0 0 0 0 0 0 0 0 0 0 0 0 
##$SW_h= 40650.406504065
##$TD= 32768
##$TD0= 1
##$TE= 0
##$TE2= 300
##$TE3= 300
##$TEG= 300
##$TL= (0..7)
0 120 53 12 22 120 120 120 
##$TP= (0..7)
150 150 150 150 150 150 150 150 
##$TP07= 0
##$TPNAME0= <>
##$TPNAME1= <>
##$TPNAME2= <>
##$TPNAME3= <>
##$TPNAME4= <>
##$TPNAME5= <>
##$TPNAME6= <>
##$TPNAME7= <>
##$TPOAL= (0..7)
0.5 0.5 0.5 0.5 0.5 0.5 0.5 0.5 
##$TPOFFS= (0..7)
0 0 0 0 0 0 0 0 
##$TUNHIN= 0
##$TUNHOUT= 0
##$TUNXOUT= 0
##$USERA1= <user>
##$USERA2= <user>
##$USERA3= <user>
##$USERA4= <user>
##$USERA5= <user>
##$V9= 5
##$VALIST= <valist>
##$VCLIST= <CCCCCCCCCCCCCCC>
##$VD= 0
##$VDLIST= <DDDDDDDDDDDDDDD>
##$VPLIST= <PPPPPPPPPPPPPPP>
##$VTLIST= <TTTTTTTTTTTTTTT>
##$WBST= 1024
##$WBSW= 4
##$XGAIN= (0..3)
0 0 0 0 
##$XL= 0
##$YL= 0
##$YMAX_a= 6637
##$YMIN_a= -10947
##$ZGOPTNS= <>
##$ZL1= 120
##$ZL2= 120
##$ZL3= 120
##$ZL4= 120
##$ABSF1= 248.5645
##$ABSF2= -253.2056
##$ABSG= 5
##$ABSL= 3
##$ALPHA= 0
##$AQORDER= 0
##$ASSFAC= 0
##$ASSFACI= 0
##$ASSFACX= 0
##$ASSWID= 0
##$AUNMP= <proc_1d>
##$AZFE= 0.1
##$AZFW= 0.5
##$BCFW= 0
##$BC_mod= 2
##$BYTORDP= 0
##$COROFFS= 0
##$CY= -3
##$DATMOD= 1
##$DC= 0
##$DFILT= <>
##$DTYPP= 0
##$F1P= 0
##$F2P= 0
##$FCOR= 1
##$FTSIZE= 65536
##$FT_mod= 6
##$GAMMA= 0
##$GB= 0
##$INTBC= 1
##$INTSCL= 5.30512e-09
##$ISEN= 30
##$LB= 1
##$LEV0= 0
##$LPBIN= 0
##$MAXI= 10000
##$MC2= 0
##$MEAN= 0
##$ME_mod= 0
##$MI= 50
##$NCOEF= 0
##$NC_proc= -8
##$NLEV= 6
##$NOISF1= 182.463
##$NOISF2= 159.3651
##$NSP= 0
##$NTH_PI= 0
##$NZP= 0
##$OFFSET= 248.5645
##$PC= 4
##$PHC0= -8109.692
##$PHC1= 81.07024
##$PH_mod= 1
##$PKNL= yes
##$PPARMOD= 0
##$PSCAL= 0
##$PSIGN= 0
##$REVERSE= no
##$SF= 81.014009
##$SI= 65536
##$SIGF1= 159.3651
##$SIGF2= -187.1042
##$SINO= 113.3802
##$SIOLD= 16384
##$SREGLST= <1H.CDCl3>
##$SSB= 0
##$STSI= 65536
##$STSR= 0
##$SW_p= 40650.406504065
##$SYMM= 0
##$S_DEV= 0
##$TDeff= 32768
##$TDoff= 0
##$TI= <>
##$TILT= no
##$TM1= 0
##$TM2= 0
##$TOPLEV= 0
##$USERP1= <user>
##$USERP2= <user>
##$USERP3= <user>
##$USERP4= <user>
##$USERP5= <user>
##$WDW= 1
##$XDIM= 65536
##$YMAX_p= 238352665
##$YMIN_p= -379623116
$$ End of Bruker specific parameters
$$ ---------------------------------
##NTUPLES= NMR SPECTRUM
##VAR_NAME=  FREQUENCY,     SPECTRUM/REAL,   SPECTRUM/IMAG
##SYMBOL=    X,             R,               I
##VAR_TYPE=  INDEPENDENT,   DEPENDENT,       DEPENDENT
##VAR_FORM=  AFFN,          ASDF,            ASDF
##VAR_DIM=   65536,         65536,           65536
##UNITS=     HZ,            ARBITRARY UNITS, ARBITRARY UNITS
##FACTOR=    0.620285442955139, 1,           1
##FIRST=     20137.2065510759, 0,            0
##LAST=      -20513.1999529892, 0,           0
##MIN=       -20513.1999529892, -379623116,  0
##MAX=       20137.2065510759, 238352665,    0
$$ Real data points
##PAGE= N=1
##DATA TABLE= (X++(R..R)), XYDATA
$$ [...]
$$ plain form
43424 -2999081 -7956141 -10617815 -14259326 -16276627 -11656987 -2983287 1328184 -1465190
43416 -1465190 -5494359 -5340074 -2133882 514598 1548052 1483386 201591 -2097632 -3928437
43407 -3928437 -3954100 -2215821 196021 1431909 -416342 -5043374 -9152094 -9889425 -8018044
43398 -8018044 -5703648 -2979727 594694 2610641 391100 -3855811 -4952084 -2001060
43390 -2001060 569969 -34841 -1231487 169917 3206534 4954053 4523295 2664693
43382 2664693 -138154 -2978181 -4087465 -3363524 -3543247 -6577140 -10309379 -11087417 -8567338
43373 -8567338 -5619208 -4181939 -3499104 -2306360 -790030 -581 -537757 -2118828 -3767446
43364 -3767446 -4436778 -3897258 -2770148 -1515109 -173691 587051 -481142 -3110142 -4635292
$$ packed form
43424b999081m957060k661674l641511k017301M619640Q673700M311471k793374
43416a465190m029169J54285L206192K648480J033454o4666j281795k299223j830805
43407c928437k5663J738279K411842J235888j848251m627032m108720p37331J871381
43398h018044K314396K723921L574421K015947k219541m246911j096273K951024
43390b001060K571029o04810j196646J401404L036617J747519m30758j858602
43382B664693k802847k840027j109284P23941j79723l033893l732239p78038K520079
43373h567338K948130J437269O82835J192744J516330P89449n37176j581071j648618
43364c767446o69332N39520J127110J255039J341418P60742j068193k629000j525150
$$ plain form
43355 -4635292 -2702857 1762112 5637009 7122482 6811350 5730560 4017555 1658493
43347 1658493 -863014 -3056068 -4690186 -5504761 -5542175 -5673982 -6682695 -7784306 -7225935
43338 -7225935 -4498321 -810409 2742136 6112798 9114606 10838760 10975852 10401342
43330 10401342 9726835 8641751 7406801 7185364 7655499 6349114 2439371 -697848
43322 -697848 358667 3655245 4172351 1005219 -1843255 -2213960 -2772468 -5399685 -6963353
43313 -6963353 -4137218 685814 2416072 333434 -1945790 -2414878 -2465444 -3188522 -3928758
43304 -3928758 -4670207 -6046820 -6574321 -3820416 770849 2285479 -844417 -4360563
43296 -4360563 -4669854 -3831101 -4881875 -5860521 -3084625 1815990 3247999 -457051 -5038439
$$ packed form
43355d635292J932435M464969L874897J485473l11132j080790j713005k359062
43347A658493k521507k193054j634118q14575l7414j31807j008713j101611N58371
43338g225935K727614L687912L552545L370662L001808J724154J37092n74510
43330A0401342o74507j085084j234950k21437M70135j306385l909743l137219
43322f97848J056515L296578N17106l167132k848474l70705n58508k627217j563668
43313f963353K826135M823032J730258k082638k279224m69088n0566p23078p40236
43304c928758p41449j376613n27501K753905M591265J514630l129896l516146
43296d360563l09291Q38753j050774r78646K775896M900615J432009l705050m581388
$$ plain form
43287 -5038439 -6651749 -6253180 -6445555 -7280361 -7119555 -5476994 -3130890 -762430 1121490
43278 1121490 2022734 2324025 3199837 4494336 3797174 -726335 -6974519 -10039453 -7311524
43269 -7311524 -1631316 1617483 607178 -752874 2184382 8183498 10738852 6314601
43261 6314601 -255076 -1216143 4368063 9705562 9303907 5251023 2709488 2481876 1685066
43252 1685066 65876 915824 5024362 8039408 6532192 3622901 4513030 7877815
43244 7877815 6807783 -729432 -7319498 -5385587 2316944 6188600 2269267 -3861220
43236 -3861220 -5824676 -4030905 -2643354 -3108242 -3692322 -2779611 176024 4884748 8919327
43227 8919327 8448927 3159490 -1657476 -1233333 2265670 3113782 231377 -2323462 -2192544
$$ packed form
43287e038439j613310L98569j92375q34806J60806J642561K346104K368460J883920
43278A121490R01244L01291Q75812J294499o97162m523509o248184l064934K727929
43269g311524N680208L248799j010305j360052K937256N999116K555354m424251
43261F314601o569677r61067N584206N337499m01655m052884k541535k27612p96810
43252A685066j619190Q49948M108538L015046j507216k909291Q90129L364785
43244G877815j070032p537215o590066J933911P702531L871656l919333o130487
43236c861220j963456J793771J387551m64888n84080R12711K955635M708724M034579
43227H919327m70400n289437m816966M24143L499003Q48112k882405k554839J30918
$$ plain form
43218 -2192544 -1181843 -591147 1178589 4952205 8679448 10729628 11843515 12064833
43210 12064833 9252744 3045681 -2810958 -5036421 -5322197 -7194373 -10228112 -10761970
43202 -10761970 -7518034 -3458388 -2050457 -3774293 -6293455 -6587867 -3317518 1520520
43194 1520520 3864284 1930125 -1412269 -2134753 -130059 1137945 -348455 -2664232
43186 -2664232 -2830996 -425650 2605268 4598998 5362262 4886639 2231732 -3018552 -8405934
43177 -8405934 -9722650 -5892702 -1138000 69899 -973123 454523 4627310 6221228
43169 6221228 2255437 -3052855 -4004700 -639483 2967435 4939130 6371220 7543976
43161 7543976 7151777 4836543 1819276 -432432 -394465 2947344 7495767 8349142 3871656
$$ packed form
43218b192544J010701N90696J769736L773616L727243K050180J113887K21318
43210A2064833k812089o207063n856639k225463k85776j872176l033739n33858
43202a0761970L243936M059646J407931j723836k519162k94412L270349M838038
43194A520520K343764j934159l342394p22484K004694J268004j486400k315777
43186b664232j66764K405346L030918J993730P63264m75623k654907n250284n387382
43177h405934j316716L829948M754702J207899j043022J427646M172787J593918
43169F221228l965791n308292r51845L365217L606918J971695J432090J172756
43161G543976l92199k315234l017267k251708L7967L341809M548423Q53375m477486
$$ plain form
43152 3871656 -842534 -453100 2947600 3573310 1588140 2803600 8910459 14450452
43144 14450452 14968101 12400816 10093591 7782849 4656642 2749337 3438222 4150374
43136 4150374 2472752 597543 1643983 3917888 3115980 -1160879 -5112561 -6263154
43128 -6263154 -5730655 -5190695 -4657489 -3547982 -1682163 956400 3797451 5277758 4412365
43119 4412365 2322633 757142 -187167 -1320986 -2237891 -1823772 -335215 783863 768438
43110 768438 -212448 -2027290 -4323389 -5976060 -6315673 -6259402 -6780270 -7021768 -5531710
43101 -5531710 -2761355 -809498 -1070898 -3150239 -5342232 -5420804 -2393954 1457375 2129710
43092 2129710 -1053287 -4026847 -3449744 -1112781 -311754 -467456 874189 2690492 1714555
$$ packed form
43152C871656m714190L89434L400700O25710j985170J215460O106859N539993
43144A4450452N17649k567285k307225k310742l126207j907305O88885P12152
43136D150374j677622j875209J046440K273905q01908m276859l951682j150593
43128f263154N32499N39960N33206J109507J865819K638563K841051J480307q65393
43119D412365k089732j565491r44309j133819r16905M14119J488557J119078j5425
43110G68438r80886j814842k296099j652671l39613N6271n20868k41498J490058
43101e531710K770355J951857k61400k079341k191993p8572L026850L851329O72335
43092B129710l182997k973560N77103K336963Q01027j55702J341645J816303r75937
$$ plain form
43083 1714555 -1900884 -4788731 -6019622 -7833329 -10235502 -9764669 -5417657 -1577775
43075 -1577775 -2342505 -5942976 -7608769 -5895293 -3427030 -2514352 -2433486 -941529 2767347
43066 2767347 6747430 7910805 5425096 1977307 536585 593243 -662997 -4046104
43058 -4046104 -7353005 -8331825 -6764088 -4121953 -3009940 -5761297 -11137023 -13981545
43050 -13981545 -11420349 -7657394 -8332098 -11823670 -11879444 -7965014 -5973275 -7921534
43042 -7921534 -8399110 -3713018 2445463 5926478 8048936 10317175 9723892 4822579
43034 4822579 658886 1278432 2429817 -1201325 -6055217 -5113654 189777 2338531
43026 2338531 29787 -959842 1476892 3251120 2909415 4076290 7136462 6914815 1835628
$$ packed form
43083A714555l615439k887847j230891j813707k402173M70833M347012L839882
43075a577775p64730l600471j665793J713476K468263R12678Q0866J491957L708876
43066B767347L980083J163375k485709l447789j440722N6658j256240l383107
43058d046104l306901r78820J567737K642135J112013k751357n375726k844522
43050a3981545K561196L762955o74704l491572n5774L914430J991739j948259
43042g921534m77576M686092O158481L481015K122458K268239n93283m901313
43034D822579m163693O19546J151385l631142m853892R41563N303431K148754
43026B338531k308744r89629K436734J774228l41705J166875L060172k21647n079187
$$ plain form
43017 1835628 -2222212 -1303343 138927 -3030867 -8178617 -9613394 -7168642 -4400499
43009 -4400499 -1761245 2488353 6724149 7028731 3121458 -1276684 -3649231 -4498208
43001 -4498208 -4224781 -1796009 2866342 7614835 9961665 9177603 6681000 5018105
42993 5018105 5584895 6796220 5937916 3187001 1345500 792210 -1809107 -7564609 -11629724
42984 -11629724 -9165847 -2680774 806157 -1213725 -4562270 -4801004 -2070552 790067
42976 790067 1736472 313125 -2684468 -5521189 -6963725 -7496066 -7798607 -6779948 -3205900
42967 -3205900 1335786 3663486 3082958 1704366 569097 -1759801 -5898774 -9446093
42959 -9446093 -9670050 -6860986 -3512261 -1128151 759260 2817136 4447550 4526379 3121371
$$ packed form
43017A835628m057840R18869J442270l169794n147750j434777K444752K768143
43009d400499K639254M249598M235796L04582l907273m398142k372547q48977
43001d498208K73427K428772M662351M748493K346830p84062k496603j662895
42993E018105N66790J211325q58304k750915j841501n53290k601317n755502m065115
42984a1629724K463877O485073L486931k019882l348545k38734K730452K860619
42976G90067R46405j423347k997593k836721j442536n32341l02541J018659L574048
42967c205900M541686K327700n80528j378592j135269k328898m138973l547319
42959i446093k23957K809064L348725K384110J887411K057876J630414P8829j405008
$$ plain form
42950 3121371 1773722 1809205 3032149 4762816 7131175 9659017 9591543 4777951 -1756943
42941 -1756943 -4006768 -995820 1582638 44350 -1661481 860546 4124787 2072856
42933 2072856 -3042981 -2966158 3578201 8074148 4441062 -2795755 -6006926 -4418698
42925 -4418698 -2198690 -1091105 8210 1133799 1833777 3719032 7842052 10849498
42917 10849498 8284991 1355478 -3583575 -2542009 2297917 6481209 7919534 6973053
42909 6973053 4524231 1295317 -2063049 -4750665 -5313278 -2363614 2943649 6496823
42901 6496823 5350904 1318728 -1626655 -2364233 -2540282 -2791566 -2429697 -2139684 -3121617
42892 -3121617 -3622818 -522325 4875935 6883061 2913074 -2910607 -5726261 -5764003 -5456582
$$ packed form
42950C121371j347649L5483J222944J730667K368359K527842o7474m813592o534894
42941a756943k249825L010948K578458j538288j705831K522027L264241k051931
42933B072856n115837P6823O544359M495947l633086p236817l211171J588228
42925d418698K220008J107585J099315J125589O99978J885255M123020L007446
42917A0849498k564507o929513m939053J041566M839926M183292J438325r46481
42909F973053k448822l228914l358366k687616n62613K949664N307263L553174
42901F496823j145919m032176k945383p37578j76049k51284L61869K90013r81933
42892c121617n01201L100493N398260K007126l969987n823681k815654l7742L07421
$$ plain form
42883 -5456582 -4347323 -805956 3636089 5839142 5503592 4341540 2225031 -1758205
42875 -1758205 -5513938 -5953322 -4647650 -6468060 -11553102 -13509685 -8008694 752468
42867 752468 5241063 3416467 -671686 -2828614 -2051447 453815 2415721 1605939 -1542494
42858 -1542494 -3402892 -1659575 1129379 1473488 756315 2818409 6669802 7110775 3506513
42849 3506513 2158487 6860686 12010076 9996339 2233213 -3034184 -2593907 -1621530
42841 -1621530 -4332823 -7363021 -5825098 -1587974 -602983 -3903063 -6208165 -3509907
42833 -3509907 2157388 6566694 8222321 7416316 3562594 -3143504 -9062647 -9883227
42825 -9883227 -6027959 -2228790 -1223517 -741580 2141511 6350319 8526376 7626317
$$ packed form
42883e456582J109259L541367M442045K203053l35550j162052k116509l983236
42875a758205l755733m39384J305672j820410n085042j956583N500991Q761162
42867G52468M488595j824596m088153k156928P77167K505262J961906q09782l148433
42858a542494j860398J743317K788954L44109p17173K062094L851393M40973l604262
42849C506513j348026M702199N149390k013737p763126n267397M40277R72377
42841a621530k711293l030198J537923M237124R84991l300080k305102K698258
42833c509907N667295M409306J655627q06005l853722o706098n919143q20580
42825i883227L855268L799169J005273M81937K883091M208808K176057r00059
$$ plain form
42817 7626317 5590688 4339428 4008113 3734318 2778039 1172440 36016 417240 1352216
42808 1352216 858587 -229072 1814640 7590006 11455941 8379053 1761003 -721599
42800 -721599 1825049 2633515 -1820767 -6423671 -5736827 -2017319 -493760 -1120981 -633895
42791 -633895 240503 -1899284 -5726004 -5630269 -426204 4034245 3055864 -702613 -2109110
42782 -2109110 -917230 -522212 -1779416 -2276290 -1040601 -152237 -1114615 -2623946 -3166325
42773 -3166325 -3466155 -4548684 -5112239 -3331019 -605016 -722858 -4649126 -8466694 -7952777
42764 -7952777 -3548160 908195 2978802 3063618 2141832 710456 -340126 -300835 -142355
42755 -142355 -1170393 -2324234 -1471595 612656 748240 -1640535 -3429639 -2811032 -1963999
$$ packed form
42817G626317k035629j251260l31315k73795r56279j605599j136424L81224R34976
42808A352216m93629j087659K043712N775366L865935l076888o618050k482602
42800g21599K546648Q08466m454282m602904O86844L719508J523559o27221M87086
42791f33895Q74398k139787l826720R5735N204065M460449r78381l758477j406497
42782b109110J191880L95018j257204m96874J235689Q88364r62378j509331n42379
42773c166325k99830j082529n63555J781220K726003j17842l926268l817568N13917
42764g952777M404617M456355K070607Q4816r21786j431376j050582L9291J58480
42755a42355j028038j153841Q52639K084251J35584k388775j789104O18607Q47033
$$ plain form
42746 -1963999 -3117267 -5247156 -6537057 -6841415 -5852873 -2599993 987770 485874 -3835745
42737 -3835745 -5113625 219999 5510190 3071079 -3916049 -6495356 -3862270 -2924572
42729 -2924572 -5171992 -4374376 1104768 3949268 62549 -3745902 -350226 6281890
42721 6281890 7296119 1704443 -4175305 -6632796 -6804213 -5012915 37875 6521393
42713 6521393 9798555 8375668 5247491 2614488 -784181 -5855820 -9920500 -9300966
42705 -9300966 -3840665 2363052 4601816 2097304 -1103124 -762191 2340545 4065193
42697 4065193 3547398 4333668 7873635 10563803 9857320 8582628 9330054 9161556 5075454
42688 5075454 547856 171774 1217084 -1766636 -6287125 -4826966 2081073 5317361
$$ packed form
42746a963999j153268k129889j289901l04358R88542L252880L587763n01896m321619
42737c835745j277880N333624N290191k439111o987128k579307K633086R37698
42729b924572k247420P97616N479144K844500l886719l808451L395676O632116
42721F281890J014229n591676n879748k457491j71417J791298N050790O483518
42713F521393L277162j422887l128177k633003l398669n071639m064680O19534
42705i300966N460301O203717K238764k504512l200428L40933L102736J724648
42697D065193n17795P86270L539967K690168p06483j274692P47426j68498m086102
42688E075454m527598l76082J045310k983720m520489J460159O908039L236288
$$ plain form
42680 5317361 1465089 -1761623 1731520 6783470 5971235 1358259 16428 2445208
42672 2445208 2961734 -903334 -6208503 -10443560 -13508961 -14499600 -12026760 -7809979
42664 -7809979 -5292071 -4567993 -2898382 -159755 731696 -754935 -1393248 635864 3129815
42655 3129815 3753075 2976924 1629939 -1088557 -5120822 -7755383 -6436558 -1706081
42647 -1706081 3715291 6883465 5438342 -329387 -5328170 -3414854 4763246 11317885
42639 11317885 10893594 6965077 5089932 4171865 -173569 -6508166 -8606920 -5046165
42631 -5046165 -1370098 -1667747 -3560225 -3507902 -2241838 -2142015 -2930317 -2844616 -1382117
42622 -1382117 1277879 4774705 6719805 3950367 -1951964 -4365389 -324851 4247147
$$ packed form
42680E317361l852272l226712L493143N051950q12235m612976j341831K428780
42672B445208N16526l865068n305169m235057l065401r90639K472840M216781
42664g809979K517908P24078J669611K738627Q91451j486631o38313K029112K493951
42655C129815O23260p76151j346985k718496m032265k634561J318825M730477
42647a706081N421372L168174j445123n767729m998783J913316Q178100O554639
42639A1317885m24291l928517j875145r18067m345434o334597k098754L560755
42631e046165L676067k97649j892478N2323J266064R9823p88302Q5701J462499
42622a382117K659996L496826J945100k769438n902331k413425M040538M571998
$$ plain form
42614 4247147 2433399 -3870878 -7391706 -6049248 -3756778 -2253295 557539 3838107
42606 3838107 2774349 -3358734 -8271083 -7088330 -2733465 -446175 -451458 -65279 781507
42597 781507 637006 274202 969486 1336444 1892 -855846 913188 2477873 -197724
42588 -197724 -5125188 -6576235 -4104400 -3168921 -5891371 -7300855 -3368069 2382448
42580 2382448 4101303 1786075 -46444 400581 676759 -936430 -2764087 -2612971 -720653
42571 -720653 1054055 1462603 682319 -54773 667299 3006796 5034031 4291864 666218
42562 666218 -3082521 -4396442 -4024963 -4950065 -8092338 -10387763 -8280076 -2375095 3119190
42553 3119190 5549945 6378876 7887805 9562856 9590891 8285793 7485473 7360661 6577758
$$ packed form
42614D247147j813748o304277l520828J342458K292470J503483K810834L280568
42606C838107j063758o133083m912349J182753M354865K287290n283L86179Q46786
42597G81507j44501l62804O95284L66958j334552q57738J769034J564685k675597
42588a97724m927464j451047K471835R35479k722450j409484L932786N750517
42580B382448J718855k315228j832519M47025K76178j613189j827657J51116J892318
42571g20653J774708M08548p80284p37092P22072K339497K027235p42167l625646
42562F66218l748739j313921L71479r25102l142273k295425K107687N904981N494285
42553C119190K430755Q28931J508929J675051K8035j305098q00320j24812p82903
$$ plain form
42544 6577758 5534853 6495467 9500272 10623164 6376661 -1177340 -5730445 -3417779
42536 -3417779 2859853 6559176 4715854 951872 383766 2693259 2942262 -519617
42528 -519617 -2759688 509955 5556289 5052033 -1386347 -6272402 -4508985 267054
42520 267054 1786353 -339741 -1587540 331345 2930265 2940953 89820 -3374095 -5302736
42511 -5302736 -5359177 -4674768 -3980411 -2585462 -145027 1343598 -421595 -4066705 -5528671
42502 -5528671 -3889349 -3041850 -5650157 -8544128 -7222491 -2660514 240658 -122291
42494 -122291 -531329 1182950 2751799 1624934 -486047 -6600 2878348 4043977 1381851
42485 1381851 -1541770 -19652 4624877 5797129 732137 -4685543 -3762193 851548
$$ packed form
42544F577758j042905R60614L004805J122892m246503p554001m553105K312666
42536c417779O277632L699323j843322l763982n68106K309493K49003l461879
42528e19617k240071L269643N046334n04256o438380m886055J763417M776039
42520B67054J519299k126094j247799J918885K598920J0688k851133l463915j928641
42511e302736n6441O84409O94357J394949K440435J488625j765193l645110j461966
42502e528671J639322Q47499k608307k893971J321637M561977K901172l62949
42494a22291m09038J714279J568849j126865k110981M79447K884948J165629k662126
42485A381851k923621J522118M644529J172252n064992n417680R23350M613741
$$ plain form
42477 851548 508328 -6261088 -10681994 -6366430 1366219 3834133 1681152 2241003 6889340
42468 6889340 8899178 4132072 -3002909 -6082731 -3736941 1859200 8511098 13217692
42460 13217692 12235662 5596069 -1275500 -3561979 -2353778 -1427958 -1503140 -871924 558545
42451 558545 1455535 1915667 2979678 4319316 5041580 5564479 6148871 5127537 1525852
42442 1525852 -2100482 -2727552 -1305219 -521580 321163 3657570 7918262 8917628 7141868
42433 7141868 7730191 11586937 12477439 6357036 -1500932 -3462954 -25022 2061220
42425 2061220 81717 -1898613 -301640 3077228 4639688 3585833 1171647 -1846159
42417 -1846159 -4936599 -6693320 -6174248 -4794867 -5113005 -7299940 -8017006 -4293143 1515789
$$ packed form
42477H51548l43220o769416m420906M315564P732649K467914k152981N59851M648337
42468F889340K009838m767106p134981l079822K345790N596141O651898M706594
42460A3217692r82030o639593o871569k286479J208201R25820p5182O31216J430469
42451E58545Q96990M60132J064011J339638P22264N22899N84392j021334l601685
42442A525852l626334o27070J422333P83639Q42743L336407M260692R99366j775760
42433G141868N88323L856746Q90502o120403p857968j962022L437932K086242
42425B061220j979503j980330J596973L378868J562460j053855k414186l017806
42417a846159l090440j756721N19072J379381l18138k186935p17066L723863N808932
$$ plain form
42408 1515789 2979948 -2224260 -7528281 -4977684 3272359 6694692 975118 -5661953
42400 -5661953 -4698897 406043 972525 -2741318 -3323317 13450 -172252 -6245492 -10502343
42391 -10502343 -7306339 -1828042 -1253626 -4072127 -4498393 -2271996 -1058005 -813202
42383 -813202 1128949 3624547 3127562 342792 -648070 754349 1421741 833531 2029974
42374 2029974 5780623 8874308 9119424 7706848 5823062 3013892 -268636 -2341875
42366 -2341875 -3315780 -4903454 -6758915 -6696128 -4861977 -3623337 -2862883 89807 4854008
42357 4854008 7013671 4504329 778513 -447778 175435 293376 -466868 -1606937 -3286137
42348 -3286137 -4787357 -4486289 -2723579 -1323431 493811 4972812 9419733 7165168
$$ packed form
42408A515789J464159n204208n304021K550597Q250043L422333n719574o637071
42400e661953R63056N104940N66482l713843n81999L336767j85702o073240m256851
42391a0502343L196004N478297N74416k818501m26266K226397J213991K44803
42383h13202J942151K495598m96985k784770r90862J402419O67392n88210J196443
42374B029974L750649L093685K45116j412576j883786k809170l282528k073239
42366b341875r73905j587674j855461O2787J834151J238640P60454K952690M764201
42357D854008K159663k509342l725816j226291O23213J17941p60244j140069j679200
42348c286137j501220L01068J762710J400148J817242M479001M446921k254565
$$ plain form
42340 7165168 -2048795 -9025105 -7207476 -1973102 -1679626 -4628321 -2998517 3459477
42332 3459477 6779416 3435004 -689802 332145 4771222 7399533 6226759 2471100
42324 2471100 -2152114 -5510203 -5455690 -2420736 570624 1935644 3420059 6796356
42316 6796356 10782880 12366253 9574315 2621363 -5629335 -10218537 -7812902 -740639
42308 -740639 4787906 5080897 1711022 -2014185 -4559387 -5717946 -5604672 -5247442 -5950140
42299 -5950140 -7115029 -6665199 -4231170 -1868301 -1224401 -2199845 -4507071 -7744684 -9591947
42290 -9591947 -7256295 -1816845 1912215 1183574 -1760580 -3666610 -4080643 -3826163 -3031778
42281 -3031778 -2587442 -4288199 -7215734 -7203363 -2699674 1908199 2136660 -238417 -548722
$$ packed form
42340G165168r213963o976310J817629N234374K93476k948695J629804O457994
42332C459477L319939l344412m124806J021947M439077K628311j172774l755659
42324B471100m623214l358089N4513L034954K991360J365020J484415L376297
42316F796356L986524J583373k791938o952952q250698m589202K405635P072263
42308g40639N528545K92991l369875l725207k545202j158559J13274L57230p02698
42299e950140j164889M49830K434029K362869O43900r75444k307226l237613j847263
42290i591947K335652N439450L729060p28641k944154j906030m14033K54480P94385
42281c031778M44336j700757k927535J2371M503689M607873K28461k375077l10305
$$ plain form
42272 -548722 1437166 2201078 1139128 1553183 4875974 8224031 8669310 6600819 3763184
42263 3763184 791321 -2006454 -3601869 -3336080 -1779408 89016 1426109 1355076 -150870
42254 -150870 -1384210 -714433 982732 1790087 2175028 4055164 6422531 5528737 715280
42245 715280 -3394511 -2901215 -81169 257092 -1987366 -2283502 1650539 6518967 7967418
42236 7967418 6021825 4379299 5365367 7188171 6405787 2430905 -1215084 -712277 3380226
42227 3380226 6561909 5809989 2893228 1129554 593749 -1085638 -4071817 -5527853
42219 -5527853 -3923138 -1372491 -365716 -433886 22276 369359 -1222358 -4195259 -5756306
42210 -5756306 -4814705 -3563916 -4466881 -7357332 -10204391 -11097947 -8680938 -2631852 4489168
$$ packed form
42272e48722J985888P63912j061950M14055L322791L348057M45279k068491k837635
42263C763184k971863k797775j595415K65789J556672J868424J337093p1033j505946
42254a50870j233340O69777J697165Q07355L84941J880136K367367q93794m813457
42245G15280m109791M93296K820046L38261k244458k96136L934041M868428J448451
42236G967418j945593j642526R86068J822804p82384l974882l645989N02807M092503
42227C380226L181683p51920k916761j763674n35805j679387k986179j456036
42219e527853J604715K550647J006775o8170M56162L47083j591717k972901j561047
42210e756306R41601J250789r02965k890451k847059q93556K417009O049086P121020
$$ plain form
42201 4489168 7406536 2857592 -5887930 -11470238 -10017552 -4653768 -853492 -158791
42193 -158791 61017 1993997 4756018 6334887 6397765 6386025 7534259 9297171 9532632
42184 9532632 6439536 860725 -3779583 -4895340 -3764724 -3617719 -4848120 -4454438
42176 -4454438 -1057918 2198332 1962128 -265902 -654768 602114 -425207 -4542076
42168 -4542076 -7188729 -4991393 -1050124 -684918 -4165054 -6920900 -5702933 -1374767
42160 -1374767 3763901 8238358 10716426 9777053 5476077 -205563 -5083116 -8141700
42152 -8141700 -9290448 -8752062 -6692390 -2999700 1937109 6032195 6841475 4974600
42144 4974600 3898674 4872365 4973189 2605745 1487328 4889496 8829243 6807272
$$ packed form
42201D489168K917368m548944q745522n582308J452686N363784L800276O94701
42193a58791K19808J932980K762021J578869O2878j1740J148234J762912K35461
42184I532632l093096n578811m640308j115757J130616J47005j230401L93682
42176d454438L396520L256250k36204k228030l88866J256882j027321m116869
42168d542076k646653K197336L941269L65206l480136k755846J217967M328166
42160a374767N138668M474457K478068r39373m300976n681640m877553l058584
42152h141700j148748N38386K059672L692690M936809M095086Q09280j866875
42144D974600j075926R73691J00824k367444j118417L402168L939747k021971
$$ plain form
42136 6807272 -163348 -4627620 -3436263 -713402 631009 3127077 7937234 10484644
42128 10484644 7003923 478787 -3970062 -5382388 -5061542 -2930635 64099 215194
42120 215194 -3648129 -6948144 -6062854 -4195885 -5250099 -5960680 -951572 7136527 10020228
42111 10020228 5320021 -977458 -3455614 -2586053 -779488 1223203 2896436 3293947
42103 3293947 2848041 2543168 1494611 -1297204 -3763300 -3273397 -1145622 -295288 275099
42094 275099 3620711 8504517 10222209 7286245 2475680 -1719498 -3706541 -859316
42086 -859316 6590828 11547528 7590473 -569088 -2598884 2073514 3985854 -744791
42078 -744791 -5283180 -5023780 -4634114 -7536350 -8782177 -4826739 -1204460 -3018407 -5762977
$$ packed form
42136F807272o970620m464272J191357K722861J344411K496068M810157K547410
42128A0484644l480721o525136m448849j412326L20846K130907K994734J51095
42120B15194l863323l300015Q85290J866969j054214p10581N009108Q088099K883701
42111A0020228m700207o297479k478156Q69561J806565K002691J673233L97511
42103C293947m45906l04873j048557k791815k466096M89903K127775Q50334N70387
42094B75099L345612M883806J717692k935964m810565m195178j987043K847225
42086h59316P450144M956700l957055q159561k029796M672398J912340m730645
42078g44791m538389K59400L89666k902236j245827L955438L622279j813947k744570
$$ plain form
42069 -5762977 -3541544 764005 1922701 2250203 5745287 8082061 2835337 -6248440
42061 -6248440 -9618540 -6068595 -2544831 -1583325 784024 4851655 5072800 -194781
42053 -194781 -5145632 -5099139 -1958959 725372 2067091 1634927 -1222650 -4150907 -3234074
42044 -3234074 713504 2213763 -1168373 -5932229 -8539676 -9277044 -8990644 -6979239
42036 -6979239 -3899631 -2343474 -2797639 -2926857 -2030109 -2105250 -3471086 -3745097 -2421307
42027 -2421307 -2023206 -3272561 -3547548 -1799391 -647853 -1705922 -2990042 -2969930 -3118364
42018 -3118364 -4249332 -4273078 -2133914 -489623 -1784629 -4467002 -5445239 -3904088 -925785
42009 -925785 2244462 4182935 4083293 3591517 5142193 7898354 8600293 6852642 5609178
$$ packed form
42069e762977K221433M305549J158696L27502L495084K336774n246724r083777
42061f248440l370100L549945L523764R61506K367349M067631K21145n267581
42053a94781m950851M6493L140180K684331J341719m32164k857577k928257R16833
42044c234074L947578J500259l382136m763856k607447p37368K86400K011405
42036f979239L079608J556157m54165j29218Q96748p5141j365836k74011J323790
42027b421307L98101j249355k74987J748157J151538j058069j284120K0112j48434
42018c118364j130968k3746K139164J644291j295006k682373r78237J541151K978303
42009i25785L170247J938473r9642m91776J550676K756161P01939j747651j243464
$$ plain form
42000 5609178 5817988 5227580 3642727 4245756 7694830 9922256 8362441 5599185 4067716
41991 4067716 2092890 -1428611 -3327307 -1318963 1466406 1588853 1009576 2940958
41983 2940958 5524356 4757059 873802 -3068887 -6123273 -7916338 -5319300 3043390
41975 3043390 11004150 10488894 2527984 -3734667 -3412816 -1096937 -2249395 -5112072
41967 -5112072 -4323020 1119177 6848725 8370982 5044140 -327180 -4501009 -6477811
41959 -6477811 -7224848 -6896345 -4118172 780063 4106643 2946385 -667475 -2537941
41951 -2537941 -1813460 -659011 63517 1044896 1496373 -26638 -2237164 -2681904 -2381199
41942 -2381199 -4276299 -6846437 -4675525 2901020 8935265 7907428 3463944 2856143
$$ packed form
42000E609178K08810n90408j584853O03029L449074K227426j559815k763256j531469
41991D067716j974826l521501j898696K008344K785369J22447n79277J931382
41983B940958K583398p67297l883257l942689l054386j793065K597038Q362690
41975C043390P960760n15256p960910o262651L21851K315879j152458k862677
41967e112072P89052N442197N729548J522257l326842n371320m173829j976802
41959f477811p47037L28503K778173M898235L326580j160258l613860j870466
41951b537941P24481J154449P22528R81379M51477j523011k210526m44740L00705
41942b381199j895100k570138K170912P576545O034245j027837m443484o07801
$$ plain form
41934 2856143 6428029 7585024 2498315 -4560469 -6527712 -1435520 6186209 10166255
41926 10166255 8036824 2650497 -673729 873338 5016622 7065409 5038610 1356867
41918 1356867 -615034 -458091 -196201 -788552 -789429 1311833 4817171 7546239 7820343
41909 7820343 5207275 682516 -3001556 -2738996 1397417 5265147 5203935 2324839 220600
41900 220600 -9896 427794 1513958 3637865 4376603 1055885 -3549968 -3631103 690268
41891 690268 2875332 431378 -745356 3737345 8873674 7893083 2669721 -208406
41883 -208406 54846 -706123 -2836253 -2918058 -1749515 -4230890 -10307198 -13228026 -9188856
41874 -9188856 -2894100 -679836 -2698678 -4772911 -4231702 -1103753 3447679 7155812
$$ packed form
41934B856143L571886J156995n086709p058784j967243N092192P621729L980046
41926A0166255k129431n386327l324226J547067M143284K048787k026799l681743
41918A356867j971901J56943K61890n92351q77K101262L505338K729068K74104
41909G820343k613068m524759l684072K62560M136413L867730o1212k879096k104239
41900B20600k30496M37690J086164K123907P38738l320718m605853q1135M321371
41891F90268K185064k443954j176734M482701N136329r80591n223362k878127
41883b08406K63252p60969k130130q1805J168543k481375o076308k920828M039170
41874i188856O294756K214264k018842k074233N41209L127949M551432L708133
$$ plain form
41866 7155812 7335760 3873558 99439 -811871 867017 2406539 1608830 -1373416 -3914503
41857 -3914503 -3049227 965934 4606060 6224394 8469166 12489979 13436630 7286918
41849 7286918 -873728 -2892339 -141919 -1081305 -6300651 -6589592 1075500 6334870
41841 6334870 659974 -9078950 -10812404 -4670924 -708633 -3201535 -6875193 -7175336
41833 -7175336 -5306193 -2804112 1119297 5349873 6215350 2950708 -813740 -2270873
41825 -2270873 -2020735 -721694 2495501 7133773 10656005 11795877 11363087 9500185
41817 9500185 5866505 2675569 3042701 5540252 5184020 1306116 -543197 2935618
41809 2935618 7158317 6211460 1297996 -1816929 -1299401 -409135 -1226166 -1766919 151926
$$ packed form
41866G155812J79948l462202l774119r11310J678888J539522p97709k982246k541087
41857c914503Q65276M015161L640126J618334K244772M020813R46651o149712
41849G286918q160646k018611K750420r39386n219346k88941P665092N259370
41841F334870n674896r738924j733454O141480L962291k492902l673658l00143
41833g175336J869143K502081L923409M230576Q65477l264642l764448j457133
41825b270873K50138J299041L217195M638272L522232J139872m32790j862902
41817I500185l633680l190936L67132K497551l56232l877904j849313L478815
41809B935618M222699r46857m913464l114925N17528Q90266q17031n40753J918845
$$ plain form
41800 151926 3509133 5614653 5018482 2166876 -1305181 -3476535 -3721543 -3777262 -5852608
41791 -5852608 -9161998 -9877111 -5779630 93457 2386532 26335 -2225225 -95296
41783 -95296 4173162 4877008 1218604 -1255460 1210081 4975862 4760006 1922432 2240774
41774 2240774 6895815 11127653 12012312 11982728 12972739 12484928 8698701 4863850 4255758
41765 4255758 4382753 1354772 -2665405 -2375264 1593399 2939875 -634949 -4256512
41757 -4256512 -4023036 -2406057 -2523191 -2309403 1274407 6246919 8708398 8959350 9406271
41748 9406271 8755807 4152666 -2110553 -4156151 -823336 3333725 5686979 7946237
41740 7946237 9881097 7846952 2635250 1654401 8115631 14206560 11820948 5170229
$$ packed form
41800A51926L357207K105520n96171k851606l472057k171354k45008n5719k075346
41791e852608l309390p15113M097481N873087K293075k360197k251560K129929
41783i5296M268458P03846l658404k474064K465541L765781k15856k837574L18342
41774B240774M655041M231838Q84659k9584R90011m87811l786227l834851o08092
41765D255758J26995l027981m020177K90141L968663J346476l574824l621563
41757d256512K33476J616979j17134K13788L583810M972512K461479K50952M46921
41748I406271o50464m603141o263219k045598L332815M157061K353254K259258
41740G946237J934860k034145n211702r80849O461230O090929k385612o650719
$$ plain form
41732 5170229 4471703 10309957 13748186 11204511 9442889 13877469 20704131 24433783
41724 24433783 25869177 27654809 27868925 23861704 18334908 15937820 16619814 17280426
41716 17280426 17438101 18354882 18804018 16904486 14615984 15236673 17323929 16211953 11468679
41707 11468679 8087085 9582882 13774913 16245249 14910629 10658274 6172855 4378473
41699 4378473 5704642 7263616 6989844 7162510 10527947 14640304 14749438 11385096 9628312
41690 9628312 10831548 10978142 8433019 7247559 10140699 13602444 13552644 11394730 10463167
41681 10463167 10250443 8567414 6419308 6009486 5944213 3102170 -1853907 -5090252 -5166942
41672 -5166942 -4251159 -4103836 -4312528 -4397586 -4366517 -2981600 1373284 7411242 11167649
$$ packed form
41732E170229o98526N838254L438229k543675j761622M434580O826662L729652
41724B4433783J435394J785632K14116m007221n526796k397088O81994O60612
41716A7280426J57675R16781M49136j899532k288502O20689K087256j111976m743274
41707A1468679l381594J495797M192031K470336j334620m252355m485419j794382
41699D378473J326169J558974k73772J72666L365437M112357J09134l364342j756784
41690I628312J203236J46594k545123j185460K893140L461745m9800k157914r31563
41681A0463167k12724j683029k148106m09822o5273k842043m956077l236345p6690
41672e166942R15783J47323k08692q5058L1069J384917M354884O037958L756407
$$ plain form
41663 11167649 10520119 7702600 6640813 9096899 13525360 16334163 14597004 9356537
41655 9356537 5928996 8636018 15159213 18671078 16204135 12221051 12311737 15697322
41647 15697322 16795764 13374154 9927427 11692223 17402071 20681534 18547775 15631761
41639 15631761 17996978 24743221 29153989 27786513 24436848 23738465 24601797 23000743
41631 23000743 18618484 14849628 13392497 12630737 11161267 9450794 7572280 4498436
41623 4498436 753175 -835505 1409006 5473658 7891293 7372001 5330416 3940429
41615 3940429 4561788 7225001 10776588 13692084 14781819 13026879 7938268 1345078
41607 1345078 -2583885 -1654218 689680 -780797 -5363125 -6231904 507071 9960798
$$ packed form
41663A1167649o47530k817519j061787K456086M428461K808803j737159n240467
41655I356537l427541K707022O523195L511865k466943l983084R0686L385585
41647A5697322J098442l421610l446727J764796N709848L279463k133759k916014
41639A5631761K365217O746243M410768j367476l349665o98383Q63332j601054
41631B3000743m382259l768856j457131p61760j469470j710473j878514l073844
41623D498436l745261j588680K244511M064652K417635n19292k041585j389987
41615C940429O21359K663213L551587K915496J089735j754940n088611o593190
41607A345078l928963R29667K343898j470477m582328q68779O738975R453727
$$ plain form
41599 9960798 14433380 12816398 10408884 10584936 10789852 7564040 2083994 -1639899
41591 -1639899 -2332754 -2478095 -3909315 -4817180 -2437321 2675435 6954824 8085398 7124787
41582 7124787 6141214 5639472 5180060 4772957 4308834 3057430 1147915 94372 385335
41573 385335 362789 -655382 -416264 2404378 4884382 4331636 3787127 7618226 12931006
41564 12931006 12178528 4851560 -730809 266706 2315031 -657487 -5108205 -3967635
41556 -3967635 1853064 5425518 4459010 2569141 1414492 -868728 -3415013 -2143251
41548 -2143251 2973478 6433873 5186695 2688822 2612681 3560187 2971163 1774915 1728493
41539 1728493 1861406 1063307 1019243 3104228 5200364 5030218 3931661 3795980 3145059
$$ packed form
41599I960798M472582j616982k407514J76052K04916l225812n480046l723893
41591a639899o92855j45341j431220r07865K379859N112756M279389J130574r60611
41582G124787r83573n01742m59412m07103m64123j251404j909515j053543K90963
41573C85335k2546j018171K39118K820642K480004n52746n44509L831099N312780
41564A2931006p52478p326968n582369R97515K048325k972518m450718J140570
41556c967635N820699L572454r66508j889869j154649k283220k546285J271762
41548b143251N116729L460395j247178k497873p6141R47506n89024j196248m6422
41539A728493J32913p98099m4064K084985K096136j70146j098557j35681o50921
$$ plain form
41530 3145059 507149 -944906 2562702 8228552 9329875 4951867 1388738 2678890
41522 2678890 5150323 4051499 1110307 1369551 5054054 7105321 4424967 -60687
41514 -60687 -1501688 1154754 5131990 8138937 10570881 13303195 15362992 15455869 14713597
41505 14713597 15388022 16691712 14821425 8647862 2987765 3709771 10844036 18746364
41497 18746364 21974627 18973309 11634662 4240710 1625704 4840871 9164059 9729386
41489 9729386 8196749 9566619 13183078 12909402 7333795 3321126 6075712 11251949
41481 11251949 11718276 7801489 5178031 5673984 6214052 5039169 2916961 -729843
41473 -729843 -6616574 -10731240 -7257824 2384405 9426583 8800362 4944722 4073519 5990082
$$ packed form
41530C145059k637910j452055L507608N665850J101323m378008l563129J290152
41522B678890K471433j098824k941192K59244L684503K051267k680354m485654
41514f0687j441001K656442L977236L006947K431944K732314K059797R2877p42272
41505A4713597O74425J303690j870287o173563n660097P22006P134265P902328
41497A8746364L228263l001318p338647p393952k615006L215167M323188N65327
41489I729386j532637J369870L616459k73676n575607m012669K754586N176237
41481A1251949M66327l916787k623458M95953N40068j174883k122208l646804
41473g29843n886731m114666L473416R642229P042178o26221l855640q71203J916563
$$ plain form
41464 5990082 7148820 7029645 6792442 5201850 1015321 -2878904 -2588184 981586 3773905
41455 3773905 4665870 5547565 6532199 5874287 4186646 3958853 4757377 3581058 557010
41446 557010 -460222 1776005 3542217 2080435 -221116 -60549 1917243 3240842
41438 3240842 3537006 3415722 2013249 -1320542 -4830219 -6476162 -6437026 -5381694 -2733348
41429 -2733348 792400 1759466 -1410808 -4823224 -3944661 -73768 2100228 1543508 868726
41420 868726 775777 -264542 -1471219 -328631 2308460 3079315 2360839 3862415 7244099
41411 7244099 7699266 4863789 5123147 11219027 16077254 12528166 3995107 -925023
41403 -925023 -621424 -223962 -1899309 -2901435 -2306504 -2451858 -3307429 -1970174 1109734
$$ packed form
41464E990082J158738j19175k37203j590592m186529l894225K90720L569770K792319
41455C773905Q91965Q81695R84634o57912j687641k27793P98524j176319l024048
41446E57010j017232K236227J766212j461782k301551J60567J977792J323599
41438C240842K96164j21284j402473l333791l509677j645943L9136J055332K648346
41429b733348L525748R67066l170274l412416Q78563L870893K173996n56720o74782
41420H68726r2949j040319j206677J142588K637091P70855p18476J501576L381684
41411G244099M55167k835477K59358O095880M858227l549088q533059m920130
41403i25023L03599L97462j675347j002126N94931j45354q55571J337255L079908
$$ plain form
41394 1109734 1470326 -1953643 -4244926 -1754939 2837538 5384081 5802403 5720279 4583202
41385 4583202 1768386 -478263 93167 2200777 3595614 4935358 7742318 10532894
41377 10532894 10690986 8784933 7389893 6715303 5156726 3468843 4255365 7051748
41369 7051748 7892440 5072045 2072115 2765209 6077207 7842649 6638040 5143243
41361 5143243 5741061 7124519 6685191 4996942 5514768 9402470 13186666 13623422 12911324
41352 12911324 15527401 20709124 22688905 19327148 15727249 16627943 19470028 19099645
41344 19099645 16139340 15588396 18785984 22026332 22880678 23111040 24640036 26632444
41336 26632444 27643202 27436322 25776643 22423939 19239687 19411296 23351480 27554754
$$ packed form
41394A109734L60592l423969k291283K489987M592477K546543M18322q2124j137077
41385D583202k814816k246649N71430K107610J394837J339744K806960K790576
41377A0532894J58092j906053j395040o74590j558577j687883P86522K796383
41369G051748Q40692k820395k999930O93094L311998J765442j204609j494797
41361E143243N97818J383458m39328j688249N17826L887702L784196M36756p12098
41352A2911324K616077N181723J979781l361757l599899R00694K842085l70383
41344A9099645k960305n50944L197588L240348Q54346K30362J528996J992408
41336B6632444J010758k06880j659679l352704l184252J71609L940184M203274
$$ plain form
41328 27554754 28385278 25283788 20330200 16860188 17915488 22977221 26708714 24571531
41320 24571531 19252473 17160698 18936332 19184402 16290159 15511828 19424516 22122586
41312 22122586 17998704 10870131 8219363 10330501 11782681 10934852 10734636 11295420
41304 11295420 8938644 3484524 505007 4220282 12050077 17835430 17723468 12221869
41296 12221869 5044361 214469 -1722496 -3740807 -6528855 -5455740 2337632 10683438
41288 10683438 10937433 4612841 1767877 6278471 10945470 9592340 5672310 4367411
41280 4367411 3754593 284223 -2966812 -1153853 3297583 4343017 2374744 2773756
41272 2773756 5933871 6861138 4679089 4411255 7623091 8845792 4706183 412671
$$ packed form
41328B7554754Q30524l101490m953588l470012J055300N061733L731493k137183
41320B4571531n319058k091775J775634K48070k894243p78331L912688K698070
41312B2122586m123882p128573k650768K111138J452180q47829k00216N60784
41304A1295420k356776n454120k979517L715275P829795N785353j11962n501599
41296A2221869p177508m829892j936965k018311k788048J073115P793372Q345806
41288A0683438K53995o324592k844964M510594M666999j353130l920030j304899
41280D367411o12818l470370l251035J812959M451436J045434j968273L99012
41272B773756L160115R27267k182049k67834L211836J222701m139609m293512
$$ plain form
41264 412671 2620156 10111779 15995143 16183997 11910486 6499359 3424637 5236336
41256 5236336 10457573 13263236 9995880 4410045 2588211 4415110 4993870 3419964
41248 3419964 3979910 7756614 9351222 5087987 -636051 -1639446 1187595 2539284
41240 2539284 1536827 1667937 2863381 667846 -5082707 -7309438 -1479572 6421214
41232 6421214 7128258 575223 -4756256 -3959443 -948386 -488978 -955394 1288746 4396167
41223 4396167 3242455 -2076137 -5053460 -1352755 5012047 6608846 1907064 -3081194
41215 -3081194 -2150765 4438757 11193357 13394997 10793222 6818129 5713607 9386838
41207 9386838 15238880 17940791 15482427 12469921 14270490 18559067 17486546 9402571
$$ packed form
41264D12671K207485P491623N883364J88854m273511n411127l074722J811699
41256E236336N221237K805663l267356n585835j821834J826899N78760j573906
41248C419964N59946L776704J594608m263235n724038j003395K827041J351689
41240B539284j002457J31110J195444k195535n750553k226731N829866P900786
41232F421214P07044o553035n331479P96813L011057M59408m66416K244140L107421
41223D396167j153712n318592k977323L700705O364802J596799m701782m988258
41215c081194R30429O589522O754600K201640k601775l975093j104522L673231
41207I386838N852042K701911k458364l012506J800569M288577j072521q083975
$$ plain form
41199 9402571 2884288 5373299 12509484 14519142 10176812 7395395 10794814 15972071
41191 15972071 17411098 15497109 12924091 9793767 6121678 4727631 7148142 9792973
41183 9792973 8567052 5114241 4334127 7341144 10868665 12532169 12886647 12869388 12642873
41174 12642873 12785966 13817619 14759956 14430313 13408136 12528354 10897212 8301316 7835239
41165 7835239 12026191 17415115 17969614 14054512 12725576 17507367 23000144 22893852
41157 22893852 19139069 18353881 21473874 22652380 18665873 14141834 14690238 18390120
41149 18390120 18562546 13989657 11388385 15931847 23398940 25715132 22032669 19238564
41141 19238564 21732004 25984202 26779727 24054565 20710834 17707184 15040166 14372931
$$ packed form
41199I402571o518283K489011P136185K009658m342330k781417L399419N177257
41191A5972071J439027j913989k573018l130324l672089j394047K420511K644831
41183I792973j225921l452811p80114L007017L527521J663504L54478j7259k26515
41174A2642873J43093J031653R42337l29643j022177q79782j631142k595896m66077
41165G835239M190952N388924N54499l915102j328936M781791N492777j06292
41157B2893852l754783p85188L119993J178506l986507m524039N48404L699882
41149A8390120J72426m572889k601272M543462P467093K316192l682463k794105
41141A9238564K493440M252198P95525k725162l343731l003650k667018o67235
$$ plain form
41133 14372931 16360468 17630269 14939881 10911792 11205137 16722972 22673405 24868668
41125 24868668 23152137 19084037 14203264 10539929 9267101 8891129 7866497 8007227
41117 8007227 11385977 15076754 14172545 9672053 7615268 9794508 11389546 9560779
41109 9560779 8370661 12051513 18449949 22906749 24580385 25095968 24421753 22191845
41101 22191845 20465319 21116942 22240675 20615116 16445191 12917224 12363430 14965867
41093 14965867 19386618 22585020 21342975 16495639 13306934 14843837 17391463 15817565
41085 15817565 11340058 9870430 13743387 19105108 21330127 19612216 15965810 12672203
41077 12672203 11447718 12922743 15982532 18759292 20621573 22368382 24521014 26206556
$$ packed form
41133A4372931J987537J269801k690388m028089K93345N517835N950433K195263
41125B4868668j716531m068100m880773l663335j272828l75972j024632J40730
41117H007227L378750L690777r04209m500492k056785K179240J595038j828767
41109I560779j190118L680852O398436M456800J673636N15583o74215k229908
41101B2191845j726526O51623J123733j625559m169925l527967n53794K602437
41093A4965867M420751L198402j242045m847336l188705J536903K547626j573898
41085A5817565m477507j469628L872957N361721K225019j717911l646406l293607
41077A2672203j224485J475025L059789K776760J862281J746809K152632J685542
$$ plain form
41069 26206556 25804136 22622227 18348638 16420629 18708684 23085834 25808383 25826332
41061 25826332 24705682 23055038 20155039 16967675 15937268 17287654 18795945 19468710
41053 19468710 19879443 19153385 16277126 14104107 15989725 18224465 13634621 4540775
41045 4540775 2949409 13256028 23720255 22174571 12444626 6594235 7573806 9788417
41037 9788417 11797061 16726990 22416131 22706877 18448294 16906535 19593370 20502034
41029 20502034 17772275 17314197 22077022 26600227 25989194 22803771 21214596 20971030
41021 20971030 20878847 22073959 24090812 23434347 19827837 18498450 22445401 27404888
41013 27404888 28236941 25719811 23488527 22660311 22813170 23924184 24272467 20977581 15534240
$$ packed form
41069B6206556m02420l181909m273589j928009K288055M377150K722549J7949
41061B5826332j120650j650644k899999l187364j030407J350386J508291O72765
41053A9468710M10733p26058k876259k173019J885618K234740m589844r093846
41045D540775j591366J0306619J0464227j545684r729945n850391R79571K214611
41037I788417K008644M929929N689141K90746m258583j541759K686835R08664
41029B0502034k729759m58078M762825M523205o11033l185423j589175k43566
41021B0971030r2183J195112K016853o56465l606510j329387L946951M959487
41013B7404888Q32053k517130k231284q28216J52859J111014L48283l294886n443341
$$ plain form
41004 15534240 13834929 17671906 21691559 22098094 22079168 24221535 24428697 19732273 15991213
40995 15991213 19727261 26634119 26902184 19450632 12348332 10360110 10583973 10707254
40987 10707254 13295763 19392522 24319752 23529867 18777744 15474889 16336584 19768617
40979 19768617 22814833 24049776 24307232 25205293 26846194 27760470 27446502 27072660 26756079
40970 26756079 24825364 21514140 20261746 22662897 25301788 25122637 24794757 28135222
40962 28135222 32801466 33153939 29026671 25826410 26215051 27458850 27653757 28802644
40954 28802644 31661927 32548121 28694112 23567235 23106564 27934400 32367989 31345040
40946 31345040 26429600 23802118 26745346 31828172 33901312 33267191 34457491 38307798
$$ packed form
41004A5534240j699311L836977M019653M06535j8926K142367K07162m696424l741060
40995A5991213L736048O906858K68065p451552p102300j988222K23863J23281
40987A0707254K588509O096759M927230p89885m752123l302855Q61695L432033
40979A9768617L046216J234943K57456Q98061J640901R14276l13968l73842l16581
40970B6756079j930715l311224j252394K401151K638891j79151l27880L340465
40962B8135222M666244L52473m127268l200261L88641J243799J94907J148887
40954B8802644K859283Q86194l854009n126877m60671M827836M433589j022949
40946C1345040m915440k627482K943228N082826K073140o34121J190300L850307
$$ plain form
40938 38307798 40310317 38595639 38048145 42442302 47281215 46191282 40939005 38469414
40930 38469414 40300980 42070032 42400210 44404091 48068317 49061719 46968211 47217621
40922 47217621 51746898 54756999 52147770 48925397 51477941 57427843 60013471 59366120
40914 59366120 61817882 68809986 73932081 72734015 69486009 70698505 75975467 79791377
40906 79791377 80475242 82621620 90026323 100170050 108014102 112729964 117443726 123540185
40898 123540185 129076156 133184203 138320592 146519669 156397865 165840358 174913884 183833899
40890 183833899 190847681 195085100 198972761 204442608 209257378 211235515 213773185 221703729
40882 221703729 232646867 238352665 235282522 228676866 224798375 223854393 222519879 219178661
$$ packed form
40938C8307798K002519j714678n47494M394157M838913j089933n252277k469591
40930C8469414J831566J769052L30178K003881L664226R93402k093508K49410
40922D7217621M529277L010101k609229l222373K552544N949902K585628o47351
40914E9366120K451762O992104N122095j198066l248006J212496N276962L815910
40906G9791377O83865K146378P404703J0143727P844052M715862M713762O096459
40898A23540185N535971M108047N136389Q199077R878196R442493R073526Q920015
40890A83833899P013782M237419L887661N469847M814770J978137K537670P930544
40882B21703729J0943138N705798l070143o605656l878491r43982j334514l341218
$$ plain form
40874 219178661 213918509 206503776 197271738 188160044 180703784 174367852 168066742 161672608
40866 161672608 155043567 147369440 138485067 129335808 120659621 112823860 106932116 103862867
40858 103862867 102112698 99052246 94576698 91113846 89955028 90143698 90812205 91586246
40850 91586246 90834789 87039849 82041539 79228591 78337361 76183837 72858538 72213475
40842 72213475 74912430 76144417 72608561 67182501 63842892 62118754 59711063 56838964
40834 56838964 54610208 52377284 50071882 50111782 53556188 57135318 57556076 56298078
40826 56298078 56794349 59153098 60954925 61167182 60163445 57939865 55249923 54343501
40818 54343501 55745740 56626390 55093531 53353448 53656360 54304657 53261069 52373316 53649193
$$ packed form
40874B19178661n260152p414733r232038r111694p456260o335932o301110o394134
40866A61672608o629041p674127q884373r149259q676187p835761n891744l069249
40858A03862867j750169l060452m475548l462852j158818J88670O68507P74041
40850I1586246p51457l794940m998310k812948q91230k153524l325299o45063
40842G2213475K698955J231987l535856n426060l339609j724138k407691k872099
40834E6838964k228756k232924k305402L9900L444406L579130M20758j257998
40826E6298078M96271K358749J801827K12257j003737k223580k689942r06422
40818E4343501J402239Q80650j532859j740083L02912O48297j043588q87753J275877
$$ plain form
40809 53649193 54461843 51595928 47556770 47276352 50315044 52003815 51086728 50468069 51143446
40800 51143446 51297427 51227583 53151430 55612210 54043983 48269278 43961441 44776294 47994230
40791 47994230 50033662 51335021 52957072 52904069 49702052 46408917 47080789 51187764
40783 51187764 54965637 56937790 58878104 61922379 64595411 65044207 63415308 61333980
40775 61333980 59820684 58467894 56960555 56895178 60487938 66778772 71203270 71003072
40767 71003072 69315792 70960758 75501131 78269992 77762178 77673578 80887369 85487230
40759 85487230 88294624 88936683 88580259 87702627 87219842 89129066 93693137 98197068 100818603
40750 100818603 103796227 110328662 119864642 128862452 135061143 138792665 141156445 143346604
$$ packed form
40809E3649193Q12650k865915m039158k80418L038692J688771r17087o18659O75377
40800E1143446J53981o9844J923847K460780j568227n774705m307837Q14853L217936
40791D7994230K039432J301359J622051n3003l202017l293135O71872M106975
40783E1187764L777873J972153J940314L044275K673032M48796j628899k081328
40775F1333980j513296j352790j507339o5377L592760O290834M424498k00198
40767G1003072j687280J644966M540373K768861n07814q8600L213791M599861
40759H5487230K807394O42059l56424q77632m82785J909224M564071M503931K621535
40750A00818603K977624O532435R535980Q997810O198691L731522K363780K190159
$$ plain form
40742 143346604 147221881 154051318 162408831 169157743 173178700 176931328 183499648 192654194
40734 192654194 200817416 205246973 207439464 211054132 216589230 220299455 219494501 216467399
40726 216467399 214699168 213310417 209080711 202759125 198555084 197017883 193375217 184846443
40718 184846443 175328146 169864678 167663158 163953659 156668184 148019177 140647693 134958428
40710 134958428 129749458 123696727 116739805 110779990 107696442 106317935 103727623 100040268
40702 100040268 98325553 98456158 95487754 87070459 78140069 74083106 73159998 70893767
40694 70893767 68358733 69341032 71610095 68966470 61659233 56794260 57161942 57539597
40686 57539597 54815412 53969615 59045500 64623338 62890926 55095981 49242464 48783221
$$ packed form
40742A43346604L875277O829437Q357513O748912M020957L752628O568320R154546
40734A92654194Q163222M429557K192491L614668N535098L710225q04954l027102
40726B16467399j768231j388751m229706o321586m204041j537201l642666q528774
40718A84846443r518297n463468k201520l709499p285475q649007p371484n689265
40710A34958428n208970o052731o956922n959815l083548j378507k590312l687355
40702A00040268j714715J30605k968404q417295q930390m056963r23108k266231
40694G0893767k535034R82299K269063k643625p307237m864973L67682L77655
40686E7539597k724185q45797N075885N577838j732412p794945n853517m59243
$$ plain form
40678 48783221 49967156 49208043 47038790 44759493 42413093 40792202 41174608 42354196
40670 42354196 41709513 39759424 39897035 42967772 45937577 46804568 46870513 46879142 45099370
40661 45099370 41413769 39404794 41236250 43377077 40913064 34352021 29059554 29067493
40653 29067493 33895330 40338902 45028635 46124467 44589720 43182240 42952764 42120432
40645 42120432 39552704 37041654 36203002 35639655 33814563 32234560 32445312 32192904 28752461
40636 28752461 24409585 23925242 27312415 29879268 29398318 28613411 30080024 32800153
40628 32800153 34832004 35302994 33062866 27442294 21411764 19871337 23384550 27427493
40620 27427493 29036111 29915064 31452734 31463116 28447376 24788033 22799143 21504837
$$ packed form
40678D8783221J183935p59113k169253k279297k346400j620891L82406J179588
40670D2354196o44683j950089J37611L070737K969805Q66991O5945Q629j779772
40661D5099370l685601k008975J831456K140827k464013o561043n292467P939
40653B9067493M827837O443572M689733J095832j534747j407480k29476q32332
40645D2120432k567728k511050q38652n63347j825092j580003K10752k52408l440443
40636B8752461m342876m84343L387173K566853m80950p84907J466613K720129
40628C2800153K031851M70990k240128n620572o030530j540427L513213M042943
40620B7427493J608618Q78953J537670J0382l015740l659343j988890j294306
$$ plain form
40612 21504837 20161180 20798942 23938513 25960272 24648475 23375305 25410851 27967051
40604 27967051 26992392 24385371 24620158 26979245 27418465 26174679 26969327 29755663 30807341
40595 30807341 29660074 29541211 30672691 29562154 25949190 24291133 26601093 29399292
40587 29399292 29809032 29358203 29360427 27803762 24039861 21880193 24108071 27524057 27444577
40578 27444577 24343812 22107125 21837851 21422807 20077963 19511519 20509491 21205282 19637177
40569 19637177 16665629 15322588 17007188 18720769 15799638 8534159 3716092 6584430
40561 6584430 13215948 15485953 12436509 10680314 13066455 14078583 9731352 5651746
40553 5651746 9649930 20183959 28334006 29403763 26993958 26119655 27316897 28351106
$$ packed form
40612B1504837j343657O37762L139571K021759j311797j273170K035546K556200
40604B7967051r74659k607021K34787K359087M39220j243786P94648K786336J051678
40595C0807341j147267j18863J131480j110537l612964j658057K309960K798199
40587B9399292M09740m50829K224j556665l763901k159668K227878L415986p9480
40578B7444577l100765k236687k69274m15044j344844n66444R97972O95791j568105
40569A9637177k971548j343041J684600J713581k921131p265479m818067K868338
40561F584430O631518K270005l049444j756195K386141J012128m347231m079606
40553E651746L998184J0534029Q150047J069757k409805q74303J197242J034209
$$ plain form
40545 28351106 27947006 26253262 23736749 20904986 18264591 16156685 15003124 15311526
40537 15311526 17063980 19803121 23360199 27193750 29146724 27018673 21657058 16072602
40529 16072602 11215583 5672605 -22665 -2825929 -2316826 -2011903 -3245245 -2325784
40521 -2325784 2787564 7454783 6738415 3271485 3325871 7544645 11213481 12030636 11862478
40512 11862478 11724443 10710511 9697622 10758785 12727557 12432572 10606562 11326435
40504 11326435 14919413 16837012 14931553 12587601 12673472 13446786 13071852 13476701 16332183
40495 16332183 19027673 18239164 14556624 10434367 6499092 3142085 2794291 6692420
40487 6692420 11539028 13183495 11907950 10576358 9557336 7592929 5990496 7110012
$$ packed form
40545B8351106m04100j693744k516513k831763k640395k107906j153561L08402
40537A5311526J752454K739141L557078L833551J952974k128051n361615n584456
40529A6072602m857019n542978n695270k803264N09103L04923j233342R19461
40521b325784N113348M667219p16368l466930N4386M218774L668836Q17155j68158
40512A1862478j38035j013932j012889J061163J968772k94985j826010P19873
40504A1326435L592978J917599j905459k343952Q5871P73314l74934M04849K855482
40495A6332183K695490p88509l682540m122257l935275l357007l47794L898129
40487F692420M846608J644467j275545j331592j019022j964407j602433J119516
$$ plain form
40479 7110012 9452386 9249738 6998847 7338019 11447301 14552508 12986152 9185752
40471 9185752 6885132 5514019 3147100 1511840 3255452 6490223 7312413 6604474
40463 6604474 8732220 13478281 15283129 12132584 9272047 10677731 12166597 8302249
40455 8302249 2249253 1830945 7300054 10445726 6885319 2404318 3873141 9339800
40447 9339800 11948000 10161024 8499411 9425117 9940616 7218216 3616022 3803053 8636350
40438 8636350 13748750 13901690 8148428 992747 -1570410 2204442 7924496 9409807
40430 9409807 5020146 -668935 -1487403 4205580 11953684 15737611 13923124 9950797
40422 9950797 7090970 4687303 1463724 154259 4437574 11704167 14241468 9561212
$$ packed form
40479G110012K342374k02648k250891L39172M109282L105207j566356l800400
40471I185752k300620j371113k366919j635260J743612L234771Q22190p07939
40463F604474K127746M746061J804848l150545k860537J405684J488866l864348
40455H302249o052996m18308N469109L145672l560407m481001J468823N466659
40447I339800K608200j786976j661613R25706N15499k722400l602194J87031M833297
40438H636350N112400J52940n753262p155681k563157L774852N720054J485311
40430I409807m389661n689081q18468N692983P748104L783927j814487l972327
40422I950797k859827k403667l223579j309465M283315P266593K537301m680256
$$ plain form
40414 9561212 4749672 7014261 13722210 16470548 12516046 6957292 4727430 5658476
40406 5658476 7547022 9160059 9037781 5613795 500548 -1700346 872772 4336386
40398 4336386 4040472 552783 -1706800 -450879 2297581 3537642 2752772 1762440 2322993
40389 2322993 4352884 6158866 6284163 5178721 4778151 6220742 8214934 8099885 4857899
40380 4857899 983473 519755 4479857 9002916 9541465 6360987 3761328 4010621 4990838
40371 4990838 4625963 4327485 6048205 8760921 10415157 10931685 10472104 7301711 1023087
40362 1023087 -4068827 -3088523 2958478 8529504 10354453 9121702 5769741 1007203
40354 1007203 -1957884 406086 6213586 9303065 7258816 3943344 2971516 3463452
$$ packed form
40414I561212m811540K264589O707949K748338l954502n558754k229862R31046
40406E658476J888546J613037j22278l423986n113247k200894K573118L463614
40398D336386k95914l487689k259583J255921K748460J240061p84870r90332N60553
40389B322993K029891J805982J25297j105442m00570J442591J994192j15049l241986
40380D857899l874426m63718L960102M523059N38549l180478k599659K49293R80217
40371D990838l64875k98478J720720K712716J654236N16528m59581l170393o278624
40362A023087n091914R80304O047001N571026J824949j232751l351961m762538
40354A007203k965087K363970N807500L089479k044249l315472r71828M91936
$$ plain form
40346 3463452 4054313 6155605 10258069 13169217 12469497 10508751 10541158 11690627 11279851
40337 11279851 9734473 9404455 10280911 10617626 10619152 11852173 13501322 12622294 8466822
40328 8466822 4017722 2512424 3925025 5389961 4432457 1750656 815121 3905896
40320 3905896 8741268 10765225 8896867 6665242 7033014 8830851 9588269 9167475 8814189
40311 8814189 9045497 10300270 13232597 16508583 17033321 14498542 12744591 14099674
40303 14099674 15713558 14841640 14238889 17577665 22204809 22123300 16900068 12014529 10746539
40294 10746539 11168520 11450869 12634694 14796387 15374619 13329858 10974421 9812585
40286 9812585 8381524 6116683 5340871 6856403 7334892 4315340 620407 241269 2539521
$$ packed form
40346C463452N90861K101292M102464K911148o99720j960746L2407J149469m10776
40337A1279851j545378l30018Q76456L36715J526J233021J649149q79028m155472
40328H466822m449100j505298J412601J464936r57504k681801r35535L090775
40320C905896M835372K023957j868358k231625L67772J797837P57418m20794l53286
40311H814189K31308J254773K932327L275986N24738k534779j753951J355083
40303A4099674J613884q71918o02751L338776M627144q1509n223232m885539j267990
40294A0746539M21981K82349J183825K161693N78232k044761k355437j161836
40286I812585j431061k264841p75812J515532M78489l019552l694933l79138K298252
$$ plain form
40277 2539521 4423670 5882811 8706736 11307375 10276850 7082582 7682590 13720709
40269 13720709 18814509 16647337 9276750 3752248 3002010 4356189 5638447 7646207
40261 7646207 10189602 10585220 8270403 7031315 9502756 12413493 11168714 7096347
40253 7096347 5531702 7503783 8299740 4989200 716865 -401533 1254711 3021954
40245 3021954 4396779 6203556 7773642 8181987 8483913 9567759 9339299 5456557 -149426
40236 -149426 -2954001 -1623230 1035682 2650030 3627784 4831591 6035728 7266942
40228 7266942 8897950 9709281 7585406 3259812 965549 3749684 9581866 13356293
40220 13356293 11904819 6587473 1918492 1625936 4826938 6464251 3144659 -2212434
$$ packed form
40277B539521J884149J459141K823925K600639j030525l194268O00008O038119
40269A3720709N093800k167172p370587n524502p50238J354179J282258K007760
40261G646207K543395L95618k314817j239088K471441K910737j244779m072367
40253G096347j564645J972081P95957l310540m272335j118398J656244J767243
40245C021954J374825J806777J570086M08345L01926J083846k28460l882742n605983
40236a49426k804575J330771K658912J614348R77754J203807J204137J231214
40228G266942J631008Q11331k123875m325594k294263K784135N832182L774427
40220A3356293j451474n317346m668981k92556L201002J637313l319592n357093
$$ plain form
40212 -2212434 -3970204 -1295748 1353239 1250660 678578 1900642 3242712 2978957 3386176
40203 3386176 6902553 10740967 9998673 5183502 2105925 3916550 7201777 7362709
40195 7362709 4797474 3621696 5947063 9426267 9999047 6092610 400925 -2368795
40187 -2368795 -309287 3282811 3764686 1366694 1199564 6000293 11440396 11302717 5821120
40178 5821120 1355338 1737377 3505773 1356586 -4415711 -8557450 -7493378 -2639648
40170 -2639648 2326088 4954049 4770889 2883675 1394479 1528734 2148632 1873472 2368057
40161 2368057 6591658 13220454 16361611 12907148 7211841 5492731 7795768 9076088
40153 9076088 6872484 3862690 2853989 3003743 2192428 526645 -42881 1748570 5171264
$$ packed form
40212b212434j757770K674456K648987j02579n72082J222064J342070k63755M07219
40203C386176L516377L838414p42294m815171l077577J810625L285227J60932
40195G362709k565235j175778K325367L479204N72780l906437n691685k769720
40187b368795K059508L592098M81875k397992j67130M800729N440103j37679n481597
40178E821120m465782L82039J768396k149187n772297m141739J064072M853730
40170b639648M965736K627961j83160j887214j489196J34255O19898k75160M94585
40161B368057M223601O628796L141157l454463n695307j719110K303037J280320
40153I076088k203604l009794j008701J49754q11315j665783n69526J791451L422694
$$ plain form
40144 5171264 7880072 7641464 4779417 2433764 2933835 4644626 4367297 2097566 807285
40135 807285 1852423 3512077 4302215 4891657 6091194 7410352 8181744 7907861 5531519
40126 5531519 1191077 -1517134 1067378 6510342 8053138 4083635 1063796 4227935
40118 4227935 9889671 11034997 6901599 2224554 -299649 -1465142 -1096411 2265052
40110 2265052 7232238 9836535 8647278 6112795 4474659 3695009 3627134 4722310 6054762
40101 6054762 5960174 5277108 6776315 10663475 13733783 13717740 11455420 8278576 4750810
40092 4750810 2735039 4623464 8893182 10399299 7365172 4415156 5964720 10086037
40084 10086037 12157089 11376308 9839443 7951459 5263882 3961610 6724466 11935117
$$ packed form
40144E171264K708808k38608k862047k345653N00071J710791k77329k269731j290281
40135H07285J045138J659654P90138N89442J199537J319158P71392k73883k376342
40126E531519m340442k708211K584512N442964J542796l969503l019839L164139
40118D227935N661736J145326m133398m677045k524203j165493L68731L361463
40110B265052M967186K604297j189257k534483j638136p79650o7875J095176J332452
40101F054762r4588o83066J499207L887160L070308j6043k262320l176844l527766
40092D750810k015771J888425M269718J506117l034127k950016J549564M121317
40084A0086037K071052p80781j536865j887984k687577j302272K762856N210651
$$ plain form
40076 11935117 15306531 15776012 15730490 15885852 14397439 11171113 8590573 7277223 5410861
40067 5410861 3233277 3828367 7867348 11825314 13377613 14341740 15898017 15437777 11634286
40058 11634286 8394163 9180575 10846486 8455060 3743612 2922834 7427837 12777710
40050 12777710 15962075 17741978 17529200 12942776 6322513 4920522 10895011 16658410
40042 16658410 14845447 8466286 5795532 8574551 11407953 10982267 9467358 8865805
40034 8865805 7863490 5671109 4347516 5321179 7034592 7826517 8178291 8435432 7330371
40025 7330371 4983398 4688089 8783776 14419296 16429894 13698481 9977377 8620012
40017 8620012 9187295 9969763 11465972 15253215 20164214 21974404 18102887 11505326
$$ packed form
40076A1935117L371414M69481m5522J55362j488413l226326k580540j313350j866362
40067E410861k177584N95090M038981L957966J552299R64127J556277m60240l803491
40058A1634286l240123P86412J665911k391426m711448q20778M505003N349873
40050A2777710L184365J779903k12778m586424o620263j401991N974489N763399
40042A6658410j812963o379161k670754K779019K833402m25686j514909o01553
40034H865805j002315k192381j323593R73663J713413P91925L51774K57141j105061
40025G330371k346973k95309M095687N635520K010598k731413l721104j357365
40017H620012N67283P82468J496209L787243M910999J810190l871517o597561
$$ plain form
40009 11505326 8011519 9705187 12789174 12825006 10188024 8590976 9710634 11785007
40001 11785007 12847913 12631585 11194119 8249001 4557844 1972598 1351822 1929109
39993 1929109 2854346 3537794 2771837 256743 -994869 2589036 9020607 11452053 7256473
39984 7256473 2542615 4097516 10011883 12931350 10648754 8165459 9531571 12750131
39976 12750131 14013353 12840452 10909093 8782626 6206799 3871351 2853358 3302968
39968 3302968 4843872 7140499 9244828 9880342 9370668 9685758 11370956 12177520 10472449
39959 10472449 8385756 9076034 11701670 11930169 7656807 1725297 -1857146 -2208821
39951 -2208821 -770017 1662392 4729862 6615186 5499144 3112408 3829275 8861781
$$ packed form
40009A1505326l493807J693668L083987L5832k636982j597048J119658K074373
40001A1785007J062906k16328j437466k945118l691157k585246o20776N77287
39993A929109R25237O83448p65957k515094j251612L583905O431571K431446m195580
39984G256473m713858J554901N914367K919467k282596k483295J366112L218560
39976A2750131J263222j172901j931359k126467k575827k335448j017993M49610
39968C302968J540904K296627K104329O35514n09674L15090J685198Q06564j705071
39959A0472449k086693O90278K625636K28499m273362n931510l582443l51675
39951b208821J438804K432409L067470J885324j116042k386736P16867N032506
$$ plain form
39943 8861781 13827966 14192227 11103450 8958240 8576895 6624941 1848727 -2026253
39935 -2026253 -1169966 3462782 8025807 10359497 10723434 9838175 8403720 7438418 7414189
39926 7414189 8009643 9540079 12677727 15795031 15631955 12658408 12304514 17375306 22414966
39917 22414966 20487744 13378544 9224466 10818183 12515685 9539814 4412706 2007115
39909 2007115 3162398 5872876 8663007 10016993 8195470 4560923 3753948 7627234
39901 7627234 12183384 13461731 12973866 13722618 14379368 12189928 9048628 9262981 12583951
39892 12583951 14697907 14171276 13878094 15295909 16194834 15060133 13645376 13619103 14142775
39883 14142775 14341665 15078734 16591514 17189101 16208569 15781711 17442030 18972365 17281393
$$ packed form
39943H861781M966185L64261l088777k145210l81345j951954m776214l874980
39935b026253Q56287M632748M563025K333690L63937q85259j434455r65302k4229
39926G414189N95454J530436L137648L117304j63076k973547l53894N070792N039660
39917B2414966j927222p109200m154078J593717J697502k975871n127108k405591
39909B007115J155283K710478K790131J353986j821523l634547q06975L873286
39901G627234M556150J278347m87865P48752O56750k189440l141300K14353L320970
39892A2583951K113956n26631k93182J417815Q98925j134701j414757k6273N23672
39883A4142775J98890P37069J512780N97587r80532m26858J660319J530335j690972
$$ plain form
39874 17281393 13471213 12437548 16953012 23599366 25775691 20965110 14212658 12964859
39866 12964859 18458509 24506161 25814550 24393061 24899873 26656740 25236607 20605113
39858 20605113 17825047 19142053 21029607 20923317 21564744 25575269 30275133 31959057
39850 31959057 31975806 34200008 38664861 41769790 41283102 37631207 31899749 26269934
39842 26269934 24846234 29749889 37142569 41256505 41942203 43978687 48952907 52561311
39834 52561311 51194816 46927728 43750189 42194335 40450838 38518093 38245784 40166141
39826 40166141 42579274 43659698 43160091 42022491 40857745 38846386 34649541 29158622
39818 29158622 26240000 28627032 33620011 35711358 33589314 31114189 30389458 28010897
$$ packed form
39874A7281393l810180j033665M515464O646354K176325m810581o752452j247799
39866A2964859N493650O047652J308389j421489N06812J756867j420133m631494
39858B0605113k780066J317006J887554j06290O41427M010525M699864J683924
39850C1959057J6749K224202M464853L104929m86688l651895n731458n629815
39842B6269934j423700M903655P392680M113936O85698K036484M974220L608404
39834E2561311j366495m267088l177539j555854j743497j932745k72309J920357
39826D0166141K413133J080424m99607j137600j164746k011359m196845n490919
39818B9158622k918622K387032M992979K091347k122044k475125p24731k378561
$$ plain form
39810 28010897 21142702 13915114 13139266 19032975 24935733 26296796 25373660 25663081
39802 25663081 26038706 23629416 19706942 18606121 21600706 25475004 27394918 27973582
39794 27973582 28492031 27955011 24877181 20132716 15979935 13527290 13029162 15327022
39786 15327022 20570258 26322720 29501964 29907424 29603421 29427490 28847485 28680123 30330087
39777 30330087 32159266 30658693 26325309 24319927 27429019 32263387 34773651 35490410
39769 35490410 36151902 35268571 31529388 28323661 29573402 33177112 33900727 31342000
39761 31342000 29756736 31042729 33299081 35627816 38685773 40714373 38937485 35186346
39753 35186346 34054473 34764848 31417794 22888659 15729194 14631716 16599988 17987605
$$ packed form
39810B8010897o868195p227588p75848N893709N902758J361063r23136K89421
39802B5663081L75625k409290l922474j100821K994585L874298J919914N78664
39794B7973582N18449n37020l077830m744465m152781k452645m98128K297860
39786A5327022N243236N752462L179244M05460l04003j75931n80005j67362J649964
39777C0330087J829179j500573m333384k005382L109092M834368K510264P16759
39769C5490410O61492q83331l739183l205727J249741L603710P23615k558727
39761C1342000j585264J285993K256352K328735L057957K028600j776888l751139
39753C5186346j131873P10375l347054q529135p159465j097478J968272J387617
$$ plain form
39745 17987605 20611016 25992874 29538513 26671879 20440709 16812760 15882426 14016226
39737 14016226 11823993 13166662 17736040 21041471 21280444 20682874 20408788 19408813 18270100
39728 18270100 19056368 20884123 20305661 16860718 14256772 15270591 18851850 22647598
39720 22647598 25198500 25551901 23841079 22172257 22094104 21979902 20062210 18562284 20616109
39711 20616109 24459390 25667353 24279929 24175317 25789461 25553650 22903554 21422316
39703 21422316 21803206 20209998 15824660 13679415 16761228 20897338 21196213 18698973
39695 18698973 16842939 15865777 14818877 15092764 17649079 20080908 20308196 19992969 20775474
39686 20775474 20769832 18586493 16908155 17744761 18177162 15858522 14695169 18848051 24402809
$$ packed form
39745A7987605K623411N381858L545639k866634o231170l627949r30334j866200
39737A4016226k192233J342669M569378L305431K38973n97570k74086r99975j138713
39728A8270100P86268J827755n78462l444943k603946J013819L581259L795748
39720B2647598K550902L53401j710822j668822p8153j14202j917692j499926K053825
39711B0616109L843281J207963j387424j04612J614144k35811k650096j481238
39703B1422316L80890j593208m385338k145245L081813M136110K98875k497240
39695A8698973j856034r77162j046900K73887K556315K431829K27288l15227P82505
39686B0775474n642k183339j678338Q36606M32401k318640j163353M152882N554758
$$ plain form
39677 24402809 24119919 18350494 13804893 12592877 10320347 5396540 2450217 4417763
39669 4417763 7846070 8923669 8654678 8910564 8289751 5697351 4146354 6817237 11767216
39660 11767216 14221410 12631156 9635083 8229905 9214996 11243062 11622307 8497933
39652 8497933 3952270 3245285 8792490 16204940 18707808 14844522 9655468 8459243
39644 8459243 11375297 14260886 13640657 9990064 6607665 5782550 6524132 6448546 5342438
39635 5342438 5543917 8557726 12607314 14466624 13106800 10641033 9663770 10155403 9533517
39626 9533517 6113765 1955397 908636 3758571 7189437 8283465 7699845 6819243
39618 6819243 4497229 -216394 -4175740 -3120371 2136894 6538567 7711717 8096244
$$ packed form
39677B4402809k82890n769425m545601j212016k272530m923807k946323J967546
39669D417763L428307J077599k68991K55886o20813k592400j550997K670883M949979
39660A1767216K454194j590254k996073j405178R85091K028066L79245l124374
39652H497933m545663p06985N547205P412450K502868l863286n189054j196225
39644H459243K916054K885589o20229l650593l382399q25115P41582p5586j106108
39635E342438K01479L013809M049588J859310j359824k465767r77263M91633o21886
39626I533517l419752m158368j046761K849935L430866J094028n83620q80602
39618F819243k322014m713623l959346J055369N257265M401673J173150L84527
$$ plain form
39610 8096244 9872009 11922869 12795924 12745672 11673483 9003561 6851248 8759778 13344033
39601 13344033 14212328 9324697 5343570 8128407 13531586 13734669 9255798 7249223
39593 7249223 9502112 10268628 6842083 4503042 7725717 12599243 12734775 8864841
39585 8864841 7579649 12210768 19096624 22531610 20573249 15891625 12642865 12571419
39577 12571419 13488370 12170025 8833263 6940331 8018444 9239074 7772998 5112109
39569 5112109 4561652 6228950 7366699 6595092 4980246 3630755 2948184 3750228 6302690
39560 6302690 8428349 7508248 4624450 3892833 7074564 11503792 14120080 14787618 14427676
39551 14427676 12712176 9676982 7445726 7870291 9678271 10059884 8199542 5495096
$$ packed form
39610H096244J775765K050860Q73055n0252j072189k669922k152313J908530M584255
39601A3344033Q68295m887631l981127K784837N403179K03083m478871k006575
39593G249223K252889P66516l426545k339041L222675M873526J35532l869934
39585H864841j285192M631119O885856L434986j958361m681624l248760p1446
39577A2571419R16951j318345l336762j892932J078113J220630j466076k660889
39569E112109n50457J667298J137749p71607j614846j349491o82571Q02044K552462
39560F302690K125659r20101k883798p31617L181731M429228K616288O67538l59942
39551A4427676j715500l035194k231256M24565J807980L81613j860342k704446
$$ plain form
39543 5495096 3253432 1993633 2153897 3487237 4288672 3182497 1465482 1882190 5020375
39534 5020375 8418754 9400807 7587009 4511680 1892210 617885 794000 2397637
39526 2397637 5626861 10065750 13921962 15552036 15662225 15990136 15775737 12586554 7447977
39517 7447977 5194371 7455309 9390154 7029649 3916420 5344491 9376121 10202884
39509 10202884 8237247 8998193 12442308 12008690 5978519 1411776 3186807 6699636
39501 6699636 6480520 5336307 8373540 13123278 13213578 8841288 6148209 7472154 8843417
39492 8843417 6933554 2864372 -1058081 -3566685 -3219085 591297 5061333 6308392
39484 6308392 4483671 3090019 3539589 4180951 4299744 4773793 4730919 2043057 -2202254
$$ packed form
39543E495096k241664j259799J60264J333340Q01435j106175j717015M16708L138185
39534E020375L398379R82053j813798l075329k619470j274325J76115J603637
39526B397637L229224M438889L856212J630074J10189L27911k14399l189183n138577
39517G447977k253606K260938J934845k360505l113229J428071M031630Q26763
39509A0202884j965637P60946L444115m33618o030171m566743J775031L512829
39501F699636k19116j144213L037233M749738R0300m372290k693079J323945J371263
39492H843417j909863m069182l922453k508604L47600L810382M470036J247059
39484F308392j824721j393652M49570O41362J18793M74049m2874k687862m245311
$$ plain form
39475 -2202254 -3915935 -1678704 1545888 3287953 4494332 6545119 8874648 10712718
39467 10712718 11936531 11274504 7166820 1560187 -706084 2152828 6629862 8938988
39459 8938988 9082477 8618177 7863906 7233156 8249596 11060834 13396790 13757052 13245424
39450 13245424 12807487 11396568 8653032 6841644 8119574 11705794 15006933 15691427
39442 15691427 12294367 5651125 251567 654601 5567232 9038349 8342271 6427805
39434 6427805 5565698 3939783 787166 -617008 1534974 4204164 5291843 7378479
39426 7378479 11185357 11199715 4199622 -3029660 -2482555 2306202 1315205 -6195405 -10704044
39417 -10704044 -7317310 -1968263 -473050 -325668 2297281 4794817 3279807 291598
$$ packed form
39475b202254j713681K237231L224592J742065J206379K050787K329529J838070
39467A0712718J223813o62027m107684n606633k266271K858912M477034K309126
39459H938988J43489m64300p54271o30750J016440K811238K335956L60262n11628
39450A3245424m37937j410919k743536j811388J277930L586220L301139O84494
39442A5691427l397060o643242n399558M03034M912631L471117o96078j914466
39434F427805q62107j625915l152617j404174K151982K669190J087679K086636
39426G378479L806878J4358p000093p229282N47105M788757r90997p510610m508639
39417a0704044L386734N349047J495213J47382K622949K497536j515010k988209
$$ plain form
39409 291598 1095335 5264803 7676310 6323616 4142868 3743281 4816948 6936852 10838833
39400 10838833 15593761 17562783 14388433 8604309 5186596 5809875 7269988 6083776
39392 6083776 3098598 1983241 3899759 5911266 5080968 2060719 -378434 -418035 2480199
39383 2480199 8078471 14103787 16475471 13589520 9124481 7877016 9989921 12158550
39375 12158550 13104497 14013329 14405175 12229648 8508459 7310462 9612276 11257682
39367 11257682 9101886 5408487 3405259 2026946 -1031251 -3657022 -1692963 3795808
39359 3795808 6655608 4148799 988731 2245186 5542352 4562396 -1021856 -4198819
39351 -4198819 -448393 5694314 7448334 5879186 7775362 14431042 18741993 15279556
$$ packed form
39409B91598Q03737M169468K411507j352694k180748l99587J073667K119904L901981
39400A0838833M754928J969022l174350n784124l417713O23279J460113j186212
39392F083776k985178j115357J916518K011507q30298l020249k439153l9601K898234
39383B480199N598272O025316K371684k885951m465039j247465K112905K168629
39375A2158550R45947R08832L91846k175527l721189j197997K301814J645406
39367A1257682k155796l693399k003228j378313l058197k625771J964059N488771
39359C795808K859800k506809l160068J256455L297166r79956n584252l176963
39351d198819L750426O142707J754020j569148J896176O655680M310951l462437
$$ plain form
39343 15279556 8018608 4543927 6322004 8804989 8552470 5913960 2304540 -904467
39335 -904467 -1633913 913999 4044442 4745074 4289608 6051147 9530009 10811091 8895758
39326 8895758 7248068 8327180 10496216 11482389 11423943 11103687 10142371 8445580 7147208
39317 7147208 6953040 7321762 7703637 7825088 7095328 5924526 6648320 10076619 12323214
39308 12323214 9276392 3521307 1786470 5340249 8291517 6457406 2524747 606197
39300 606197 810426 1503867 2114256 1222300 -3216392 -8880029 -9293517 -2543576 4880840
39291 4880840 6771612 5078485 4776231 5607803 4501694 2328361 1901596 1885185 -835032
39282 -835032 -4288431 -3369728 1749550 5057920 3120043 -895017 -2630856 -1948558 -1563170
$$ packed form
39343A5279556p260948l474681J778077K482985k52519k638510l609420l209007
39335i04467p29446K547912L130443P00632m55466J761539L478862J281082j915333
39326H895758j647690J079112K169036R86173n8446l20256r61316j696791j298372
39317G147208j94168L68722L81875J21451p29760j170802P23794L428299K246595
39308A2323214l046822n755085j734837L553779K951268j834111l932659j918550
39300F06197K04229O93441O10389q91956m438692n663637m13488O749941P424416
39291D880840J890772j693127l02254Q31572j106109k173333m26765j6411k720217
39282h35032l453399R18703N119278L308370j937877m015060j735839O82298L85388
$$ plain form
39273 -1563170 -3092223 -5579760 -6454609 -3998665 148597 2293391 1564573 886414 1505574
39264 1505574 537872 -2995573 -4391184 -486178 3769370 2620958 -289058 2657114
39256 2657114 9631741 10959977 4243829 -1789277 -752020 3110684 3862927 2899419
39248 2899419 3679026 4179666 1062115 -3258180 -3973311 -1277852 972563 1543270 1993017
39239 1993017 2788728 3653002 5604607 8380290 8241333 3212133 -1625798 196253 6504548
39230 6504548 8138938 1368427 -6659111 -6955100 672825 8530891 10098632 5693680
39222 5693680 331129 -1858712 -830779 810114 1404986 1386072 1119400 -200921 -2278317
39213 -2278317 -2348923 1653213 7637549 11266126 10817723 8485666 7474864 9224767 12535892
$$ packed form
39273a563170j529053k487537q74849K455944M147262K144794p28818o78159O19160
39264A505574r67702l533445j395611L905006M255548j148412k910016K946172
39256B657114O974627J328236o716148o033106J037257L862704P52243r63508
39248B899419P79607N00640l117551m320295p15131K695459K250415N70707M49747
39239A993017P95711Q64274J951605K775683j38957n029200m837931J822051O308295
39230F504548J634390o770511q027538k95989P627925P858066J567741m404952
39222E693680n362551k189841J027933J640893N94872j8914k66672j320321k077396
39213b278317p0606M002136N984336L628577m48403k332057j010802J749903L311125
$$ plain form
39204 12535892 14064755 11142229 5769941 3854178 8019949 13167777 12393649 5652420
39196 5652420 -1223304 -4594504 -5383910 -4250019 -228713 4836522 6135525 2662296
39188 2662296 -403411 1000026 4123079 4245488 1431852 -1410482 -3751314 -5934102
39180 -5934102 -5207290 932164 8576065 10440363 5353070 -441192 -2190277 -1696385
39172 -1696385 -1964309 -2024351 -79971 2377038 3211470 3224763 3513252 2212896 -1955466
39163 -1955466 -5363454 -3649140 1140510 2714023 -568633 -4133198 -4903745 -5158671
39155 -5158671 -6999762 -8109871 -6100584 -3015140 -1785879 -1324701 792842 3059404
39147 3059404 1892950 -2402679 -5736274 -5922054 -4527238 -3138997 -1605314 -562170
$$ packed form
39204A2535892J528863k922526n372288j915763M165771N147828p74128o741229
39196E652420o875724l371200p89406J133891M021306N065235J299003l473229
39188B662296l065707J403437L123053J22409k813636k842334k340832k182788
39180e934102P26812O139454P643901J864298n087293n794262j749085M93892
39172a696385k67924o0042J944380K457009Q34432J3293K88489j300356m168362
39163a955466l407988J714314M789650J573513l282656l564565p70547k54926
39155e158671j841091j110109K009287L085444J229261M61178K117543K266562
39147C059404j166454m295629l333595j85780J394816J388241J533683J043144
$$ plain form
39139 -562170 -1987889 -5655004 -7856852 -5673121 -780729 2675105 2962890 2320344 4159018
39130 4159018 9027238 12872759 10281711 1196927 -6747374 -5796387 2303532 8156538
39122 8156538 6761062 2996390 2965784 4985123 3903421 781785 1780313 8209931 13885169
39113 13885169 13608955 9279745 5519227 3566489 2376066 2147504 2996160 2506010 -1410536
39104 -1410536 -6533277 -8872225 -8133420 -6801654 -4719142 408190 6691253 7908918
39096 7908918 2255001 -3611673 -3199426 972435 2003571 -907557 -2589064 -973632
39088 -973632 588060 376802 1149318 4060487 5581792 3431743 591112 -5697 -203823
39079 -203823 -2109302 -3157464 -537838 2976286 2961521 432632 -417545 646709 639454
$$ packed form
39139e62170j425719l667115k201848K183731M892392L455834K87785o42546J838674
39130D159018M868220L845521k591048r084784p944301R50987Q099919N853006
39122H156538j395476l764672l0606K019339j081702l121636R98528O429618N675238
39113A3885169k76214m329210l760518j952738j190423k28562Q48656m90150l916546
39104a410536n122741k338948P38805J331766K082512N127332O283063J217665
39096G908918n653917n866674M12247M171861J031136k911128j681507J615432
39088i73632J561692k11258P72516K911169J521305k150049k840631n96809j98126
39079b03823j905479j048162K619626L514124j4765k528889q50177J064254p255
$$ plain form
39070 639454 -566622 -673384 42992 152430 1877845 7534438 12386272 9407092 1448244
39061 1448244 -450563 6883552 13418723 10651101 3242157 272539 2219335 3674094
39053 3674094 3325443 3574928 4119435 3198007 2427489 3878202 5039895 3097209 1426218
39044 1426218 4885353 10972106 13069504 10806933 9482374 10290279 9394059 6635358
39036 6635358 6526149 9193077 8664809 2866105 -2195810 -1689001 1288998 2126210 1795213
39027 1795213 3081491 4951925 5438196 5800393 7203892 7130254 3729016 285457 694999
39018 694999 3504078 4954636 5015399 5705246 6240219 5008684 4086981 6335826 9594495
39009 9594495 9237876 5525064 3044504 3441695 4138560 4182778 5678779 8519094 9163028
$$ packed form
39070F39454j206076j06762P16376J09438J725415N656593M851834k979180p958848
39061A448244j898807P334115O535171k767622p408944k969618J946796J454759
39053C674094l48651K49485N44507r21428p70518J450713J161693j942686j670991
39044A426218L459135O086753K097398k262571j324559Q07905q96220k758701
39036F635358j09209K666928n28268n798704n061915N06809K977999Q37212l30997
39027A795213J286278J870434M86271L62197J403499p3638l401238l443559M09542
39018F94999K809079J450558O0763O89847N34973j231535r21703K248845L258669
39009I594495l56619l712812k480560L97191O96865M4218J496001K840315O43934
$$ plain form
39000 9163028 6539478 4392320 5290150 6478001 4799934 2368879 3449654 7453538
38992 7453538 8809756 3867203 -4387004 -9154424 -6652006 40811 4048903 2010384
38984 2010384 -2316028 -2815747 1641760 6719343 8598311 7290948 4037828 -642393
38976 -642393 -4822126 -4808739 180403 5499324 6464682 4562629 4773693 7702509 8500384
38967 8500384 4314639 -901849 -1371404 2879500 6380849 5760996 3980384 5721130
38959 5721130 10502715 12900641 9328721 2105002 -3990634 -6823498 -6919297 -4666852
38951 -4666852 -472668 3524825 5370257 6691981 10664110 16146886 17655096 12717619
38943 12717619 5906088 3263463 5411613 8561120 9758308 8298196 4378170 -47602
$$ packed form
39000I163028k623550k147158Q97830J187851j678067k431055J080775M003884
38992G453538J356218m942553q254207m767420K502418O692817M008092k038519
38984B010384m326412m99719M457507N077583J878968j307363l253120m680221
38976f42393m179733J3387M989142N318921R65358j902053K11064K928816P97875
38967H500384m185745n216488m69555M250904L501349o19853j780612J740746
38959E721130M781585K397926l571920p223719o095636k832864r5799K252445
38951d666852M194184L997493J845432J321724L972129N482776J508210m937477
38943A2717619o811531k642625K148150L149507J197188j460112l920026m425772
$$ plain form
38935 -47602 -803878 4073479 10161391 10741693 5047574 -871215 -1546669 2782806 8388487
38926 8388487 11947111 11825309 8789564 6097684 5991367 6071915 2715854 -2170798 -2888473
38917 -2888473 778910 2138195 -1943453 -5420377 -2534333 2708286 2926770 -1009266
38909 -1009266 -2403333 -227196 273366 -2046269 -1803754 3367445 8507822 9449834 8600020
38900 8600020 9057904 9027239 6516761 4372005 5515808 7409321 6564585 4945243 6178709
38891 6178709 8347382 6673347 1407534 -2952698 -4754384 -5369080 -3735562 2072360
38883 2072360 8021618 6738876 -1228194 -6063010 -1792427 5800041 8649693 7776086
38875 7776086 9118838 12343609 11311181 4572144 -1366990 -604339 4930588 8907911
$$ packed form
38935d7602p56276M877357O087912N80302n694119n918789o75454M329475N605681
38926H388487L558624j21802l035745k691880j06317Q0548l356061m886652p17675
38917b888473L667383J359285m081648l476924K886044N242619K18484l936036
38909a009266j394067K176137N00562k319635K42515N171199N140377R42012q49814
38900H600020M57884l0665k510478k144756J143803J893513q44736j619342J233466
38891F178709K168673j674035n265813m360232j801686o14696J633518N807922
38883B072360N949258j282742p967070m834816M270583P592468K849652q73607
38875G776086J342752L224771j032428o739037n939134P62651N534927L977323
$$ plain form
38867 8907911 8462479 6345745 6245990 7871529 7624557 4011398 640133 1726898 5659297
38858 5659297 6725221 3576391 1372148 3415360 5442935 2364970 -3160730 -4507068
38850 -4507068 -1217205 860170 -925914 -2590587 -740053 2278178 2986198 2367344
38842 2367344 3706160 7449684 10992007 11977701 9908399 5962809 2671239 2159324
38834 2159324 3491924 3592806 1929095 1860477 5467340 9457514 9151349 5180290 2994716
38825 2994716 5742954 10255810 10957324 6223743 -203128 -3594198 -3098615 -1740404
38817 -1740404 -1892026 -2326139 -1027807 676721 -171312 -2687613 -2260466 2501637 6584734
38808 6584734 5054249 -64839 -2873982 -1701716 -139807 -719673 -1660042 -582663
$$ packed form
38867H907911m45432k116734r9755J625539k46972l613159l371265J086765L932399
38858E659297J065924l148830k204243K043212K027575l077965n525700j346338
38850d507068L289863K077375j786084j664673J850534L018231P08020o18854
38842B367344J338816L743524L542323R85694k069302l945590l291570n11915
38834B159324J332600J00882j663711o8618L606863L990174l06165l971059k185574
38825B994716K748238M512856P01514m733581o426871l391070M95583J358211
38817a740404j51622m34113J298332J704528q48033k516301M27147M762103M083097
38808F584734j530485n119088k809143J172266J561909n79866r40369J077379
$$ plain form
38800 -582663 1844232 3367571 3025564 1307252 -859375 -2213774 -1750711 -257317 -14908
38791 -14908 -1940749 -4057601 -3825223 -1241874 1274251 1603029 -91689 -1659030 -895055
38782 -895055 2285651 5396221 5749379 3417627 1004756 383678 855315 948872 598296
38773 598296 406474 -153705 -2096735 -4654218 -5192279 -2044027 3317821 7604784 8927098
38764 8927098 8131006 7034287 6136553 4700362 2606978 923376 403879 733570 2054218
38755 2054218 5785583 12096802 17448860 17383865 12280931 7836185 8344987 11528592 12209866
38746 12209866 9557929 7450224 7881753 7816638 4452903 649399 1538192 6734005 9898283
38737 9898283 6997581 1546847 -701240 388170 418001 -1879051 -2532881 1269563 6544056
$$ packed form
38800e82663K426895J523339l42007j718312k166627j354399M63063J493394K42409
38791a4908j925841k116852K32378K583349K516125L28778j694718j567341P63975
38782h95055L180706L110570L53158k331752k412871o21078M71637R3557l50576
38773E98296j91822n60179j943030k557483n38061L148252N361848M286963J322314
38764H927098p96092j096719q97734j436191k093384j683602n19497L29691J320648
38755B054218L731365O311219N352058o4995n102934m444746N08802L183605O81274
38746A2209866k651937k107705M31529o5115l363735l803504Q88793N195813L164278
38737I898283k900702n450734k248087J089410K9831k297052o53830L802444N274493
$$ plain form
38728 6544056 8481587 6336175 2718964 -869574 -4549635 -7220676 -6700461 -2898091
38720 -2898091 1790591 5585765 8473350 9963942 8456934 4129720 319809 143283
38712 143283 2760779 4584284 3799239 2472413 3921670 8421647 12123418 11069843
38704 11069843 6216931 2718405 3320704 4767751 2976560 -589467 -1516019 195836
38696 195836 470998 -1246716 -451589 4780111 10091137 11696408 11906577 13806100 14931711
38687 14931711 11515393 5663622 2366011 1553723 -571808 -3524363 -2683234 2202989
38679 2202989 5347055 3658034 1267768 2360823 4485610 3059118 -960497 -2372694
38671 -2372694 964200 5880580 8419596 7942350 6721396 6992588 8524590 8889262 6752474
$$ packed form
38728F544056J937531k145412l617211l588538l680061k671041N20215L802370
38720b898091M688682L795174K887585J490592j507008m327214l809911j76526
38712A43283K617496J823505p85045j326826J449257M499977L701771j053575
38704A1069843m852912l498526O02299J447047j791191l566027r26552J711855
38696A95836K75162j717714P95127N231700N311026J605271K10169J899523J125611
38687A4931711l416318n851771l297611q12288k125531k952555Q41129M886223
38679B202989L144066j689021k390266J093055K124787j426492m019615j412197
38671b372694L336894M916380K539016m77246j220954K71192J532002L64672k136788
$$ plain form
38662 6752474 4199948 3813187 4177031 1700470 -3004936 -4860251 -1768019 2111731
38654 2111731 2910621 2480570 3843127 5358977 4110911 1887073 2408727 4783678 5368016
38645 5368016 4649291 6119818 8818858 7630591 1991194 -2111961 -1137496 809925
38637 809925 -930082 -4496568 -5939234 -6400821 -9195276 -12313446 -10119140 -2172416
38629 -2172416 5129711 6725987 4292208 2037799 1245760 1448021 3424488 7143895
38621 7143895 8760546 4298185 -3644250 -7104665 -2282033 5442556 8401371 5761365
38613 5761365 2303026 249603 -2555994 -6351049 -7004662 -2521074 2421187 2600442
38605 2600442 100851 1120534 6136620 8518871 3907681 -3203428 -4579069 2185921
$$ packed form
38662F752474k552526l86761L63844k476561m705406j855315L092232L879750
38654B111731P98890m30051J362557J515850j248066k223838N21654K374951N84338
38645E368016p18725J470527K699040j188267n639397m103155R74465J947421
38637H09925j740007l566486j442666m61587k794455l118170K194306P946724
38629b172416P302127J596276k433779k254409p92039K02261J976467L719407
38621G143895J616651m462361p942435l460415M822632P724589K958815k640006
38613E761365l458339k053423k805597l795055o53613M483588M942261J79255
38605B600442k499591J019683N016086K382251m611190p111109j375641O764990
$$ plain form
38597 2185921 11124263 14074069 8566546 137397 -3232721 463920 5416520 5633419
38589 5633419 2316295 878000 2592712 3642039 1847185 -635189 -1961076 -2927237
38581 -2927237 -3037599 784487 8719958 15544402 17089719 15766720 16002583 17315867
38573 17315867 16091726 11810211 7197406 3947769 2327621 3252461 6405990 7824901
38565 7824901 4182569 -1387746 -2643718 1011275 4178105 3895138 2911506 3461651 3368765
38556 3368765 923292 -1017873 708366 4395163 5865786 3913344 797372 -708307
38548 -708307 1239249 6664205 12216080 13129759 9137714 5608756 6003114 6494988 2223310
38539 2223310 -4029194 -5013217 511149 6524971 9002407 10190206 12123784 12060033 7928022
$$ packed form
38597B185921Q938342K949806n507523q429149l370118L696641M952600K16899
38589E633419l317124j438295J714712J049327j794854k482374j325887r66161
38581b927237j10362L822086P935471O824444J545317j322999K35863J313284
38573A7315867j224141m281515m612805l249637j620148R24840L153529J418911
38565G824901l642332n570315j255972L654993L166830k82967r83632N50145r2886
38556C368765k445473j941165J726239L686797J470623j952442l115972j505679
38548g08307J947556N424956N551875R13679l992045l528958L94358M91874m271678
38539B223310o252504r84023N524366O013822K477436J187799J933578o3751m132011
$$ plain form
38530 7928022 3406665 2799577 4190186 2839965 -795633 -1940693 633261 3269840
38522 3269840 4133250 5587146 8470558 9495189 7077478 4796809 5158979 4217844 -2459769
38513 -2459769 -11513266 -15283563 -11961115 -6537782 -2682616 127606 1606515 -187695
38505 -187695 -3171760 -1523150 5367321 10327265 8530758 4399243 3823292 5315963
38497 5315963 5015294 5180874 9626971 14261445 11509066 3031709 -1218542 2635341
38489 2635341 7727160 8120351 6561387 6905408 6807664 3656215 1546865 5492091 12596358
38480 12596358 15590229 12791355 8671198 6213745 4424501 2630705 1884063 1920668
38472 1920668 1198695 386520 1905700 5399663 7155173 4935069 611024 -2654328
$$ packed form
38530G928022m521357o07088J390609j350221l635598j145060K573954K636579
38522C269840Q63410J453896K883412J024631k417711k280669L62170r41135o677613
38513b459769r053497l770297L322448N423333L855166K810222J478909j794210
38505a87695k984065J648610O890471M959944j796507m131515n75951J492671
38497E315963l00669J65580M446097M634474k752379q477357m250251L853883
38489B635341N091819L93191j558964L44021r7744l151449k109350L945226P104267
38480A2596358K993871k798874m120157k457453j789244j793796p46642L6605
38472A920668p21973q12175J519180L493963J755510k220104m324045l265352
$$ plain form
38464 -2654328 -3338181 -1328491 2485765 5674502 5799351 3436140 1700081 2141610 3232680
38455 3232680 3655334 4701975 7816054 11432654 12309921 9588925 6069063 5147849 7112953
38446 7112953 8994290 8213715 5773892 4813823 6260860 7712470 7192931 5967270 6197457
38437 6197457 7574465 8168838 7222662 5097399 1758148 -2454704 -5641011 -6232898 -5129162
38428 -5129162 -3804924 -1656473 2126633 5514295 5878840 4304361 3927510 4665641 3824689
38419 3824689 1754237 2008448 4946672 6134714 3288174 387633 1781562 5786236
38411 5786236 7869530 7558948 8036073 10258692 11583559 10197726 7620883 6003272
38403 6003272 5228167 3923250 2092124 1275980 2018829 2294762 -97479 -3594020 -3610535
$$ packed form
38464b654328o83853K009690L814256L188737J24849k363211j736059M41529J091070
38455C232680M22654J046641L114079L616600Q77267k720996l519862r21214J965104
38446G112953J881337p80575k439823r60069J447037J451610n19539j225661K30187
38437F197457J377008N94373r46176k125263l339251m212852l186307n91887J103736
38428e129162J324238K148451L783106L387662L64545j574479l76851P38131q40952
38419C824689k070452K54211K938224J188042k846540k900541J393929M004674
38411E786236K083294l10582M77125K222619J324867j385833k576843j617611
38403F003272p75105j304917j831126q16144P42849K75933k392241l496541j6515
$$ plain form
38394 -3610535 1280185 6362847 6961653 5427005 7336834 11945051 12548871 7155495
38386 7155495 2236038 2955107 5597557 4239509 132408 -1210714 1014736 2829227
38378 2829227 2492921 1987521 2463415 3280209 4914570 8000347 10043749 8101802 4551364
38369 4551364 4943027 9559039 12338274 9647958 5304686 4585471 7203365 9011810
38361 9011810 7954616 5785572 5524318 8739561 13965169 17254859 16042670 12377208
38353 12377208 10091865 9469196 8022005 5792938 5188586 5443260 2810168 -2265131
38345 -2265131 -3823060 1032972 7407886 9916568 9859091 10828387 11603340 8889718 4123301
$$ packed form
38394c610535M890720N082662N98806j534648J909829M608217O03820n393376
38386G155495m919457P19069K642450j358048m107101j343122K225450J814491
38378B829227l36306n05400M75894Q16794J634361L085777K043402j941947l550438
38369D551364L91663M616012K779235k690316m343272p19215K617894J808445
38361I011810j057194k169044k61254L215243N225608L289690j212189l665462
38353A2377208k285343o22669j447191k229067o04352K54674k633092n075299
38345b265131j557929M856032O374914K508682n7477R69296P74953k713622m766417
$$ [...]
##END NTUPLES=NMR SPECTRUM
##END=
