##TITLE=31Pdec_SR88_rm1
 , 24 sc
 20.09.2021
##JCAMPDX= 6.0         $$ Bruker NMR JCAMP-DX V2.0
##DATA TYPE= NMR SPECTRUM
##DATA CLASS= NTUPLES
##ORIGIN= UXNMR, Bruker Analytische Messtechnik GmbH
##OWNER= root
$$ XWIN-NMR		Version 3.5
$$ Mon Sep 20 10:29:40 2021 Russian Standard Time (UT+4h)  she@DPX200
##.OBSERVE FREQUENCY= 81.013821
##.OBSERVE NUCLEUS= ^31P
##.ACQUISITION MODE= SIMULTANEOUS
##.ACQUISITION SCHEME= undefined
##.AVERAGES= 24
##.DIGITISER RES= 16
##SPECTROMETER/DATA SYSTEM= spect
##.PULSE SEQUENCE= zgpg30
##.SOLVENT NAME= CDCl3
##.SHIFT REFERENCE= (INTERNAL, CDCl3, 0, 248.564)
##AUDIT TRAIL= $$ (NUMBER, WHEN, WHO, WHERE, WHAT)
$$ ##TITLE= Audit trail, XWIN-NMR		Version 3.5
$$ ##JCAMPDX= 5.01
$$ ##ORIGIN= Bruker BioSpin GmbH
$$ ##OWNER= she
$$ F:/spectra/data/she/nmr/P31/1/pdata/1/auditp.txt
$$ ##AUDIT TRAIL=  $$ (NUMBER, WHEN, WHO, WHERE, WHAT)
(   1,<2021-09-20 10:27:45.46 +0400>,<she>,<DPX200>,
      <created by zg, POWCHK disabled, PULCHK disabled
       configuration hash MD5:
       00 E9 B6 7A A2 85 ED C7 34 08 36 98 17 FE 4E 26
       data hash MD5: 32K
       10 63 E6 91 87 F1 52 D5 4A 95 35 31 B0 1D 51 6D>)
(   2,<2021-09-20 10:28:18.37 +0400>,<she>,<DPX200>,
      <Start of raw data processing
       efp BC_mod = 2 LB = 1 FT_mod = 6 PKNL = 1 PHC0 = -7859.587 PHC1 = 316.8701 SI = 64K 
       data hash MD5: 64K
       76 47 3E 15 38 7D B2 2D CC C8 71 31 34 87 7A 9B>)
(   3,<2021-09-20 10:28:56.07 +0400>,<she>,<DPX200>,
      <pk PHC0 = 113.1583 PHC1 = -232 
       data hash MD5: 64K
       0B 89 70 71 E1 CC 19 11 15 E7 32 07 FD AF BA 5B>)
$$ ##END=
$$ 
$$ hash MD5
$$ 52 93 F0 7F 03 3A 35 16 CD 19 B5 98 3B 8B 2E 6D
##$RELAX= 
##$RELAX= 
##$RELAX= 
##$RELAX= 
##$RELAX= 
##$RELAX= 
##$RELAX= 
##$RELAX= 
$$ Bruker specific parameters
$$ --------------------------
##$DU= <F:/spectra>
##$EXPNO= 1
##$NAME= <P31>
##$PROCNO= 1
##$TYPE= <nmr>
##$USER= <she>
##$AMP= (0..31)
100 100 100 100 100 100 100 100 100 100 100 100 100 100 100 100 100 100 
100 100 100 100 100 100 100 100 100 100 100 100 100 100 
##$AQSEQ= 0
##$AQ_mod= 1
##$AUNM= <au_zg>
##$AUTOPOS= <>
##$BF1= 81.014009
##$BF2= 200.13
##$BF3= 200.13
##$BF4= 200.13
##$BF5= 200.13
##$BF6= 200.13
##$BF7= 200.13
##$BF8= 200.13
##$BYTORDA= 1
##$CFDGTYP= 0
##$CFRGTYP= 5
##$CHEMSTR= <none>
##$CNST= (0..31)
1 1 145 1 1 1 1 1 1 1 1 1 1 1 1 1 1 1 1 1 1 1 1 1 1 1 1 1 1 1 1 1 
##$CPDPRG= <waltz16>
##$CPDPRG1= <>
##$CPDPRG2= <waltz16>
##$CPDPRG3= <>
##$CPDPRG4= <mlev>
##$CPDPRG5= <mlev>
##$CPDPRG6= <mlev>
##$CPDPRG7= <mlev>
##$CPDPRG8= <mlev>
##$CPDPRGB= <>
##$CPDPRGT= <>
##$D= (0..31)
0 1 0 0 0 0 0 0 0 0 0 0.03 2e-05 3e-06 0 0 0 0 0 0 0 0 0 0 0 0 0 0 0 0 
0 0 
##$DATE= 1632119264
##$DBL= (0..7)
120 120 120 11 120 120 24 19 
##$DBP= (0..7)
150 150 150 150 150 150 150 150 
##$DBP07= 0
##$DBPNAM0= <>
##$DBPNAM1= <>
##$DBPNAM2= <>
##$DBPNAM3= <>
##$DBPNAM4= <>
##$DBPNAM5= <>
##$DBPNAM6= <>
##$DBPNAM7= <>
##$DBPOAL= (0..7)
0.5 0.5 0.5 0.5 0.5 0.5 0.5 0.5 
##$DBPOFFS= (0..7)
0 0 0 0 0 0 0 0 
$$ [...]
##$SUBNAM2= <"">
##$SUBNAM3= <"">
##$SUBNAM4= <"">
##$SUBNAM5= <"">
##$SUBNAM6= <"">
##$SUBNAM7= <"">
##$SUBNAM8= <"">
##$SUBNAM9= <"">
##$SW= 501.771253377433
##$SWIBOX= (0..15)
0 1 3 0 0 0 0 0 0 0 0 0 0 0 0 0 
##$SW_h= 40650.406504065
##$TD= 32768
##$TD0= 1
##$TE= 0
##$TE2= 300
##$TE3= 300
##$TEG= 300
##$TL= (0..7)
0 120 53 12 22 120 120 120 
##$TP= (0..7)
150 150 150 150 150 150 150 150 
##$TP07= 0
##$TPNAME0= <>
##$TPNAME1= <>
##$TPNAME2= <>
##$TPNAME3= <>
##$TPNAME4= <>
##$TPNAME5= <>
##$TPNAME6= <>
##$TPNAME7= <>
##$TPOAL= (0..7)
0.5 0.5 0.5 0.5 0.5 0.5 0.5 0.5 
##$TPOFFS= (0..7)
0 0 0 0 0 0 0 0 
##$TUNHIN= 0
##$TUNHOUT= 0
##$TUNXOUT= 0
##$USERA1= <user>
##$USERA2= <user>
##$USERA3= <user>
##$USERA4= <user>
##$USERA5= <user>
##$V9= 5
##$VALIST= <valist>
##$VCLIST= <CCCCCCCCCCCCCCC>
##$VD= 0
##$VDLIST= <DDDDDDDDDDDDDDD>
##$VPLIST= <PPPPPPPPPPPPPPP>
##$VTLIST= <TTTTTTTTTTTTTTT>
##$WBST= 1024
##$WBSW= 4
##$XGAIN= (0..3)
0 0 0 0 
##$XL= 0
##$YL= 0
##$YMAX_a= 5419
##$YMIN_a= -7876
##$ZGOPTNS= <>
##$ZL1= 120
##$ZL2= 120
##$ZL3= 120
##$ZL4= 120
##$ABSF1= 0
##$ABSF2= 0
##$ABSG= 0
##$ABSL= 0
##$ALPHA= 0
##$AQORDER= 0
##$ASSFAC= 0
##$ASSFACI= 0
##$ASSFACX= 0
##$ASSWID= 0
##$AUNMP= <proc_1d>
##$AZFE= 0.1
##$AZFW= 0.5
##$BCFW= 0
##$BC_mod= 2
##$BYTORDP= 0
##$COROFFS= 0
##$CY= -3
##$DATMOD= 1
##$DC= 0
##$DFILT= <>
##$DTYPP= 0
##$F1P= 0
##$F2P= 0
##$FCOR= 1
##$FTSIZE= 65536
##$FT_mod= 6
##$GAMMA= 0
##$GB= 0
##$INTBC= 1
##$INTSCL= 5.30512e-09
##$ISEN= 30
##$LB= 1
##$LEV0= 0
##$LPBIN= 0
##$MAXI= 10000
##$MC2= 0
##$MEAN= 0
##$ME_mod= 0
##$MI= 50
##$NCOEF= 0
##$NC_proc= -8
##$NLEV= 6
##$NOISF1= 182.463
##$NOISF2= 159.3651
##$NSP= 0
##$NTH_PI= 0
##$NZP= 0
##$OFFSET= 248.5645
##$PC= 4
##$PHC0= -7746.429
##$PHC1= 84.87009
##$PH_mod= 1
##$PKNL= yes
##$PPARMOD= 0
##$PSCAL= 0
##$PSIGN= 0
##$REVERSE= no
##$SF= 81.014009
##$SI= 65536
##$SIGF1= 159.3651
##$SIGF2= -187.1042
##$SINO= 113.3802
##$SIOLD= 16384
##$SREGLST= <1H.CDCl3>
##$SSB= 0
##$STSI= 65536
##$STSR= 0
##$SW_p= 40650.406504065
##$SYMM= 0
##$S_DEV= 0
##$TDeff= 32768
##$TDoff= 0
##$TI= <>
##$TILT= no
##$TM1= 0
##$TM2= 0
##$TOPLEV= 0
##$USERP1= <user>
##$USERP2= <user>
##$USERP3= <user>
##$USERP4= <user>
##$USERP5= <user>
##$WDW= 1
##$XDIM= 65536
##$YMAX_p= 175062884
##$YMIN_p= -365649805
$$ End of Bruker specific parameters
$$ ---------------------------------
##NTUPLES= NMR SPECTRUM
##VAR_NAME=  FREQUENCY,     SPECTRUM/REAL,   SPECTRUM/IMAG
##SYMBOL=    X,             R,               I
##VAR_TYPE=  INDEPENDENT,   DEPENDENT,       DEPENDENT
##VAR_FORM=  AFFN,          ASDF,            ASDF
##VAR_DIM=   65536,         65536,           65536
##UNITS=     HZ,            ARBITRARY UNITS, ARBITRARY UNITS
##FACTOR=    0.620285442955139, 1,           1
##FIRST=     20137.2065510759, 0,            0
##LAST=      -20513.1999529892, 0,           0
##MIN=       -20513.1999529892, -365649805,  0
##MAX=       20137.2065510759, 175062884,    0
$$ Real data points
##PAGE= N=1
##DATA TABLE= (X++(R..R)), XYDATA
$$ [...]
##PAGE= N=2
##DATA TABLE= (X++(I..I)), XYDATA
13032a45584k851073k5122K737363P54649l226221l632879l35799K389369K519057
$$ -145584 -2996657 -3021779 -284416 470233 -2755988 -6388867 -6724666 -4335297 -1816240
13023a816240J590232J090719J119773J457740J364931l42790l005570l726586
$$ -1816240 -226008 864711 1984484 3442224 4807155 4464365 1458795 -2267791
13015b267791j298981J467075J541746j07784m06148J405265L532715M426640
$$ -2267791 -3566772 -2099697 -557951 -665735 -1071883 333382 3866097 8292737
13007H292737L686333J357801j733962l846958l971198k807715j409013k21581
$$ 8292737 11979070 13336871 11602909 7755951 3784753 977038 -431975 -653556
12999f53556J56088o28096j112496M01665K187420P00104k939114k705578L225230
$$ -653556 -497468 -1125564 -2238060 -1836395 351025 1051129 -1887985 -4593563 -1368333
12990a368333P729587L771618n155916r267674n363179L74938J992579L33326
$$ -1368333 6361254 10132872 4976956 -4290718 -9653897 -9278959 -7286380 -6953054
12982f953054j058372j328425j044877N84496L838203N942394L782042j300772
$$ -6953054 -8011426 -9339851 -10384728 -9800232 -5962029 -19635 3762407 2461635
12974B461635m059883j500626K950225K977424k804028q155434o111017K111100
$$ 2461635 -1598248 -3098874 -148649 2828775 24747 -8130687 -14241704 -12130604
12966a2130604P902570N628595q99032m198674k293001J140359L305389M402028
$$ -12130604 -4228034 1400561 501529 -3697145 -5990146 -4849787 -1544398 2857630
12958B857630M207127J544393k177374l280718j136520O02171k10765j001387
$$ 2857630 7064757 8609150 6431776 3151058 2014538 2616709 2405944 1404557
12950A404557M97032J766776k22411l184102k641981P83515K366263J062242P10438
$$ 1404557 1901589 3668365 3445954 261852 -2380129 -1596614 769649 1831891 2542329
12941B542329K464858J932413k983457o587659k981986M257881O362497J880939
$$ 2542329 5007187 6939600 3956143 -2631516 -5613502 -1355621 5006876 6887815
12933F887815j912074n13872J932360P70159j678968j292442L15829p89271l445726
$$ 6887815 4975741 4461869 6394229 7164388 5485420 4192978 4508807 3719536 273810
12924B73810l629563j791205j464224j982646L64910M170123L489330j897099
$$ 273810 -3355753 -5146958 -6611182 -8593828 -8228918 -4058795 -569465 -2466564
12916b466564m228888Q57488P051995O141122p37895n697352m584347R53L758085
$$ -2466564 -6695452 -5837964 1214031 7355153 6617258 919906 -3664441 -3663488 94597
12907I4597M275636J287043k775669l870211j088433J495578N54699j509722q14230
$$ 94597 4370233 5657276 2881607 -988604 -2077037 -581459 -26760 -1536482 -2350712
12898b350712J582539J948621K95675m47499p3670p02394j724787m88410K219475
$$ -2350712 -768173 1180448 1476123 1028624 954954 252560 -1472227 -1960637 258838
12889B58838K587845L5997j822226j112674R8893M03269J071202K106871J050038
$$ 258838 2846683 2882680 1060454 -52220 46673 449942 1521144 3628015 4678053
12880D678053k078630k987768O68211M657723L327328k562847o483764m054760
$$ 4678053 2599423 -388345 279866 4937589 8264917 5702070 -781694 -4836454
12872d836454J977722M966653J738659l709161m682762j64013L521747J144857
$$ -4836454 -2858732 2107921 3846580 137419 -4545343 -4709356 -1187609 -42752
12864d2752m151286n557128k080303J674070L390441M420328M026306k82651n671460
$$ -42752 -4194038 -9751166 -11831469 -10157399 -6766958 -2346630 1679676 1397025 -4274435
12855d274435n129076J498052N305832J431382l161565j022184L667337K609565
$$ -4274435 -9403511 -7905459 -2599627 -1168245 -4329810 -5351994 -1684657 924908
12847I24908k242058j972625M035378O735285J922451l634827l508137p41952
$$ 924908 -1317150 -3289775 745603 7480888 9403339 5768512 2260375 1518423
12839A518423r58761k800872j315342L044642M996145K503885q45630j463604
$$ 1518423 559662 -2241210 -3556552 -511910 4484235 6988120 6142490 4678886
12831D678886J13911J295818Q15752q58932k583012l033089j395130J434019K932627
$$ 4678886 4792797 6088615 6904367 6045435 3462423 429334 -965796 468223 3400850
12822C400850J249689k435351m538173k776840R82367K711122J267587j86791
$$ 3400850 4650539 2215188 -2322985 -5099825 -4117458 -1406336 -138749 -325540
12814c25540J066987L026076J952793j504591k780454l17973J809224J34345k676251
$$ -325540 741447 3767523 5720316 4215725 1435271 1117298 2926522 3060867 384616
12805C84616j923195J608356K599174o63172l590470k226280J007374J524207
$$ 384616 -1538579 69777 2668951 2005779 -1584691 -3810971 -2803597 -1279390
12797a279390j93373J46003L078275L898187M0848m206809l459737R74900L023104
$$ -1279390 -1472763 -1326760 1751515 5649702 5690550 1483741 -1975996 -1001096 2022008
12788B022008M89503k406651j652893J186571K137791O36271n52280L9695P58087
$$ 2022008 2511511 104860 -1548033 -361462 1776329 2412600 1860320 1900015 2658102
12779B658102k78466k386912l259405j886790L21091J452309J560461K257546
$$ 2658102 2379636 -7276 -3266681 -5153471 -4832380 -3380071 -1819610 437936
12771D37936L716474L692312Q88345k240057k555630j171604j899582m760986
$$ 437936 4154410 7846722 8735067 6495010 3939380 2767776 868194 -3892792
12763c892792n143893r21501L591813L705950J140677Q23366L004255L136363
$$ -3892792 -9036685 -9958186 -6366373 -2660423 -1519746 -696380 2307875 5444238
12755E444238q30838n219748n541353j723221K605199M081447K170397p86313
$$ 5444238 4613400 -606348 -6147701 -7870922 -5265723 -1184276 986121 199808
12747A99808j800625n33398K50858j254457k932156k101997l7828M24176L98258
$$ 199808 -1600817 -2134215 -1883357 -3137814 -6069970 -8171967 -8209795 -7785619 -7387361
12738g387361L259082P635321P602326J359461n415444p350222n758056m108783
$$ -7387361 -4128279 3507042 11109368 12468829 7053385 -296837 -6054893 -10163676
12730a0163676k030014J510996L261106J44372l865518k163124M097071O970578
$$ -10163676 -12193690 -10682694 -7421588 -7277216 -11142734 -13305858 -9208787 -2238209
12722b238209L619762J97603J523943L583501Q50079m040211m083308J188658
$$ -2238209 1381553 1579156 3103099 6686600 7536679 3496468 -586840 601818
12714F01818M874130K593846k071617l423595j010455J180597O40855j093529
$$ 601818 5475948 8069794 5998177 2574582 1564127 2744724 3385579 2292050
12706B292050j297927K62012J182386l42862k908434l469110j377821P45297Q20959
$$ 2292050 994123 1256135 2438521 2095659 -812775 -4281885 -5659706 -4914409 -4093450
12697d093450J66156J077647L151026M050187K848908M84588k166460m391141
$$ -4093450 -3927294 -2849647 301379 4351566 7200474 7685062 5518602 1127461
12689A127461m754964k774890p81323j181977k388518q17723L230043N496536
$$ 1127461 -3627503 -6402393 -7183716 -8365693 -10754211 -11571934 -8341891 -2845355
12681b845355L994252J320529j96959j410127k760679k234455M42445J698261
$$ -2845355 1148897 2469426 2272467 862340 -1898339 -4132794 -3690349 -1992088
12673a992088m41353k582432j469233M59292k91725j570301N82937M016716L334425
$$ -1992088 -2433441 -5015873 -6485106 -6025814 -6317539 -7887840 -7304903 -3288187 46238
12664D6238n63700j297763K310805L949713J24600m378427m568054k308951j054646
$$ 46238 -517462 -1815225 495580 4445293 4569893 191466 -4376588 -6685539 -7740185
12655g740185N30848M108082N774099J586926m111351l374255L402516P359306
$$ -7740185 -7209337 -3101255 2672844 4259770 148419 -3225836 176680 7535986
12647G535986L572206k838384m806153k016418J239865K429677J558839j140306
$$ 7535986 11108192 8269808 3463655 1447237 2687102 5116779 6675618 5535312
12639E535312m563915n750663k956287J383179L523271L186411K697297K353377
$$ 5535312 971397 -4779266 -7735553 -6352374 -2829103 357308 3054605 5407982
12631E407982J48036l745972n683197l262628J012806K738666R31872j471856
$$ 5407982 5556018 1810046 -3873151 -7135779 -6122973 -3384307 -2452435 -3924291
12623c924291j689356R3454J856460K287164J813998J795920K908616M078576
$$ -3924291 -5613647 -5520193 -3663733 -1376569 437429 2233349 5141965 9220541
12615I220541L299006j6773l818172n180505l180287L18689K418317J535580j214361
$$ 9220541 12519547 12502774 8684602 3504097 323810 642499 3060816 4596396 3382035
12606C382035k600784l91054L431752M130978J79273m103185m050598r33537N36663
$$ 3382035 781251 390197 3821949 7952927 8132200 4029015 -21583 -955120 -418457
12597d18457m41063m21041J487827J805727p23724j878137J353837M946064L204697
$$ -418457 -859520 -1280561 207266 2012993 1289269 -588868 764969 5711033 8915730
12588H915730k609967n808667l289985J326659L399214K298173J99051j117299
$$ 8915730 6305763 497096 -2792889 -1466230 1932984 4231157 4430208 3312909
12580C312909j134188j12049J202973J951641J462070n93751l268029l868617
$$ 3312909 2178721 2066672 3269645 5221286 6683356 6089605 2821576 -1047041
12572a047041p61911L140509K887499j658322n219366m647452k463399q55592
$$ -1047041 -1808952 1331557 4219056 2560734 -2658632 -7306084 -9769483 -10625075
12564a0625075K072549O380334O900855J514423k996068o54042L408464J212384
$$ -10625075 -8552526 -2172192 4728663 6243086 3247018 2592976 6001440 7213824
12556G213824m079589l280319K620712L799745j322891l455798R32744L335138
$$ 7213824 3134235 -146084 2474628 6274373 4951482 1495684 2428428 5763566
12548E763566j574280o269434l008689L637878N034403J556592p97389p50526
$$ 5763566 4189286 -2080148 -5088837 -1450959 3583444 5140036 4342647 3592121
12540C592121p95147q01276K46411L73872j341304j433481J527403K639404r61784
$$ 3592121 2796974 1995698 2242109 2615981 1274677 -158804 1368599 4008003 3046219
12531C046219l515442J76692N012012L664148j141645k168125o39815k687793
$$ 3046219 -469223 -292531 4719481 8383629 7241984 5073859 4434044 1746251
12523A746251o406842m558514J414012K507415k252880l457442K986485Q934947
$$ 1746251 -4660591 -9219105 -7805093 -5297678 -7550558 -11008000 -8021515 913432
12515I13432O990491R38552j941856j298394r38745j591589j709334j250656n20556
$$ 913432 7903923 8842475 6900619 5602225 4663480 3071891 1362557 111901 -408655
12506d08655J224410L023371J787610k694107n945072m475277m9266L544151M678082
$$ -408655 815755 3839126 5626736 2932629 -3012443 -7487720 -7536986 -3992835 685247
12497F85247L448968O19235j651057j370524J65326J90734p32212m7821J151768
$$ 685247 4134215 4753450 3102393 1731869 1897195 2087929 1355717 1307896 2459664
12488B459664n56071l904780l707428M18472K874794J252032l44900O09504J026016
$$ 2459664 1903593 -2001187 -5708615 -5290143 -2415349 -1163317 -1508217 -898713 127303
12479A27303n42580j61591L545540M977586P01140l538833j582432K935855K554847
$$ 127303 -415277 -576868 2968672 7946258 8647398 5108565 3526133 6461988 9016835
12470I016835k112677m268770j933260N90429P83145L91207L49955m97346j519668
$$ 9016835 6904158 2635388 702128 1292557 2075702 2466909 2816864 2319518 799850
12461G99850o42699J064980J33249l288345m647047j418122L320489N120666L260161
$$ 799850 157151 1222131 1355380 -1932965 -6580012 -7998134 -4677645 443021 3703182
12452C703182L93129r30527l87300L83024k53256j837499k331679j019166O52165
$$ 3703182 4096311 3165784 2778484 3161508 2908252 1070753 -1260926 -2280092 -1627927
12443a627927J707134K844157L858198K662744j009488l530601j836400J926915
$$ -1627927 79207 2923364 6781562 9444306 8434818 4904217 3067817 4994732
12435D994732L130614P55032j901891j757247R65989L543662L244455j13427l426037
$$ 4994732 8125346 8880378 6978487 5221240 6187229 9730891 12975346 12861919 9435882
12426I435882l661828k109731k588352n149878n491262j848000J992342K754277
$$ 9435882 5774054 3664323 1075971 -4073907 -9565169 -11413169 -9420827 -6666550
12418f666550K197947K623452K464309K61308j223308N22727K812921K119282
$$ -6666550 -4468603 -1845151 619158 880466 -342842 179885 2992806 5112088
12410E112088O2905k562P98483m02816k169083j461584N3723j111250k992056
$$ 5112088 5174993 5172431 5970914 5568098 3399015 1937431 1991154 879904 -2112152
12401b112152q07736M129445N429062J672783j606364j030601K33087q59851k227992
$$ -2112152 -2919888 1209557 6638619 8311402 6705038 5674437 5907524 5047673 2819681
12392B819681j177894Q22283Q33427j491615m594652o725962n793630j011835
$$ 2819681 1641787 2464070 3297497 1805882 -2788770 -9514732 -15308362 -16320197
12384a6320197M221061M979989J667721J25728L189179O389449M646893n07933
$$ -16320197 -12099136 -7119147 -5451426 -5325698 -2136519 4252930 8899823 8391890
12376H391890l625487k535926K89867J698181M59933k622009m873213l261907
$$ 8391890 4766403 2230477 2520344 4218525 4678458 2056449 -2816764 -6078671
12368f078671K025389O367608N149357p66824n559916m783476l14805J902768
$$ -6078671 -4053282 2314326 7463683 6696859 1136943 -3646533 -3961338 -2058570
12360b058570p60829l863580j580679M594773O838202J909371l662391k799342
$$ -2058570 -2819399 -6682979 -8263658 -3668885 3169317 5078688 1416297 -1383045
12352a383045K101165L761502J261668k47641O89945J26441l022748m541445k415712
$$ -1383045 718120 4479622 5741290 5493649 6183594 6310035 3287287 -1254158 -3669870
12343c669870J6726O70882J907098M219772L329753k256109o682861m850629j92076
$$ -3669870 -3653144 -2982262 -1075164 3144608 6474361 4218252 -2464609 -7315238 -7507314
12334g507314J161562k37892K18445K479284K628320O74757O21160K849257K813917
$$ -7507314 -6345752 -6583644 -6365199 -3885915 -1257595 -582838 38322 2887579 5701496
12325E701496j353045n266107m578579q39155J578823J495989R81504J135163
$$ 5701496 4348451 -917656 -5496235 -6335390 -4756567 -3260578 -2279074 -1143911
12317a143911Q27846n94107j744971j244089J2291N5644j089151j328286l3162
$$ -1143911 -316065 -910172 -2655143 -3899232 -3886941 -3831297 -4920448 -6248734 -6281896
12308f281896L70924j856467m113333k460213K403511N527659M348733J597452
$$ -6281896 -5910972 -7767439 -11880772 -14340985 -11937474 -6409815 -2061082 -463630
12300d63630N62000O45871m81473k717633l696763j899433J702817M208273K916135
$$ -463630 98370 744241 262768 -2454865 -6151628 -8051061 -6348244 -2139971 776164
12291G76164j413331l903219r26279M327327N438287J755682j159557p40344q76475
$$ 776164 -637167 -4540386 -5466665 -1139338 4298949 6054631 4895074 4154730 3278255
12282C278255l781039n013608j193457L154054K557438k75291O07706L869475
$$ 3278255 -502784 -5516392 -6709849 -3555795 -998357 -1273648 -665942 3203533
12274C203533L362788p68255k052504J192080K974492l40278m384796m112103
$$ 3203533 6566321 5798066 3745562 4937642 7912134 7571856 3187060 -925043
12266i25043p85056J706242K559766K651072J573402n41209j720902j520478k156015
$$ -925043 -1710099 -3857 2555909 5206981 6780383 6239174 4518272 2997794 841779
12257H41779l740513k696963J759907M238401R56398l293690j913470L009339
$$ 841779 -2898734 -5595697 -3835790 402611 1359009 -1934681 -3848151 -838812
12249h38812M000556J58204k007223K47366J889518n17677k841206r37606J891721
$$ -838812 3161744 3319948 1312725 1560091 3449609 2931932 90726 -846880 1044841
12240A044841N77268k975716l152987R4633J914317J221608J716840L804824K604232
$$ 1044841 1622109 -1353607 -4506594 -4411961 -2497644 -1276036 440804 4245628 6849860
12231F849860l322083p482693m302078K067588L485856l39763k168432J275109
$$ 6849860 3527777 -3954916 -8256994 -6189406 -2703550 -3043313 -5211745 -3936636
12223c936636M723084L114306p04658r46573K082404K885184o08380m255630m254223
$$ -3936636 786448 3900754 3196096 2249523 4331927 7217111 6608731 2353101 -1901122
12214a901122k322642k018929k819724j378485K489186M927618L684399J193165
$$ -1901122 -4223764 -6242693 -9062417 -10440902 -7951716 -3024098 660301 1853466
12206A853466L27873J45520j290808k406541o59380J788866J91374m702331o311819
$$ 1853466 2181339 2326859 1036051 -1370490 -2029870 -241004 -49630 -4751961 -11063780
12197a1063780j976537K497938J713817j027561K32791L877588L640412n02694
$$ -11063780 -13040317 -10542379 -8828562 -9856123 -9623332 -5745744 -2105332 -2608026
12189b608026k352806r4181J322502j80226j38608L061600L271697l046361q361119
$$ -2608026 -4960832 -5055013 -3732511 -3912737 -4051345 -989745 2281952 -764409 -9125528
12180i125528m063290N513256Q211889J400935n024192l582467J557638L124765
$$ -9125528 -13188818 -7675562 536327 1937262 -3086930 -6669397 -5111759 -1986994
12172a986994J073054k45657K86711J085447K284281M315236M633593J080022
$$ -1986994 -913940 -1159597 -872886 212561 2496842 6812078 11445671 12525693
12164A2525693l207122l458002p86657n70814l600759m827465k056787K15582
$$ 12525693 9318571 5860569 5073912 4503098 902339 -3925126 -5981913 -5766331
12156e766331j488422l569097j383367K950303M147796K141413R14520Q72453
$$ -5766331 -7254753 -10823850 -12207217 -9256914 -5109118 -2967705 -2053185 -1180732
12148a180732j003732l864792k891709K156907M910957J762698k447124j902227
$$ -1180732 -2184464 -6049256 -8940965 -6784058 -1873101 -110403 -2557527 -4459754
12140d459754J876950L597827K063787k57487k159651l215243j354088L605276
$$ -4459754 -2582804 1015023 3078810 2821323 661672 -2553571 -3907659 -302383
12132c02383O418852K390774m690836o736946k566478J399395J349061K00275
$$ -302383 6116469 8507243 3816407 -2920539 -5487017 -4087622 -2738561 -2538286
12124b538286O39701Q48963m75953p63563J543639L423727J950556j106640k315358
$$ -2538286 -1898585 -1049622 -1525575 -2289138 -745499 2678228 4628784 3522144 1206786
12115A206786j169742P22256K147426K144563M04420q36656J067660L991208K616064
$$ 1206786 37044 759300 2906726 5051289 5455709 4619053 5686713 9677921 12293985
12106A2293985l052602o125632k731838J934937J634103j772118k416910J84151
$$ 12293985 9241383 3115751 383913 2318850 3952953 2180835 -236075 -51924
12098e1924J671465L73910j213394j295117o42316l15960o92351j602324j374114
$$ -51924 1619541 1993451 780057 -515060 -1157376 -1473336 -2165687 -3768011 -5142125
12089e142125J702445M985173K793609m703823q992311m422577L085398M704703
$$ -5142125 -3439680 1545493 4339102 -364721 -9357032 -13779609 -10694211 -5989508
12081e989508J294371l15136N16442p72967l197039r82766M890790O242799Q25339
$$ -5989508 -4695137 -5010273 -4493831 -5266798 -8463837 -9446603 -4555813 1686986 2512325
12072B512325l542932j396711K351637J426673k144770l027364j463229j064065
$$ 2512325 -1030607 -2427318 -75681 1350992 -793778 -3821142 -5284371 -6348436
12064f348436j705823m54877K756195N108705N028520K929912m78978l808679
$$ -6348436 -8054259 -8509136 -5752941 -644236 4384284 7314196 6835218 3026539
12056C026539m715112k527556M79772K155545K658479K295107K94583k427686
$$ 3026539 -1688573 -4216129 -3736357 -1580812 1077667 3372774 3667357 1239671
12048A239671k704700K45978K839539K368448R27452J172960J620097p4947k137107
$$ 1239671 -1465029 -1219051 1620488 3988936 4916388 6089348 7709445 7634498 5497391
12039E497391j416910R27794J073466j235547k492508j276803l08697j849822
$$ 5497391 4080481 5008275 6081741 4846194 2353686 1076883 768186 -1081636
12031a081636m061488l493816J98755L402064K567606j237402k949798K21978
$$ -1081636 -5143124 -8636940 -8438185 -5036121 -2468515 -3705917 -6655715 -6433737
12023f433737M625578M884993J586200J25882K092625K964258k18963m092405
$$ -6433737 -1808159 3076834 4663034 4788916 6881541 9845799 9626836 5534431
12015E534431m531035k355069l12952J319641K580064J469688k152457m219498
$$ 5534431 1003396 -1351673 -1664625 -344984 2235080 3704768 1552311 -2667187
12007b667187k316745M756n59881q42927K902935O855245M721486j592421m306789
$$ -2667187 -4983932 -4979176 -5539057 -6381984 -3479049 3376196 8097682 6505261 2198472
11998B198472j569136R27737k5081j318185p12353m52093j666378j734802K37108
$$ 2198472 629336 1557073 1531992 213807 -498546 -950639 -2617017 -4351819 -4114711
11989d114711J121595m72196j568244n75340k82746k095028k545820P57221M427843
$$ -4114711 -2993116 -3465312 -5033556 -5608896 -5891642 -7986670 -10532490 -9775269 -5347426
11980e347426M570821K590584J570352P73124j548871l198750j156140K521888
$$ -5347426 -776605 1813979 3384331 4157455 2608584 -590166 -1746306 775582
11972G75582L044694o5261k812942k838377j500613k92331Q51208J534020O67945
$$ 775582 3820276 3755015 942073 -1896304 -3396917 -3689248 -2838040 -1304020 -636075
11963f36075j166470j792607l94742J604998K735203K707679J640855p130q15570
$$ -636075 -1802545 -3595152 -3989894 -2384896 350307 3057986 4698841 4691711 3876141
11954C876141L84986K465944K653148m18316n022703p648871n870858q67221K871567
$$ 3876141 4261127 6727071 9380219 8961903 3939200 -3709671 -9580529 -10447750 -7576183
11945g576183K121140o11918N6218M371537O171232J820984l777678m054144q5354
$$ -7576183 -5455043 -6066961 -6010743 -1639206 4532026 6353010 2575332 -1478812 -1564166
11936a564166K132423J072171J45860K67473j040486k970744j161823L970974
$$ -1564166 568257 1640428 1786288 2053761 1013275 -1957469 -3119292 851682
11928H51682N592292P08207m085677k124188L069658L336232j639202m510473
$$ 851682 6443974 7152181 3066504 942316 4011974 7348206 5709004 1198531
11920A198531j772726J960054K094358K78624q5773K84210j107872l342427l165778
$$ 1198531 -574195 1385859 3480217 3758841 3673068 3957278 2849406 -493021 -3658799
11911c658799N9032L733781N740777N980586M487606R05119l528184n873480m683456
$$ -3658799 -3599767 134014 5874791 11855377 16342983 17248102 13719918 7846438 3162982
11902C162982j814936M9862L65832Q4464m65973j293324j382235K02012K235177
$$ 3162982 1348046 1397908 1763740 1848204 1382231 88907 -1293328 -1091316 1143861
11893A143861K497463R83384j53884N3999M69426N54132J090803J314543j209561
$$ 1143861 3641324 4624708 4470824 4524823 4994249 5548381 6639184 7953727 6744166
11884F744166n776855p163574k565944L022831L070005r09040j837089J607440
$$ 6744166 967311 -6196263 -8762207 -5739376 -2669371 -3578411 -5415500 -3808060
11876c808060L111366l32164k805859Q94202N952465M448533k058287m636154
$$ -3808060 -696694 -1028858 -3834717 -2940515 3011950 7460483 5402196 766042
11868G66042p10006K312239j024340n783857m479795J739186N474397L868627
$$ 766042 56036 2368275 1343935 -4439922 -8919717 -7180531 -1706134 2162493
11860B162493R08990k52531j117858k731147k395140J193531L753612J007784
$$ 2162493 3071483 2818952 1701094 -1030053 -3425193 -2231662 1521950 2529734
11852B529734m017428m488989L70651M399264L952200K469846L289977L524067
$$ 2529734 -1487694 -5976683 -5606032 -1206768 2745432 5215278 8505255 12029322
11844A2029322l08243m799135m074849M39098J546239k509772n211580k018652
$$ 12029322 11721079 6921944 2847095 3286193 4832432 2322660 -2888920 -4907572
11836d907572K796362L211839L78799m04911J655088K633774Q54462r99906p64632
$$ -4907572 -2111210 1100629 1479428 1074517 2729605 5363379 6217841 5217935 4453303
11827D453303K87469J73998j068879k209918k408457j612137p64267j150039k104477
$$ 4453303 4740772 4914770 3845891 1635973 -772484 -2384621 -3148888 -4298927 -6403404
11818f403404p51333L686386P007509M882595o85142l940705l621837l499059
$$ -6403404 -7154737 -3468351 3539158 8421753 7736611 3795906 174069 -3324990
11810c324990m593712l066865K077003N420327L356927N57274K560452O015150
$$ -3324990 -7918702 -10985567 -8908564 -3488237 -131310 425964 2986416 9001566
11802I001566L476509m136376p823397l672890J785705J889953j127295j679343
$$ 9001566 12478075 8341699 518302 -3154588 -1368883 521070 -606225 -2285568
11794b285568r2294m77862k482682j673795K512057N124589L131654k51932q07492
$$ -2285568 -2377862 -2855724 -5338406 -7012201 -4500144 624445 3756099 3504167 2696675
11785B696675P19223O94443j691412l761800l338412r09598J790118L421998L339324
$$ 2696675 3415898 4110341 2418929 -1342871 -4681283 -5590881 -3800763 -378765 2960559
11776B960559J792825N9074o08381l07006k27346j185430k753971l536761k224102
$$ 2960559 4753384 4812458 4204077 3897071 3669725 2484295 -269676 -3806437 -6030539
11767f030539Q73261L308011K761084M6175j743199j407748p94817j140162j163332
$$ -6030539 -5157278 -1849267 911817 957992 -785207 -2192955 -2987772 -4127934 -5291266
11758e291266k80755l57562j743181j134868K853185N470533K333584k742212
$$ -5291266 -5572021 -5929583 -7672764 -8807632 -5954447 -483914 1849670 -892542
11750h92542k824364J239746K562488q2854j052652J019784O13830l302090l444216
$$ -892542 -3716906 -2477160 85328 2474 -1050178 -30394 583436 -2718654 -6162870
11741f162870K806463O280480j25417q684034p797874O17368N656186M564647
$$ -6162870 -3356407 2924073 2798656 -5885378 -13683252 -13065884 -7409698 -2845051
11733b845051L349121L299209M5535m509086k764605M168743N582948j468329
$$ -2845051 504070 3803279 3848814 -660272 -3424877 743866 6326814 4858485
11725D858485o358808k169274L104887O35164m557982l222249K255421L268429
$$ 4858485 -1500323 -3669597 -564710 70454 -4487528 -7709777 -5454356 -2185927
11717b185927L74600Q60770M255698K879900l658453o388045j355585M173543
$$ -2185927 -1811327 -950557 3305141 6185041 2526588 -3861457 -5217042 -1043499
11709a043499L450122l73810j201374N41058Q07772n73412q61527M9536o1705
$$ -1043499 2406623 2032813 831439 1372497 2180269 1606857 745330 794866 733161
11700G33161j397419k034565j415049p97405m97243O72332K806852L750613J701587
$$ 733161 -664258 -2698823 -4113872 -4911277 -5408520 -4736188 -1929336 1821277 3522864
11691C522864j840862l213866j165415J042383j49818l087266k600908K387054
$$ 3522864 1682002 -1531864 -2697279 -1654896 -1804714 -4891980 -7492888 -5105834
11683e105834O615567N724522K170394P71630J446262O43390k059730l576689
$$ -5105834 1509733 7234255 9404649 10176279 11622541 12265931 10206201 6629512
11675F629512k686076j311176n61643M91111J846166J911152K73503j589120k359904
$$ 6629512 3943436 2632260 2070617 2561728 4407894 6319046 6592549 5003429 2643525
11666B643525j456535J321749M142288L191768j974911n518034k570809K884876
$$ 2643525 1186990 2508739 6651027 9842795 7867884 2349850 -220959 2663917
11658B663917L428984m81668k093456k36160o57235m509683n073714N97411N568715
$$ 2663917 6092901 5611233 3517777 3281617 2624382 -1885301 -6959015 -6361604 -792889
11649g92889L721681r36992j686463N84079J073340k31063m72407k72997j365481
$$ -792889 2928792 1991800 305337 889416 1962756 1731693 1259286 986289 -379192
11640c79192j559103J235457L414000J059888k293629p82755L533791L610446
$$ -379192 -1938295 -702838 2711162 3771050 1477421 694666 4228457 7838903
11632G838903j026953l884427k068314O77836J550305J660048J010854j928152
$$ 7838903 6811950 2927523 859209 1537045 3087350 4747398 5758252 3830100
11624C830100m783431k912890K292907M170533J204926j072258k43898m87552
$$ 3830100 -953331 -3866221 -1573314 2597219 3802145 2729887 2485989 1998437
11616A998437l194048l214005J216329L668824K86180l042223r86987J851306
$$ 1998437 -1195611 -4409616 -3193287 475537 761717 -2280506 -3267493 -1416187
11608a416187p525k165474J387017N680654K214610n327300n658843J655772N443089
$$ -1416187 -1423712 -3589186 -2202169 3478485 5693095 365795 -5293048 -3637276 1805813
11599A805813J116403l258726j821237M53149j092148k114165J392972M404537
$$ 1805813 2922216 -336510 -2157747 -1704598 -2796746 -4910911 -3517939 886598
11591H86598J582620k752157k008496J199104R9488l977155l861152J264142M924151
$$ 886598 2469218 -282939 -2291435 -1092331 -992843 -4969998 -8831150 -7567008 -2642857
11582b642857L766181Q45263j278152l104252l572068m02217L849053L352275
$$ -2642857 1123324 1968587 690435 -2413817 -5985885 -6388102 -2539049 813226
11574H13226j570364l667519N5044L518924J743821j102479N96952M002311K840114
$$ 813226 -757138 -4424657 -4369613 -850689 893132 -209347 387605 4389916 7230030
11565G230030j552120k394547Q51910J407661l179303o189395k224032L683026
$$ 7230030 5677910 3283363 4135273 5542934 2363631 -3825764 -6049796 -2366770
11557b366770L270673k304030m064576J110224N527607K159081m625690n304116
$$ -2366770 903903 -1400127 -5464703 -4354479 1173128 3332209 -1293481 -6597597
11549f597597Q69817N120848K364105j939474j176584K254923J788215k206428
$$ -6597597 -5727780 -606932 1757173 -182301 -1358885 896038 2684253 477825
11541D77825l181476R14703M636981L653609M03334j019389p12543p93656j186685
$$ 477825 -2703651 -1788948 2848033 6501642 6904976 5885587 5173044 4379388 3192703
11532C192703p46794N7135K52176M1812m85033j854484k860485r37282L112454
$$ 3192703 2445909 2503044 2755220 2797032 2311999 457515 -2402970 -3340252 -227798
11523b27798M447853J059226k462129j696210P25073k15491l393673l498163J79530
$$ -227798 4220055 5279281 2817152 1120942 1846015 1630524 -1763149 -5261312 -5081782
11514e081782L030196K825452K208178K790372K286276p34999l859411m705020
$$ -5081782 -2051586 773866 2982044 5772416 8058692 7323693 3464282 -1240738
11506a240738l961353k604773O9573L234365L194975j222593m843231j934123
$$ -1240738 -5202091 -7806864 -7737291 -4502926 -1307951 -2530544 -7373775 -9307898
11498i307898N578475R792397O558917p6943l856402l493067k021266j308723
$$ -9307898 -3729423 6062974 12621891 12544948 8688546 5195479 3174213 1865490
11490A865490l20721J474493K062066r1307k779538k375826J035681L447633K291425
$$ 1865490 1544769 3019262 5081328 4990021 2210483 -165343 870338 4317971 6609396
11481F609396n11187j980921k099776k462653k957963k380676j097676m15398
$$ 6609396 6098209 4117288 2017512 -445141 -3403104 -5783780 -6881456 -7296854
11473g296854M2460J715248M050463M504903J969715j607794l458695k651103
$$ -7296854 -7254394 -5539146 -1488683 3016220 4985935 3378141 -80554 -2731657
11465b731657m18787J202373J154963L51531L59178R48900N48952l84484R34353
$$ -2731657 -3150444 -1948071 -793108 -441577 -82399 866501 1415453 1030969 1965322
11456A965322M895665P165419L851256k934938p572221p432681m184970m08857
$$ 1965322 6860987 14026406 17877662 14942724 7370503 -62178 -4247148 -4656005
11448d656005K000612J733233l32435r14838J249196K852890J230034q06397J01689
$$ -4656005 -2655393 -922160 -1254595 -2169433 -920237 1932653 3162687 2356290 2457979
11439B457979J279517j355940m661605k199131M155325N414182n62229n135849
$$ 2457979 3737496 2381556 -2280049 -4479180 -323855 5090327 4528098 -607751
11431f07751k005211L802822M671490J311119p33273k67465m0926o18308l39690
$$ -607751 -2612962 1189860 5861350 7172469 6439196 6171731 6130805 5512497 5172807
11422E172807O09944O20355k72403j014002j631481k226982j855506l47986J106036
$$ 5172807 5782751 6403106 6130703 5116701 3485220 1258238 -597268 -945254 160782
11413A60782K415504M291819M678053M17435o002235p548053l208685n08539l348214
$$ 160782 2576286 6868105 11546158 11963593 5961358 -1586695 -4795380 -5303919 -8652133
11404h652133n036529K03418O337529M996518l12766k93139L917545K803318m529375
$$ -8652133 -13688662 -13485244 -7147715 -2151197 -2463963 -2757102 1160443 3963761 -565614
11395e65614p887337k217045N043971O446982M320362L174841J399725k851853
$$ -565614 -8452951 -10669996 -5626025 820957 5141319 8316160 9715885 6864032
11387F864032m837414k40533N809278M812568k539486p266836m606243J019168
$$ 6864032 2026618 1786085 7595363 12407931 9868445 2601609 -2004634 -985466
11379i85466L879992L847546L488296K769267p3868m405207o888625n320710j294103
$$ -985466 2894526 6742072 10230368 12999635 12925767 8520560 1631935 -3688775 -4982878
11370d982878J485841J139417o08171p55805J276399L004640K028508r09094k620672
$$ -4982878 -3497037 -2357620 -2965791 -3721596 -2445197 559443 2587951 1678857 -941815
11361i41815j160045J710258K423215J74357j570600M51786M234548M538009J05603
$$ -941815 -2101860 -391602 2031613 2205970 635370 1087156 5321704 9859713 9965316
11352I965316m350383m624406k223479q41951p24411P8413J127091L26045j835208
$$ 9965316 5614933 990527 -1232952 -2074903 -2799314 -2720901 -1593810 -1267765 -3102973
11343c102973k557435r49278J051858J645897N72965j613565l254123j996561
$$ -3102973 -5660408 -6609686 -5557828 -3911931 -3338966 -4952531 -8206654 -10203215
11335a0203215J737018L661874J418199j005953P76343L717986J734371l646866
$$ -10203215 -8466197 -4804323 -3386124 -4392077 -3615734 102252 1836623 -1810243
11327a810243m711292J15308L495433R14145k642881j642274J362777J402446
$$ -1810243 -6521535 -6406227 -2910794 -1996649 -4639530 -6281804 -4919027 -3516581
11319c516581k23311Q25081L895661M780577K716373L65103j329695l098224l715138
$$ -3516581 -3739892 -2914811 980850 5761427 8477800 8842903 7513208 4414984 699846
11310F99846j477543J719534K419122Q08478l87083r06137k123600k578498Q5013
$$ 699846 -777697 941837 3360959 4169437 3782354 2876217 752617 -1825881 -1740868
11301a740868L396473K452653j749285k933217K72606J800637j418014l634803
$$ -1740868 1655605 4108258 2358973 -574244 -301638 1498999 80985 -3553818
11293c553818R0476M626790K249877m654733o585595j110960M177733L597340
$$ -3553818 -3463342 1163448 3413325 -1241408 -7827003 -8937963 -4760230 -1162890
11285a162890N52037J24544J196010L58544j313470o80999J483422K156391J568048
$$ -1162890 -610853 -486309 709701 1068245 -245225 -926224 557198 2713589 4281637
11276D281637J921320K132838o29194m700114n015679j181853J188857r08684
$$ 4281637 6202957 8335795 7706601 3006487 -2009192 -3191045 -2002188 -2910872
11268b910872l219253j259504K609696L340908J028606k36932O59146R39751n90788
$$ -2910872 -6130125 -7389629 -4779933 -1439025 -410419 -647351 11795 951546 360758
11259C60758j564283j88579J846984J778025o31818k608047j046496L568291N766175
$$ 360758 -1203525 -1392104 454880 2232905 1601087 -1006960 -2053456 1514835 7281010
11250G281010L43538r450161j2791045m215379P581235R633143J550233m639291
$$ 7281010 7624548 -1825613 -14616658 -18832037 -11250802 -1617659 -67426 -4706717
11242d706717j732489L471486J639997n215078p493570j940429M928496O562771
$$ -4706717 -6439206 -2967720 -1327723 -6542801 -14036371 -15976800 -11048304 -4485533
11234d485533L751798J126944O40504R08127O37647K09085M87536J538188K410155
$$ -4485533 -733735 393209 1033713 1941840 2579487 2788572 3276108 4814296 7224451
11225G224451J687313j167712m467111n128829j945355K474498M387727L305246
$$ 7224451 8911764 7744052 3276941 -1851888 -3797243 -1322745 3064982 6370228
11217F370228J922733J555787L00812k822118m816442k979687m9660o00549l391617
$$ 6370228 8292961 9848748 10149560 7327442 2511000 -468687 -518347 -1118896 -4510513
11208d510513k862711J389482L047422n73120l065294J307068P633260O874520
$$ -4510513 -7373224 -5983742 -2936320 -3509440 -6574734 -5267666 2365594 9240114
11200I240114o93156n889492l641533J304049K542844K0920k185944j835909N5170
$$ 9240114 8546958 2657466 -984067 319982 2862826 2883746 697802 -1138107 -1082937
11191a082937J168264j06906k776841l362728k09492L097622J946673k274814
$$ -1082937 85327 -21579 -2798420 -6161148 -6370640 -3273018 -1326345 -3601159
11183c601159l470058O58427N527899N976967K006144k747442m952721l129151
$$ -3601159 -7071217 -6412790 -884891 5092076 7098220 4350778 -601943 -3731094
11175c731094J544933N075297M181100N12272j436254m90340N05438j17151j001924
$$ -3731094 -2186161 2889136 7070236 7582508 6146254 5655914 6161352 6044201 5042277
11166E042277j188057j157408l31149K006389L289238L85956l990341l618873
$$ 5042277 3854220 2696812 2365663 4372052 7661290 8047246 4056905 438032
11158D38032J416510L822659J73229l793640k373001J789005K976948Q33303j204143
$$ 438032 1854542 5677201 5850430 2056790 -316211 1472794 4449742 5283045 4078902
11149D078902j720854j238411L8906P67626j318257m587504l762384J567667M508645
$$ 4078902 2358048 1119637 1158543 1926169 607912 -3979592 -7741976 -6174309 -1665664
11140a665664J371552j912180R4953K550104j098064o496316m610058K972823
$$ -1665664 -294112 -2206292 -2111339 438765 -659299 -7155615 -11765673 -8792850
11132h792850O033277J808460j852896j59869K203266Q45729j452396j412231
$$ -8792850 -2759573 -951113 -2804009 -2963878 -760612 85117 -1367279 -2779510
11124b779510r10045j684290j202435J696740L100497O27951j830050q76565L05434
$$ -2779510 -3689555 -5373845 -6576280 -4879540 -1779043 -1151092 -2981142 -3857707 -3552273
11115c552273j671326l028584J041732O637993N820629o69505l983524q97124
$$ -3552273 -5223599 -8252183 -7210451 -572458 5248171 4578666 595142 -301982
11107c01982J586779j748002n501941k435011M551508O616273K413403p02411
$$ -301982 1284797 -463205 -5965146 -8400157 -3848649 2767624 5181027 4478616
11099D478616J069639K545773o61133m034547j655002L089747K034558m504766
$$ 4478616 5548255 8094028 7432895 3398348 1743346 4833093 6867651 2362885
11091B362885p369430k354768L601559L435214K37725Q62102M270666L630984
$$ 2362885 -5006545 -7361313 -3759754 -324540 -86815 775287 5045953 8676937
11083H676937k033076n732242k785697K771536M346804J196084k133830k205603
$$ 8676937 6643861 911619 -1874078 897458 5244262 6440346 4306516 2100913
11075B100913J97189K169439J809515m13471k234817j724924N65377J937539N12961
$$ 2100913 2298102 4467541 6277056 5863585 3628768 1903844 2469221 4406760 4919721
11066D919721k453051l837793k300205k1201O284j841748k043037Q18989L117805
$$ 4919721 2466670 -1371123 -3671328 -3692529 -3686245 -5527993 -7571030 -6752041 -3634236
11057c634236R62139l513279m287076J82338M616495M105094J32158k554806k205387
$$ -3634236 -2672097 -6185376 -10472452 -10290114 -5673619 -1568525 -1436367 -3991173 -6196560
11048f196560o57438M27393J364785L086355N300732N836423K377504l752545
$$ -6196560 -6853998 -6426605 -5061820 -1975465 3325267 9161690 11539194 7786649
11040G786649p034865m103176P71491J064025k323620k937293P4256P04809k510348
$$ 7786649 751784 -3351392 -2579901 -1515876 -3839496 -6776789 -6702533 -5997724 -8508072
11031h508072l000042J933422M964766R56237l280260q3383N586604M395505j229645
$$ -8508072 -11508114 -9574692 -4609926 -3653689 -6933949 -7017332 -1430728 2964777 1735132
11022A735132j387203M034003N333184j38536l788553o73313K908100Q92967l146389
$$ 1735132 347929 4381932 9715116 9576580 5788027 5114714 8022814 8915781 5769392
11013E769392l388174r13701K8332q76433j521307j449886o72889J363280K939157
$$ 5769392 2381218 1467517 1495849 619416 -901891 -2351777 -3024666 -1661386 1277771
11004A277771R12150l330735m198113n29570K233290J328331J169899M512611
$$ 1277771 2189921 -1140814 -5338927 -5868497 -3635207 -2306876 -1136977 3375634
10996C375634O332021K289888l083523l533158j063323j234325k878912r17669
$$ 3375634 9707655 11997543 8914020 5380862 4317539 3083214 204302 -713367
10988g13367L422582L929044j44814l070812k091853l51492K92804J984927M602265
$$ -713367 2709215 6638259 6493445 3422633 1330780 979288 1272092 3257019 7859284
10979G859284L817728j282616m558048j244512M239888L977836k328908o954798
$$ 7859284 11677012 10394396 5836348 4591836 8831724 12809560 10480652 3525854
10971C525854m513127J407424L294843r88598o015254n503661M44116N914466
$$ 3525854 -987273 420151 3714994 2726396 -3288858 -8792519 -8348403 -2433937
10963b433937O320967L030021K87222k80801j39503l94809o78861r97154j906153
$$ -2433937 3887030 6917051 7204273 6923472 6783969 6389160 5710299 4713145 2806992
10954B806992k699406k030013p83588j578832m396051n490278k495043J764409
$$ 2806992 107586 -1922427 -2706015 -4284847 -8680898 -14171176 -16666219 -14901810
10946a4901810L010709J271462J8637P69729J867075K204051K548399K647027
$$ -14901810 -11891101 -10619639 -10601002 -9831273 -7964198 -5760147 -3211748 -564721
10938e64721O84063k831254l974331o09980L985399N417943L698138J463577p48272
$$ -564721 119342 -2711912 -6686243 -7296223 -3310824 2107119 5805257 7268834 6520562
10929F520562l397994m289567j241786K616640J952334k343299l794726l23978
$$ 6520562 3122568 -1166999 -2408785 207855 2160189 -183110 -3977836 -4301814
10921d301814K703572J435661q97112o67650Q9186j172588j929282L21254K272906
$$ -4301814 -1598242 -162581 -1059693 -1727343 -1638157 -2810745 -4740027 -4418773 -2145867
10912b145867L66209k062640j49001L398399K300646k385978l491615Q63285M837415
$$ -2145867 -1779658 -3842298 -3991299 -592900 1707746 -678232 -4169847 -3306562 1530853
10903A530853M198041J106125j203012k177276j542890R33116K606208O08124
$$ 1530853 5728894 6835019 5632007 3454731 1911841 2844957 5451165 6059289
10895F059289k496147j870957J011899L30270l367667l109641K233613N025430
$$ 6059289 3563142 1692185 2704084 3034354 -333313 -3442954 -1209341 3816089
10887C816089J620172j323317J476486M698232J897246l231588l385736K05465
$$ 3816089 5436261 4112944 5589430 10287662 12184908 8953320 5567584 5773049
10879E773049J020258j339262j936882l56598r85725m123547m802303j173450
$$ 5773049 6793307 5454045 3517163 3160565 2174840 -1948707 -6751010 -7924460
10871g924460K614016L179254K009253J323569N21586j443389l574403m237805
$$ -7924460 -5310444 -2131190 -121937 1201632 1723218 279829 -3294574 -7532379
10863g532379k819605M34138M161462N875010M533456K323061J413433L96681
$$ -7532379 -10351984 -9917846 -5756384 118626 4652082 6975143 8388576 8785257
10855H785257k739516n645190m120747Q61865L410878P59606l086290l149145
$$ 8785257 6045741 400551 -3720196 -2858331 552547 1312153 -1774137 -4923282
10847d923282M50369L794079L796538Q0822n314168q563170o504950j72312N517057
$$ -4923282 -4472913 -678834 3117704 3198526 -2115642 -10678812 -17183762 -17356074 -11839017
10838a1839017O831779M749029K570384J678161J090847J9416r50250j034090
$$ -11839017 -5007238 -258209 2312175 3990336 5081183 5100599 4150349 3116259
10830C116259l69402K44278R3425j071972k852751m030173l024369N06246M214364
$$ 3116259 2746857 2991135 3084560 2012588 -840163 -4870336 -7894705 -7388459 -3174095
10821c174095M359014j33294n426848o276302j881084L334817N104406L702098
$$ -3174095 1184919 1051625 -4375223 -10651525 -12532609 -9197792 -4093386 -391288
10813c91288K110327J584819Q73537q00658j929431p17560J860918K445961m18612
$$ -391288 1719039 3303858 4177395 3376737 1447306 729746 2590664 5036625 4618013
10804D618013l503963k677592P57784J008057l536017o663808k890559L951699
$$ 4618013 1114050 -1563542 -805758 202299 -3333718 -9997526 -12888085 -8936386
10796h936386N940185K448397k10399M70272K99216k718787m218225j393112J596230
$$ -8936386 -2996201 -547804 -758203 -287931 11285 -2707502 -6925727 -8318839 -6722609
10787f722609P47198p85924J510654M904051L168495l254172p305974n159066
$$ -6722609 -5975411 -6761335 -5250681 -346630 2821865 -432307 -7738281 -12897347
10779a2897347m61121K007783K188954K345746K309840J92682l322940m300251
$$ -12897347 -13358468 -11350685 -9161731 -6815985 -4506145 -4313463 -7636403 -11936654
10771a1936654l06805N479373P177604L505903m85509n82528Q21011m46026k688063
$$ -11936654 -12243459 -6764086 413518 3919421 3433912 2851384 3672395 3226369 538306
10762E38306j112672L240162M154594K42485k707486j286464N13065r52144k769699
$$ 538306 -574366 2665796 6820390 7062875 4355389 3068925 3581990 2629846 -139853
10753a39853j554247N9999j403294l288991j230642K902407L819887J229477o72827
$$ -139853 -1694100 -1634101 -3037395 -6326386 -7557028 -4654621 -834734 394743 -278084
10744b78084n18919n82124j164820j09080J985896J627282j352844k284982J473780
$$ -278084 -797003 -1379127 -2543947 -2653027 -667131 960151 -392693 -2677675 -1203895
10735a203895N766285M635053j638926o252918l768586L380811P554838M738447
$$ -1203895 4562390 9197443 7558517 1305599 -2462987 917824 8472662 13211109
10727A3211109j203972m099516l017312j638092j919675k294067j472787l677
$$ 13211109 12007137 7907621 4890309 3252217 1332542 -961525 -2434312 -2437989
10719b437989J760657L355037K422035k260343o638087n615799r71328J049933
$$ -2437989 -677332 2677705 5099740 2839397 -3798690 -9414489 -10385817 -9335884
10711i335884l36214k34250K028180J471199k340995k910471K039617N947267
$$ -9335884 -9672098 -9906348 -7878168 -6406969 -8747964 -11658435 -9618818 -3671551
10703c671551M174473O75329p02743k324658m642408j977380O130000R227043
$$ -3671551 502922 1178251 475508 -1849150 -6491558 -8468938 -2338938 6888105
10695F888105J075710q353808o883052J591822M893950K055784J344633L290534
$$ 6888105 7963815 -389993 -7273045 -5681223 -787273 1268511 2613144 5903678
10687E903678N47438o480609q138562j448725M551962K747276k529300l811321
$$ 5903678 6451116 -29493 -8168055 -9616780 -5064818 -2317542 -4846842 -8658163
10679h658163p52583K004346K041651Q64783J007683K731822K755523j700631
$$ -8658163 -9410746 -7406400 -5364749 -4499966 -3492283 -760461 1995062 294431
10671B94431o680186m635133L439737O511679m81588p534006m507079L267874
$$ 294431 -6385755 -11020888 -7581151 -1069472 -1551060 -9085066 -13592145 -10324271
10663a0324271M858617J420598J131542K839152l78757n557075l576585L497158
$$ -10324271 -5465654 -4045056 -2913514 -74362 -453119 -6010194 -9586779 -6089621
10655f089621M738266m56256j611955L329519M164563k637436o913268k122402
$$ -6089621 -1351355 -1807611 -3419566 -90047 4074516 1437080 -5476188 -7598590
10647g598590M351182M572338J368457k23458j538481l694200k703837K228982
$$ -7598590 -3247408 1324930 2693387 2469929 931448 -2762752 -5466589 -3237607
10639c237607M742804J607690j767779j310429o45896k353079k350061J330825
$$ -3237607 1505197 3112887 1345108 34679 -611217 -2964296 -5314357 -3983532
10631c983532L458070J177732m32901J695109K456183j265201l692525o24452
$$ -3983532 -525462 652270 219369 1914478 4370661 3105460 -587065 -1211517
10623a211517K304536j99471l201376n42400L904086L211859q12017k069018r56081
$$ -1211517 1093019 893548 -2307828 -2850228 1053858 4265717 3453700 1384682 428601
10614D28601j566193k609033k30750L289825K238363k939065n997048l860557
$$ 428601 -1137592 -3746625 -3977375 -687550 1550813 -1388252 -7385300 -11245857
10606a1245857M19140K811738K180764L8546p63904J329329L872371L114790j25058
$$ -11245857 -10826717 -8014979 -5834215 -5795669 -6559573 -5230244 -1357873 1756917 1631859
10597A631859j599494q64376j485921l357350j961638K936833N336767K333894
$$ 1631859 32365 -832011 -2317932 -5675282 -7636920 -4700087 636680 2970574
10589B970574j738181l090664l157135l016813q33232K430180K531676k60188
$$ 2970574 1232393 -1858271 -5015406 -8032219 -8865451 -6435271 -3903595 -4163783
10581d163783r94578L40947j588014n952303m699589L233998P896763L649339
$$ -4163783 -5158361 -4817414 -6405428 -12357731 -17057320 -13823322 -5926559 -2277220
10573b277220k348686k764967m69663P3270J025399L552257K387768l962693p241394
$$ -2277220 -4625906 -7390873 -7860536 -7787266 -6761867 -3209610 -821842 -4784535 -12025929
10564a2025929k037767M461255L621831j879113m336445k365997J192126N029560
$$ -12025929 -14063696 -9602441 -5980610 -7859723 -12196168 -14562165 -13370039 -8340479
10556h340479O694803K422545m590348m949420K241612N766335m89086p819274
$$ -8340479 -1645676 776869 -3813479 -8762899 -6521287 -754952 -1244038 -9063312
10548i063312p142491j861335J178113K346718L323927J747582j211926L48394
$$ -9063312 -16205803 -18067138 -16889025 -14542307 -11218380 -9470798 -10682724 -10334330
10540a0334330M653159K194214o107070o926670K170520O014155k168987q055828
$$ -10334330 -5681171 -3486957 -9594027 -16520697 -14350177 -8336022 -10505009 -18560837
10532a8560837j764346M536777j96114n314272Q94594Q755752N158090k906258
$$ -18560837 -20325183 -15788406 -15984520 -21298792 -20404198 -11648446 -6490356 -9396614
10524i396614k864413J103778L0122j232032L051647M317381k825381n652231
$$ -9396614 -12261027 -11157249 -11127127 -12359159 -9307512 -4990131 -7815512 -13467743
10516a3467743L712144R909207J009686p738101j348897O496221N7453p326284
$$ -13467743 -9755599 153608 1163294 -6574807 -7923704 -1427483 -1370030 -8696314
10508h696314K19348P853433k023922j3277392n614837M775896l780154j3619131
$$ -8696314 -8476966 -623533 -2647455 -15924847 -21539684 -16763788 -20543942 -34163073
10500c4163073j310845J2108610j134952j6828983j151123J8151981j389495k8087909
$$ -34163073 -35473918 -23365308 -24500260 -41329243 -42480366 -24328385 -25717880 -53805789
10492e3805789p040734K4087429j2095596o9607755j2458219J53533364K31693192
$$ -53805789 -60846523 -36759094 -48854690 -118462445 -130920664 22612700 254305892
10485B54305892J01000647r5926917j46818631n2694748J9510047j495089l1915414
$$ 254305892 355306539 259379622 112560991 59866243 79376290 77881201 45965787
10478D5965787j0971277J3588249j256292j9064282n016451J1463336P63537j2598636
$$ 45965787 34994510 48582759 47326467 28262185 23245734 34709070 35472607 22873971
10470B2873971k825429R067713J26515j1242144m047942N864386l48579q584056
$$ 22873971 20048542 29116255 29242770 18000626 13952684 19817070 19468491 10884435
10462A0884435j750319P308326K564082n045409j536480L225672k151441o940552
$$ 10884435 9134116 16442442 19006524 13961115 12424635 15650307 13498866 6558314
10454F558314p30823M880581m63153m768902K244945P521489o57657r146945l887599
$$ 6558314 5827491 10708072 10244919 5476017 7720962 15242451 14584794 5437849 1550250
10445A550250M281098J108736m286455J581404R535478M876052m662002l290428
$$ 1550250 5831348 6940084 2653629 4235033 13770511 18646563 13984561 10694133
10437A0694133M177405K661836n550367p006882j578322J001408P89427L663971
$$ 10694133 14871538 17533374 11983007 4976125 3397803 4399211 5188638 8852609
10429H852609N585338n6101o775300m620344J966503K823023L42280K008334L417015
$$ 8852609 14437947 14381846 7606546 2986202 4952705 7775728 8118008 10126342 13543357
10420A3543357l077147j0670266p726279J609396M628235J555231J612499L760734
$$ 13543357 10466210 -204056 -7930335 -6320939 -1692704 -137473 1475026 5235760
10412E235760L77816m912362k453669M207415L463540l028437l512986J642850
$$ 5235760 5613576 701214 -1752455 2454960 5918500 2890063 -622923 1019927
10404A019927J013572n212039m313437N233530R266201J765470n358944k777346
$$ 1019927 2033499 -3178540 -7491977 -2258447 7007754 8773224 3414280 636934
10396F36934K575572K114551o89603j2614J200674j026974k878058m87606J839837
$$ 636934 3212506 5327057 4637454 4624840 5825514 4798540 1920482 1432876 3272713
10387C272713l81089k714248Q02796O626519O523951J36007m811601l522713O30775
$$ 3272713 2891624 177376 980172 7606691 14130642 14266649 9455048 5932335 6563110
10378F563110J967522n28017l108314k246598J334223L718584K546419o15954
$$ 6563110 8530632 8002615 4894301 2647703 3981926 7700510 10246929 9630975
10370I630975k953403l218343j112435K849594N333072K250385m580614p549796
$$ 9630975 6677572 3459229 2346794 5196388 10529460 12779845 8199231 649435
10362F49435l543557J079106M02036j905108K16305M255352L657964n30458j643532
$$ 649435 -2894122 -1815016 -1412980 -3318088 -3101783 1153569 4811533 4281075 2637543
10353B637543J140014K309718J22607j328211j89605P15707m4374q62639j645874
$$ 2637543 3777557 6087275 6209882 4881671 4692066 5407773 5363399 4500760 2854886
10344B854886l484645m118833o20527L791532L043049j710023l111615P07666
$$ 2854886 -629759 -4748592 -5369119 -1577587 1465462 -244561 -3356176 -2648510
10336b648510L634340K220998N30690J600034J908816j502632m860610l376961
$$ -2648510 985830 3206828 3737518 5337552 7246368 5743736 883126 -2493835
10328b493835J516570M888243M705934K155601j216935l742427l750843j776254
$$ -2493835 -977265 3910978 8616912 10772513 9555578 5813151 2062308 286054
10320B86054k54486K24977J354971K946383K287245q15474k490899o13270J551541
$$ 286054 31568 256545 1611516 4557899 6845144 6029670 3538771 2925501 4477042
10311D477042L54640k585886k934135J08237L110411L101524O25271j757553k527238
$$ 4477042 4831682 2245796 -688339 -580102 2530309 5631833 6257104 4499551 1972313
10302A972313k282974k118723j749344m12417Q12840N9404j542152n12997L090145
$$ 1972313 -310661 -2429384 -4178728 -4591145 -3778305 -3718901 -5261053 -5774050 -2683905
10293b683905M462027J368606j698455o62753J314838k98019k774278o43076L869154
$$ -2683905 1778122 3146728 1448273 785520 2100358 1802339 -971939 -1615015 2254139
10284B254139L386882k317663n209766j427044L141990K495725j050004j893348
$$ 2254139 5641021 3323358 -1886408 -3313452 -171462 2324263 1274259 -619089
10276f19089N50033K677927K402551N50141j223613j579359k53168J169078R40855
$$ -619089 -69056 2608871 5011422 5561563 4337950 2758591 2505423 3674501 4615356
10267D615356l03538q59232j007588j711007j465815J377788M147598K731722
$$ 4615356 4311818 3452586 2444998 733991 -731824 645964 4793562 7525284
10259G525284j472830k934417m22409J642050Q42713k33234J27930k3919j314746
$$ 7525284 6052454 3118037 2695628 4337678 5180391 4947157 5075087 5051168 3736422
10250C736422j141881Q92618J303731q74531j630301R80040K863752P15147k345312
$$ 3736422 2594541 3487159 4790890 3916359 2286058 3266098 6129850 6844997 4499685
10241D499685k250248n34630p34972k119265j888900n61877l86199p84643J22939
$$ 4499685 2249437 1714807 979835 -1139430 -3028330 -3590207 -3976406 -4761049 -4638110
10232d638110J359498O79842j068488r83792J364897L547036L746555K338165
$$ -4638110 -3278612 -2598770 -3667258 -4651050 -3286153 260883 4007438 6345603
10224F345603P29824J47428N49516R9802k484020n016371m229453j008982Q53880
$$ 6345603 7075427 7222855 7772371 7872173 5388153 371782 -3857671 -4866653 -4012773
10215d012773J169342L048955N430043L148631l060679m802491J023307N681125
$$ -4012773 -2843431 205524 5635567 8784198 5723519 921028 1944335 7625460
10207G625460J938673l766464j878024L877324K411203n919131r311837l120936
$$ 7625460 9564133 5797669 3919645 7796969 10208172 4289041 -5022796 -8143732
10199h143732L902895M284544J557523J270149K127831J435991R70488J545902
$$ -8143732 -4240837 43707 1601230 2871379 4999210 6435201 7405689 8951591
10191H951591p68553o607658q499127j594537O796835O850093N56501k829640
$$ 8951591 8183038 1575380 -6923747 -8518284 -1721449 5128644 5685145 2855505
10183B855505j855686k732907n902111m437476K708212O919873L406570j060514
$$ 2855505 999819 -1733088 -7635199 -12072675 -9364463 -2444590 961980 -98534
10175i8534M61208M158017L100188p96518j043881J591790Q69443l281715m162693
$$ -98534 362674 4520691 7620879 6824361 5780480 7372270 8241713 4959998 797305
10166G97305K48425L614622J247663l151868m133819k383785j832554k691939
$$ 797305 1045730 4660352 5908015 2756147 -1377672 -3761457 -5594011 -8285950
10158h285950j783942J913561N448541N277316J013922l687112l976701R62769
$$ -8285950 -10069892 -8156331 -2707790 2569526 3583448 -103664 -4080365 -3117596
10150c117596O018206N765227J168312k484310l158141k950769k195728J002219
$$ -3117596 2900610 8665837 9834149 7349839 4191698 1240929 -954799 47420
10142D7420M573823K926342l678918o945986j970618N054106N631054L87978l868710
$$ 47420 4621243 7547585 3868667 -3077319 -5047937 6169 5637223 6025201 2156491
10133B156491m208110k725012j051168M50179P04756J89402K028305O004157N802104
$$ 2156491 -2051619 -4776631 -5827799 -5377620 -4672864 -4483462 -2455157 3549000 9351104
10124I351104j627184q504921n912465K495054N399886K61002m556663l305031
$$ 9351104 7723920 -781001 -6693466 -4198412 1201474 1462476 -3094187 -6399218
10116f399218Q58349L610588M680295L971495N06161l140323k716010J81913k0619
$$ -6399218 -5540869 -1930281 2750014 6721509 7227670 4087347 1371337 1553250 1532631
10107A532631k650554j156420M602042O119155o2095n798267l852343J362493
$$ 1532631 -1117923 -2274343 2327699 8446854 8384759 2586492 -1265851 96642
10099I6642K092320p12449j120440J237035K034517M08287p06661n47113j015779
$$ 96642 2188962 1476513 356073 1593108 3627625 4035912 3329251 2782138 1766359
10090A766359k204693k040489K66J936053J683463j043789m103507l962914K53119
$$ 1766359 -438334 -2478823 -2478557 -542504 1140959 97170 -4006337 -7969251 -7716132
10081g716132M195718L484719N75758R81724L399552J239031n290591p672145
$$ -7716132 -3520414 -35695 540063 1521787 4921339 6160370 869779 -6802366
10073f802366k519571K731945K225707O07748L056899N045888P13559n373720
$$ -6802366 -9321937 -6589992 -4364285 -3756537 -699638 4346250 5059809 -313911
10065c13911m666218J639744M918374K381005q82288j490269j238083j542691
$$ -313911 -4980129 -3340385 1577989 3958994 3076706 1586437 348354 -1194337
10057a194337j277738p6060J315380L066385M530297K923379j794021m148050
$$ -1194337 -2472075 -2548135 -1232755 1833630 6363927 9287306 7493285 3345235
10049C345235o77826L443563J655308l609887m998627j852749N2470j361716k322307
$$ 3345235 2667409 6110972 7766280 4156393 -842234 -2694983 -2642513 -4004229 -6326536
10040f326536n26953K113323L673807L658018J480173j509332j091641L249660
$$ -6326536 -6853489 -4740166 -1066359 2591659 4071832 2562500 1470859 4720519
10032D720519M663926j292194p607659n288609K134305M094338L3110j162109
$$ 4720519 9384445 8092251 484592 -4804017 -2669712 1424626 1457736 295627
10024B95627K378649K817783k199308m747352q40389K545653J97452k247387J160547
$$ 295627 2674276 5492059 3292751 -1454601 -2294990 250663 448115 -1799272 -638725
10015f38725N979452M976813l86028l706121l685592l265581k705089l07476K498680
$$ -638725 5340727 10317540 9931512 6225391 2539799 -725782 -3430871 -3738347 -1239667
10006a239667K607785L14588j326008r87190J38049P49373N62470K79645J172836
$$ -1239667 1368118 1682706 356698 -630492 -492443 256930 819400 1099045 2271881
9997B271881K901307K427035j610884m709689j732893M543609O396210K459904
$$ 2271881 5173188 7600223 5989339 1279650 -453243 4090366 10486576 12946480
9989A2946480j123397j375476k132632n185098o257824l143552P7133Q15086K279093
$$ 12946480 11823083 10447607 8314975 3129877 -3127947 -6271499 -6194366 -5379280 -3100187
9980c100187N718164O193360J326990l173455k603739q39506k522580m533218
$$ -3100187 2617977 8811337 10138327 6964872 4361133 3521627 999047 -3534171
9972c534171k335940J460138K433030K401210M201423M099884j572977p029649
$$ -3534171 -5870111 -4409973 -1976943 424267 4625690 8725574 7152597 122948
9964A22948m227719L799486O871630K935532n68782J66320P49909j900472m425753
$$ 122948 -4104771 -305285 6566345 9501877 8933095 9099415 9849324 7948852 3523099
9955C523099l743725j784197r65547n73584J97625L22781k17489K61576J785809
$$ 3523099 -220626 -2004823 -2970370 -3543954 -3346329 -3023548 -3241037 -2979461 -1193652
9946a193652K266396J118568m148l28422n96588p56370j87469K53420n10889j353968
$$ -1193652 1072744 2191312 2187164 1858742 1262154 505784 318315 571735 60846 -1293122
9936a293122p47713M53228J011846J823609L000100J598802l127827n661625j469223
$$ -1293122 -2040835 -1587607 -575761 1247848 4247948 5846750 2718923 -2942702 -4411925
9927d411925M536797L917311k751272o854160m389609J27704K409472L151019
$$ -4411925 124872 4042183 1290911 -5563249 -9952858 -9825154 -7415682 -4264663
9919d264663K987679L41645l454232l533239J233726N742499N800372K950059
$$ -4264663 -1276984 -935339 -4389571 -7922810 -6689084 -946585 4853787 7803846
9911G803846L11804j539908k633694k043641j61901J179283J772202K557179K338929
$$ 7803846 8115650 6575742 3942048 1898407 1736506 2915789 4687991 7245170 9584099
9902I584099m20187l164406k150091Q07426P51274j837922j993679O17600J607535
$$ 9584099 9163912 5999506 3849415 4656841 5408115 3570193 1576514 2194114 3801649
9893C801649Q86150K635579N518198L061071m191711p516336l965610n00065o08284
$$ 3801649 4687799 7323378 12841576 15902647 11710936 4194600 228990 -271075 -879359
9884h79359R84885N239110L930582m661228r025201l158513K150703q50080j016671
$$ -879359 105526 5344636 9275218 4613990 -4411211 -7569724 -5419021 -6269101 -7285772
9875g285772J0294326J6328445k214289l0069196l1732986k502516K3065495J9920691
$$ -7285772 3008554 19336999 17122710 -12946486 -44679472 -47181988 -24116493 -4195802
9867d195802L184648k012828K670391R56975o703703o599802K399066P552381
$$ -4195802 -1011154 -3023982 -353591 603384 -6100319 -12700121 -10301055 -2748674
9859b748674L758845j065886j539299r78392j251126O61248M057281L480907j292504
$$ -2748674 1010171 -55715 -1595014 -2573406 -3824532 -3163284 893997 4374904 3082400
9850C082400l691842j158609J130675j26424j293262M33663J708495m71776l123449
$$ 3082400 -609442 -1768051 -637376 -763800 -2057062 -1623399 85096 -386680 -3510129
9841c510129k348863O93361K597922K651663J973219J079635N88357J239500J850802
$$ -3510129 -5858992 -5165631 -2567709 83954 2057173 3136808 3725165 4964665 6815467
9832F815467O26009j006343j82585J620895J97142l487255l762607m1521J534298
$$ 6815467 7441476 6435133 6252548 7873443 8070585 4583330 820723 779202 2313500
9823B313500j169957k321098R00795K249827k287097n724927j284824N039464
$$ 2313500 1143543 -1177555 -276760 1973067 -314030 -6038957 -7323781 -2284317
9815b284317L750434j978203j654408M307065N057035k218444p432755l888720
$$ -2284317 1466117 -512086 -2166494 2140571 7197606 4979162 -2453593 -6342313
9807f342313K269985L458358J413455P77888M53946j867489l189665k78579L540725
$$ -6342313 -4072328 -613970 799485 1577373 2031319 163830 -3025835 -3304414 236311
9798B36311L170064l04897k240454j907520j857341k354073j652893q9525N38379
$$ 236311 3406375 3101478 861024 -1046496 -2903837 -5257910 -6910803 -7000328 -6461949
9789f461949K63185J27531k09976j058327j011943N47261J737510J471572J368261
$$ -6461949 -6198764 -6071233 -6281209 -7339536 -8351479 -7804218 -6066708 -4595136 -3226875
9780c226875J900238O57386k443606k925801J080309M241790J826818k475709
$$ -3226875 -1326637 -669251 -3112857 -6038658 -4958349 -716559 1110259 -1365450
9772a365450k685316k45385m47251k603746j783895J880071L708649K936957K761300
$$ -1365450 -4050766 -4296151 -4743402 -7347148 -9131043 -7250972 -3542323 -605366 2155934
9763B155934K958825O27111k242547n39187M280545M993678K59561l256753k294924
$$ 2155934 5114759 5741870 3499323 2960136 7240681 12234359 12493920 9237167 6942243
9754F942243j608602m143188n397952j999002K016925K654291K602534M763698
$$ 6942243 5333641 1190453 -4207499 -6206501 -4189576 -1535285 1067249 5830947
9746E830947N619090J546995l500994l447517N94458K686196P55833k538716m863589
$$ 5830947 11450037 12997032 9496038 6048521 6642979 9329175 10085008 7546292 2682703
9737B682703n197312k574875J593953K961905K79188j612859P12304L170074J109260
$$ 2682703 -2514609 -5089484 -3495531 -533626 -254438 -1867297 -1154993 2015081 3124341
9728C124341k238943j277510J817120O54787m070111n418309j428352K727278
$$ 3124341 885398 -392112 1425008 2079795 -1990316 -7408625 -8836977 -6109699
9720f109699L772336L600337K997826J17545l251366j789904M173871O795885
$$ -6109699 -2337363 1262974 4260800 4378345 1126979 -662925 3510946 10306831
9712A0306831J875041m304429l954983J264576L487355k38660m963666m784952
$$ 10306831 12181872 7877443 3922460 5187036 8674391 8435731 3472065 -1312887
9704a312887N55353N677192M891590j527465o575056m396120J754538L511079
$$ -1312887 -757534 4919658 9811248 8283783 1708727 -2687393 -932855 2578224
9696B578224q63573m356106k082798K005888K443782L73229l06795m3483j302943
$$ 2578224 1714651 -2641455 -4724253 -2718365 -274583 98646 -208149 -251632 -1554575
9687a554575k751671j626074N86604N10668r78732n26577J368343J454419o6056
$$ -1554575 -4306246 -5932320 -5345716 -4835048 -5813780 -6340357 -4972014 -3517595 -3583651
9678c583651k81131M52264m24133j288182J761247O400583N664782k14902k443815
$$ -3583651 -3864782 -3412518 -3836651 -5124833 -3363586 3036997 8701779 8486877 6043062
9669F043062K055699M270274k290409r198651n378888M389302N816447k593119
$$ 6043062 8098761 12369035 10078626 879975 -4498913 -109611 5706836 3113717
9661C113717p298439j277100N633867L447022k664951k583212K056678K246988
$$ 3113717 -4184722 -5461822 172045 3619067 954116 -1629096 427582 2674570
9653B674570k624744m698107j153447K645954L250416K866267K227285j181631
$$ 2674570 49826 -4648281 -5801728 -3155774 94642 2960909 5188194 4006563
9645D006563n804838n479161O72043N456662M301369J509616J814507K863351
$$ 4006563 -1798275 -7277436 -6605393 -1148731 3152638 4662254 6476761 9340112
9637I340112J173681j089109j145913j380142l745593m184452J63332L546251
$$ 9340112 10513793 9424684 8278771 6898629 3153036 -1031416 -868084 2678167
9629B678167k45698o716350o864342j279977J820755N82084R74922M617667N772183
$$ 2678167 2432469 -4283881 -11148223 -12428200 -10607445 -10025361 -9050439 -4432772 1339411
9620A339411K120252j140824o22957N18832J41734J062207L884228L837421q90298
$$ 1339411 3459663 2318839 1695882 2214714 2356448 3418655 7302883 11140304 10250006
9611A0250006m772840l422323k353J120992P01026K38165j998663n657121n676850
$$ 10250006 5477166 2054843 2052490 3173482 3874508 4112673 2114010 -3543111 -9219961
9602i219961m52276L864813K956261J398218L652103N347996J758922k021633
$$ -9219961 -9672237 -5807424 -2851163 -1452945 2199158 7547154 9306076 7284443
9594G284443N58785M733075J551898o119958p210012l51996M323223J673540k171341
$$ 7284443 7843228 12576303 14128201 8008243 798231 446235 4769458 6442998 4271657
9585D271657k072052j200807k452814k460309J021961L865285K559703k10371
$$ 4271657 2199605 998798 -1454016 -3914325 -2892364 972921 3532624 3322253
9577C322253j128986j188207j521535o92815M44596j918266o488818n575341L024782
$$ 3322253 2193267 1005060 -516475 -1209290 -764694 -2682960 -9171778 -14747119 -11722337
9568a1722337J0004936O921578j462570m471063l89188L582098K945734Q08j919557
$$ -11722337 -1717401 5204177 3741607 -729456 -1118644 2463454 5409188 5409996 3490439
9559C490439j852906K13874L110018L904657J605436m11400N73114J846919k59966
$$ 3490439 1637533 1851407 4961425 8866082 10471518 10060118 10633232 12480151 12220185
9550A2220185m067544n437715m189864k765623j316837Q08693J617424j39541
$$ 12220185 8152641 2714926 -1474938 -4240561 -5557398 -4748705 -3131281 -3270822
9542c270822j178820J117013L230842J550814k08671K468223M910397j61380q539414
$$ -3270822 -4449642 -3332629 -101787 1449027 1240356 3708579 8618976 8457596 -81818
9533h1818q621336M94691O970189M340391k03357J85014J240975k337337n825181
$$ -81818 -8703154 -8208463 -1238274 3102117 2898760 3083774 4324749 1987412 -3837769
9524c837769k385062M727724O930924K984030j172584k131709j272731L34441
$$ -3837769 -6222831 -1495107 5435817 8419847 7247263 5115554 3842823 4177264
9516D177264K495545K942678j68866l969431m223449j623997J1228Q2111O73733
$$ 4177264 6672809 9615487 9446621 5477190 1253741 -370256 -359028 -276917 396816
9507C96816J345294k02j966803q86807K954028N205470L693325N03144k072389
$$ 396816 1742110 1741908 -224895 -1111702 1842326 7047796 10741121 11244265 9171876
9498I171876l523778l274622j077165P75042k95505k788656l086739j362422q39947
$$ 9171876 5648098 2373476 1296311 2071353 1775848 -1012808 -4099547 -5461969 -6301916
9489f301916j377749O10636M917384O099352J708429l203791l272612l49722K83777
$$ -6301916 -7679665 -7069029 -2151645 3947707 5656136 2452345 -820267 -1169989 -886212
9480h86212j802021k379500L16338L098286K779536L52661j015876k52360R54494
$$ -886212 -2688233 -5067733 -4751395 -1653109 1126427 1479088 463212 210852 1165346
9471A165346J146998J118669K038260K588400K79457l953879n351446j649787
$$ 1165346 2312344 3431013 5469273 8057673 8337130 4383251 -968195 -2617982
9463b617982K773891K596850m74099k18071M108424N952147J281940m997402n975375
$$ -2617982 155909 2752759 2278660 2060589 6169013 12121160 13403100 8405698 2430323
9454B430323k272997q0774j740951l249703j106085K667425L941989K083626j12610
$$ 2430323 157326 76552 -1664399 -4914102 -6020187 -3352762 589227 2672853 2560243
9445B560243p09659n46343r83295j669569j477803n33575J6299j82003m17911
$$ 2560243 1850584 1304241 320946 -1348623 -2826426 -3360001 -3343702 -3525705 -3943616
9436c943616k48939K99254J638505L817291M805761K180329k667488m831407k051472
$$ -3943616 -4192555 -3893301 -2254796 1562495 6368256 8548585 5881097 1049690 -1001782
9427a001782K032930K859233N85341j736596k904155l204561j831586J273709
$$ -1001782 1031148 3890381 4475722 2739126 -165029 -3369590 -5201176 -3927467
9419c927467K959248P53402k247717j285479K310390K782783q47458l170999j045217
$$ -3927467 -968219 -214817 -2462534 -3748013 -1437623 1345160 497702 -2673297 -3718514
9410c718514J830168J222039j552063k638111j000529J876845M520348N354040
$$ -3718514 -1888346 -666307 -2218370 -4856481 -5857010 -3980165 540183 5894223
9402E894223K885993j796368n063776m853308k463886M05515L150057M080290
$$ 5894223 8780216 6983848 1920072 -2933236 -5397122 -4991607 -1841550 2238740
9394B238740R53008m615089p244495m373152Q28076M717481P128483Q168053N993981
$$ 2238740 3191748 -1423341 -8667836 -13040988 -12212912 -7495431 -366948 7801105 13795086
9385A3795086Q13814l344803m144040l989374m467526k762665K212157N261680
$$ 13795086 14608900 11264097 7120057 3130683 -1336843 -4099508 -1887351 3374329
9377C374329K080865l196018l760918j22864K031334J203462M85163M57052j224334
$$ 3374329 5455194 2259176 -1501742 -1624606 406728 1610190 2095353 2552405 1328071
9368A328071l777395l530774n01036J205171K24389k64311J432285K706186J439585
$$ 1328071 -2449324 -5980098 -6481134 -5275963 -5051574 -5315885 -3883600 -1177414 262171
9359B62171m42844j7199K710170N016907M014796o35948n121623m525497L94331
$$ 262171 -180673 -197872 2512298 7529205 11544001 10908053 5786430 1260933 1655264
9350A655264K656351j339719n644622l369282K505473M010707Q57429l13358K143340
$$ 1655264 4311615 2971896 -2672726 -6042008 -3536535 474172 1331601 1018243 3161583
9341C161583K988136L44637j475108r65120k119547n351045m594278K280294Q074910
$$ 3161583 6149719 6494356 5019248 4054128 1934581 -3416464 -8010742 -5730448 2344462
9332B344462O444175Q04429k191377k046687j748163j173430P50612J624958p18494
$$ 2344462 8788637 9593066 7401689 5355002 3606839 2433409 3184021 4808979 4090485
9323D090485l379832k540169M13537J533180K76109j254869k081523j782736M01137
$$ 4090485 710653 -1829516 -1415979 117201 393310 -861559 -2943082 -4725818 -4324681
9314d324681K670118J231810k868628l025774K518125O014963J889169l683936
$$ -4324681 -1654563 -422753 -3291381 -6317155 -3799030 2215933 4105102 421166
9306D21166k759690J149430j81958m692998l600398K611837M307778j096636n019501
$$ 421166 -2338524 -1189094 -1371052 -6064050 -9664448 -7052611 -2744833 -3841469 -8860970
9297h860970j883631L408746N245575M576119K748788k151313q010540p077936
$$ -8860970 -10744601 -7335855 -2090280 2485839 5234627 3083314 -4927226 -12005162
9289a2005162K085003R170215N769886k431925m735793p16466K039457R55434
$$ -12005162 -9920159 -749944 5019942 2588017 -2147776 -2864242 -824785 130649
9281A30649J01521J164472J349666k52770j270772j009069j056425j268699l39785
$$ 130649 232170 1396642 2746308 2493538 1222766 213697 -842728 -2111427 -2451212
9272b451212M21264q65245j982814K08633L087493J469443l021242l386543J159551
$$ -2451212 -2029948 -2895193 -4878007 -4669374 -1581881 -112438 -3133680 -6520223 -5360672
9263e360672L163898r34351m612251j799122L276586L088803j298064k558336
$$ -5360672 -2196774 -3131125 -7743376 -9542498 -6265912 -3177109 -4475173 -7033509
9255g033509J282451M535870K661308k234787n243132l951795M99672M539498
$$ -7033509 -5751058 -1215188 1446120 -788667 -6031799 -9983594 -9483922 -4944424
9247d944424M447435L56982k656854n09925L925837M552954Q33580j836399n25586
$$ -4944424 -496989 -140007 -2796861 -3306786 619051 5172005 6005585 4169186 3643600
9238C643600J626560J472252N01093Q54185R59540j234596l565536k166979K551610
$$ 3643600 5270160 6742412 7243505 8097690 9057230 7822634 4257098 2090119 4641729
9229D641729N666655L431692k458102o270769l764868K743014N753051J558921
$$ 4641729 10308384 13740076 11281974 5011205 1246337 3989351 9742402 11301323
9221A1301323l552771j011933O647708P544035k180989j1187839q744266O9462
$$ 11301323 7748552 6736619 13384327 20928362 18747373 7559534 -1184732 -1115270
9213a115270L426442P19901L72868L455375K533825l175979m685209J363462O054954
$$ -1115270 2311172 3031073 3403941 6859316 9393141 6217162 1531953 2895415 8950369
9204H950369K642514k732988k066851J643117J247174j964646k134121l6246m68003
$$ 8950369 11592883 8859895 6793044 8436161 9683335 7718689 5584568 5548322 5080319
9195E080319k129292j93788L299741J806398l776423n466941j052591K880476
$$ 5080319 2951027 2757239 6056980 7863378 4086955 -1379986 -2432577 447899
9187D47899K335527J164413K190665J759212k636087o610035n602427j464600
$$ 447899 2783426 3947839 6138504 7897716 5261629 -1348406 -6950833 -8415433
9179h415433K036863M678770O395328M332091j381766m324462m33666M647890
$$ -8415433 -6378570 -1699800 4695528 9027619 7645853 3321391 2887725 7535615
9171G535615L631479j070720j838901J305567J359831k993912m795089p05234
$$ 7535615 11167094 10096374 8257473 9563040 10922871 7928959 3133870 2428636
9163B428636L025842N96203m090494l791202J008547L651365J627077q86948o20921
$$ 2428636 5454478 6050681 1960187 -1831015 -822468 2828897 4455974 3569026 2948105
9154B948105K53149j047860k841812j949765P03223J265601q49917j668061J381256
$$ 2948105 3201254 2153394 -688418 -2638183 -1934960 -669359 -1519276 -3187337 -1806081
9145a806081N204686N049338R06560k835793l259162j617808l15174J19741M62415
$$ -1806081 3398605 8447943 9354503 6518710 3259548 1641740 1326566 1446307 1908722
9136A908722J256830K424962K957285J262073k327071m316861k248781Q29409
$$ 1908722 3165552 5590514 8547799 9809872 7482801 3165940 917159 1746568
9128A746568K22304k651840j955422K505935L843800n26314l443605O72163N777101
$$ 1746568 1968872 -682968 -2638390 -132455 3711345 3185031 -258574 413589 6190690
9119F190690L396983l118192l435940K978165N776663K26234n724633m550986
$$ 6190690 9587673 6469481 3033541 6011706 11788369 12014603 6289970 1738984
9111A738984k20465k39401l572107l811020j49684K265212J159338k00201R57334
$$ 1738984 1518519 1279118 -2292989 -6104009 -6253693 -3988481 -2829143 -3029344 -2072010
9102b072010L246746M098411K770738k3577k683997l002354o27292J139933q01228
$$ -2072010 1174736 5273147 8043885 8020308 5336311 2333957 1706665 2846598 2045370
9093B045370l917270k414300M008326P939795L567859m878099q089922l718978
$$ 2045370 -1871900 -4286200 -277874 7661921 11229780 6351681 -1738241 -5457219
9085e457219J333725J307340p98087O33411M053250L144486k247415m766246r96728
$$ -5457219 -4123494 -2816154 -3614241 -2980830 1072420 4216906 1969491 -2796755 -3793483
9076c793483K676951K30308l945009k156596L523861M171287j464765m859193
$$ -3793483 -1116532 -886224 -4831233 -6987829 -3463968 707319 -757446 -5616639
9068e616639j397616K939836K059793j158404j399899J60363k99617j607764m53709
$$ -5616639 -7014255 -4074419 -2014626 -3173030 -4572929 -4412566 -4712183 -6319947 -6773656
9059f773656J791846J580108k43161m74919K20815p95291k141420o59063J978884
$$ -6773656 -4981810 -3401702 -3644863 -4119782 -3898967 -4694258 -6835678 -7494741 -5515857
9050e515857J505564j118120r06817K434612L860426J555758n39260n9449K71856
$$ -5515857 -4010293 -5128413 -6035230 -3600618 259808 1815566 1276306 1216857 1488713
9041A488713j549691l160619k325845k16815J795733L899454M745598J873324
$$ 1488713 -60978 -3221597 -5547442 -5764257 -3968524 -69070 4676528 6549852
9033F549852k689778k862520K497596O430671L446819k563749m273070p03043
$$ 6549852 3860074 997554 3495150 9925821 13372640 10808891 6535821 5832778
9025E832778L366185M366435J962141k862020p306951o952022r67019M755102
$$ 5832778 9198963 13565398 15527539 12665519 5358568 -1593454 -2560473 2194629
9017B194629L843826k551803p466020o316419m04156N806383P794746L574187
$$ 2194629 6038455 3486652 -3979368 -10295787 -10699943 -4893560 2901186 6475373
9009F475373l434726o216920k179533K981121K893866q88493k340098l19352J061011
$$ 6475373 3040647 -3176273 -5355806 -2374685 519181 -369312 -2709410 -3028762 -1967751
9000a967751j07064j443608j323507q29711m23904Q18346K271667K079298O80011
$$ -1967751 -2074815 -3518423 -4841930 -5671641 -6095545 -5277199 -3005532 -926234 -246223
8991b46223L25815J103121J138014M78463P33940J141968m95492k911593k320034
$$ -246223 79592 1182713 2320727 2799190 3533130 4675098 4179606 1268013 -1052021
8982a052021J038143K298890n65001l401781k226300J169519K605931J245299
$$ -1052021 -13878 2285012 1720011 -1681770 -3908070 -2738551 -132620 1112679
8974A112679p56816j789056j533707j73579J178291J027770n0991M86598L159532
$$ 1112679 355863 -1433193 -2966900 -3140479 -1962188 -934418 -985409 -498811 2660721
8965B660721M688028K053281l214365o488365m872408L10027M847024N089404
$$ 2660721 7348749 9402030 6187665 -300700 -5173108 -4863081 -16057 5073347
8957E073347J308082k345471k539380p42941m63755j606140r97619J805501L371335
$$ 5073347 6381429 4035958 1496578 753637 289882 -1316258 -2313877 -508376 2862959
8948B862959J863886k90693p21667m28126p36640l54574J779281L376965J748033
$$ 2862959 4726845 4436152 3714485 3286359 2549719 2195145 3974426 7351391 9099424
8939I099424j715578l069443j211975Q52173L27949j746855k218526l41823J005304
$$ 9099424 7383846 4314403 3102428 3954601 4282550 2535695 317169 -24654 980650
8930I80650n06320k683250j620004J975364L285991J172683L38276K847813L269779
$$ 980650 474330 -2208920 -3828924 -1853560 1432431 2605114 2943390 5791203 9060982
8921I060982k297678p686454n017229K224756L983528n84736k852097o6995Q66812
$$ 9060982 6763304 -923150 -5940379 -3715623 267905 -316831 -3168928 -3235923 -2369111
8912b369111k559068k743327M028684Q781743L349311n855269p203240r28409
$$ -2369111 -4928179 -7671506 -3642822 5138921 8488232 2632963 -4570277 -5498686
8904e498686L214651J541937m08531J013185K487919Q18255j751103j439006J826418
$$ -5498686 -2284035 -742098 -1150629 -137444 2350475 3168730 1417627 -21379 1805039
8895A805039M533795L138147k266077o925961o073930j267986J534684J032696
$$ 1805039 6338834 9476981 7210904 284943 -5788987 -7056973 -5522289 -4489593
8887d489593K023604N683390N711405j087354p430755n529126J347254M741894
$$ -4489593 -2465989 3217401 8928806 7841452 410697 -5118429 -3771175 970719
8879I70719L469691K143757J564898o21805k748038j321686J725044J940656K04964
$$ 970719 4440410 6584167 8149065 7527260 4779222 3457536 5182580 7123236 7328200
8870G328200m4319m10372l806574o305629k464952L794871M173812j74354j121437
$$ 7328200 7283881 6873509 3066935 -3238694 -5703646 -1908775 2265037 2090683 969246
8861I69246J618376P26514l897377m150421Q07004K066617k510712l279426M012236
$$ 969246 2587622 3314136 -583241 -4733662 -3926658 -1860041 -4370753 -7650179 -3637943
8852c637943R353644M538896l662160n347050k312064j469047k256583o79017
$$ -3637943 5715701 10254597 6592437 1245387 -1066677 -2535724 -4792307 -5471324
8844e471324J367237O43513J64605K940949M324532J05453l937427r57860M154511
$$ -5471324 -4104087 -3460574 -3295969 -355020 3969512 4074965 137538 -820322 3334189
8835C334189K343534l780963m087636J865716M526102N45056k976677j475053
$$ 3334189 5677723 1896760 -2190876 -325160 4200942 4745998 1769321 294268
8827B94268J076272J331519J599893K765786J319253k983386m530614p61020L312499
$$ 294268 1370540 2702059 4301952 7067738 8386991 5403605 872991 111971 3424470
8818C424470L116765O24643j019291k574184m451271l459002J448541N136086
$$ 3424470 6541235 7165878 6146587 3572403 -878868 -4337870 -2889329 2246757
8810B246757K919585k542681n322082l839334n26264K740676M766828L622207
$$ 2246757 5166342 2623661 -2698421 -6537755 -7064019 -4323343 443485 4065692
8802D065692n80797l749508k580382P18981K046563J496853J837254K937203K364802
$$ 4065692 3484895 -264613 -2844995 -2126014 -79451 1417402 3254656 6191859 8556661
8793H556661L75575m99824n09943k437127n665693n393434J18840N585368N227892
$$ 8556661 8932236 8432412 7922469 5485342 -180351 -5573785 -5454945 130423 5358315
8784E358315M85503k535681j555199K79544Q28047K018798M719308N031383k53508
$$ 5358315 5843818 3308137 1752938 2032482 2860529 4879327 9598635 14630018 14376510
8775A4376510p046130p806633j600223M409936M460106Q21369j125458n47310
$$ 14376510 7330380 -476253 -2076476 2333460 6793566 7614935 6489477 5942167
8767E942167n00211k163002l603181l343263j933873j84792J673796K984489K704682
$$ 5942167 5441956 3278954 -324227 -3667490 -5601363 -5786155 -4112359 -1127870 1576812
8758A576812Q03157j274718j580916P42250L803767L556230j412548o107221m248132
$$ 1576812 2379969 1105251 -475665 266585 4070352 7626582 6214034 106813 -4141319
8749d141319K287850M604217m12133m764474j446737M374255L624189j989239
$$ -4141319 -1853469 2750748 2338615 -2425859 -3872596 501659 4125848 2136609
8741B136609l069290J853879M265642n186m499679l465191n84588j148909k710698
$$ 2136609 -932681 921198 5186840 5181654 681975 -2783216 -3367804 -4516713 -7227411
8732g227411k26165M351962M739578J83796l610765k717952P59367K806768K223887
$$ -7227411 -7453576 -3101614 1637964 1821760 -1789005 -4506957 -3747590 -940822 1283065
8723A283065O23191o5855M96377R70776M85811M52909K216146L302572k05151
$$ 1283065 1906256 1840401 2336778 3307554 3793365 4246274 6462420 9764992 9559841
8714I559841o684579q891294l394076L988695N694348J916877j503072j835803
$$ 9559841 2875262 -6016032 -9410108 -5421413 272935 2189812 686740 -1149063
8706a149063j278899j610890j812687p94446J063986K968953L810685K203454
$$ -1149063 -2427962 -4038852 -5851539 -6645985 -5581999 -2613046 1197639 3401093
8698C401093j106137k577668n75242J384518k16007k791940j593350K029037K371859
$$ 3401093 2294956 -282712 -857954 526564 310557 -2481383 -4074733 -2045696 326163
8689C26163j007144k028480K127546O069602M017002k070350n688204l950743
$$ 326163 -680981 -2709461 -581915 5487687 9504689 7434339 1746135 -2204608
8681b204608N19011L509061K617659j189732l722541j630863K499675K462002
$$ -2204608 -1685597 1823464 4441123 3251391 -471150 -2102013 397662 2859664
8673B859664k647119o152827l284727J631061J981187r95473r82179K669431L929651
$$ 2859664 212545 -5940282 -9225009 -7593948 -5612761 -6608234 -7590413 -4920982 -991331
8664i91331N4676l856255k514930K157637M483804K798102L55584j04007L85129
$$ -991331 -936655 -4792910 -7307840 -5150203 -666399 2131703 2487287 2383280 2768409
8655B768409n07157k460376k467637R50555M734182M605399J210727l89247J490931
$$ 2768409 2261252 -199124 -2666761 -1716206 3017976 7623375 8834102 8444855 9935786
8646I935786K204741j301678m303122j663054K446472J55893o631982p871132
$$ 9935786 12140527 10838849 6535727 4872673 7319145 7475038 843056 -7028076
8638g028076j182070M005697J520825k107227O43134N681316M773016p80728l419023
$$ -7028076 -8210146 -4204449 -2683624 -4790851 -4147717 1533599 6306615 5525887 2106864
8629B106864j961375j116006j108849J835157N569148L137028m922580r128857
$$ 2106864 145489 -970517 -2079366 -244209 5324939 8461967 3539387 -5589470
8621e589470m746948J676967L110667J453894J515875K611435J930499Q50037
$$ -5589470 -10336418 -8659451 -5548784 -4094890 -2579015 32420 1962919 2812956
8613B812956J805095K759282N06226l331884m659645k999880q21635J036757L021946
$$ 2812956 4618051 7377333 7883559 4551675 -107970 -3107850 -3929485 -2892728 129218
8604A29218L845238J951972j222448k748153j729891R12556L952492M991067J452366
$$ 129218 3974456 5926428 4703980 1955827 225936 1138492 5090984 10082051 11534417
8595A1534417m570607o298880j108626M394602L088787k399191m150369q92298
$$ 11534417 6963810 664930 -443696 3950906 7039693 4640502 490133 -402165
8587d02165J546259L99198p94464L88362J266515o06854l299148l973696k754764
$$ -402165 1144094 1543292 748828 1137190 2403705 1796851 -1502297 -5475993 -8230757
8578h230757j243133m6332Q96146J746352K990638M295961L835034J178163o71819
$$ -8230757 -9473890 -9520222 -8624076 -6877724 -3887086 408875 4243909 5422072 4750253
8569D750253M56741J469625j508966n766499n028594N34854L805507J243938k383183
$$ 4750253 5206994 6676619 5167653 -598846 -5627440 -5092586 -1287079 -43141 -2426324
8560b426324k051558M29115O66116j409146k498047q26685K728662N989880O119269
$$ -2426324 -4477882 -4048767 -3382651 -4791797 -7289844 -8116529 -5387867 602013 6721282
8551F721282J735945l975801n424641j667156J917628R38291k367158l198034
$$ 6721282 8457227 4481426 -943215 -2610371 -692743 245548 -2121610 -5319644
8543e319644q51753J542201J791239N09289m78675J38769K031454L206139K399536
$$ -5319644 -6171397 -4629196 -2837957 -2328668 -2807343 -2668574 -637120 2569019 4968555
8534D968555J024304N82083n12395l826785o119491l173339K171622K675146j832730
$$ 4968555 5992859 6574942 6062547 2235762 -3883729 -7057068 -4885446 -2210300 -4043030
8525d043030l366006J348402N066000J730866l599610l155794J332253K676480
$$ -4043030 -7409036 -6060634 -994634 736232 -2863378 -6019172 -4686919 -2010439
8517b010439K01298o80346J478792K568996P16811j322329j760027j866120k009036
$$ -2010439 -1809141 -2489487 -1010695 1558301 2275112 952783 -807244 -2673364 -4682400
8508d682400p23900J640184K625964J445401m77246k331860l651382k266506K948276
$$ -4682400 -5406300 -3766116 -1140152 305249 -171997 -2503857 -6155239 -8421745 -5473469
8499e473469P926834O953378N12694m950161n384254k754940l1967K418461M153631
$$ -5473469 2453365 9406743 9919437 4969276 -414978 -3169918 -3201885 -783424 3370207
8490C370207L144118o50860l653561l034645l64420Q78077m73421k793612l716166
$$ 3370207 6514325 5863465 2209904 -824741 -1189161 -311084 -784505 -3578117 -7294283
8481g294283j900683J673148L973046L160305J197514J083320K280420J928889
$$ -7294283 -9194966 -7521818 -3548772 -388467 809047 1892367 4172787 6101676
8473F101676P4206j30164K187395L861426K514164k02414j732507k108173k542362
$$ 6101676 6175882 6045718 8233113 12094539 14608703 14406289 12673782 10565609 8023247
8464H023247k879569k350177j267233m12727J64523O92892Q93737K74868j304560
$$ 8023247 5143678 2793501 1526268 1113541 1278064 1970956 2864693 3139561 1835001
8455A835001l167384l458056n99117L662980M717915R49162l025517k321802J096674
$$ 1835001 -1332383 -4790439 -5389556 -1726576 2991339 3940501 914984 -1406818 -310144
8446c10144J780164l74633m93783K383543L360589J79018k584865q98782K411762
$$ -310144 1470020 1095387 601604 2985147 6345736 6524754 3939889 3041107 5452869
8437E452869K703626P17421K81403J783719K442688J256727l61054j702516k975757
$$ 5452869 8156495 8873916 9155319 10939038 13381726 14638453 14277399 12574883 9599126
8428I599126l310954j864848l25725j145930l408054l437170n7819L249256K634011
$$ 9599126 6288172 4423324 4097599 2951669 -456385 -3893555 -3951374 -702118 1931893
8419A931893j203809l848675k535923O33574J606398k57881j607146k76114J491520
$$ 1931893 728084 -3120591 -5656514 -5022940 -3416542 -3674423 -5281569 -5557683 -4066163
8410d066163R57571m11443M09770K364339J819320r14608j655354N52407J717661
$$ -4066163 -3108592 -3520035 -3110265 -745926 1073394 158786 -1496568 -944161 773500
8401G73500j41894j665270m60558L95476j890676m034639j672975L051170M436761
$$ 773500 631606 -1033664 -1494222 -1098746 -2989422 -7024061 -8697036 -5645866 -1209105
8392a209105J879210O6575J266421K682785J908518L94680J53509N57461J54649
$$ -1209105 670105 736680 2003101 4685886 6594404 6989084 7142593 7700054 7854703
8383G854703p50409r36615j53478R95184K008591K520651K075596N03272j578545
$$ 7854703 7104294 6167679 6014201 7009385 9017976 11538627 13614223 14117495 12538950
8374A2538950k791475k040495k83489m71099l811813o676398m366587J755621
$$ 12538950 9747475 7706980 7423491 6952392 3140579 -3535819 -7902406 -6146785
8366f146785M911655K174772j326056l97975K394412J488728k514799m217398
$$ -6146785 -1235130 939642 -386414 -784389 1610023 3098751 583952 -3633446
8358c633446k063215L55241R53155J285117J843964R52257n95868P47383N037878
$$ -3633446 -5696661 -5341420 -4388265 -3103148 -1259184 -306927 -902795 -155412 4882466
8349D882466P317324M846038J258439L43965m3130l584340q199563q323916l264656
$$ 4882466 12199790 17045828 18304267 18648232 18605102 15020762 6821199 -1502717 -4767373
8340d767373J505210J722798p58647j570150M35718K776516L154713J874414O66301
$$ -4767373 -3262163 -1539365 -2298012 -3868162 -3432444 -655928 2498785 4373199 5039500
8331E039500L04081J2076r81118k048028j912224m70397R55291J237741O25151
$$ 5039500 5343581 5355657 4374539 2326511 414287 -56110 899181 2136922 2762073
8322B762073J27758K14329K98174n77013k336223l353972k330357o29215q13281
$$ 2762073 2889831 3104160 3402334 2825321 489098 -2864874 -5195231 -5824446 -6637727
8313f637727k235966r21324M130415P594916M630760j231557k300447J975127
$$ -6637727 -8873693 -9795017 -5664602 1930314 6561074 5329517 3029070 5004197
8305E004197M074931j16184n161286m584454k00395J799630K81971q49186J1557
$$ 5004197 9079128 8962944 3801658 -782796 -983191 816439 1098410 249224 260781
8296B60781N26181l62521o55078N32072J144880j53631j692341j592205l77435
$$ 260781 786962 424441 -230637 301435 1446315 1292684 -399657 -1991862 -2369297
8287b369297N92667J268886K045492K210056O78298k284917m706215m112291K38547
$$ -2369297 -1776630 -507744 1537748 3747804 4426102 2141185 -2565030 -6677321 -6438774
8278f438774N441672O544558K081646l052442l060079J096751L005486k03342
$$ -6438774 -997102 5547456 7629102 4576660 1516581 2613332 5618818 5415476
8270E415476m303020m594932j892327N05411K025370L501881L548331N58894l171579
$$ 5415476 1112456 -3482476 -5374803 -4869392 -2844022 657859 4206190 4765084 1593505
8261A593505l556191n04236K025865J650392j22248j309371j829634j824048o79320
$$ 1593505 -1962686 -2466922 -441057 1209335 1087087 -222284 -2051918 -3875966 -4555286
8252d555286J150678J786595N17855j091882j345860M6078K556784M754174L985009
$$ -4555286 -3404608 -1618013 -1100158 -2192040 -3537900 -3491822 -935038 3819136 7804145
8243G804145o92444n299608m614539L15139K873017M92154j697720L01244K488452
$$ 7804145 7111701 1812093 -2802446 -2487307 385710 877864 -819856 -518612 1969840
8234A969840j07499m137956k590554L681996O494161K140909m049822o024559
$$ 1969840 1862341 -2275615 -4866169 -1184173 5309988 7450897 3401075 -2623484
8226b623484l966498j134447J071488K357960J968201M75102L2772R40956J046022
$$ -2623484 -6589982 -7724429 -6652941 -4294981 -2326780 -1851678 -1818906 -877950 168072
8217A68072j8512K65519K383842K914528J48669k405777j408716J008153J083637
$$ 168072 149560 415079 2798921 5713449 5862118 3456341 2047625 3055778 4139415
8208D139415n44344q33488J65659K56144l15885K85923J283757L34085j899713
$$ 4139415 3595071 2761583 2927242 3183386 2867501 3153424 4437181 4771266 2871553
8199B871553k357847m74293J320432J777299J841256J588138q5245k351047k574851
$$ 2871553 513706 39413 1359845 3137144 4978400 6566538 6481293 4130246 1555395
8190A555395l45511J567933J044269j085571k942447l365925j668049J721719
$$ 1555395 1209884 2777817 3822086 2736515 -205932 -3571857 -5239906 -3518187
8182c518187M187334L174790k58617k632628k629983j699900m89072J725121L853295
$$ -3518187 669147 3843937 3585320 952692 -1677291 -3377191 -3866263 -2141142 1712153
8173A712153L123960o06646l991600m620276l262119j113331J657473L790679
$$ 1712153 4836113 4229467 237867 -4382409 -7644528 -8757859 -7100386 -3309707
8165c309707L172722M81094r81609k74041J04442q73765j184537m00436q37588
$$ -3309707 -136985 344109 -637500 -911541 -807099 -1680864 -2865401 -3265837 -4103425
8156d103425k150449n77150L518937L825100j686190n312344r39294N174360L521466
$$ -4103425 -6253874 -6831024 -3312087 513013 -1173177 -6485521 -7424815 -2250455 1271011
8147A271011l228234m261626K047868O084006K897901r52921K31024K286175K03915
$$ 1271011 -1957223 -6218849 -4170981 1913025 4810926 3858005 4089029 6375204 6579119
8138F579119k335605J42641M648623M444218K5654k545959j792720j516968k615708
$$ 6579119 4243514 4386155 9034778 13478996 13504650 10958691 9165971 7649003 5033295
8129E033295j959620L78322K32200k743989l140037J363146N231066L177897j848515
$$ 5033295 3073675 3451997 3684197 940208 -2199829 -836683 4394383 7572280 5723765
8120E723765l592564j678303m14764q82241k57150J736076J763016p70135j738952
$$ 5723765 2131201 452898 38134 -844107 -1101257 634819 2397835 1627700 -111252
8111a11252R72524L264933Q14197l951296m989261j004861L427647M457227K791136
$$ -111252 861272 4126205 4940402 989106 -4000155 -5005016 -1577369 2879858 5670994
8102E670994P32381r22922j823406j003650J114355J795850p12094m235214n079925
$$ 5670994 6403375 5480453 3657047 2653397 3767752 5563602 4851508 616294 -4463631
8093d463631k637085L23396J585627J780987K388751L024463J991029p56352k463080
$$ -4463631 -7100716 -6777320 -5191693 -3410706 -1021955 2002508 3993537 3237185 774105
8084G74105n13742L690520N518136K772609j231954k409192j950887l788538o740257
$$ 774105 260363 3950883 9469019 12241628 11009674 8600482 6649595 2861057 -3879200
8075c879200m749502L166927Q822209N279752k665649m582261J041216N247199
$$ -3879200 -8628702 -5461775 3360434 8640186 5974537 1392276 2433492 7680691
8067G680691J864991m478055o150230k808012J84081K1883j358839j596505m10700
$$ 7680691 9545682 5067627 -1082603 -3890615 -3706534 -3684651 -5043490 -6639995 -7050695
8058g050695J580763L422907L415550P12919k602148l117967o7790L685275M725452
$$ -7050695 -5469932 -2047025 1368525 2081444 -520704 -3638671 -3706461 -21186 4704266
8049D704266K202106j761215l822445k165659J523216L483689K075817n57890
$$ 4704266 6906372 5145157 1322712 -842947 680269 4163958 6239775 5681885
8041E681885j881526k201512k856115l133410j645531N82206J412038J099930
$$ 5681885 3800359 1598847 -1257268 -4390678 -6036209 -5454003 -4041965 -2942035
8033b942035J338734J517853l31537k964953k475066J634275M826894L626390
$$ -2942035 -1603301 -85448 -416985 -3381938 -5857004 -4222729 604165 4230555
8025D230555q1635k631604l099668k149390J66851K680029K411732j051085l329376
$$ 4230555 4148920 1517316 -1582352 -3731742 -3564891 -884862 1526870 475785 -2853591
8016b853591j075476K616323K755071o0096j520119r02305r15836j651652q86813
$$ -2853591 -3929067 -1312744 1442327 1382231 -137888 -1040193 -1956029 -3607681 -4494494
8007d494494K03691j506318l665235j83729P686008J0137470K758846n795105
$$ -4494494 -4290803 -5797121 -9462356 -9646085 -1960077 8177393 10936239 5141134
7999E141134n919630l81140J786205n25775j224521J209706K134805J20972r95041
$$ 5141134 -778496 -1159636 626569 100794 -1123727 85979 2220784 2341756 1346715
7990A346715m6629k42129j544661L71278N052119N518466l01557m386900q14568
$$ 1346715 1300086 1057957 -486704 -115426 4936693 10455159 10153602 5766702 4952134
7981D952134L949342Q75611o760898p870655n09444N491153L371998k045547l565684
$$ 4952134 8901476 9777087 3016189 -4854466 -5363910 127243 3499241 1453694 -2111990
7972b111990j849532j673615l198604k704344N40026L337584L667779K601077
$$ -2111990 -3961522 -5635137 -8833741 -11538085 -10998059 -7660475 -3992696 -1391619
7964a391619J266509m35807j559026L9473L923521N758445K336438l396223n212613
$$ -1391619 -125110 -560917 -2119943 -2080470 1843051 7601496 9937934 6541711 1329098
7955A329098j420080K993003L013047j58309j681895m7479J717220J257105j87362
$$ 1329098 -90982 2902021 5915068 5756759 4074864 4027385 5744605 7001710 6814348
7946F814348q96687j561857l140464m194332k940141n76416J42976q85151r54523
$$ 6814348 5917661 4355804 1215340 -2978992 -5919133 -6495549 -6352573 -7237724 -8192247
7937h192247J163559L127960K326145l43999j666138n25997O82527k73653j868687
$$ -8192247 -7028688 -3900728 -1574583 -1918582 -3584720 -4110717 -3428190 -3701843 -5570530
7928e570530q08638K730201M455295J691726k648845m033183k195874m6458J525899
$$ -5570530 -6379168 -3648967 806328 2498054 -150791 -4183974 -6379848 -6426306 -4900407
7919d900407L589728M880708K746557j135495j412104K702491N027169J296508
$$ -4900407 -1310679 3570029 6316586 5181091 3768987 6471478 11498647 12795155
7911A2795155m238173n105901j627122J022390P58221l78856j053170j566303
$$ 12795155 8556982 3451081 1823959 2846349 3604570 3225714 2172544 606241
7903F06241j275981L87730J366763l40980k539600j647210J450333K835284J813772
$$ 606241 -669740 -282010 1084753 743773 -1795827 -3443037 -1992704 842580 2656352
7894B656352R06006M31094j486877l654128k267132K453040N332659L445516l19981
$$ 2656352 3562358 3993452 2506575 -1147553 -3414685 -961645 4371014 7816530 7496549
7885G496549k361687k703093k660816k240979j528707j137071k08687K327243
$$ 7496549 5134862 2431769 -229047 -2470026 -3998733 -5135804 -5344491 -3017248
7877c017248M086932J575101l100127l571836J047674L951916J077775k420904
$$ -3017248 1069684 2644785 -455342 -4027178 -2979504 972412 2050187 -370717
7869c70717n21976M176672M762709k64n299174p030335m220220K354496Q950523
$$ -370717 -892693 3283979 8046688 8046424 2747250 -4283085 -8503305 -6148809 2801714
$$ [...]
##END NTUPLES=NMR SPECTRUM
##END=
