##TITLE=31Pdec_SR88_k
 CDCl3, 124 sc
 29.09.2021
##JCAMPDX= 6.0         $$ Bruker NMR JCAMP-DX V2.0
##DATA TYPE= NMR SPECTRUM
##DATA CLASS= NTUPLES
##ORIGIN= UXNMR, Bruker Analytische Messtechnik GmbH
##OWNER= root
$$ XWIN-NMR		Version 3.5
$$ Wed Sep 29 12:21:47 2021 Russian Standard Time (UT+4h)  she@DPX200
##.OBSERVE FREQUENCY= 81.013821
##.OBSERVE NUCLEUS= ^31P
##.ACQUISITION MODE= SIMULTANEOUS
##.ACQUISITION SCHEME= undefined
##.AVERAGES= 124
##.DIGITISER RES= 16
##SPECTROMETER/DATA SYSTEM= spect
##.PULSE SEQUENCE= zgpg30
##.SOLVENT NAME= D2O
##.SHIFT REFERENCE= (INTERNAL, D2O, 0, 248.564)
##AUDIT TRAIL= $$ (NUMBER, WHEN, WHO, WHERE, WHAT)
$$ ##TITLE= Audit trail, XWIN-NMR		Version 3.5
$$ ##JCAMPDX= 5.01
$$ ##ORIGIN= Bruker BioSpin GmbH
$$ ##OWNER= she
$$ F:/spectra/data/she/nmr/P31/1/pdata/1/auditp.txt
$$ ##AUDIT TRAIL=  $$ (NUMBER, WHEN, WHO, WHERE, WHAT)
(   1,<2021-09-29 12:20:36.50 +0400>,<she>,<DPX200>,
      <continue with go, POWCHK disabled, PULCHK disabled
       configuration hash MD5:
       00 E9 B6 7A A2 85 ED C7 34 08 36 98 17 FE 4E 26
       data hash MD5: 32K
       E8 9E A8 54 5C F4 18 55 72 32 55 17 01 2C 4E AE>)
(   2,<2021-09-29 12:20:38.71 +0400>,<she>,<DPX200>,
      <Start of raw data processing
       efp BC_mod = 2 LB = 1 FT_mod = 6 PKNL = 1 PHC0 = -8513.296 PHC1 = 190.2688 SI = 64K 
       data hash MD5: 64K
       21 D4 AA 12 0B 79 86 06 60 FB C0 A9 E5 17 92 92>)
(   3,<2021-09-29 12:21:12.78 +0400>,<she>,<DPX200>,
      <pk PHC0 = -586.2943 PHC1 = 554.6002 
       data hash MD5: 64K
       FE AA AB 3E CA 9E DF B4 74 F8 22 2B 3D 62 8E 91>)
(   4,<2021-09-29 12:21:26.68 +0400>,<she>,<DPX200>,
      <abs ABSG = 5 
       data hash MD5: 64K
       1C 97 79 1E 5A 6C 67 DD 1F 01 15 DD B0 34 29 76>)
$$ ##END=
$$ 
$$ hash MD5
$$ F4 D2 62 FC 3F 4C 96 B0 E2 B0 38 17 22 44 57 66
##$RELAX= 
##$RELAX= 
##$RELAX= 
##$RELAX= 
##$RELAX= 
##$RELAX= 
##$RELAX= 
##$RELAX= 
$$ Bruker specific parameters
$$ --------------------------
##$DU= <F:/spectra>
##$EXPNO= 1
##$NAME= <P31>
##$PROCNO= 1
##$TYPE= <nmr>
##$USER= <she>
##$AMP= (0..31)
100 100 100 100 100 100 100 100 100 100 100 100 100 100 100 100 100 100 
100 100 100 100 100 100 100 100 100 100 100 100 100 100 
##$AQSEQ= 0
##$AQ_mod= 1
##$AUNM= <au_zg>
##$AUTOPOS= <>
##$BF1= 81.014009
##$BF2= 200.13
##$BF3= 200.13
##$BF4= 200.13
##$BF5= 200.13
##$BF6= 200.13
##$BF7= 200.13
##$BF8= 200.13
##$BYTORDA= 1
##$CFDGTYP= 0
##$CFRGTYP= 5
##$CHEMSTR= <none>
##$CNST= (0..31)
1 1 145 1 1 1 1 1 1 1 1 1 1 1 1 1 1 1 1 1 1 1 1 1 1 1 1 1 1 1 1 1 
##$CPDPRG= <waltz16>
##$CPDPRG1= <>
##$CPDPRG2= <waltz16>
##$CPDPRG3= <>
##$CPDPRG4= <mlev>
##$CPDPRG5= <mlev>
##$CPDPRG6= <mlev>
##$CPDPRG7= <mlev>
##$CPDPRG8= <mlev>
##$CPDPRGB= <>
##$CPDPRGT= <>
##$D= (0..31)
0 1 0 0 0 0 0 0 0 0 0 0.03 2e-05 3e-06 0 0 0 0 0 0 0 0 0 0 0 0 0 0 0 0 
0 0 
##$DATE= 1632903462
##$DBL= (0..7)
120 120 120 11 120 120 24 19 
##$DBP= (0..7)
150 150 150 150 150 150 150 150 
##$DBP07= 0
##$DBPNAM0= <>
##$DBPNAM1= <>
##$DBPNAM2= <>
$$ [...]
##$SUBNAM3= <"">
##$SUBNAM4= <"">
##$SUBNAM5= <"">
##$SUBNAM6= <"">
##$SUBNAM7= <"">
##$SUBNAM8= <"">
##$SUBNAM9= <"">
##$SW= 501.771253377433
##$SWIBOX= (0..15)
0 1 3 0 0 0 0 0 0 0 0 0 0 0 0 0 
##$SW_h= 40650.406504065
##$TD= 32768
##$TD0= 1
##$TE= 0
##$TE2= 300
##$TE3= 300
##$TEG= 300
##$TL= (0..7)
0 120 53 12 22 120 120 120 
##$TP= (0..7)
150 150 150 150 150 150 150 150 
##$TP07= 0
##$TPNAME0= <>
##$TPNAME1= <>
##$TPNAME2= <>
##$TPNAME3= <>
##$TPNAME4= <>
##$TPNAME5= <>
##$TPNAME6= <>
##$TPNAME7= <>
##$TPOAL= (0..7)
0.5 0.5 0.5 0.5 0.5 0.5 0.5 0.5 
##$TPOFFS= (0..7)
0 0 0 0 0 0 0 0 
##$TUNHIN= 0
##$TUNHOUT= 0
##$TUNXOUT= 0
##$USERA1= <user>
##$USERA2= <user>
##$USERA3= <user>
##$USERA4= <user>
##$USERA5= <user>
##$V9= 5
##$VALIST= <valist>
##$VCLIST= <CCCCCCCCCCCCCCC>
##$VD= 0
##$VDLIST= <DDDDDDDDDDDDDDD>
##$VPLIST= <PPPPPPPPPPPPPPP>
##$VTLIST= <TTTTTTTTTTTTTTT>
##$WBST= 1024
##$WBSW= 4
##$XGAIN= (0..3)
0 0 0 0 
##$XL= 0
##$YL= 0
##$YMAX_a= 4461
##$YMIN_a= -7778
##$ZGOPTNS= <>
##$ZL1= 120
##$ZL2= 120
##$ZL3= 120
##$ZL4= 120
##$ABSF1= 248.5645
##$ABSF2= -253.2056
##$ABSG= 5
##$ABSL= 3
##$ALPHA= 0
##$AQORDER= 0
##$ASSFAC= 0
##$ASSFACI= 0
##$ASSFACX= 0
##$ASSWID= 0
##$AUNMP= <proc_1d>
##$AZFE= 0.1
##$AZFW= 0.5
##$BCFW= 0
##$BC_mod= 2
##$BYTORDP= 0
##$COROFFS= 0
##$CY= -3
##$DATMOD= 1
##$DC= 0
##$DFILT= <>
##$DTYPP= 0
##$F1P= 0
##$F2P= 0
##$FCOR= 1
##$FTSIZE= 65536
##$FT_mod= 6
##$GAMMA= 0
##$GB= 0
##$INTBC= 1
##$INTSCL= 5.30512e-09
##$ISEN= 30
##$LB= 1
##$LEV0= 0
##$LPBIN= 0
##$MAXI= 10000
##$MC2= 0
##$MEAN= 0
##$ME_mod= 0
##$MI= 50
##$NCOEF= 0
##$NC_proc= -7
##$NLEV= 6
##$NOISF1= 182.463
##$NOISF2= 159.3651
##$NSP= 0
##$NTH_PI= 0
##$NZP= 0
##$OFFSET= 248.5645
##$PC= 4
##$PHC0= -9099.59
##$PHC1= 744.869
##$PH_mod= 1
##$PKNL= yes
##$PPARMOD= 0
##$PSCAL= 0
##$PSIGN= 0
##$REVERSE= no
##$SF= 81.014009
##$SI= 65536
##$SIGF1= 159.3651
##$SIGF2= -187.1042
##$SINO= 113.3802
##$SIOLD= 16384
##$SREGLST= <1H.CDCl3>
##$SSB= 0
##$STSI= 65536
##$STSR= 0
##$SW_p= 40650.406504065
##$SYMM= 0
##$S_DEV= 0
##$TDeff= 32768
##$TDoff= 0
##$TI= <>
##$TILT= no
##$TM1= 0
##$TM2= 0
##$TOPLEV= 0
##$USERP1= <user>
##$USERP2= <user>
##$USERP3= <user>
##$USERP4= <user>
##$USERP5= <user>
##$WDW= 1
##$XDIM= 65536
##$YMAX_p= 542626761
##$YMIN_p= -53235470
$$ End of Bruker specific parameters
$$ ---------------------------------
##NTUPLES= NMR SPECTRUM
##VAR_NAME=  FREQUENCY,     SPECTRUM/REAL,   SPECTRUM/IMAG
##SYMBOL=    X,             R,               I
##VAR_TYPE=  INDEPENDENT,   DEPENDENT,       DEPENDENT
##VAR_FORM=  AFFN,          ASDF,            ASDF
##VAR_DIM=   65536,         65536,           65536
##UNITS=     HZ,            ARBITRARY UNITS, ARBITRARY UNITS
##FACTOR=    0.620285442955139, 1,           1
##FIRST=     20137.2065510759, 0,            0
##LAST=      -20513.1999529892, 0,           0
##MIN=       -20513.1999529892, -53235470,   0
##MAX=       20137.2065510759, 542626761,    0
$$ Real data points
##PAGE= N=1
##DATA TABLE= (X++(R..R)), XYDATA
$$ [...]
13009b824053k528211J659667J061468k213690j552113K651372L670114P40351
$$ -2824053 -5352264 -3692597 -2631129 -4844819 -6396932 -3745560 -75446 664905
13001F64905O05209M742602N469857r24211o839219n157761k2805J154256o74392
$$ 664905 1270114 6012716 11482573 10558362 3719143 -1438618 -1461423 -307167 -981559
12992i81559k76453J903793J943958L07059j90204p46054l458974m962532r12024
$$ -981559 -1258012 645781 2589739 2896798 2706594 1960540 -1498434 -6460966 -7372990
12983g372990N327343O145168P94231l887554l348269K17573K815437K482759
$$ -7372990 -2045647 4099521 4893752 1006198 -2342071 -2124498 690939 3173698
12975C173698j152300n846149o321473l14869O244516N935659L52474k569270
$$ 3173698 2021398 -3824751 -10146224 -10461093 -4216577 1719082 2071556 -497714
12967d97714n64528J036773p56185k571793j839216o68780n03430N12084K452101
$$ -497714 -1062242 -25469 -781654 -3353447 -5192663 -5861443 -6364873 -5852789 -3400688
12958c400688K038232j271982l296241j723819P92593K335153M442142O561256
$$ -3400688 -1362456 -2634438 -5930679 -7654498 -6861905 -4526752 -84610 6476646
12950F476646M502188j801497n523165k653453J624961J586537j38980J101188
$$ 6476646 10978834 9177337 3654172 1000719 2625680 4212217 4073237 5174425
12942E174425K477783j098523o289076n325717J077974M232026R59111k454554
$$ 5174425 7652208 6553685 264609 -5061108 -3983134 248892 1208003 -1246551
12934a246551j468490J62248j391800k798236P6101M104573L490734q75804k847838
$$ -1246551 -2715041 -2552793 -3944593 -6742829 -6666728 -2562155 928579 52775 -2795063
12925b795063k73265K839727L093239J507095n8456j572040k421261o87194K691817
$$ -2795063 -3068328 -228601 2864638 4371733 4313277 2741237 319976 -367218 2324599
12916B324599K946441j738509n712308k959117L431862M861076k56974m316206
$$ 2324599 5271040 3532531 -2179777 -5138894 -1707032 3154044 2897070 -1419136
12908a419136k338729J036395K07959k145956n86673L130627L252477L86287L40032
$$ -1419136 -3757865 -2721470 -2513511 -4659467 -5246140 -2115513 1136964 1523251 1863283
12899A863283L461662L686729o78371l471783r06763K018098k83087n207214o442806
$$ 1863283 5324945 9011674 8333303 4861520 3954757 5972855 5689768 482554 -5960252
12890e960252k950493J434450M088455M737907L203032K22490j650552j475845
$$ -5960252 -8910745 -7476295 -3387840 1350067 4553099 4775589 3125037 1649192
12882A649192j781410l817409m278017p50291L057700K595696l9831J52492K111341
$$ 1649192 -132218 -3949627 -8227644 -8977935 -5920235 -3324539 -3364370 -3211878 -1100537
12873a100537M42212m572619o023554q80677M924670M843703K86151k674555j696649
$$ -1100537 -658325 -5230944 -11254498 -12135175 -7210505 -2366802 -2080651 -4755206 -6451855
12864f451855N92559J768849K203290K784174K967424J959798K85062r54309j738526
$$ -6451855 -5859296 -4090447 -1887157 897017 3864441 5824239 6109301 5154992 3416466
12855C416466k797320l586557k254852J213114L448438J643495k016412k998535
$$ 3416466 619146 -2967411 -5222263 -4009149 -560711 1082784 -933628 -3932163
12847c932163r89588O7236j264519j704738P35588L164688K732535R31007j9337
$$ -3932163 -4921751 -4854515 -6119034 -7823772 -7088184 -3923496 -1190961 -259954 -279291
12838b79291j023005k838145k891153M21033L648919L010281K32866p83054j44276
$$ -279291 -1302296 -4140441 -7031594 -6610561 -2961642 48639 281505 -501549 -645825
12829f45825n7903K02067K088504L307364J300915j256911n24727J272403o26245
$$ -645825 -703728 -501661 1586843 4894207 6195122 4938211 4413484 5685887 5059642
12820E059642m672300n079833j612913M62089j10272P92877L790906L932479l54510
$$ 5059642 387342 -4692491 -6305404 -5843315 -5953587 -5160710 -1369804 2562675 2208165
12811B208165l658148j956148J629364K531264Q40659j032605j960963j187221
$$ 2208165 -1449983 -3406131 -1776767 754497 1595156 562551 -1398412 -2585633
12803b585633J407172K628837r93012o206594n596978Q88355M353151K45981m324579
$$ -2585633 -1178461 1450376 457364 -5749230 -11346208 -10457853 -6104702 -5858721 -10183300
12794a0183300j723469M408513N125484o59753n744843m829046L54569M568823
$$ -10183300 -11906769 -7498256 -2372772 -3032525 -8777368 -13606414 -13251845 -8683022
12786h683022L989878p35570m187966j743563L347769L230421k676242n769681
$$ -8683022 -4693144 -5428714 -9616680 -11360243 -8012474 -4782053 -7458295 -13227976
12778a3227976j370885L986838L610253J166975K716213N222468K454992k838802
$$ -13227976 -14598861 -10612023 -7001770 -5834795 -3118582 2103886 4558878 1720076
12770A720076l068036J161083K611209R3539q98661O08437p3653k750871j403314
$$ 1720076 -1347960 -186877 2424332 2517871 1619210 2227647 2153994 -596877 -2000191
12761b000191M154252N974193P70881m610013m946306m489706p009373o771258
$$ -2000191 2154061 8128254 8899135 4289122 -657184 -5146890 -12156263 -18927521
12753a8927521J957989J2608977J3301063L311451o304183p735653m219505k104505
$$ -18927521 -16969532 -4360555 8940508 12251959 5947776 -1787877 -6007382 -8111887
12745h111887k019866o85119K847293N892868N456278J439044k703257k855189
$$ -8111887 -10131753 -10816872 -7969579 -2076711 3379567 4818611 2115354 -739835
12737g39835Q84248L440848J122162k825570k609807J143683J758478l321132
$$ -739835 144413 3585261 4707423 1881853 -727954 415729 2174207 -1146925
12729a146925p863504n325836J933398O100822M175149J72090j861877k137202
$$ -1146925 -9010429 -14336265 -12402867 -6302045 -2126896 -1954806 -3816683 -5953885
12721e953885j904294n10330K231089L952198K586290o29011l021825l608392
$$ -5953885 -7858179 -8368509 -6137420 -2185222 401068 -227943 -3249768 -6858160
12713f858160k616986k4104L187907M341399K381253K35639R32558K893106K454807
$$ -6858160 -9475146 -9499250 -6311343 -1969944 411309 646948 1579506 4472612 6927419
12704F927419j92837j525260n22036J77534q89274k053970k113598k081023k203378
$$ 6927419 6734582 5209322 4687286 4864820 3975546 1921576 -192022 -2273045 -4476423
12695d476423p96653K298149M082133K121061k148508n166111m697947j120112
$$ -4476423 -5273076 -2974927 1107206 3228267 1079759 -4086352 -8784299 -9904411
12687i904411K853920L839485J419529n51519Q83737K700855L22696m023977l395557
$$ -9904411 -7050491 -3211006 -1791477 -2342996 -1459259 1241596 1564292 -2459685 -5855242
12678e855242L044540P772412N408860n00563l882031l736417k152956P3107K098884
$$ -5855242 -2810702 4961710 10370570 9870007 5987976 2251559 98603 171710 2270594
12669B270594J719782j006535k637482j605959l67086p6072J465636L913974K846255
$$ 2270594 3990376 2983841 346359 -1259600 -1626686 -1702758 -237122 3676852 6523107
12660F523107k211783n046221k643406n86133k820613l742390J751665P478140
$$ 6523107 4311324 -734897 -3378303 -3964436 -6785049 -10527439 -8775774 -1297634
12652a297634M985713k087286l382007J996973N437080K973799q60022k527975
$$ -1297634 3688079 1600793 -1781214 215759 5652839 8626638 7766616 5238641
12644E238641l239004l352715j669691l4385o66185j80340M989452R036189L328898
$$ 5238641 1999637 -1353078 -3022769 -3057154 -3723339 -3903679 1085773 10121962 13450860
12635A3450860p986531j0725547p85918R688969R503727J531648n289791p504906
$$ 13450860 5464329 -5261218 -6047136 3641833 13145560 14677208 9387417 1882511
12627A882511n924151j352263L301816L604445N00390N1777L249018L784102p49273
$$ 1882511 -4041640 -5393903 -2092087 1512358 2012748 2064525 5313543 9097645 8348372
12618H348372m087364k106635K80263j619254m436128m077384k845090k773923
$$ 8348372 4261008 2154373 2434636 815382 -3620746 -7698130 -10543220 -13317143
12610a3317143P5529P161847J0902157N251381l448492n178695n53076K520701
$$ -13317143 -13241614 -6079767 4822390 10073771 6625279 1446584 893508 3414209
12602C414209J772737Q06476J61337k253365m185744j594373L245004M338108
$$ 3414209 5186946 5993422 6154759 3901394 -284350 -1878723 1366281 5704389
12594E704389J488756k69260N85996J226720J041608J707084J896179p51735l463311
$$ 5704389 7193145 6923885 7509881 8736601 9778209 11485293 13381472 12629737 9166426
12585I166426j619018K618725K639547k005376n028655l592853j449388j213062
$$ 9166426 7547408 10166133 12805680 10800304 5771649 2178796 729408 -483654
12577d83654r02144N84759J381810J299144K082625K224893j439538n938710l929314
$$ -483654 -1385798 -801039 580771 1879915 3962540 6187433 4747895 -1190815 -5120129
12568e120129M349803Q864931L531193m824178o306432j096014K975663J989740
$$ -5120129 -770326 8094605 11625798 6801620 495188 -600826 2374837 4364577
12560D364577p82559j243493O84021K244490J209520j787226l575820k196378
$$ 4364577 3582018 2338525 3022546 5267036 6476556 4689330 1113510 -1082868
12552a082868K27184P85510O94174K651912M383702J139604m904693n322622J654170
$$ -1082868 -855684 -70174 624000 3275912 7659614 8799218 3894525 -1428097 226073
12543B26073O426969J480256o737428o587364K035805P780606L589039m892165
$$ 226073 6653042 8133298 1395870 -5191494 -3155689 4624917 8213956 3321791
12535C321791p919372l216513L608974O831052N695254K743682l00694l477584
$$ 3321791 -4597581 -7814094 -4205120 2625932 8321186 11064868 10764174 7286590
12527G286590n962481n104332k69354M105614K995837k131615m814895k379395
$$ 7286590 1324109 -3780223 -4049577 56037 3051874 920259 -3894636 -6274031
12519f274031J377241L083554L919663M704441K692720k705448o040135k950937
$$ -6274031 -4896790 -1813236 2106427 6810868 9503588 6798140 758005 -2192932
12511b192932K494284L221887p67971l482569k168915M30689J996647K953455
$$ -2192932 301352 3523239 2755268 -727301 -2896216 -2465527 -468880 2484575
12503B484575K997075P08350k788038m355341l539184k583431j741254P64858
$$ 2484575 5481650 6190000 3401962 -953379 -4492563 -7075994 -8817248 -8052390
12495h052390L864175L939011J068246k36048J709747K863445L10279k851774
$$ -8052390 -4188215 -249204 819042 582994 2292741 5156186 5466465 2614691
12487B614691k826617j090881j094045k401451k383667j131948l77017N03167
$$ 2614691 -211926 -1302807 -2396852 -4798303 -7181970 -8313918 -8690935 -8187768
12479h187768L036845N560441M837280J142677k014781k753071j957930l29063
$$ -8187768 -5150923 409518 5246798 6389475 4374694 1621623 -336307 -665370
12471f65370J849736K493459l92241m387176m621491q74279J750895O73497l62698
$$ -665370 1184366 3677825 3285584 -1101592 -5723083 -6597362 -4846467 -4172970 -4535668
12462d535668K028974M872598L653906j03048j148643J204399K330674j54121
$$ -4535668 -2506694 2365904 6019810 5916762 4768119 5972518 8303192 8149071
12454H149071k875857k185802N65962J523423l35279k731613l519454k421148
$$ 8149071 5273214 3087412 3653374 5176797 4841518 2109905 -1409549 -3830697
12446c830697j67830K093752K818249J225714j375100k704614k132676r94410
$$ -3830697 -3998527 -1904775 913474 2139188 764088 -1940526 -4073202 -5067612
12438e067612j42305J199632L318871M463456L226750J296707J245233K060029
$$ -5067612 -5209917 -4010285 -691414 3772042 6998792 8295499 9540732 11600761
12430A1600761K44146l974169n497425j854926J889186m426m828654m885967Q50731
$$ 11600761 11844907 7870738 2373313 518387 2407573 2403147 -2425507 -7311474 -6460743
12421f460743M993493K766524j564556k227541k60371J90522n34347P03514L214710
$$ -6460743 -1467250 1299274 -265282 -2492823 -2753194 -2562672 -3097019 -2393505 821205
12412H21205L220473J36380k725653l248357k234412o36225J074518J427865l31408
$$ 821205 4041678 4178058 1452405 -1795952 -4030364 -4666589 -3592071 -2164206 -2495614
12403b495614j796786n05499J588655J070289p97131j66599K096260J534265j448987
$$ -2495614 -4292400 -4797899 -3209244 -2138955 -2936086 -3102685 -1006425 527840 -921147
12394i21147j314449K958522N132040J633748k479817j764948J264351J304402
$$ -921147 -2235596 722926 5854966 7488714 5008897 3243949 4508300 5812702
12386E812702r70608j245227O72691J391118J71531q33616j287341k680293m344954
$$ 5812702 4842094 3596867 4269558 5660676 5832207 4998591 3711250 1030957 -3313997
12377c313997l746933n11398L032873M679409L318872j056829n551657n225662
$$ -3313997 -7060930 -7572328 -4539455 139954 3458826 2401997 -3149660 -8375322
12369h375322N07132N141333L376716o84227L75210N201711N269999j616593p473290
$$ -8375322 -7868190 -2726857 649859 -34368 340842 5542553 10812552 9195959 1722669
12360A722669o016741j273889k81386k702961k912128Q75726M682328M692511
$$ 1722669 -4294072 -5567961 -5849347 -8552308 -11464436 -10588710 -5906382 -1213871
12352a213871J209992k858240m729697l268858J72291K616072K414173Q24251
$$ -1213871 -3879 -2862119 -7591816 -10860674 -10688383 -8072311 -5658138 -4833887
12344d833887j68161m33495r52797j685345j671076n42675J261367L106486L998780
$$ -4833887 -5002048 -5435543 -6388340 -8073685 -9744761 -10287436 -9026069 -5919583 -1920803
12335a920803K782012j68264k256228j344911J185226J837970k24385j572220
$$ -1920803 861209 692945 -1563283 -2908194 -1722968 115002 -109383 -1681603
12327a681603J008927N466205O051009M44472o520001p963066k921142K931834
$$ -1681603 -672676 4793529 10844538 11289010 4769009 -3194057 -6115199 -3183365
12319c183365M448432K414154P39455N53635m07187l231720n296055l467831J218066
$$ -3183365 1265067 3679221 4418676 4972311 4565124 1333404 -3962651 -7430482 -6212416
12310f212416L807861J215660l164852k837206L270559Q453348O649822N20695
$$ -6212416 -2404555 -1188895 -4353747 -7190953 -3920394 4532954 11182776 11703471
12302A1703471k815550k071726k169709m786194n252994q41749M045738M427003
$$ 11703471 8887921 6816195 4646486 -139708 -5392702 -6234451 -2188713 2238290
12294B238290J390094j562153l980436o017409n291405j312039J372999J65109
$$ 2238290 3628384 2066231 -1914205 -7931614 -13223019 -14535058 -13162059 -12996950
12286a2996950J18496N717521J1048416P090831l350802p891550k103529M690404
$$ -12996950 -12878454 -7160933 3887483 10978314 7627512 -264038 -2367567 2322837
12278B322837L635408k085880m154734r84651K570390L188381J818102N07306
$$ 2322837 5958245 3872365 -282369 -1267020 1303370 4491751 6309853 6817159
12270F817159j2236m32952j992767m429791n060768k136883J714802K657404J239509
$$ 6817159 6804923 6371971 4379204 -50587 -5111355 -7248238 -5533436 -2876032 -1636523
12261a636523P58149J245969L00343j044735L54363K767964J201953l216125l441744
$$ -1636523 -878374 367595 667938 -376797 -22434 2745530 3947483 731358 -2710386
12252b710386J719489M357695j42908n357291l967512J108026K279901j212005
$$ -2710386 -990897 3366798 3223890 -2133401 -6100913 -4992887 -2712986 -3924991
12244c924991m088042l531881p49579K856261N537046M256951q34056m080383
$$ -3924991 -8013033 -11544914 -12294493 -9438232 -3901186 355765 -478291 -4558674
12236d558674j660721K126945J476566j652377j458669J606977K281069K12124
$$ -4558674 -6219395 -4092450 -2615884 -4268261 -5726930 -4119953 -1838884 -1626760
12228a626760J86661K773746K563386k522255o658738l912647L633265Q530241
$$ -1626760 -1440099 1333647 3897033 1374778 -5283960 -9196607 -5563342 2966899
12220B966899O561519P92649k184932L17744L594900J372098m945051p314506
$$ 2966899 9528418 10321067 8136135 8453879 12048779 13420877 8475826 1161320
12212A161320l000268P07173j895427n077735q81200O904357P590085j21579o774899
$$ 1161320 -1838948 -1131775 -3027202 -8104937 -8986137 -2081780 5508305 5386726 -1388173
12203a388173o605411l523328j686447L28279L346142M206377K189347J558796
$$ -1388173 -7993584 -11516912 -13203359 -12875080 -9528938 -5322561 -3133214 -1574418
12195a574418L988751N057244K007978j322432j341726n14842k023482m044460
$$ -1574418 2414333 7471577 9479555 8157123 6815397 6300555 4277073 232613
12187B32613l836792k680460k418615j657235M99329J595149P46970J399068M734585
$$ 232613 -3604179 -6284639 -8703254 -10360489 -9861160 -8266011 -7519041 -6119973 -1385388
12178a385388N690264R18567m339672l587452R93582K557323N0713k038312j576137
$$ -1385388 4304876 5223443 883771 -2703681 -1710099 847224 897937 -1140375 -2716512
12169b716512N6511K238111M379521L562143q74692l423938P9388M382509K255085
$$ -2716512 -2660001 -421890 3957631 7519774 6645082 3221144 3300532 7683041 9938126
12160I938126l217929l435657Q79525R67183m084054n058158J278717N881854
$$ 9938126 6720197 3284540 4164065 5131248 1047194 -4010964 -2732247 3149607
12152C149607K332592k838290j737200K291029K046688j109655j620871q06962
$$ 3149607 5482199 2643909 906709 3197738 5244426 4134771 2513900 1706938
12144A706938l451398o803804l338614O221173J1712626O698190l786881j0135093
$$ 1706938 -1744460 -8548264 -11886878 -5665705 6046921 12745111 8958230 -1176863
12136a176863q006490n30096N284040M135112k189108n761538j981894M111678
$$ -1176863 -9183353 -9713449 -4429409 -294297 -2483405 -8244943 -10226837 -6115159
12128f115159N186059K157110J125210K290693J69934n480526p643542k883533
$$ -6115159 -929100 1228010 2353220 4643913 4813847 -666679 -8310221 -11193754
12120a1193754L351958N187053L566276J896814N07282q96129o00279J507674
$$ -11193754 -7841796 -2654743 911533 2808347 3315629 2419500 1819221 3326895
12112C326895K355014R07976Q8540O05220j126216n216156n388165P19004N285705
$$ 3326895 5681909 6589885 6678425 7283645 6157429 941273 -4446892 -3727888 1557817
12103A557817J718561l952773k344166L635715L566494k849666n379144o45914
$$ 1557817 3276378 -676395 -3020561 615154 4181648 1331982 -4047162 -4693076
12095d693076K691282o71315l972521j019726K808151N92219l182458q0557O920536
$$ -4693076 -2001794 -2673109 -6645630 -7665356 -4857205 -4264986 -7447444 -7528001 -607465
12086f07465O928618j399936o903004k421195N108965N673895K25638k784642
$$ -607465 6321153 4921217 -1981787 -4402982 705983 6379878 6605516 3820874
12078C820874p80306M83549k745527o152455m195125J368454L886527J000543
$$ 3820874 3040568 3524117 778590 -5373865 -9568990 -8200536 -4314009 -3313466
12070c313466k718495k554780N43066K647875K578998K078828J772042L88496
$$ -3313466 -6031961 -8586741 -8043675 -5395800 -2816802 -737974 1034068 1422564
12062A422564j995030l125246k023957o66641o43842m70568J433007K947372Q73987
$$ 1422564 -572466 -3697712 -5721669 -6388310 -7032152 -7502720 -6069713 -3122341 -2248354
12053b248354l241981l980639P5336L338181J184462k412367m59693N397787N817305
$$ -2248354 -5490335 -9470974 -9395638 -6057457 -4872995 -7285362 -7745055 -2347268 3470037
12044C470037k118327q982914n970174K256834M866582Q15315j508054J278264
$$ 3470037 1351710 -7631204 -13601378 -11344544 -6477962 -5662647 -7170701 -5892437
12036e892437L612361K323384J612018L384448K380058l580267p224464k835535
$$ -5892437 -2280076 43308 1655326 5039774 7419832 3839565 -3384899 -6220434
12028f220434L747462M202086N00069k24185J807618J326039j378181k266654
$$ -6220434 -2472972 1729114 2229183 2004998 3812616 5138655 3760474 1493820
12020A493820k599109n645988p280458j481190O645227O135726j723961m090936
$$ 1493820 -1105289 -6751277 -14031735 -15512925 -8867698 -2731972 -4455933 -8546869
12012h546869K822701P715318L056127l344231k315808K732972L904467J217355
$$ -8546869 -5724168 1991150 5047277 1703046 -612762 2120210 6024677 7242032
12004G242032j263421l377364n061086k479498M109602O369870Q3238o283996
$$ 7242032 5978611 2601247 -2459839 -4939337 -829735 5540135 5623373 -660623
11996f60623m108615J892890K648213j02956Q76405L970663K397194k072160k140677
$$ -660623 -4769238 -2876348 -228135 -331091 545314 4515977 6913171 4841011 2700334
11987B700334J029966k160m292444l417684K770375M594041j126361n609224k683149
$$ 2700334 3730300 3728140 -564304 -3981988 -1211613 3382428 2256067 -3353157 -6036306
11978f036306K207552K308765n69492j685083j094277p83026m13167P9464o22285
$$ -6036306 -3828754 -1519989 -2089481 -3774564 -4868841 -5651867 -6065034 -5985570 -6607855
11969f607855r70953K492394P585647P063945l19806o670050o227909k404997
$$ -6607855 -7578808 -5086414 2499233 9563178 9243372 2573322 -3654587 -6059584
11961f059584O2598K039235M423530L679969j019361l363599N90925M840801K640348
$$ -6059584 -5996986 -3957751 465779 4145748 3126387 -237212 353713 5194514 7834862
11952G834862k489083l027114R7323K25684l104157m086729j099046J291122P65148
$$ 7834862 5345779 2318665 2415988 2641672 -462485 -4549214 -5648260 -4357138 -3591990
11943c591990K08235J345053J858174L47815j067567p05463L00591Q40073J427259
$$ -3591990 -3383755 -2038702 -180528 167287 -900280 -1605743 -1305152 -465079 962180
11934I62180J941414J058209j048641k245638j525765j92861N10361O86102L90973
$$ 962180 2903594 3961803 2913162 667524 -858241 -1051102 -540741 145361 536334
11925E36334p72383k243361k608631j479730K20345J732291K728121K581990J190347
$$ 536334 -236049 -2479410 -5088041 -6567771 -6347426 -4615135 -1887014 694976 1885323
11916A885323J00568Q14647K169679J507334j364108l393079k221148O11040J611957
$$ 1885323 1985891 2800538 4970217 6477551 5113443 1720364 -500784 110256 1722213
11907A722213j18210j655224j37128L066235L846418J154045j213362j72756J981449
$$ 1722213 1604003 -51221 -188349 2877886 6724304 7878349 6664987 6492231 8473680
11898H473680J456159r01747j647347j155951k495792m566840k723638K969158
$$ 8473680 9929839 9028092 7380745 6224794 3729002 -837838 -3561476 -592318
11890e92318O518588M827803J449822p07448l477661o809152n528654J692177
$$ -592318 5926270 10754073 12203895 11496447 8018786 1209634 -4319020 -2626843
11882b626843O777478K834333m831101o145098q51658K688562P90752k018104
$$ -2626843 4150635 6984968 2153867 -3991231 -4842889 -2154327 -1363575 -3381679
11874c381679j857253O8546K065181L991715M220798R05189l194399l128674N73271
$$ -3381679 -5238932 -5170386 -3105205 886510 5107308 6012497 2818098 -310576 262695
11865B62695K553940J170512M0860N65730j38120k446968k483818M08072J300920
$$ 262695 2816635 3987147 4028007 4593737 4455617 2008649 -475169 -67097 1233823
11856A233823j829878l686052j38569M435373L632200j352591m149207k417652
$$ 1233823 -596055 -4282107 -4420676 14697 3646897 2294306 -1854901 -4272553
11848d272553P05885K540080L160136K524912q7025l316921l913451r17345K387642
$$ -4272553 -3566668 -1026588 2133548 4658460 4571435 1254514 -2658937 -3576282 -1188640
11839a188640K068069j581486l833316q65650M990848P113712K715743l121477
$$ -1188640 879429 -702057 -4535373 -5401023 -410175 6703537 9419280 6297803
11831F297803l962833l82247J975798J041388j3304O86162J072868n7047q55529
$$ 6297803 2334970 1952723 3928521 4969909 4956605 5642767 6715635 6658588 5803059
11822E803059o47984j398874l022589k245560J309351K858507l82162m189788
$$ 5803059 5155075 3756201 733612 -1511948 -202597 2655910 2273748 -1916040
11814a916040l315185J201335M474691M290417J611500k200148n052371m185854
$$ -1916040 -5231225 -4029890 444801 4735218 6346718 4146570 -905801 -5091655
11806e091655k27301J999551K84507j108553J405744L965277J382355l502614
$$ -5091655 -5318956 -3319405 -3034898 -4143451 -2737707 1227570 2609925 -892689
11798h92689l577046J371765M439954K128713j641104k645483j438895L5095J634620
$$ -892689 -4469735 -3097970 1341984 3470697 1829593 -815890 -2254785 -2219690 -585070
11789e85070K870081J791010j826349n114447n443824k957585O17912L344354
$$ -585070 2285011 4076021 2249672 -2864775 -8308599 -11266184 -10648272 -7303918
11781g303918L428546R04140j374210j084709J16997m57675j658470o14785J692081
$$ -7303918 -3875372 -2971232 -4345442 -5430151 -5313154 -5770829 -7429299 -8044084 -6352003
11772f352003J896030L88059O17081K709494L460390K446163J967044J049101
$$ -6352003 -4455973 -4067914 -3450833 -741339 2719051 5165214 7132258 8181359
11764H181359l153766p339605m129544N268381R536175L123717m948256m728819
$$ 8181359 5027593 -2312012 -6441556 -1173175 8363000 11486717 6538461 1809642
11756A809642J89705N53605k792280k067389K220766J446925n625210q961617
$$ 1809642 1999347 2552952 -239328 -2306717 -85951 1360974 -4264236 -13225853
11748a3225853k316503O953429Q403673K344871k733644k420157j6839L54671
$$ -13225853 -15542356 -8588927 -185254 2159617 -574027 -2994184 -3011023 -2656352
11740b656352j003394j522459m20836R01121J297048J332304J872731J954112
$$ -2656352 -3659746 -5182205 -5603041 -4701920 -3404872 -2072568 -199837 1754275
11732A754275j56621l305674l405952R01074M925615L605856j194467l171737
$$ 1754275 1597654 -1708020 -5113972 -4212898 712717 4318573 3124106 -47631
11724d7631m31629K774474L055887J651191L42279j335755k924416j882173J641313
$$ -47631 -479260 2295214 5351101 7002292 7344571 6008816 3084400 1202227 2843540
11715B843540L150107K77461k877110j725269J867492K971380J016133j035990
$$ 2843540 5993647 6271108 3393998 1668729 3536221 6507601 7523734 6487744
11707F487744k431828l911826l152359K315742Q074450O179277k838131q584351
$$ 6487744 4055916 144090 -3008269 -692527 7381923 13561200 10723069 2138718
11699B138718m820822J863069K532910r71723q02226L178036L703226r43095l873642
$$ 2138718 -2682104 -819035 1713875 742152 -60074 3117962 6821188 5878093 2004451
11690B004451j353877J255719n37565k380744N68984L788739M17866n956955n476979
$$ 2004451 650574 1906293 1368728 -1012016 -443032 3345707 3763573 -2193382 -7670361
11681g670361K153521O229598J279983m788318l228487K896949N087297K484662
$$ -7670361 -5516840 712758 1992741 -2795577 -6024064 -3127115 1960182 4444844
11673D444844Q23004J725143J093820k622156n540154m615435j634179K10803
$$ 4444844 5267848 6992991 8086811 5464655 -75499 -4690934 -6325113 -6114310
11665f114310o4770j626902k605542p21277L465297M922392K41510n603660m459030
$$ -6114310 -6179080 -7805982 -10411524 -11132801 -7667504 -2745112 -2503602 -8107262 -12566292
11656a2566292K972124P134795L415769j288745K85765M707499M134669j024581
$$ -12566292 -9594168 -2459373 956396 -332349 -46584 4660915 8795584 7771003
11648G771003l327754k62628K424085m5748m941856o789125m480957j106844P43315
$$ 7771003 4443249 4180621 6604706 6558958 1617102 -5172023 -9652980 -10759824 -10016509
11639a0016509J100807J248102J989676L097144L790371L643789K711337P84378
$$ -10016509 -8915702 -7667600 -5677924 -2580780 1209591 4853380 7564717 8349095
11631H349095k285046n039894m968971j906260Q94605R52625J07440J415435M000647
$$ 8349095 6064049 1024155 -3944816 -5851076 -4956471 -4003846 -3896406 -2480971 1519676
11622A519676M167243R13709k937899m946298n184975m081862j569127Q86668
$$ 1519676 5686919 6600628 3662729 -1283569 -6468544 -10550406 -12119533 -11232865
11614a1232865Q60886r77958n99574L510137P048522N301492k60697m076540l870694
$$ -11232865 -10371979 -11349937 -11949511 -8439374 -1390852 3910640 3649943 -426597 -4297291
11605d297291k275565j429463p3996K512534L279326n03159n502722m815574K877674
$$ -4297291 -6572856 -8002319 -8076315 -5563781 -2284455 -2787614 -8290336 -13105910 -10228236
11596a0228236R928201Q179892q15801p434378n794908l43594J114405k135595
$$ -10228236 -300035 7879857 7064056 -370322 -6165230 -6508824 -5394419 -7530014
11588g530014l866875l35614M650832N216477R17218l401084l630747j89317L451020
$$ -7530014 -11396889 -11732503 -7081671 -1865194 -947976 -4349060 -7979807 -8169124 -4718104
11579d718104M197333J564731k024390l129355o00527K966162M012471K094665
$$ -4718104 -520771 1043960 -980430 -4109785 -4710312 -1744150 2268321 4362986
11571D362986k9543m07102l50661j934898m223999l806065O30762N532343N588119
$$ 4362986 4333443 3926341 3575680 1640782 -2583217 -6389282 -5758520 -226177 5361942
11562E361942j84647o410323o598509m20755N673558N880291J506056j747005
$$ 5361942 5177295 -1233028 -7831537 -8252292 -2578734 3301557 4807613 3060608
11554C060608j489711m07072o02638m14446J365875K010606r28006m619484m432929
$$ 3060608 1570897 1163825 561187 146741 1512616 3523222 2595216 -2024268 -6457197
11545f457197q80496J415419R74078Q89497K809116M314239L479836J625175o3995
$$ -6457197 -7337693 -5922274 -4948196 -4058699 -1249583 3064656 6544492 8169667 8105672
11536H105672k391998m736777m146455l94342K208805J044009o90595O50556L528502
$$ 8105672 5713674 976897 -3169558 -3563900 -1355095 -311086 -1001681 -351125 3177377
11527C177377M580193L797227K429786k69950l705262l577878J584594N521925
$$ 3177377 7757570 11554797 13984583 13714633 10009371 6431493 8016087 13538012
11519A3538012K371869l754430m694106q83595K65977l051881n042727k707118
$$ 13538012 15909881 12155451 7461345 6577750 6843727 3791846 -1250881 -3957999
11511c957999M61329J937574L073019L408522L46852l828629k942973K693365
$$ -3957999 -3496670 -1559096 1513923 4922445 5269297 1440668 -1502305 1191060
11503A191060N046764M12356n185513n817447l002023J31601L770455O489980
$$ 1191060 6237824 6650180 1464667 -4352780 -7354803 -7223202 -3452747 3037233
11495C037233L932315k628702m782561L51785M366697Q18855m386191l465732
$$ 3037233 6969548 4340846 -441715 -89930 4276767 5095622 709431 -2756301
11487b756301P95588K010903J750587L892728M439413j379850p414180m605960
$$ -2756301 -1960713 50190 1800777 5693505 10132918 8753068 1338888 -3267072
11479c267072L176212M344903j692307m436605l73325K453601l21736k517396
$$ -3267072 -90860 4254043 2561736 -1874869 -2248194 205407 -116329 -2633725
11471b633725K73244K862392M95295k657623j360706J635046J007776j858722
$$ -2633725 -2360481 501911 997206 -1660417 -3021123 -1386077 -378301 -2237023
11463b237023j410409L132377O542122M397420j744385n820456l521786K334255
$$ -2237023 -3647432 -515055 6027067 10424487 8680102 2859646 -662140 1672115
11455A672115M400776M69851k960453m88388L334471J412712l573017l132899
$$ 1672115 6072891 6542742 3582289 3093901 6428372 7841084 4268067 1135168
11447A135168K773581N405518J277738l301059l341636j481377n53140J230246
$$ 1135168 3908749 9314267 10592005 7290946 3949310 2467933 1914793 3145039
11439C145039M003210L353401j761829n214831k583656K105415L029239P18830
$$ 3145039 7148249 10501650 8739821 3524990 941334 3046749 6075988 6794818
11431F794818p14397O0604J789549L171694K309432k268822p764292q704768m281108
$$ 6794818 6080421 6141025 7930574 11102268 13411700 11142878 3378586 -5326182 -9607290
11422i607290N26094K369155K658088K350400K39851k058778o54240L023239K781923
$$ -9607290 -9081196 -6712041 -4053953 -1703553 -1463702 -3522480 -4176720 -1153481 1628442
11413A628442j712035l134777J414028N266894L507434O32058J344392K188645
$$ 1628442 -83593 -3218370 -1804342 3462552 6969986 7602044 8946436 11135081
11405A1135081q97342m266118l115872J41620J088127O76631P14905j311075n677760
$$ 11135081 10237739 5971621 2855749 2997369 4085496 4762127 5477032 4165957 -1511803
11396a511803n791804J508341P870533N129438j257504j149745L438039K606212
$$ -1511803 -7303607 -5795266 2075267 7204705 5947201 4797456 8235495 10841707
11388A0841707m021883p153441l781563n99661q02744M45551M745142N674410
$$ 10841707 6819824 -333617 -4115180 -4714841 -5517585 -5072034 -326892 5347518
11380E347518n9519n495881l263848L530305O003241J450722m309893n051257
$$ 5347518 5287999 -207882 -3471730 58575 6061816 7512538 3202645 -1848612
11372a848612j169281J648660l05881l939104l600268M26464K138307k37883p98560
$$ -1848612 -3017893 -1369233 -1675114 -5614218 -9214486 -8788022 -6649715 -6887598 -7686158
11363g686158L588551O234876J045461n825662m198163L904700O983987J826370
$$ -7686158 -4097607 2137269 3182730 -2642932 -6841095 -2936395 4047592 5873962
11355E873962k540832j6146L905571K399394k387133m465742l093201j374749
$$ 5873962 3333130 3316984 7222555 9621949 7234816 2769074 -324127 -1698876
11347a698876k64036J031880J604077J30920k066583k478514q99505O54482P20204
$$ -1698876 -1962912 -931032 673045 803965 -1262618 -3741132 -4640637 -3986155 -3265951
11338c265951k31299n88270O37471K223813J508440k012136m879108l445758J279147
$$ -3265951 -3497250 -4085520 -3448049 -1224236 284204 -1727932 -6607040 -10052798 -8773651
11329h773651M649288L809107L68843j935828j031365J520444K023142o16809
$$ -8773651 -4124363 -315256 53587 -1882241 -2913606 -1393162 629980 13171
11321A3171k351396P58748N538987N093683n04517l567916o89930K246182N06008
$$ 13171 -2338225 -1579477 3959510 9053193 8548676 4980760 4290830 6537012 7043020
11312G043020k020891j142221k67782k916297m645796r54583L243465J482815
$$ 7043020 5022129 3879908 3612126 695829 -3949967 -4904550 -1661085 -178270
11304a78270k694531k267318N31663o07133k865635Q19478O895598N247968l056655
$$ -178270 -2872801 -5140119 -4608456 -5215589 -8081224 -7261746 -366148 4881820 1825165
11295A825165o325186j153311L269136J795245K65720K124541J707799l512279
$$ 1825165 -4500021 -5653332 -2384196 -588951 -323231 1801310 3509109 -3170
11287c170o363516k455342J714285M09608j613216J080067M242910K215759j240454
$$ -3170 -6366686 -8822028 -7107743 -6698135 -8311351 -7231284 -2988374 -772615 -2013069
11278b013069K08445L867609K760331k264809m126190o55259L512651M587701
$$ -2013069 -1804624 2062985 4823316 2558507 -1567683 -2222942 1289709 5877410
11270E877410K942119J34501k276815k231650M72290K745137K049182m35566k610984
$$ 5877410 8819529 8954030 6677215 4445565 4917855 7662992 9712174 9276608 6665624
11261F665624m164851m368427j417862L287939M705975J123234k901719l601806
$$ 6665624 2500773 -1867654 -3285516 2423 4708398 5831632 2929913 -671893
11253f71893k910581k867021r74330M007203P150932M246343q51139k003393j43470
$$ -671893 -3582474 -6449495 -7423825 -3416622 3734310 7980653 7129514 5126121 4982651
11244D982651k76178k248382j718764J298170J972877j219965l981073k924351
$$ 4982651 4706473 2458091 739327 2037497 4010374 2790409 -1190664 -4115015
11236d115015j80640M70973j022434j418075J265178M937295N563800K143098
$$ -4115015 -4295655 -3824682 -4847116 -6265191 -5000013 -62718 5501082 7644180
11228G644180j710135k635435k194089l523514n062917k590008L072818O194217
$$ 7644180 5934045 3298610 1104521 -2418993 -7481910 -10071918 -6999100 -804883
11220h04883M523236J672545J75812j454451l172808j857382K037522L162385
$$ -804883 3718353 5390898 5566710 4112259 939451 -917931 1119591 4281976
11212D281976k3344j987522N31571K770855K65012l689867m341884l033524k508735
$$ 4281976 4258632 2271110 2802681 5573536 5838548 2148681 -2193203 -5226727 -7735462
11203g735462p08615L930467O350515J688342n698970p375592k113623M283165
$$ -7735462 -8444077 -4513610 1836905 3525247 -2173723 -9549315 -11662938 -7379773
11195g379773P369590O310828J298227m900245o219468o95107M699730L171100
$$ -7379773 -10183 6300645 7598872 2698627 -3520841 -4215948 483782 3654882
11187C654882j640390j829918K116981L468249J204719K76424J251829m01861
$$ 3654882 2014492 184574 2301555 5769804 6974523 7250947 8502776 8100915
11179H100915m320165m070562J913562O547604M386310j092765l839216l147739
$$ 8100915 3780750 -289812 1623750 8171354 12557664 11464899 7625683 4477944
11171D477944j756374p88805k52434j062177l147206l911425j409464K447506
$$ 4477944 2721570 1932765 1680331 618154 -2529052 -6440477 -7849941 -5402435
11163e402435L964001K055267q22100j748223n35905N43270L70217J009209M078684
$$ -5402435 -1438434 616833 -205267 -1953490 -2489395 -1946125 -1575908 -566699 3511985
11154C511985O372919L292432l336516o207652k745172J429325J706573P07988
$$ 3511985 9884904 13177336 9840820 3633168 887996 2317321 4023894 4731882
11146D731882J428147J023611k804495n526547k957648P64121J92518j540056
$$ 4731882 6160029 7183640 4379145 -1147402 -4105050 -3340929 -3148411 -4688467
11138d688467J217137N205784L260441k404187l243033P75986J326695k900336
$$ -4688467 -3471330 1734454 4994895 2590708 -652325 123661 1450356 -1449980
11130a449980l299346L267552P798488L281627m085680m700049M88185L101751
$$ -1449980 -4749326 -1481774 6316714 9598341 5512661 812612 1300797 4402548
11122D402548q4049m319394m392148j66723M207856M051752j288618o512775n625549
$$ 4402548 4318499 -895 -4393043 -4559766 -351910 3699842 2411224 -4101551 -9727100
11113i727100L25740M452922L510380J460546K245499M117940L619027P40929
$$ -9727100 -9401360 -4948438 -1438058 22488 2267987 6385927 10004954 10745883
11105A0745883k595596n353521o218671l466109J500006M151091K821135J010418
$$ 10745883 8150287 2796766 -3421905 -6888014 -5388008 -1236917 1584218 2594636
11097B594636J371955J579652p37288l079309k149402M28368R26995k56823K10416
$$ 2594636 3966591 5546243 4808955 1729646 -419756 8612 935607 678784 889200
11088H89200K449692K909919J07008k899409k833473n17375O94130l84980j330590
$$ 889200 3338892 6248811 6355819 3456410 622937 105562 799692 414712 -915878
11079i15878L27911L327081M048649J480490j470565k387908k323958k601455
$$ -915878 -587967 2739114 6787763 8268253 6797688 4409780 2085822 -515633
11071e15633j769434J065178K705083R3649l860140l689569N06489L522624L006802
$$ -515633 -2285067 -1219889 1485194 1578843 -2281297 -5970866 -5464377 -1941753 1065049
11062A065049J502667O58726p50049k318947j448853J221312J501380j230956
$$ 1065049 2567716 3226442 2476393 157446 -1291407 -70095 1431285 200329
11054B00329k206154Q22515L360801J415196j988101j875800R51299J895431l82042
$$ 200329 -2005825 -1183310 2177491 3592687 1604586 -271214 680085 2575516 2193474
11045B193474l069860l581715j533159J951732M313733L009001p93545k514667
$$ 2193474 -876386 -4458101 -5991260 -4039528 274205 3283206 2489661 -25006
11037b5006m80041J318254k90686k191832l00001L047642K620664r33060k107940
$$ -25006 -505047 813207 522521 -1669311 -1969312 1078330 3698994 2765934 657994
11028F57994L75217J933213L28711p33332J453867L601155K098578o95719o20132
$$ 657994 1033211 2966424 3295135 2561803 4015670 7616825 9715403 9019684 8399552
11019H399552Q87305p79574m863828n273829n874N034500M212132k94899k638593
$$ 8399552 9286857 8507283 3643455 -1630374 -1636248 3398252 7610384 7315485 4676892
11010D676892j437282M25490J353718J573981J81671k971235l921075O92818O269195
$$ 4676892 3239610 3665100 5018818 6592799 6774470 3803235 -117840 574978 6844173
11001F844173M760156k909397o872209k884437J649230L34442k209189K80145
$$ 6844173 11604329 8694932 1822723 -1061714 587516 921958 -1287231 -1007086
10993a007086M006635J884909l469388l807292Q09588K641853k91668j771926
$$ -1007086 2999549 4884458 1415070 -2392222 -1582634 1059219 767551 -1004375
10985a004375R29249K718768M29300j799672m67444J297711n0475k211454j514885
$$ -1004375 -75126 2643642 3072942 1273270 805826 2103537 2053062 -158392 -1673277
10976a673277Q20021J198672p20845k428868k379114j000140L69978N21487J73213
$$ -1673277 -853256 345416 -375429 -2804297 -5183411 -6183551 -5813573 -5292086 -5118873
10967e118873K160281O799527Q683550L204436n005419p025479k809462j056251
$$ -5118873 -2958592 3840935 12524485 15728921 10723502 3698023 888561 -167690
10959a67690m472876m830443K685970R441149N570517m382121p597264j327090
$$ -167690 -4640566 -9471009 -6785039 2656110 8226627 3844506 -3752758 -5079848
10951e079848M540903K763643k222331k770783J200794L925849K446288o96672
$$ -5079848 -538945 2224698 2367 -2768416 -1567622 2358227 4804515 4107843
10943D107843k176914j817109j196139o26454N05219J194949o15216m081286m896665
$$ 4107843 1930929 113820 -1082319 -1708773 -1203554 -8605 -623821 -4705107 -9601772
10934i601772r62763L782502M411877J912021J052864K799234L545755J387022
$$ -9601772 -10564535 -6782033 -2370156 -458135 594729 3393963 6939718 8326740
10926H326740j616959l489130m106195k892682M63290K852531N40535m309529
$$ 8326740 6709781 3220651 -885544 -3778226 -3314936 -462405 78130 -4231399
10918d231399n348644j219296K564443K146589r8304j157716j474631j273078
$$ -4231399 -9580043 -10799339 -8234896 -6088307 -6186611 -7344327 -8818958 -10092036
10910a0092036J083599M397767M353013Q19835p77673J484128K460494o15869
$$ -10092036 -9008437 -4610670 -257657 562178 -215495 1268633 3729127 3113258
10902C113258k499249P56604L942094J184302l779508l891379n07028j02665k683980
$$ 3113258 614009 1370613 5312707 6497009 2717501 -1173878 -1680906 -1783571 -4467551
10893d467551k585562R28320K666932Q30711n52680Q68812K611749K630810J874692
$$ -4467551 -7053113 -6124793 -3457861 -2627150 -3179830 -2311018 300731 2931541 4806233
10884D806233O95601j914763m591832m074725m87016K128410J371264j106357
$$ 4806233 5501834 3587071 -1004761 -5079486 -5566502 -3438092 -2066828 -3173185
10876c173185k887458k827664k93431L583911M744930R65321l181764j634211
$$ -3173185 -6060643 -8888307 -9181738 -5597827 -852897 112424 -3069340 -4703551
10868d703551L573622M502453o88488n018999l515652L62869J983830K447273
$$ -4703551 -1129929 3372524 2684036 -2334963 -5850615 -5487746 -3503916 -1056643
10860a056643M059285M772600K311523o50577p01438N28068r6186j247447k49663
$$ -1056643 3002642 7775242 10086765 9436188 8734750 9262818 9166632 7919185 7669522
10851G669522P93178j718563n443207m767512j30575K390971J215984J544914
$$ 7669522 8462700 6744137 1300930 -3466582 -3597157 -1206186 9798 1554712
10843A554712N397592O781029J302204n461360n471911j30668K390317k89949
$$ 1554712 6952304 13733333 15035537 9574177 4102266 3971598 6361915 6071966
10835F071966k395034m42885J351612r82076l836857j632595L721300M713109
$$ 6071966 3676932 3234047 4585659 3603583 -233274 -1865869 1855431 6568540
10827F568540j081814p155291o332355L93304N668609M838753M87190k159027
$$ 6568540 5486726 -1668565 -8000920 -7607616 -1939007 2899746 3386936 1227909
10819A227909j740106o32162K08751K576810O294718O931903J477844n968582
$$ 1227909 -512197 -1144359 -935608 1641202 7935920 14867823 16345667 10377085
10811A0377085q247920m053272J074448K385784O74505q09229m13231J514336
$$ 10377085 2129165 -1924107 -849659 1536125 2210630 1401401 988170 2502506
10803B502506K987047J134730l922796o836418l422108J882491J589691k459452
$$ 2502506 5489553 6624283 2701487 -4134931 -7557039 -5674548 -4084857 -6544309
10795f544309j185066O018993Q349885Q38028o360350l664052K722923J848208
$$ -6544309 -7729375 -1710382 6639503 7477531 1117181 -2546871 176052 2024260
10787B024260l598556k865910L694492N151350j490055o780926m529492p2323
$$ 2024260 -1574296 -4440206 -745714 4405636 2915581 -3865345 -8394837 -8467160
10779h467160O75549J15076J899283L268250M44735l875148m012936Q64487O304021
$$ -8467160 -7791611 -7676535 -5777252 -2509002 -2064267 -5939415 -9952351 -9087864 -2783843
10770b783843P902283M909262L02812j835871o03472O72759n51085k293386k190827
$$ -2783843 5118440 10027702 10330514 8494643 7891171 8563930 8012845 5719459 3528632
10761C528632j847678k683513j696994K524453M096840j706684q246309n738505
$$ 3528632 1680954 -1002559 -2699553 -175100 3921740 2215056 -6031253 -11769758
10753a1769758L001187O261415J618774j788217L04999J357350k593845n703461
$$ -11769758 -8768571 -2507156 -888382 -2676599 -2371600 -1014250 -3608095 -9311556
10745i311556l208431Q86961K213546K897630M916954N158114K099786n03649
$$ -9311556 -12519987 -11633026 -9419480 -6521850 -1604896 3553218 5653004 5149355
10737E149355r15262k252761m375739k294679L180753L752529j945072l588472
$$ 5149355 4234093 1981332 -2394407 -4689086 -1508333 2244196 299124 -3289348
10729c289348L642287Q574129J105879j0137447r914113P86255P474925L969762
$$ -3289348 352939 8927068 10032947 -104500 -10018613 -9232358 -1757433 2212329
10721B212329j563017j546269J529362K246253K16144j808176k281422j283636
$$ 2212329 649312 -896957 632405 2878658 3094802 1286626 -994796 -2278432
10713b278432K21631R09875O57872N75135L71669j525139l869336k707474K149449
$$ -2278432 -2056801 -1146926 -489054 86081 457750 -1067389 -4936725 -7644199 -5494750
10704e494750N176523K570073k456912m585572k594376J593466N616484O453825
$$ -5494750 -318227 2251846 -205066 -4790638 -7385014 -5791548 -175064 6278761
10696F278761K395153l025098m227544j599395p0535L14022L773379Q088032N364856
$$ 6278761 8673914 5648816 1421272 -178123 -248658 65364 3838743 11926775 17291631
10687A7291631l788225q453750m213208P8297j938865l965071k47867L359550
$$ 17291631 13503406 5049656 836448 914745 -1024120 -4989191 -5237058 -1877508
10679a877508J095897j422447J537549L977954l99469m850848j011370N085291
$$ -1877508 -781611 -2204058 -666509 3311445 2911976 -1938872 -2950242 2135049
10671B135049K848234m187505m618864J334263L827742J059855K146J901848J388960
$$ 2135049 4983283 795778 -3823086 -2488823 1338919 2398774 2400920 4302768 5691728
10662E691728j305194p69142J796606J51720m183509l425813K287096M737147
$$ 5691728 4386534 3617392 5413998 5565718 1382209 -2043604 243492 4980639
10654D980639J967773K90654J098893j497589p600680q616799j475333N236630
$$ 4980639 6948412 7239066 8337959 6840370 -760310 -9377109 -10852442 -5615812
10646e615812M323412j43187j257443L34239K07628j631247j928737j0993J815454
$$ -5615812 -1292400 -1435587 -2693030 -2358791 -2151163 -3782410 -5711147 -5722140 -3906686
10637c906686J820316N30014q6833J191876K699159J672345p38887q0452L571944
$$ -3906686 -2086370 -1556356 -1643189 -451313 2247846 3920191 3181304 3100852 6672796
10628F672796L851649j723225o009852k884282K338971J233765l876586l884508
$$ 6672796 10524445 8801220 2791368 -92914 2246057 3479822 -396764 -4281272
10620d281272K225890O130784K841861l762677p906220p412149k544777M427885
$$ -4281272 -2055382 4075402 6917263 3154586 -4751634 -12163783 -14708560 -10280675
10612a0280675Q758363P389640K960530r5786j290194k283541k673806j710343
$$ -10280675 -1522312 5867328 8827858 8732072 7441878 5158337 2484531 774188
10604G74188p85195m82316R09966K935421K292863n80614j033264P42531j249840
$$ 774188 -11007 -493323 416643 3352064 5644927 5064313 4031049 4773580 3523740
10595C523740o879998p239789M85645O400938L380286j770033r61636K349029
$$ 3523740 -3356258 -10596047 -10110402 -3709464 -329178 -2099211 -3060847 -711818
10587g11818K300136J648592L528108L016660k429248n069215l96597K972712
$$ -711818 1588318 3236910 6765018 9781678 7352430 2283215 1886618 4859330
10579D859330j403490m963575L20997O181529K450062m827621n032633j006850
$$ 4859330 3455840 -1507735 -1186738 4994791 7444853 2617232 -2415401 -3422251
10571c422251J08564J779951P478992Q160479j889897r839618l944954N001684
$$ -3422251 -3313687 -1533736 5945256 14105735 12215838 2376220 -1568734 3432950
10563C432950K191941n135014k584843M100553J239114n882091m154238J099970
$$ 3432950 5624891 489877 -2094966 2005587 3244701 -2637390 -6791628 -5691658
10555e691658k197799o708453M58653R355444L242019p931588l098763J0442269
$$ -5691658 -7889457 -14597910 -14139257 -4783813 -1541794 -9473382 -12572145 -2129876
10547b129876Q570040n871893q029943M458269R528358J569042k863076J1084
$$ -2129876 6440164 568271 -7461672 -3003403 6524955 8093997 5230921 5242005
10539E242005k790408r465962m489778P719706O882633m430591l809181Q403650
$$ 5242005 2451597 -7014365 -11504143 -3784437 3098196 -1332395 -5141576 3262074
10531C262074R092184l306616n908869L950871M093967p650028q194906M778171
$$ 3262074 12354258 9047642 3138773 7089644 11183611 3533583 -4661323 116848
10523A16848O865331n265271o785080N702585O157085q696667j0083146O821922
$$ 116848 6982179 1716908 -5068172 634413 6791498 -1905169 -11988315 -5166393
10515e166393J0526788p106337j3359363L887593J2797615j814230j0607927K351796
$$ -5166393 5360395 -1745942 -15105305 -11217712 1579903 -234327 -10842254 -8490458
10507h490458J0243446q95066m587627R776382J2465857n603930j0408258O651767
$$ -8490458 1752988 857922 -3729705 6046677 18512534 12908604 2500346 9152113
10499I152113O933711j6592875j6952588J3300408J6235603j7646808j5163032
$$ 9152113 16085824 -507051 -17459639 -4159231 12076372 -5570436 -20733468
10492b0733468L6979674L9140255l5553481l7800525J25358608K71954030J63281668
$$ -20733468 16246206 55386461 19832980 -17967545 107391063 379345093 542626761
10485E42626761j23863861k70569521j53911411J5563172L5514077l0032288l1255689
$$ 542626761 418762900 148193379 -5718032 9845140 45359217 15326929 -15928760
10478a5928760J8846472K0870814j7261481j7709055J4247165J3314253j6961124
$$ -15928760 2917712 23788526 6527045 -11182010 3065155 16379408 -581716
10471e81716j8208806J0252235J6882132m029327j0549132M196005P382916n077033
$$ -581716 -18790522 -8538287 8343845 4314518 -6234614 -2038609 5344307 267274
10463B67274o182686L897831O30941j1334071n796365J1354967J1188640k951575
$$ 267274 -5915412 -2017581 -1386640 -12720711 -18517076 -7162109 4026531 1074956
10455A074956k296899J1666678J0496093o312809j0225860L469510R143886j402809
$$ 1074956 -1221943 10444735 20940828 14628019 4402159 7871669 17015555 15612746
10447A5612746q388993l853511j668791m823855l55006R787400Q011389n334399
$$ 15612746 7223753 3370242 1701451 -3122404 -3477410 6309990 14321379 8986980
10439H986980j0231656j741241M047291P48656j006452J661765J45585l921156
$$ 8986980 -1244676 -2985917 1061374 1810030 803578 2465343 2610928 -1310228
10431a310228o43450M979474l53684r910497m557180J1764284J4881390N85555
$$ -1310228 -1953678 3025796 2672112 -7238385 -11795565 -31281 14850109 15435664
10423A5435664q666793j750387N857954J741795n513390o437327m893126l996167
$$ 15435664 6768871 5018484 10876438 12618233 7104843 667516 -4225610 -8221777
10415h221777P78992P251962N297390l893345o507452P23592N153275Q54572k664560
$$ -8221777 -7442785 -190823 5106567 1213222 -5294230 -4570638 582637 1437209 -1227351
10406a227351L02700K629828M84816M23999M115266L150583m332942p964167k731336
$$ -1227351 -924651 1705177 2189993 2613992 6729258 9879841 5546899 -2417268 -5148604
10397e148604K637333J342813j300985L27093K787573K061630M89672L81838K33316
$$ -5148604 -2511271 -1168458 -2469443 -2142350 645223 2706853 3196525 3578363 3811679
10388C811679J96524K152026L413957L3963m250445k972792R30194j68667m100036
$$ 3811679 4008203 6160229 9574186 9608149 5357704 2384912 3315106 3146439 -953597
10379i53597k531237L032644L421326j459366l087946n64683r48447l859169j616131
$$ -953597 -3484834 -452190 2969136 1509770 -1578176 -2142859 -3091306 -6950475 -8566606
10370h566606M909852O285999J197458k002845r45807j267937k864517P9054N093671
$$ -8566606 -3656754 2629245 3826703 1823858 878051 -389886 -3254403 -3175349 1918322
10361A918322L720566j938223j749153L297630K509473l444982k564632N420111
$$ 1918322 5638888 3700665 1951512 5249142 7758615 4313633 1749001 7169112
10353G169112O766139j478759n447684O79544M655817p93346n088889k51163M525562
$$ 7169112 13935251 12456492 7008808 7688352 12344169 11550823 6461934 6210771 10736333
10344A0736333O75980m245788j740308K021397q46842m640144j365038M058849
$$ 10736333 11412313 7166525 5426217 7447614 6600772 1960628 595590 4654439
10336D654439L275089o90186q55389L55445k337840n061330j704834L686939L298616
$$ 4654439 7929528 7239342 6383953 6739398 4401558 -659772 -2364606 1322333 4620949
10327D620949r61548j475268J753147K190130j544003m157388k465490J099679
$$ 4620949 3659401 2184133 3937280 6127410 4583407 426019 -2039471 -939792
10319i39792K770059J063418k078202j930262L459416P872057L582858n878385
$$ -939792 1830267 2893685 815483 -1114779 2344637 10216694 13799552 7921167
10311G921167q601593k085696K485806j757462o296162j612730P112263Q328221
$$ 7921167 -680426 -2766122 -280316 -2037778 -8333940 -9946670 -2834407 5493814
10303E493814J301325m724666m287494j85468L103780L666032J579515j086714
$$ 5493814 6795139 2070473 -2217021 -2402489 701291 4367323 5946838 4860124
10295D860124j427039M12744J352471Q31602J518150L104738J426235l823259
$$ 4860124 3433085 3845829 5198300 6029902 7548052 10652790 12079025 8255766
10287H255766o795027m036400N19322K150846J228128k48327k080438l134062
$$ 8255766 1460739 -2575661 -2056339 94507 1322635 1074308 -1006130 -4140192
10279d140192j067620K698082L605874J437309P27415K245958J579366j936705
$$ -4140192 -5207812 -2509730 1096144 2533453 3260868 5506826 7086192 5149487
10271E149487l149414n03191J056236l16066J60280L839791M239919j954914p778513
$$ 5149487 2000073 1496882 2553118 2237052 2397332 6237123 10477042 8522128 743615
10262G43615o072286J96190L714720K991277J133080l46762j360340j092328J02380
$$ 743615 -5328671 -5132481 -1417761 1573516 2706596 2359834 999494 -92834 9546
10253I546M27296L19095J766985L107723N73585m273548n697471l030075j054456
$$ 9546 436842 755937 2522922 5630645 6204230 1930682 -3766789 -6796864 -7851320
10244g851320q84862O89319K615402O58400k390470O53844P156400O198451k924444
$$ -7851320 -8736182 -8046863 -5431461 -4773061 -7163531 -6509687 646713 6845164 3920720
10235C920720p766301k624070L120591K346989Q74510L097230K117832n587596
$$ 3920720 -3845581 -6469651 -3349060 -1002071 -127561 2969669 5087501 -500095
10227e00095r829934l195559M648282K436003l937595k463879M463631N737428
$$ -500095 -10330029 -13525588 -8877306 -6441303 -10378898 -12842777 -8379146 -2641718
10219b641718Q17606j656692J78439P93276n55385M21572L265075L566508J528728
$$ -2641718 -1824112 -3480804 -3302365 -2509089 -3064474 -2642902 622173 4188681 5717409
10210E717409N22865p9282k152825k714311Q50581L767962R40299l515330k943932
$$ 5717409 6240274 6160992 4008167 1293856 2144437 5912399 6852698 3337368 393436
10201C93436M01145L82378j160552J738594O982430O916991R21176m312150n406108
$$ 393436 794581 1176959 16407 1755001 8737431 15654422 16575598 12263448 6857340
10192F857340m475372k638979L58883K036006K73668j761051n25551J444470N94137
$$ 6857340 2381968 -257011 101872 2137878 2411546 650495 124944 1569414 2163551
10183B163551o85479O68592J431200j622631m115736j521785J623562m20295l418050
$$ 2163551 1478072 2146664 3577864 1955233 -2160503 -3682288 -2058726 -2479021 -5897071
10174e897071m68074M981252M836321K83047j653281r34750j854483k046007K878885
$$ -5897071 -6365145 -1383893 3452428 3735475 2082194 1147444 -707039 -2753046 125839
10165A25839P555331L469736n435888p609111k238660J194362K0704M87886L476796
$$ 125839 7681170 11150906 5715018 -1894093 -4132753 -2938391 -2917687 -2429801 1046995
10156A046995K946828p85543o06443L319453L004424k309324m459047j515318
$$ 1046995 3993823 3208280 2601837 5921290 8925714 6616390 2157343 642025
10148F42025n05906k806880j476790L707422L641649l180613o055686j55383N243162
$$ 642025 136119 -2670761 -4147551 -440129 3201520 20907 -6034779 -6190162 -947000
10139i47000L410074Q91134L521983N322988R14634l392103j461208R05820k679210
$$ -947000 2463074 3354208 6876191 12199179 13113813 9721710 8260502 9166322 6487112
10130F487112o273341k302131L627870J892961m045515l598204K498091L745506
$$ 6487112 213771 -2088360 1539510 3432471 -613044 -4211248 -1713157 2032349
10122B032349k050509n672019k134938K311334J634267j020437r5684L306659
$$ 2032349 -18160 -5690179 -7825117 -5513783 -3879516 -4899953 -4995637 -1688978
10114a688978L922100L70528l232600k763268Q87450K840025M14478k783622j351919
$$ -1688978 2233122 2603650 -628950 -3392218 -2504768 335257 749735 -2033887 -3385806
10105c385806L846459O254614L145694l73549N83066L413742K788079j089301
$$ -3385806 460653 6715267 9860961 9487412 10070478 13484220 16272299 15182998
10097A5182998l652429l053277j623985j514029k514459l562806l733652k315607
$$ 15182998 11530569 8477292 6853307 5339278 2824819 -737987 -4471639 -6787246
10089f787246K83692K488356L366129L082020J216278k729786o376665n395910
$$ -6787246 -6503554 -4015198 -649069 2432951 3649229 919443 -5457222 -10853132
10081a0853132P42995O822073P753825M032414m25403l239003m243064l616616
$$ -10853132 -10110137 -3288064 4465761 8498175 8072772 4833769 590705 -3025911
10073c025911j896001m42535J02896Q20855K589034M170601L475921K93906k856733
$$ -3025911 -4921912 -5364447 -5261551 -4440696 -1851662 2318939 5794860 6088766 3232033
10064C232033k781184P70028L649864J624533l353110m599881m4254M299360L269642
$$ 3232033 450849 1220877 4870741 6495274 3142164 -1457717 -1501971 2797389 6067031
10055F067031m2189n99655N8043j729597l453869r52885K476598J022876k374704
$$ 6067031 6024842 5425187 5483230 3753633 299764 -653121 1823477 2846353 471649
10046D71649m61075M389200K942906m056101n240447K390696P298714J767794
$$ 471649 10574 4399774 7342680 3286579 -1953868 436828 7735542 9503336
10038I503336o007507n956882j385356p00364k723563r89222L447564M261157
$$ 9503336 3495829 -2461053 -3846409 -4546773 -7270336 -8259558 -4811994 -550837
10030e50837J233102l26198O46322L79417j710809k038634L26890K175207J770227
$$ -550837 682265 356067 1002389 1381806 -329003 -2367637 -2040747 134460 1904687
10021A904687R62673J311813J907150J410586k24994j954248k283808q26785L08182
$$ 1904687 2867360 4179173 6086323 7496909 7271915 5317667 3033859 2207074 2515256
10012B515256j011855k975402j922631J395878K439248L92559p19482K61566m86605
$$ 2515256 1503401 -1472001 -3394632 -1998754 440494 833053 113571 375137 -111468
10003a11468l754047m345993P4025M090588L190512Q20137J412036K498286O9054
$$ -111468 -3865515 -8211508 -8137483 -4046895 -856383 -36246 1375790 3874076 3943130
9994C943130l358737k735601J242388L887484L476197J454581j099216k928063
$$ 3943130 584393 -2151208 -908820 2978664 6454861 7909442 6810226 3882163
9986C882163k127168Q4480m71175l667519l745601Q74310L450163j39481l743616
$$ 3882163 1754995 1839475 1368300 -2299219 -6044820 -5170510 -1720347 -1859828 -5603444
9977e603444j106511L410952K564498j439548j486078K397296M724228M407961
$$ -5603444 -6709955 -3299003 -734505 -2174053 -3660131 -1262835 3461393 7869354
9969G869354M058923K864876j103116m499595l082937K82133K0641k732872l009708
$$ 7869354 11928277 14793153 13690037 9190442 6107505 6389638 6410279 3677407 667699
9960F67699j010600k06088J8202J653876K063123p07871j377971M006370Q048674
$$ 667699 -342901 -548989 -530787 1123089 3186212 2478341 1100370 5106740 13155414
9951A3155414K154606p669214q350816j75035M392812R84668k121483k22468J484043
$$ 13155414 15310020 7640806 -710010 -885045 3507767 4492435 2370952 2148484 3632527
9942C632527J17390J47698K712559K196415k546799m789686j649172J354660R54353
$$ 3632527 3749917 3897615 6610174 8806589 6259790 1470104 -179068 1175592 2129945
9933B129945P61472J844568l29862n563437o447910p57986M077366L325135J395437
$$ 2129945 2891417 4735985 4406123 -1157314 -7605224 -8363210 -4285844 -960709 434728
9924D34728J714882J138841q99566P69766N682465N184621k428436o496169j187024
$$ 434728 2149610 3288451 2388885 3158651 8841116 14025737 11597301 5101132 3914108
9915C914108M373173K091567j501425J375063M602250k84813p131958m659799
$$ 3914108 8287281 10378848 8877423 10252486 14854736 14569923 7437965 2778166
9907B778166L887586N706829r27907n278823j823586L303450L723805M39742k711471
$$ 2778166 6665752 12372581 11444674 6165851 4342265 7645715 11369520 11809262 9097791
9898I097791l511199j191398K312259K265248k683902o891508n069880L51955
$$ 9097791 5586592 4395194 6707453 8972701 6288799 -602709 -5672589 -5320634
9890e320634L723874L551261J362341j116531l02554O049800J1105705N264625
$$ -5320634 -1596760 1954501 3316842 2200311 1897757 7947557 19053262 24317887
9882B4317887o212535o782756M223740P493033k283753k176974J8812803K9508742
$$ 24317887 18105352 11322596 15546336 23039369 20755616 18578642 37391445 66900187
9874F6900187r64065m7194205n4650063j7327324J4644864R652508o191069j36673
$$ 66900187 65936122 18741917 -35908146 -53235470 -38590606 -28938098 -35129167 -35265840
9866c5265840J6385806J4994786r37884p024011L38070L864069k074488n882469
$$ -35265840 -18880034 -3885248 -4823132 -11847143 -11509073 -7645004 -9719492 -15601961
9858a5601961j915842K899030M160399M189659K768602j734610m673747j531285
$$ -15601961 -17517803 -14618773 -10458374 -6268715 -3500113 -5234723 -9908470 -11439755
9850a1439755K154044k13809l266724O75471N774406K389654l750030l30561Q243698
$$ -11439755 -9285711 -9499520 -12766244 -12090773 -6316367 -3926713 -7676743 -8007304 236394
9841B36394O497648n000217r231430q81434N811665J795914l752100k045914J485032
$$ 236394 6734042 1733825 -7497605 -8379039 -2567374 -771460 -4523560 -6569474 -5084442
9832e084442P67727O08306M661403N876149k74591n297358j653044L572242O86053
$$ -5084442 -4316715 -3708409 952994 6829143 6554552 1257194 -395850 3176392 3862445
9823C862445o217198p009709k133977O15053L1405O63792K556059K460529J548557
$$ 3862445 -2354753 -9364462 -11498439 -10883386 -10851981 -10188189 -7632130 -5171601 -3623044
9814c623044K337106J909011k446292n276880q22799N314407L525177l905721
$$ -3623044 -1285938 623073 -1823219 -7100099 -7922898 -2608491 916686 -2989035
9806b989035o146898j332259J661252r68903k703371N12834L590915K374457P47030
$$ -2989035 -9135933 -10468192 -8806940 -9775843 -12479214 -11966380 -8375465 -6001008 -5253978
9797e253978K761102N427847M406705Q29856j952666l340157l594615j818193
$$ -5253978 -2492876 2934971 7341676 8171532 6218866 2878709 -715906 -2534099
9789b534099R89324J438040r09947k233176p81984M50731l33890o50471O65899
$$ -2534099 -1544775 -106735 -1016682 -3249858 -4031842 -3581111 -3915001 -4565472 -3899573
9780c899573N97844j786386k043060K176469N690367L120829k682430n073459
$$ -3899573 -3301729 -5088115 -7131175 -4954706 735661 3856490 1174060 -3899399
9772c899399k979956m03897N83201R76568J114134P58083J220892L165931M112130
$$ -3899399 -6879355 -7283252 -6700051 -5723483 -4609349 -3851266 -2630374 535557 4647687
9763D647687K020484q15317j336632o37821j216079k135710j482426o78942j320583
$$ 4647687 6668171 5852854 4516222 3878401 2662322 526612 -955814 -1634756 -2955339
9754b955339q63524K733611N343400K656143j088226J160213O598059N482326
$$ -2955339 -3818863 -1085252 4258148 6914291 5826065 6986278 13584337 19066663
9746A9066663l125241q964016o413396k464764l931048n996200j098848P490222
$$ 19066663 15941422 6977406 564010 -1900754 -5831802 -11828002 -12926850 -5436628
9738e436628R889747M018137k439284l380649o76227J178153J211878J053649
$$ -5436628 4453119 8471256 6031972 2651323 1975096 3153249 4365127 5418776
9730E418776J277729P16748j532907m207353m472935j532796J088018l83217l888890
$$ 5418776 6696505 7413253 5880346 1672993 -2799942 -4332738 -3244720 -3627937 -7516827
9721g516827l639922J037384M034992J739705j416340l17125K916253L257204
$$ -7516827 -11156749 -10119365 -6084373 -4344668 -5761008 -6078133 -3161880 95324
9713I5324R33519l56196k91873j103876k088904q56040J321669R73265j633593
$$ 95324 1028843 672647 380774 -723102 -2812006 -3668046 -2346377 -1373112 -3006705
9704c006705l082517k443038j524265o52789R33887J910113J222411J732542N504605
$$ -3006705 -6089222 -8532260 -10056525 -10709314 -9775427 -7865314 -6642903 -4910361 594244
9695E94244P589531K103453o755812q591647j947698L754475L007911J074302
$$ 594244 8183775 10287228 3531416 -5060231 -7007929 -3253454 -245543 828759
9687H28759K569264L192984j089909n223604l196045J572865K262577l9743K49641
$$ 828759 3398023 6591007 5501098 277494 -2918551 -1345686 916891 877148 1126789
9678A126789K271499M33604m775344o645127k884331J507819K882831L277468
$$ 1126789 3398288 3831892 -943452 -7588579 -10472910 -8965091 -6082260 -2804792
9670b804792M390436L771785n8201l804359m111706k465114k141987k853903j610721
$$ -2804792 1585644 5357429 5299228 1494869 -2616837 -5081951 -7223938 -10077841 -11688562
9661a1688562K336826N981656N888316J860712k725875m069471j712642J075409
$$ -11688562 -9351736 -3370080 2518236 4378948 1653073 -2416398 -4129040 -3053631
9653c053631J074701j428683l538510l040180N0470L969586O099680M615878N44541
$$ -3053631 -1978930 -3407613 -6946123 -9986303 -9935833 -5966247 133433 4749311 5293852
9644E293852k722984k816442l37700K598250L936192K093965k192775m518134
$$ 5293852 2570868 -245574 -583274 2014976 5951168 8045133 5852358 1334224
9636A334224j348658L745595L560277k020167n170636k253995P52378q43371k294504
$$ 1334224 -14434 3731161 7291438 5271271 100635 -2153360 -1400982 -2244353 -4538857
9627d538857J118889M214708O31742m903573l768580J860774L272431O79638J443140
$$ -4538857 -3419968 794740 1426482 -3477091 -7245671 -5384897 -2112466 -1432828 10312
9618A0312M794595K640462m033918m593755K468782N242884j558208o851672j778210
$$ 10312 4804907 7445369 3411451 -1182304 1286478 6529362 4971154 -1880518 -3658728
9609c658728N319982L400441l037241l013814K192856L226003j78418k65051L527955
$$ -3658728 1661254 5061695 2024454 -989360 1203496 4429499 4251081 3986030 7513985
9600G513985L933194l22755k494127n39533n50568n063581p947298m663242N86836
$$ 7513985 11447179 11124424 8630297 8090764 7540196 2476615 -5470683 -10133925 -9547089
9591i547089K268250J526347K217218L807350K957011m97179k964444j749379
$$ -9547089 -7278839 -5752492 -3535274 272076 3229087 2731908 -232536 -1981915
9583a981915J581388K608898q15076m936167m069470J030271L150492o01278l749165
$$ -1981915 -400527 2208371 1393295 -3542872 -7612342 -6582071 -3431579 -4032857 -7782022
9574g782022r64436K657938N02459k982341Q32381Q645720Q439093j372952q597208
$$ -7782022 -8746458 -6088520 -5586061 -8568402 -7736021 909699 9348792 7975840 -621368
9565f21368n685066K40252M65723k734375k972636m49996J386998K956803N269274
$$ -621368 -6306434 -6066182 -5600459 -8334834 -11307470 -11757466 -10370468 -7413665 -2144391
9556b144391N343520J602160j391077n3547J507732j370021n156200m042431j49518
$$ -2144391 3199129 4801289 3410212 3356665 4864397 3494376 -1661824 -5704255 -5853773
9547e853773M40495j594516q08737K519735K833072n05029j961317O72961L082616
$$ -5853773 -5413278 -7007794 -7816531 -5296796 -2463724 -2968753 -4930070 -4257109 -1174493
9538a174493J943500q25713k576752k982821j659671J778390M653764L753887
$$ -1174493 769007 -56706 -2633458 -5616279 -7275950 -5497560 -843796 2910091
9530B910091J205316J700094L688530Q35975o366785q860862k448025M889080
$$ 2910091 4115407 5815501 9504031 10340006 3973221 -4887641 -7335666 -2446586
9522b446586M423851j112074l140224P9281L353711L590417J973994o21552l865991
$$ -2446586 1977265 865191 -2275033 -2195752 1157959 4748376 6722370 6100818 2234827
9513B234827n053236k004277K108480K525584M43513P58717L126423K316073k065946
$$ 2234827 -2818409 -4822686 -2714206 -188622 254891 1013608 4140031 6456104 4390158
9504D390158l779656k31110K590353l66719m746209l518056J988902M280550R33305
$$ 4390158 610502 379392 2969745 2603026 -2143183 -5661239 -3672337 608213 1541518
9495A541518k738134k281297J48041L73267j385644j406999J896886N531503N244656
$$ 1541518 -1196616 -3477913 -3329872 -2956605 -4342249 -5749248 -3852362 1679141 6923797
9486F923797O03714l851239l399805R89539L476738R43590k665336j919476K294884
$$ 6923797 7527511 3676272 276467 1266006 4742744 5686334 3020998 1101522 3396406
9477C396406M213196J524418k028986k967300k691320l524314l646248R9601N791382
$$ 3396406 7609602 9134020 7105034 4137734 1446414 -2077900 -5724148 -5624547 166835
9468A66835P211474K067810l889098l693139J480827L472318j761090p992808
$$ 166835 7378309 9446119 5557021 1863882 3344709 6817027 5055937 -2936871
9460b936871o771093R37869O084600M006746k95308j183831o48379k948782n747387
$$ -2936871 -9707964 -8770095 -2685495 1321251 1025943 -157888 -806267 -3755049 -9502436
9451i502436l412479K947018O022835L099884l00580P09997L630729L580078N41123
$$ -9502436 -12914915 -9967897 -3945062 -845178 -1145758 -435761 3194968 6775046 7316169
9442G316169j931856k223634j545770j153725j242996j487394j260061m90416
$$ 7316169 5384313 3160679 1614909 461184 -781812 -2269206 -3529267 -4019683
9434d019683n49570k198788k959731J9335M359264M226036j063589m944370k336242
$$ -4019683 -4569253 -6768041 -9727772 -9708437 -5349173 -1123137 -2186726 -7131096 -9467338
9425i467338L885040P736428P204622L637555j488858n613314n039674N9371M092525
$$ -9467338 -5582298 2154130 9358752 12996307 11507449 5894135 854461 913832 5006357
9416E006357L285829P25811L87747O77710j199592l073447k083493r59941l058836
$$ 5006357 8292186 9017997 9405744 10083454 8883862 5810415 3726922 2766981 -291855
9407b91855m784529j000541M765094M584779p09478k237614K617368O177543L017616
$$ -291855 -5076384 -6076925 -1311831 3272948 2563470 325856 2943224 9120767 12138383
9398A2138383k281032l704362k534734k640900l034100n44397L995114O876072
$$ 12138383 9857351 6152989 3618255 977355 -2056745 -2601142 1393972 8270044
9390H270044O220447K508546k702519o186142m691293J38054K052417j633419
$$ 8270044 14490491 16999037 14296518 8110376 3419083 3557137 5609554 3976135
9382C976135n657374m037031J437729M014665J294720k352119k121294J650844
$$ 3976135 -1681239 -5718270 -4280541 -265876 1028844 -1323275 -3444569 -1793725
9374a793725M692260L958432R34047l46424J361456K648343M70080k916738l123219
$$ -1793725 2898535 6856967 7791014 7444590 8806046 11454389 11924469 9007731 5884512
9365E884512k29083J744326J015408o41674k053729l376969l264146o00155J408159
$$ 5884512 5655429 7399755 8415163 7773489 5719760 2342791 -921355 -1521510 -113351
9356a13351j044527m734598k668795M271100O940552J446444m987279n200939
$$ -113351 -1157878 -5892476 -8561271 -4290171 2650381 4096825 -890454 -6091393
9348f091393j435454R97216J977304L012825K177208j140639k370384Q75945L159935
$$ -6091393 -7526847 -6529631 -4552327 -1539502 637706 -502933 -2873317 -1997372 1162563
9339A162563k13132m455343k889909J641932J796639j576983j328920L382097
$$ 1162563 949431 -3505912 -6395821 -4753889 -2957250 -4534233 -5863153 -2481056
9331b481056N838787K864834j277953k685534k110437o78786J876237L679635
$$ -2481056 3357731 6222565 4944612 2259078 148641 -530145 1346092 5025727
9323E025727J722845k342576l133684N00253L712397K963545K3994k378476l861558
$$ 5025727 6748572 4405996 1272312 1772565 5484962 8448507 8472501 6094025 2232467
9314B232467m049122j780102J676986K817049Q82766r63411n43624P94219J339460
$$ 2232467 -1816655 -3596757 -1919771 897278 1780044 816633 273009 1067228 2406688
9305B406688J135605K22669j684685l117682j921510J015893K345736Q68510j459757
$$ 2406688 3542293 3764962 2080277 -1037405 -2958915 -1943022 402714 1271224 -188533
9296a88533k756308k191880J113268N981341P310778J702020n790612o619218
$$ -188533 -2944841 -5136721 -4023453 1957888 9268666 10970686 5180074 -1439144
9288a439144m76899M397525L329959N60471N20350R64208j355980m097256l247093
$$ -1439144 -1916043 2481482 5811441 6371912 6892262 7856470 6500490 2403234 -843859
9279h43859L87909L004659L206701K032656J68924j765838k364881j364418m46013
$$ -843859 -455950 2548709 5755410 7788066 7956990 6191152 3826271 2461853 2015840
9270B015840n07501n30170j78219l61405l12806J908900M809169M046479m99101
$$ 2015840 1508339 978169 799950 438545 125739 2034639 6843808 10890287 10391186
9261A0391186l319998j594997L78202j279728l275983r63503L274122L372655
$$ 10391186 7071188 5476191 5854393 4574665 1298682 335179 3609301 6981956
9253F981956j142398m806467l951269k82699K464934J958852j561178m706846
$$ 6981956 5839558 1033091 -2918178 -3200877 -735943 1222909 -338269 -5045115
9245e045115l296983K008835M986126J904436k861659l383488r39984o98324k420624
$$ -5045115 -8342098 -6333263 -1347137 557299 -2304360 -5687848 -6627832 -7326156 -9746780
9236i746780j436918K243172L318679N38940m82032L608031Q037777P043993K190216
$$ -9746780 -11183698 -8940526 -5621847 -5082907 -5564939 -1956908 6080869 13124862 15315078
9227A5315078j045783j704303l122690n785977n834449j541068L038939L343018
$$ 15315078 14269295 12564992 9442302 3656325 -2178124 -3719192 -680253 2662765
9219B662765O00854l23616J683950K463549o88662m214751l098808J569919L763866
$$ 2662765 3263619 2940003 4623953 7087502 6398840 2184089 -914719 655200 4419066
9210D419066R21349k768089k498635J139633M034677L671468M31800l747515n896157
$$ 4419066 5340415 2572326 73691 1213324 5248001 8919469 9351269 5603754 -292403
9201b92403l560344J659059M151568O51409n045560o514166k554434K207624L571683
$$ -292403 -3852747 -2193688 1957880 2609289 -2436271 -8950437 -11504871 -9297247 -5725564
9192e725564J755608l66396n26269J283066K796840J801277n01572m46670K256813
$$ -5725564 -3969956 -4336352 -4862621 -3579555 -782715 1018562 516990 70320 2327133
9183B327133K918228p44183l294560Q52054P166709N800885l538899r690256n590231
$$ 2327133 5245361 4501178 1206618 2058672 9225381 15026266 11487367 1797111 -3793120
9174c793120J908070K857002j420821k192358K178920M401786P54573k963629
$$ -3793120 -1885050 971952 -448869 -2641227 -462307 3939479 4694052 1730423
9166A730423r74570L458981L496996q99222l815113k742364j237037k090627l239673
$$ 1730423 755853 4214834 7711830 6812608 2997495 255131 -981906 -3072533 -6312206
9157f312206k315099q27025q73436j089047N16818K216477J184044j235360j385841
$$ -6312206 -8627305 -9454330 -10327766 -11416813 -10899995 -8683518 -7499474 -8734834 -10120675
9148a0120675N21756J024142l6925P88252L331461K583856k355590m322312J629856
$$ -10120675 -9598919 -8574777 -8611702 -7823450 -4491989 -1908133 -4263723 -8586035 -6956179
9139f956179Q926440P662199p04465n123453j106703L530601J627854k616849
$$ -6956179 1970261 9632460 8927995 3804542 2697839 6228440 7856294 5239445
9131E239445j468463L584448M499812l99664m146844k321566O25852p23440m131191
$$ 5239445 3770982 7355430 11855242 11455578 7308734 4987168 5613020 4889580 758389
9122G58389l903372l34288R30502j921233m051935j591559K693765M019731K340113
$$ 758389 -3144983 -3479271 -2548769 -4470002 -8521937 -10113496 -7419731 -3400000 -1059887
9113a059887J017143J068247O84192n07231n77498J073940K400568J854725M93945
$$ -1059887 -42744 1025503 1709695 1202464 624966 1698906 4099474 5954199 6448144
9104F448144M9164O51184J176657N27997j627664m114453m620222k458451j62459
$$ 6448144 6497308 7148492 8325149 8853146 7225482 3111029 -1509193 -3967644 -4130103
9095d130103m3991k63156K229713N561001M464933j366022n523777l647673P06976
$$ -4130103 -4174094 -4437250 -2207537 3353464 7818397 6452375 928598 -2719075 -2012099
9086b012099K116826R46583P45257J541769J002969R95J220458L094841J114931
$$ -2012099 104727 1051310 1796567 3338336 4341305 4342300 5562758 8657599 9772530
9077I772530m148403o027634j081791N202916N562937O32352k755532j400393
$$ 9772530 5624127 -403507 -1485298 3717618 9280555 9912907 7157375 5756982
9069E756982P07187p84498m168050m644433j491239J259161J088844L73495J889337
$$ 5756982 6464169 5679671 1511621 -3132812 -4624051 -3364890 -2276046 -1902551 -13214
9060a3214L886715K805663o87418k283352n50177J019014m04345k795733k697548
$$ -13214 3873501 6679164 5991746 3708394 3158217 4177231 3772886 977153 -1720395
9051a720395j57697K122062K594420J471334p95439l085956k947115P64874M969601
$$ -1720395 -1878092 243970 2838390 4309724 3514285 428329 -2518786 -1753912 3215689
9042C215689M803026l99913n382308m400788K165700P673232O270493m12896n292780
$$ 3215689 8018715 7618802 2236494 -2164294 1406 7674638 13945131 13532235 8239455
9033H239455m844039l094989m367131n689589j793864M588559N154453o92778
$$ 8239455 3395416 300427 -4066704 -9756293 -11550157 -6961598 -1807145 -2499923
9025b499923l488562J901434P619635M648449l414568o533375l408486j010214
$$ -2499923 -5988485 -4087051 3532584 8181033 4766465 -1766910 -5175396 -6185610
9017f185610j497401K0169M357139N086908k69904m490652j285387M805491N377375
$$ -6185610 -7683011 -7662842 -3305703 1781205 1511301 -2979351 -4264738 540753 5918128
9008E918128N83013k225083m7955K391726J008553j823306k040030l36431l81350
$$ 5918128 6501141 4276058 4228103 6619829 7628382 5805076 3765046 3428615 3047265
8999C047265k629985l702439j872336J97166l61408k322010k712974j571753j022998
$$ 3047265 417280 -3285159 -5157495 -4960329 -5321737 -7643747 -10356721 -11928474 -12951472
8990a2951472p02029J714416N327220N968524K660524l90983m28125j89429k167432
$$ -12951472 -13653501 -11939085 -6611865 -643341 2017183 1626200 1198075 1008646 -1158786
8981a158786l394629n52909L451126L567072P18790K5749K443038L964102K474839
$$ -1158786 -4553415 -5106324 -1655198 1911874 2630664 2656413 5099451 9063553 11538392
8972A1538392q2618k189382m212451n324248l892963j171918j1864o8055Q45770
$$ 11538392 11455774 9266392 5053941 -270307 -4163270 -5335188 -5347052 -5415107 -4569337
8963d569337J277847j846763n760396l725278L983705Q457067M815958n68463
$$ -4569337 -3291490 -5138253 -10898649 -14623927 -10640222 -2183155 2632803 2064340
8955B064340l33616K770540J651764k914099l850688K76979K783827p16354n809693
$$ 2064340 1730724 4501264 6153028 3238929 -611759 -334780 2449047 1732693 -4077000
8946d077000o025891j748739J412218R71298P0556J430286K672044M56493k989157
$$ -4077000 -10102891 -11851630 -10439412 -9468114 -9397558 -7967272 -5295228 -4838735 -7827892
8937g827892k127162K916136M918588j52369o258523n498785O04894M358454L844024
$$ -7827892 -9955054 -7038918 -2120330 -2272699 -8531222 -14030007 -13425113 -9066659 -5222635
8928e222635L861468N611199M019530k641781q097168o671145o55955M495408
$$ -5222635 -1361167 4250032 8269562 5627781 -2469387 -9140532 -9796487 -5301079
8920e301079O997972P153368M277872m68848k828212j424205o87982l459734n380894
$$ -5301079 1696893 8850261 13128133 12659285 9831073 8406868 7718886 4259152 -1121742
8911a121742j964642L209256L795336O80196m10710J082208N42744k714617l921074
$$ -1121742 -3086384 122872 3918208 4598404 4187694 5269902 5812646 3098029 -823045
8902h23045j215241J252050N22003n73313J222530M037079L837715Q4456m234308
$$ -823045 -2038286 -786236 -264233 -837546 384984 4422063 8259778 8344234 4109926
8893D109926o241749m916607j029719K803301L408989K21759l480124l798083
$$ 4109926 -2131823 -7048430 -8078149 -5274848 -1865859 -1644100 -5124224 -8922307
8885h922307m47674K986841L046402K70935j421295L56371L011721K227884j583463
$$ -8922307 -9369981 -6383140 -3336738 -3065803 -4487098 -4130727 -1119006 1108878 -474585
8876d74585l038370P29361N338615M709574o70978m527268l127204N77996J662099
$$ -474585 -3512955 -2783594 2555021 7264595 6593617 2066349 -1060855 -482859 1179240
8867A179240n66892k441690q25101L137963N315565L360143n46208k481503j461588
$$ 1179240 612348 -1829342 -2654443 483520 5799085 9159228 8613020 6131517 4669929
8858D669929L97174J628482K491856K356636l68939m549842o100635l416670O8995
$$ 4669929 5067103 6695585 9187441 11544077 11175138 6625296 524661 -2892009 -2823014
8849b823014R37557K77300M82741O95559r67056k929182j944762J614209L705866
$$ -2823014 -1885457 -1608157 -1125416 -429857 -1396913 -4326095 -6270857 -4656648 -950782
8840i50782J723315k573560n014926k755156K965038P080125N460132q9080m005602
$$ -950782 772533 -1801027 -6815953 -9571109 -6606071 474054 5934186 5845106 1839504
8831A839504m240981l526561k994062j25763M763439O080398J101786m603539
$$ 1839504 -2401477 -5928038 -8922100 -9047863 -4284424 1795974 2897760 -1705779
8823a705779m688929n07961K656431L176475J757735k337645p495151p262178
$$ -1705779 -6394708 -6902669 -4246238 -1069763 687972 -1649673 -9144824 -16407002
8815a6407002Q07237Q271751O184785j489289m101879o01898J091130j001049
$$ -16407002 -15599765 -7328014 -1143229 -2632518 -6734397 -7336295 -6245165 -7246214
8807g246214n54430M036318O001581K242970j376737n39775R19130q40354l128419
$$ -7246214 -7800644 -3764326 2237255 4480225 3103488 2563713 3482843 2642489 -485930
8798d85930k882106k077679k528402j945807N61901J517158k01106p1407M151288
$$ -485930 -3368036 -5445715 -7974117 -9919924 -9358023 -7840865 -8041971 -8113378 -3962090
8789c962090P360095M734450r76640m289938m031484j694572J810725M078900
$$ -3962090 3398005 8132455 7155815 2865877 -1165607 -2860179 -1049454 3029446
8781C029446J694179l551996n133813j888973l11321k942246l321981K008488
$$ 3029446 4723625 1171629 -3962184 -5851157 -6162478 -9104724 -12426705 -10418217
8773a0418217O079660L614260R61211M252874O880340J025783o176937k778618
$$ -10418217 -4338557 -724297 236914 4489788 11370128 12395911 6218974 3440356
8765C440356O904406P667913k049994p774288k592449L061983L8659n601562m847193
$$ 3440356 10344762 18012675 15962681 8188393 5595944 8657927 8696586 3095024 -1752169
8756a752169j85289J237289N5671R09951K592414J116997j615302o80516K940122
$$ -1752169 -1937458 -700169 -644498 265453 2857867 3974864 2359562 1679046 4619168
8747D619168L810350R61305j264713p45373j58823j698027l907349m681393l893372
$$ 4619168 8429518 9390823 8126110 7380737 7221914 5523887 1616538 -3064855 -6958227
8738f958227k070177Q26087M130208N790297M234984M18387k602232k363715M50683
$$ -6958227 -9028404 -8202317 -4072109 1718188 5953172 6371559 3769327 1405612 1856295
8729A856295K482857J437287j171862k188135j042979K7784l99021j308933j308487
$$ 1856295 4339152 5776439 4604577 2416442 1373463 1401247 1002226 -306707 -1615194
8720a615194k54974J297883K401969J657850j012018k905406j430082J821872
$$ -1615194 -1870168 -572285 1829684 3487534 2475516 -429890 -1859972 -38100
8712c8100K816152P66038j255222j543614j712024k452781j454575K263242N316510
$$ -38100 2778052 3544090 2288868 745254 -966770 -3419551 -4874126 -2610884 2705626
8703B705626M188884K92682k114108j755337j280854k635291l819346j447632
$$ 2705626 6894510 7187192 5073084 3317747 2036893 -598398 -4417744 -5865376
8695e865376M043294P299643L780644l847776p887231n068249k91004J274446
$$ -5865376 -1822082 5477561 9258205 5410429 -2476802 -7545051 -7836055 -6561609
8687f561609J462453M082601O670709L997198k390012n645002l978782j977206
$$ -6561609 -5099156 -1016555 5654154 9651352 7261340 1616338 -2362444 -4339650
8679d339650j558199J57993K839266J715379k846713l434163K367354O507099
$$ -4339650 -5897849 -5739856 -2900590 -1185211 -4031924 -7466087 -5098733 1408366
8671A408366K829416k958891k749787J528003L071849J752601J343093K09032
$$ 1408366 4237782 1278891 -1470896 57107 3128956 4881557 6224650 6433682
8663F433682m888584r027885m348663N983140R929335L578121m043028n187995
$$ 6433682 1545098 -7482787 -11831450 -5848310 4081025 7659146 3616118 -1571877
8655a571877k879966k668589l554117k306425k15733J04302N4062K152372N118811
$$ -1571877 -4451843 -7120432 -10674549 -12980974 -13196707 -13092405 -13038343 -10885971 -5767160
8646e767160N962134M349882J855883m63944j483583k32537J305616m39779m319058
$$ -5767160 194974 4544856 6400739 5936795 4453212 4220675 5526291 5086512 767454
8637G67454m313202J270735N687350L237148k080749l085033l78982J05415k321382
$$ 767454 -3545748 -2275013 3412337 6649485 4568736 1483703 1104721 1210136 -1111246
8628a111246k701858L63067K613434J796310O70923R92785P58716n46944K9937
$$ -1111246 -3813104 -3450037 -836603 959707 1630630 2623415 3382131 2835187 2865124
8619B865124K824320L153197j186891n063019l356544J015633J859422p96947
$$ 2865124 5689444 8842641 7655750 2592731 -763813 251820 2111242 1314295
8611A314295k076035r04152n06436j066574Q75364M694533M440233j737090o988423
$$ 1314295 -761740 -1665892 -2172328 -3238902 -2363538 2330995 6771228 5034138 -1954285
8602a954285m920467J333366M195260K244360J11073L2731l80894k373598l559577
$$ -1954285 -6874752 -5541386 -1346126 898234 1009307 1042038 661144 -1712454 -5272031
8593e272031k138212N67680K737485L783113K934918k90223l534282l228244K14088
$$ -5272031 -7410243 -6842563 -4105078 -321965 2612953 2322730 -1211552 -4439796 -4225708
8584d225708K429074J420519N4434Q07839K022689J561886N35132P57325J559871
$$ -4225708 -1796634 -376115 -321681 486158 2508847 4070733 4605865 5363190 6923061
8575F923061J595557R42029o26636l950387o813553m347249L390355Q539962M890930
$$ 6923061 8518618 9460647 8834011 4883624 -1929929 -6277178 -2886823 5653139 10544069
8566A0544069l217942o614933l141152J587182K883997P61597l121187o342147
$$ 10544069 7326127 711194 -2429958 -842776 2041221 2802818 -318369 -6660516
8558f660516m952525K058363Q480146P222710K33474m219708l358169j771633
$$ -6660516 -11613041 -9554678 -1074532 6148178 6381652 2161944 -1196225 -2967858
8550b967858j808932n11410K505379K714208p51434k131811J357052M329009K379990
$$ -2967858 -4776790 -5288200 -2782821 -68613 -820047 -2951858 -1594806 2734203 5114193
8541E114193n35782M50772K650709J394158j258372n94502K101097K249685Q6701
$$ 5114193 4578411 5029183 7679892 9074050 7815678 7221176 9322273 11571958 11658659
8532A1658659j046626j703268m320892o519152m062259R37239K454743M00023
$$ 11658659 10612033 8908765 4587873 -1931279 -5993538 -5056299 -2601556 -2201533
8524b201533K87321L212546M138712J088414j755339j950451k325732m028189
$$ -2201533 -1914212 1298334 5437046 6525460 4770121 2819670 493938 -3534251
8516c534251l291960J156958L990760J203239l156518l059836R19587L812995
$$ -3534251 -6826211 -5669253 -1678493 -475254 -3631772 -6691608 -5772021 -1959026
8508a959026L511802J397704j074304k228374J75345M832737N783694K64653n555751
$$ -1959026 1552776 2950480 1876176 -352198 -176853 4655884 10439578 10704231 5148480
8499E148480m420564J118038K402414k155740n100993j715693L418751M179007
$$ 5148480 727916 1845954 4248368 2092628 -3008365 -4724058 -1305307 2873700
8491B873700J323430n78080l78005k69442r83804j066632J0590R48037N65679
$$ 2873700 4197130 3619050 3241045 2971603 1987799 921167 931757 1879794 2445473
8482B445473j026373k685804k663319N9988L730706M582216J198874l102440l948539
$$ 2445473 1419100 -1266704 -3930023 -3870035 -139329 4442887 5641761 2539321 -1409218
8473a409218r91413K349789L276539J823728o25747k803185l495128k045244M03521
$$ -1409218 -2400631 -50842 3225697 5049425 4423678 1620493 -1874635 -3919879 -3516358
8464c516358J484935J59844k047150k760958j110408J783528L971200M100645
$$ -3516358 -2031423 -1871579 -3918729 -6679687 -7790095 -6006567 -2035367 2065278
8456B065278K292252j16407j955058l179729l997528l573610q79696L061452N203065
$$ 2065278 4357530 4241123 2286065 -893664 -4891192 -8464802 -9344498 -6283046 -1079981
8447a079981L692608L07262j391207p1013K181088K727788J409261N9112l17929
$$ -1079981 2612627 2919889 1528682 1457669 3638757 6366545 7775806 7834918 7516989
8438G516989o66680j993373l498036l552755k004763l72274J44940k19586o82801
$$ 7516989 6850309 4856936 1358900 -2193855 -4198618 -4570892 -4425952 -4645538 -5328339
8429e328339p42941L0005J712078L126221K590362J62477k186405l115041k893873
$$ -5328339 -6071280 -6041275 -4329197 -1202976 1387386 1549863 -636542 -3751583 -6645456
8420f645456j353290K423860O780651O965687J115537n523990o303071j663004
$$ -6645456 -7998746 -5574886 1205765 8171452 9286989 3762999 -2540072 -4203076
8412d203076K261053K372577R32467m03452k783233n120451l116808L418993P562626
$$ -4203076 -1942023 430554 1363021 959569 -1823664 -6944115 -10060923 -6641930 920696
8403I20696M077386k752347n039678j997549P28358M27200m496J413789K147508
$$ 920696 4998082 2245735 -2793943 -4791492 -4063134 -3635934 -3640430 -2226641 -79133
8394g9133k50128l762137m384935j120658L036873M411066K482185N28555J665931
$$ -79133 -329261 -4091398 -8476333 -9596991 -6560118 -2149052 333133 861688 2527619
8385B527619M278415L625752j288525n655354n510589k930837j738134j668004
$$ 2527619 6806034 10431786 9143261 3487907 -2022682 -4953519 -6691653 -8359657
8377h359657p65713j54500j407897j974812J085546M885798M268490J48958j844320
$$ -8359657 -9125370 -9279870 -10687767 -12662579 -11577033 -6691235 -2422745 -2273787 -4118107
8368d118107o1933K023350K513835K513553J602081j360133l571380j601745J497067
$$ -4118107 -4180040 -2156690 357145 2870698 4472779 3112646 -458734 -2060479 -563412
8359e63412M71108j843915J512133P680667O200178k892042o694502l3930N419329
$$ -563412 -92304 -1936219 -424086 7256581 13456759 10564717 3870215 3836285 9255614
8350I255614N47262o078784l633638K149312k51218p428846p074413O60945M157136
$$ 9255614 9802876 3724092 90454 2239766 1988548 -5440298 -12514711 -11853766 -7696630
8341g696630M36603j519485K056276L992209K68111l164538j646222J141175J657709
$$ -7696630 -7260027 -8779512 -6723236 -2731027 -2462916 -5627454 -7273676 -6132501 -4474792
8332d474792K285613M261993L683924q42495m312075l325700r47617j3740J216313
$$ -4474792 -2189179 2072814 5756738 4914243 602168 -2723532 -3671149 -3684889 -2468576
8323b468576L315905L109739N37050N12026L946615M693765o9380m365889l510345
$$ -2468576 847329 3957068 4494118 5006144 8952759 13646524 13577144 9211255 5700910
8314E700910j634939k995171l709627L36048M481246K709181j820070k526091
$$ 5700910 4065971 1070800 -2638827 -2302779 2178467 4887648 3067578 541487
8306E41487o78371j609175l822402j869502K605495K844094j183058k685131J66935
$$ 541487 -136884 -1746059 -5568461 -7437963 -4832468 -1988374 -3171432 -5856563 -5689628
8297e689628J738175n11825j732601J355585M650291L470024m77566k618758j886915
$$ -5689628 -3951453 -4463278 -6195879 -4840294 -190003 3280021 2802455 183697 -1703218
8288a703218l43200O07976J003615J178853J313815R53318q10946l134080k998003
$$ -1703218 -2046418 -1438442 -434827 744026 2057841 3011159 2200213 -933867 -3931870
8279c931870K80650K339738l49449m090353k869225J966838L551870N53882r99375
$$ -3931870 -3651220 -1311482 -1660931 -5751284 -8620509 -6653671 -3101801 -2547919 -3547294
8270c547294J911522M547345K844127j36319k69318P54964m80479k498091j730735
$$ -3547294 -1635772 2911573 5755700 5619381 5350063 6105027 5624548 3126457 1395722
8261A395722Q86078J257378j392023l670303l022096l65075J905349K349580J422461
$$ 1395722 2281800 3539178 2147155 -1523148 -4545244 -4910319 -3004970 -655390 767071
8252G67071J158258K676253L512480J52583n772131p648882k631514L620546M457777
$$ 767071 1925329 4601582 8114062 8266645 2494514 -5154368 -7785882 -4165336 292441
8243B92441J018854r26552N8428P62482J88101O42538K151852J571235j654874
$$ 292441 1311295 384743 443171 1205653 1393754 2036292 4188144 5759379 4104505
8234D104505l826649k715498o24408J23044O35043K065603K608769Q45228j086311
$$ 4104505 277856 -2437642 -3062050 -2939006 -2303963 -238360 2370409 3215637 2129326
8225B129326q89082L9204m16430p94686J152595L321067J766408k365164l480814
$$ 2129326 1240244 1279448 863018 68332 1220927 4541994 6308402 3943238 462424
8216D62424K31720L832396K603222j790466m407540l361251n38709J765482K348573
$$ 462424 694144 4526540 7129762 5339296 931756 -2429495 -2968204 -1202722 1145851
8207A145851P55492k161857m119201l421107m31928L478447O727198O932247K639550
$$ 1145851 1901343 -260514 -4379715 -7800822 -8232750 -4754303 1972895 8905142 11544692
8198A1544692l067606m384772n52881K171307l22421l288429p72787M076971L656170
$$ 11544692 8477086 4092314 3539433 5710740 5388319 2099890 1327103 5404074 9060244
8189I060244j533153l545524M3496K778357O64227j899576j059177j08801j938718
$$ 9060244 7527091 3981567 4025063 6803420 7467647 5568071 4508894 4400093 2461375
8180B461375k368823K054075N739456J875373n607979o876780q65755L783921
$$ 2461375 92552 2146627 7886083 9761456 4153477 -2723303 -3589058 194863
8172A94863K039623j796285k785868j862883j094770O20295L413669L678363j24803
$$ 194863 2234486 438201 -2347667 -4210550 -5305320 -4685025 -1271356 2407007 2282204
8163B282204l275665j276749K660898J966480l097837n211589m84384N683825
$$ 2282204 -993461 -2270210 390688 2357168 -740669 -5952258 -6436642 -752817
8155g52817N786332K14701l666638j674791K037217J697321j540333j779172K191222
$$ -752817 5033515 5248216 1581578 -93213 1944004 3641325 2100992 321820 2513042
8146B513042M751878J870392l072596m674139k862651j120649m35674M87925J073424
$$ 2513042 7264920 9135312 6062716 1388577 -1474074 -2594723 -3030397 -2542472 -1469048
8137a469048k51388k079378j433467J414812L568822M099265L769233J394425
$$ -1469048 -1720436 -3799814 -5233281 -3818469 -249647 3849618 7618851 9013276
8129I013276m127378q705326o318125J658352O607134M200897r8596M7521L087785
$$ 9013276 4885898 -3819428 -10137553 -8479201 -1872067 2328830 2230234 2277755 5365540
8120E365540L782070J382619j310647l531619n971762o957858m292950L03628
$$ 5365540 9147610 10530229 9219582 5687963 -283799 -7241657 -11534607 -11230979
8112a1230979K977587L096672K927701K938393J657371k13695j0134K027159K187850
$$ -11230979 -8253392 -5156720 -2229019 709374 2366745 2153050 2142916 4170075 6357925
8103F357925j063082m342804m087501j178672J308872K485977K987510J862394
$$ 6357925 5294843 952039 -3135462 -4314134 -3005262 -519285 2468225 4330619
8095D330619k054978o076392n215210N93310M516915J394444m334912m121280
$$ 4330619 2275641 -3800751 -9015961 -8422651 -3905736 -2511292 -6846204 -10967484
8087a0967484K257564N878177J828681l244811j285065M670214N142100j260772
$$ -10967484 -8709920 -2831743 -1003062 -4247873 -5532938 -862724 4279376 3018604
8079C018604o003702l507532J724512L186772J130611m61401o49639q77590r75563
$$ 3018604 -2985098 -6492630 -4768118 -1581346 -450735 -912136 -1561775 -2439365 -3414928
8070c414928o4956Q58483P81763J035285K621057L348945R85662k632533l977071
$$ -3414928 -3479884 -2621401 -1839638 -804353 1816704 5165649 6151311 3518778 -458293
8061d58293k641947n62146J768591M650718O217420M111329m90120l913616m428620
$$ -458293 -3100240 -3662386 -1893795 2756923 8974343 13085672 12595552 8681936 4253316
8052D253316k695761P83674M825607N561801L28681o595346p413983j015500N123857
$$ 4253316 1557555 2341229 7166836 12728637 13057318 6461972 -952011 -1967511 3156346
8043C156346M864678M00923l051512m539214n305050l674592K169721Q266968
$$ 3156346 8021024 8421947 5370435 831221 -4473829 -8148421 -5978700 2288268
8035B288268P856891O28578o012781o259648k344508J80859j72867j001343o82294
$$ 2288268 10145159 10773737 4760956 -1498692 -3843200 -3662341 -3835208 -4836551 -5518845
8026e518845N80223K645055M881714M776094O72623m451223n532041k004440J549876
$$ -5518845 -4938622 -2293567 2588147 7364241 8036864 3585641 -1946400 -3950840 -2400964
8017b400964J834242L62594k98543O5721J112950L022741L762648j05100o794840
$$ -2400964 -566722 -204128 -502671 -436950 676000 3698741 7461389 7356289 561449
8008E61449q443732j583379O140465N873012J80894j911326N43886M55676l582181
$$ 561449 -7882283 -9465662 -3325197 2547815 2728709 817383 1361269 1816945 -1765236
7999a765236m321707J217648N984932M415667P25367O4379k39355l377561m535292
$$ -1765236 -6086943 -4869295 1115637 5531304 6256671 6321050 6081695 2704134 -1831158
7990a831158J132172P597516N489170k741042o009342j749836J235519j750826
$$ -1831158 -698986 6898530 12387700 9646658 3637316 1887480 3122999 1372173
7982A372173l954509M73857O055216M621367j902058m905298k000619P07270j394727
$$ 1372173 -2582336 -2108479 3946737 8568104 6666046 1760748 -239871 467399 -927328
7973i27328n149251m819363P1950M278050L050093k478441o316366m004997K535428
$$ -927328 -6076579 -10895942 -10823992 -6545942 -3495849 -5974290 -12290656 -16295653 -13760225
7964a3760225P487862P864905N680915L393405L14107m531539q505260p716206
$$ -13760225 -6272363 1592542 7273457 10666862 10980969 6449430 -2055830 -9772036
7956i772036k618179K001847L144652K757050L276048K900543j238027o460751
$$ -9772036 -12390215 -10388368 -7243716 -4486666 -1210618 1689925 451898 -6008853
7948f008853n843692K318651J0313213R653915J466810n695854o719364l877617
$$ -6008853 -11852545 -9533894 779319 10433234 11900044 6204190 -515174 -4392791
7940d392791p18517K220962M408702L600724L5357j981440l4871K380968J231479
$$ -4392791 -5111308 -2890346 1518356 5119080 5154437 3172997 3138126 5519094 6750573
7931F750573j885053k689347o38846J452381J937966Q27986j953543n053686m792890
$$ 6750573 4865520 2176173 1537327 2989708 4927674 5755660 3802117 -1251569 -6044459
7922f044459J04713M961822M497478j96000l985134m604318k938404O18973M723988
$$ -6044459 -5939746 -977924 3519554 3323554 -661580 -5265898 -8204302 -7585329 -2861341
7913b861341M903863p50381o072467m112710K065395L878250Q74280L59193L630616
$$ -2861341 2042522 1292141 -4780326 -8893036 -6827641 -2949391 -2075111 -1715918 1914698
7904A914698L467134k346792n831037j849496L334188K713372p13970j032596
$$ 1914698 5381832 3035040 -2795997 -4645493 -1311305 1402067 688097 -344499
7896c44499J75530j255070k761106L46076N205826N307206J270849p56555M76986
$$ -344499 -168969 -1424039 -4185145 -3839069 1366757 6673963 7944812 7188257 7665243
7887G665243P38144j103580j950583j490934k625110m715152l782700j01269J507821
$$ 7665243 8403387 7299807 5349224 3858290 1233180 -3481972 -7264672 -7365941 -5858120
7878e858120k3843m34992J690099K275146m52652k387044p84482J362855J672142
$$ -5858120 -5881963 -6316955 -4626856 -2351710 -2804362 -5191406 -5975888 -4613033 -2940891
7869b940891K655028N291099M720900j623479o939301l553433M938215P995384
$$ -2940891 -285863 5005236 9726136 8102657 1163356 -2390077 2548138 10543522
$$ [...]
##END NTUPLES=NMR SPECTRUM
##END=
